##TITLE=1H ikalashn
CA-9309-1
17.12.2024
##JCAMPDX= 6.0         $$ Bruker NMR JCAMP-DX V2.0
##DATA TYPE= NMR SPECTRUM
##DATA CLASS= NTUPLES
##ORIGIN= UXNMR, Bruker Analytische Messtechnik GmbH
##OWNER= root
$$ TOPSPIN		Version 1.3
$$ 2024-12-17 14:33:05.390 +0400  Irina@DPX200
$$ Compression mode = diff/dup
##.OBSERVE FREQUENCY= 200.131300845
##.OBSERVE NUCLEUS= ^1H
##.ACQUISITION MODE= SIMULTANEOUS
##.ACQUISITION SCHEME= undefined
##.AVERAGES= 32
##.DIGITISER RES= 18
##SPECTROMETER/DATA SYSTEM= spect
##.PULSE SEQUENCE= zg
##.SOLVENT NAME= CDCl3
##.SHIFT REFERENCE= INTERNAL, CDCl3, 1, 17.49637
##AUDIT TRAIL= $$ (NUMBER, WHEN, WHO, WHERE, WHAT)
$$ ##TITLE= Audit trail, TOPSPIN		Version 1.3
$$ ##JCAMPDX= 5.01
$$ ##ORIGIN= Bruker BioSpin GmbH
$$ ##OWNER= Irina
$$ $$ F:/spectra/data/iren/nmr/1H/4/pdata/1/auditp.txt
$$ ##AUDIT TRAIL=  $$ (NUMBER, WHEN, WHO, WHERE, VERSION, WHAT)
(   1,<2024-12-17 14:32:39.687 +0400>,<Irina>,<DPX200>,<TOPSPIN 1.3>,
      <created by zg
	started at 2024-12-17 14:30:31.812 +0400,
	POWCHK disabled, PULCHK disabled
       configuration hash MD5:
       BE 6D 3F 07 2A EA 11 49 91 17 2B D3 AF B3 58 0D
       data hash MD5: 16K
       49 1B 53 5E 29 AC 8E 92 54 A0 83 27 60 53 BA 11>)
(   2,<2024-12-17 14:32:41.859 +0400>,<Irina>,<DPX200>,<TOPSPIN 1.3>,
      <Start of raw data processing
       efp BC_mod = 2 LB = 0.02 FT_mod = 6 PKNL = 1 PHC0 = 145.3543 PHC1 = -20.01435 SI = 32K 
       data hash MD5: 32K
       7E 60 2B 38 05 56 42 10 D9 5A EB F8 6D D3 11 95>)
(   3,<2024-12-17 14:32:47.359 +0400>,<Irina>,<DPX200>,<TOPSPIN 1.3>,
      <abs n ABSG = 5 
       data hash MD5: 32K
       9A 35 18 EE 0A 69 BD 22 B2 35 37 22 A8 8B 50 74>)
(   4,<2024-12-17 14:32:58.671 +0400>,<Irina>,<DPX200>,<TOPSPIN 1.3>,
      <pk fgphup PHC0 = -11.37813 PHC1 = 15.2 
       data hash MD5: 32K
       88 F6 CF 91 0B 5A 5B 62 BF 2D 0D FC 75 5D D7 F6>)
$$ ##END=
$$ 
$$ $$ hash MD5
$$ $$ 4F 41 49 7F 05 4F 35 48 1E 36 BF 9C 02 E5 39 58
##$RELAX= 
##$RELAX= 
##$RELAX= 
##$RELAX= 
##$RELAX= 
##$RELAX= 
##$RELAX= 
##$RELAX= 
##$RELAX= 
$$ Bruker specific parameters
$$ --------------------------
##$DU= <F:/spectra>
##$EXPNO= 4
##$NAME= <1H>
##$PROCNO= 1
##$TYPE= <nmr>
##$USER= <iren>
##$AMP= (0..31)
100 100 100 100 100 100 100 100 100 100 100 100 100 100 100 100 100 100 
100 100 100 100 100 100 100 100 100 100 100 100 100 100 
##$ANAVPT= -1
##$AQSEQ= 0
##$AQ_mod= 1
##$AUNM= <au_zg>
##$AUTOPOS= <>
##$BF1= 200.13
##$BF2= 200.13
##$BF3= 200.13
##$BF4= 200.13
##$BF5= 200.13
##$BF6= 200.13
##$BF7= 200.13
##$BF8= 200.13
##$BYTORDA= 1
##$CFDGTYP= 0
##$CFRGTYP= 5
##$CHEMSTR= <none>
##$CNST= (0..63)
1 1 145 1 1 1 1 1 1 1 1 1 1 1 1 1 1 1 1 1 1 1 1 1 1 1 1 1 1 1 1 1 1 1 
1 1 1 1 1 1 1 1 1 1 1 1 1 1 1 1 1 1 1 1 1 1 1 1 1 1 1 1 1 1 
##$CPDPRG= <>
##$CPDPRG1= <>
##$CPDPRG2= <>
##$CPDPRG3= <>
##$CPDPRG4= <mlev>
##$CPDPRG5= <mlev>
##$CPDPRG6= <mlev>
##$CPDPRG7= <mlev>
##$CPDPRG8= <mlev>
##$CPDPRGB= <>
##$CPDPRGT= <>
##$D= (0..63)
$$ [...]
##$SW_h= 4401.40845070422
##$TD= 16384
##$TD0= 1
##$TE= 300
##$TE2= 300
##$TE3= 300
##$TEG= 300
##$TL= (0..7)
0 120 120 120 120 120 120 120 
##$TP= (0..7)
150 150 150 150 150 150 150 150 
##$TP07= 0
##$TPNAME0= <>
##$TPNAME1= <>
##$TPNAME2= <>
##$TPNAME3= <>
##$TPNAME4= <>
##$TPNAME5= <>
##$TPNAME6= <>
##$TPNAME7= <>
##$TPOAL= (0..7)
0.5 0.5 0.5 0.5 0.5 0.5 0.5 0.5 
##$TPOFFS= (0..7)
0 0 0 0 0 0 0 0 
##$TUNHIN= 0
##$TUNHOUT= 0
##$TUNXOUT= 0
##$USERA1= <user>
##$USERA2= <user>
##$USERA3= <user>
##$USERA4= <user>
##$USERA5= <user>
##$V9= 5
##$VALIST= <valist>
##$VCLIST= <CCCCCCCCCCCCCCC>
##$VD= 0
##$VDLIST= <DDDDDDDDDDDDDDD>
##$VPLIST= <PPPPPPPPPPPPPPP>
##$VTLIST= <TTTTTTTTTTTTTTT>
##$WBST= 1024
##$WBSW= 25
##$XGAIN= (0..3)
0 0 0 0 
##$XL= 0
##$YL= 0
##$YMAX_a= 1795878
##$YMIN_a= -1316273
##$ZGOPTNS= <>
##$ZL1= 120
##$ZL2= 120
##$ZL3= 120
##$ZL4= 120
##$ABSF1= 17.49637
##$ABSF2= -4.496376
##$ABSG= 5
##$ABSL= 3
##$ALPHA= 0
##$AQORDER= 0
##$ASSFAC= 0
##$ASSFACI= 0
##$ASSFACX= 0
##$ASSWID= 0
##$AUNMP= <proc_1d>
##$AXLEFT= 0
##$AXRIGHT= 0
##$AXTYPE= 0
##$AXUNIT= <>
##$AZFE= 0.1
##$AZFW= 0.1
##$BCFW= 0
##$BC_mod= 2
##$BYTORDP= 0
##$COROFFS= 0
##$CY= 7568.61572265625
##$DATMOD= 1
##$DC= 0
##$DFILT= <>
##$DTYPP= 0
##$F1P= 17.9538593292236
##$F2P= -4.03888763876832
##$FCOR= 0.5
##$FTSIZE= 32768
##$FT_mod= 6
##$GAMMA= 0
##$GB= 0
##$INTBC= 0
##$INTSCL= 5.656564e-011
##$ISEN= 128
##$LB= 0.02
##$LEV0= 0
##$LPBIN= 0
##$MAXI= 945.577
##$MC2= 0
##$MEAN= 0
##$ME_mod= 0
##$MI= -402.1523
##$NCOEF= 0
##$NC_proc= -6
##$NLEV= 6
##$NOISF1= 8.587773
##$NOISF2= 6.764455
##$NSP= 0
##$NTH_PI= 0
##$NZP= 0
##$OFFSET= 17.49637
##$PC= 1
##$PHC0= 133.9762
##$PHC1= -4.814351
##$PH_mod= 1
##$PKNL= yes
##$PPARMOD= 0
##$PPDIAG= 0
##$PPIPTYP= 0
##$PPMPNUM= 100
##$PPRESOL= 1
##$PSCAL= 0
##$PSIGN= 0
##$REVERSE= no
##$SF= 200.13
##$SI= 32768
##$SIGF1= 16.12182
##$SIGF2= -4.496377
##$SINO= 3.521527
##$SIOLD= 32768
##$SREGLST= <1H.CDCl3>
##$SSB= 0
##$STSI= 32768
##$STSR= 0
##$SW_p= 4401.40845070422
##$SYMM= 0
##$S_DEV= 0
##$TDeff= 16384
##$TDoff= 0
##$TI= <>
##$TILT= no
##$TM1= 0
##$TM2= 0
##$TOPLEV= 0
##$USERP1= <user>
##$USERP2= <user>
##$USERP3= <user>
##$USERP4= <user>
##$USERP5= <user>
##$WDW= 1
##$XDIM= 32768
##$YMAX_p= 320337096
##$YMIN_p= 193242
$$ End of Bruker specific parameters
$$ ---------------------------------
##NTUPLES= NMR SPECTRUM
##VAR_NAME=  FREQUENCY,     SPECTRUM/REAL,   SPECTRUM/IMAG
##SYMBOL=    X,             R,               I
##VAR_TYPE=  INDEPENDENT,   DEPENDENT,       DEPENDENT
##VAR_FORM=  AFFN,          ASDF,            ASDF
##VAR_DIM=   32768,         32768,           32768
##UNITS=     HZ,            ARBITRARY UNITS, ARBITRARY UNITS
##FACTOR=    0.134324425510551, 1,           1
##FIRST=     4401.40845070422, 2233592,      -7407684
##LAST=      0,             748758,          -6193618
##MIN=       0,             193242,          0
##MAX=       4401.40845070422, 320337096,    0
$$ Real data points
##PAGE= N=1
##DATA TABLE= (X++(R..R)), XYDATA
$$ [...]
10493A3678987m50556o4087L06258J18196k32855r5840L25922L41634p0790k81410
10483A3575459m4347K24778K06456O5997J842m4963j00461l9396R8802P7305j05761
10472A3915711j25605J47604L75816K37168r0167k04405n3887O4328m309q0906
10462A4181348M593J23660N8845j25571j40384R1792K71604J30111j61619k19770
10452A4214609l627J45943M4770o8637N6008K69336K50220j8532k41845k06694
10442A4441551P953J82961J81757M2797o5352j6490J12983J39117L2908n5937
10432A5004248m9672j9359J8772J31524K26832Q8298k17355l00362k1132K33466
10422A5095260J24341j16923r2036J34242K30680J79493J84017J84897j0565k31945
$$ y = [13678987, 13228431, 13164344, 13470602, 13588798, 13355943, 13260103, 13586025, 13927659, 13856869, 13575459, 13531112, 13755890, 13962346, 14028343, 14030185, 13985222, 13884761, 13845365, 13944167, 14021472, 13915711, 13790106, 13937710, 14313526, 14550694, 14460527, 14256122, 14202235, 14266563, 14262254, 14181348, 14185941, 14309601, 14368446, 14242875, 14102491, 14194283, 14465887, 14595998, 14434379, 14214609, 14210982, 14356925, 14401695, 14333058, 14389066, 14658402, 14908622, 14890090, 14648245, 14441551, 14449504, 14632465, 14814222, 14857019, 14791667, 14775177, 14888160, 15027277, 15060185, 15004248, 14954576, 14935217, 14953989, 15085513, 15312345, 15400643, 15183288, 14882926, 14861794, 15095260, 15219601, 15102678, 15010642, 15144884, 15375564, 15555057, 15739074, 15923971, 15913406, 15681461]
10412A5681461j25764K07800L06605R1426m0666N4202K9892k68485m46932j89987
10402A5299552K19544L56976K50048J61106J11232K999o0865K3418O8125j02805
10392A6329330k50445m7893L22951L61874K998k75290j59522R3941J26835J980
10382A6506759m915R6593N2036j65613k42813J5492L40568L26077J300j87542
10372A6737942l531K50905K01085m3533r8191P7298J47819j9286j36447K5690
10362A7139751K71703K90278R2011p3650q0921j7213m623o3921r9004J6398K41434
10351A7712243L06464M6292k69311k41898N3559J73650L6551M0163L01485L50236
10341A8509434q0606m87961l16809J69360L12604N6333j04342J4003J07364J8325
$$ y = [15681461, 15555697, 15763497, 16070102, 16161528, 16120862, 16175064, 16204956, 15936471, 15489539, 15299552, 15519096, 15876072, 16126120, 16287226, 16398458, 16401457, 16340592, 16364010, 16432135, 16329330, 16078885, 16030992, 16353943, 16715817, 16718815, 16443525, 16284003, 16377944, 16504779, 16506759, 16501844, 16598437, 16650473, 16484860, 16242047, 16257539, 16598107, 16924184, 16925484, 16737942, 16734411, 16985316, 17186401, 17142868, 17044677, 17121975, 17269794, 17250508, 17114061, 17139751, 17411454, 17701732, 17793743, 17720093, 17639172, 17621959, 17617336, 17553415, 17454411, 17470809, 17712243, 18018707, 18064999, 17795688, 17553790, 17607349, 17780999, 17817550, 17857713, 18159198, 18509434, 18428828, 17940867, 17624058, 17793418, 18106022, 18162355, 18058013, 18072016, 18179380, 18197705]
10331A8197705m8702J6414P4658R9078K19551L44147K01580j45835k81431n1471
10321A8625694K12962K24265Q9274o646o7671p9460P3903K96986K66214o0736
10311A9574785k81817j34873J02928P3340j23096j57346J3971J81992K41090K22516
10301A9713490J24621m0111j53756j41804p8680j0601J25875K73763K11175p1570
10291A9952402k29262l8388K45281K70659P9490p3147j28933j38289j6662K44085
10281B0167236L49099R2628k16263j57215J35507J92949j5227o4026J79231L32794
10271B0996713J39306j45911j89461k4022J33761J93724J41360l8110k07577j15028
10261B0884755K27585M38076K40929j41385k78981p2436J90152K17513J625k20778
$$ y = [18197705, 18149003, 18165417, 18240075, 18339153, 18558704, 18902851, 19104431, 18958596, 18677165, 18625694, 18838656, 19062921, 19152195, 19145549, 19077878, 18998418, 19072321, 19369307, 19635521, 19574785, 19292968, 19158095, 19261023, 19334363, 19211267, 19053921, 19067892, 19249884, 19490974, 19713490, 19838111, 19798000, 19644244, 19502440, 19423760, 19413159, 19539034, 19812797, 20023972, 19952402, 19723140, 19684752, 19930033, 20200692, 20280182, 20207035, 20078102, 19939813, 19923151, 20167236, 20516335, 20608963, 20392700, 20235485, 20370992, 20563941, 20548714, 20484688, 20663919, 20996713, 21136019, 20990108, 20800647, 20776625, 20910386, 21104110, 21245470, 21207360, 20999783, 20884755, 21112340, 21550416, 21791345, 21649960, 21370979, 21298543, 21488695, 21706208, 21707833, 21487055]
10251B1487055j97822Q7544L57580L21260K8313j88774j33425O5441K07145K57710
10241B2292027K58409J87369L3138j20950j82463j34137n018J31827J49230J7205
10231B2626637o4120R6131L27450K74165m9077k19855l3282J94172J43807k3272
10221B3272756P493J74545J93054N3252q745N3401M9328p1242j15793K0340J72774
10210B3801163J50828o061r9077r26K24160L69638K66603k3899k37558j87773
10200B4257098M0363K29810K62058J41037o3374j81058k3688L20337M37721Q2356
10190B5502660m04164m55480j3271M05723L92326R8830q0715k4046R3631J20037
10180B5635531P6336M0132K9648L1577O8028J68047K64891K02486n2865k59343
$$ y = [21487055, 21289233, 21376777, 21734357, 22055617, 22083930, 21895156, 21761731, 21827172, 22034317, 22292027, 22550436, 22737805, 22770943, 22649993, 22467530, 22333393, 22328375, 22460202, 22609432, 22626637, 22562517, 22658648, 22986098, 23260263, 23211186, 22991331, 22958049, 23152221, 23296028, 23272756, 23280249, 23454794, 23647848, 23701100, 23692355, 23745756, 23795084, 23723842, 23608049, 23628389, 23801163, 23951991, 23945930, 23846853, 23845927, 24070087, 24439725, 24706328, 24682429, 24444871, 24257098, 24297461, 24527271, 24789329, 24930366, 24866992, 24685934, 24662246, 24982583, 25420304, 25502660, 25098496, 24643016, 24629745, 25035468, 25427794, 25526624, 25445909, 25421863, 25515494, 25635531, 25711867, 25751999, 25781647, 25813224, 25881252, 26049299, 26314190, 26516676, 26463811, 26204468]
10170B6204468j45821J74861K81437K8225k18174j12354J74147K71710J78710
10161B6837209J37652J42008J8418j15037K0540L01475L04838L3404l2001K34081
10151B7882587L18457o5034m04027j68858L08722L57186L4363m1724K22019K54939
10141B8698630j51696m20883j01017L94876M19290M6908j29118P2844K49847J31262
10131B9210943l9561K8814K18225K36940O3595q8054j00389k6237P0893J42497
10121B9717666R5653p1872j33339J08760M38923M18249L0996k07769J7138L30187
10111C0744592K39431q7120r8664K37640L84475J12747j49025m6134J56027J06375
10101C1600344n596J61612M14922L01798r1372k12369Q9733L34717J73810j19462
$$ y = [26204468, 26058647, 26233508, 26514945, 26543170, 26324996, 26212642, 26386789, 26658499, 26837209, 26974861, 27116869, 27135287, 27020250, 27040790, 27342265, 27647103, 27680507, 27648506, 27882587, 28201044, 28136010, 27731983, 27563125, 27871847, 28229033, 28263396, 28221672, 28443691, 28698630, 28546934, 28126051, 28025034, 28419910, 28839200, 28886108, 28756990, 28829834, 29079681, 29210943, 29171382, 29200196, 29418421, 29655361, 29718956, 29630902, 29530513, 29504276, 29575169, 29717666, 29813319, 29741447, 29608108, 29716868, 30155791, 30574040, 30605036, 30397267, 30414405, 30744592, 30984023, 30896903, 30798239, 31035879, 31420354, 31533101, 31384076, 31337942, 31493969, 31600344, 31594748, 31756360, 32171282, 32473080, 32381708, 32169339, 32259072, 32593789, 32767599, 32648137]
10091C2648137j47410L7986J49414J31031R9433O5122K2524J09441L55602M57934
10081C3929214J71175k16427k09646J57916L61057J77339l0454L5240J48779L8337
10071C4562530r1475O8669L30998K79455j5947q9894J40046K44030M4228m8069
10061C5424571K51868N36337L06884j95756l08545O7202L58285K01943r1611j03109
10051C6448069J15168K66105K77285K52715J85549J9955j28015q0145J23477K56728
10041C7736891K01644P1704N6660K22206M26695M20382J32909j48333q8848J88888
10031C9220798K17731r4050k42477J06454N14947L85004j03206k37694J49375
10022C9916882M73870L39634Q4488J38867L44906K98787K5710j16916k2502Q1536
$$ y = [32648137, 32500727, 32538713, 32688127, 32819158, 32918591, 32983713, 33006237, 33115678, 33471280, 33929214, 34100389, 33883962, 33674316, 33832232, 34193289, 34370628, 34340174, 34375414, 34524193, 34562530, 34471055, 34539724, 34870722, 35150177, 35134230, 35044336, 35184382, 35428412, 35472640, 35424571, 35676439, 36212776, 36519660, 36323904, 36015359, 36082561, 36440846, 36642789, 36551178, 36448069, 36563237, 36829342, 37106627, 37359342, 37544891, 37564846, 37436831, 37356686, 37480163, 37736891, 37938535, 38010239, 38066899, 38289105, 38715800, 39136182, 39269091, 39120758, 39031910, 39220798, 39438529, 39344479, 39102002, 39208456, 39723403, 40108407, 40005201, 39767507, 39916882, 40390752, 40730386, 40814874, 40953741, 41298647, 41597434, 41623144, 41506228, 41483726, 41565262]
10012D1565262O4865O2542J85576L15701K71590N6325j16338k3344L00186N06110
10002D3188475K93149j48410k73976J18427N72812N64117J77914r0949m8791N6317
9992D4409085L7964K1547J30825K61360K98367K99538L14890K47401O1666n2822
9982D6029821P5489L11843L62717J58289o7492o4836J64068L77499L35106O9832
9972D7752336q3826J41186N31129N61481R6405l24398j50148M13672O61893L44384
9962D9944114n4301o6748J46119J74232R718m0158J07824K51356K96670L35477
9952E1104303L41463J71057p2180n3625K68230M86519L25491N0784K6686J62473
9942E2811201J57411N5645J20287L00466K98498J19891P5655K08994K10915J5944
$$ y = [41565262, 41630127, 41692669, 41878245, 42193946, 42465536, 42521861, 42405523, 42382179, 42682365, 43188475, 43481624, 43333214, 43059238, 43177665, 43750477, 44314594, 44492508, 44401559, 44352768, 44409085, 44447049, 44468596, 44599421, 44860781, 45159148, 45458686, 45773576, 46020977, 46082643, 46029821, 46105310, 46417153, 46779870, 46938159, 46870667, 46805831, 46969899, 47347398, 47682504, 47752336, 47668510, 47809696, 48340825, 48902306, 48998711, 48674313, 48524165, 48937837, 49599730, 49944114, 49889813, 49823065, 49969184, 50143416, 50153134, 50112976, 50220800, 50472156, 50768826, 51104303, 51445766, 51616823, 51544643, 51491018, 51759248, 52245767, 52571258, 52622042, 52648728, 52811201, 52968612, 53024257, 53144544, 53445010, 53743508, 53863399, 53939054, 54148048, 54358963, 54374907]
9932E4374907j9966K50362M38774K47414m705J01995L87845L83060J01330k7122
9922E6233894J25236K61932K32681K08941K41344J47494l0220N2631M38165O37067
9912E8549165L24699j13315j29931J81300L01640J26181O0015K84850M45731K45475
9902F0275810n4671k4283K97125M81537L24640O5697k953J20967K70797L58866
9892F2113532L74246K91075J39332O3549J42954K26821J33147l9173j5869K36253
9882F3665867M35275L83584K10829J19789J16287J31617J93046K87795K61607
9873F5805696P4438l0642J30291L46344L17314J37366J18072K47460K40933Q3775
9863F7471047O9648K55441L30848J55751j434N4014J28471M8231L662J77830L54532
$$ y = [54374907, 54354941, 54605303, 55044077, 55291491, 55286786, 55388781, 55776626, 56159686, 56261016, 56233894, 56359130, 56621062, 56853743, 57062684, 57304028, 57451522, 57421302, 57473933, 57912098, 58549165, 58873864, 58760549, 58630618, 58811918, 59113558, 59239739, 59299754, 59584604, 60030335, 60275810, 60221139, 60196856, 60493981, 60975518, 61300158, 61365855, 61362902, 61483869, 61754666, 62113532, 62487778, 62778853, 62918185, 62981734, 63124688, 63351509, 63484656, 63445483, 63429614, 63665867, 64101142, 64484726, 64695555, 64815344, 64931631, 65063248, 65256294, 65544089, 65805696, 65880134, 65849492, 65979783, 66326127, 66643441, 66780807, 66898879, 67146339, 67387272, 67471047, 67540695, 67796136, 68126984, 68282735, 68281301, 68335315, 68463786, 68512017, 68515679, 68693509, 69048041]
9852F9048041K54951J9444j6708J53075K72101K75564L15654M03551L66160J53536
9842G1245369p1496j44230j4122K72881N24388M71052J15584j43224o217K77125
9832G2527110K83273O1671j1874J00130Q5023q8882o9811K40683M53592L00710
9822G3881625M1961R794J22124J39999R0003J06908J10836k0470j42651l9026
9812G4301103J98500K88167J83828J06612J83063K87270K53519P9461r8820j43068
9802G5639635m2944N5554L2125O4J53204L86650L52164P820k11149o819K95254
9791G6661558K16182j44833k64885K5177L42275L37304J09945m2420m600J27351
9781G7363054J96761J01472r4431j70155k3178J34121O2995j07453o4252J68541
$$ y = [69048041, 69302992, 69322436, 69305728, 69458803, 69730904, 70006468, 70322122, 70725673, 71091833, 71245369, 71173873, 71029643, 71015521, 71288402, 71812790, 72283842, 72399426, 72256202, 72249985, 72527110, 72810383, 72872054, 72860180, 72960310, 73045333, 72956451, 72886640, 73127323, 73580915, 73881625, 73923586, 73933380, 74055504, 74195503, 74285506, 74392414, 74503250, 74482780, 74340129, 74301103, 74499603, 74787770, 74971598, 75078210, 75261273, 75548543, 75802062, 75881523, 75782703, 75639635, 75596691, 75652245, 75684370, 75684434, 75837638, 76224288, 76576452, 76584272, 76373123, 76366304, 76661558, 76877740, 76732907, 76468022, 76493199, 76835474, 77172778, 77282723, 77240303, 77235703, 77363054, 77559815, 77661287, 77566856, 77396701, 77373523, 77507644, 77570639, 77463186, 77398934, 77567475]
9771G7567475K45189N4124j07887j6328J64320J96915J11250M8178J3578k6898
9761G8249916k0926K9323m90j21247j35476M8728K19998J72859R837p2150q8605
9750G8291767j24521r5261O1342J37494n8677k95713j72209K68349N44828L83672
9740G8941071J9541k11724k60199k27058j32218N704O5087j7813j16843r2425
9730G7973123R093N7952M2127L8851N8210L6670m3938j13739q4490N6351J90390
9719G8220600J36709j31149l64302k84204M0081K36552J07819j23398j55362j3657
9709G7669689O0386q69l7293M2523J26052J00482K5489Q000Q792r3236k61410
9698G7648605k68174m99K82207J90178k47951m93566j48204M56414O12750J41312
$$ y = [77567475, 77812664, 77866788, 77758901, 77742573, 77906893, 78103808, 78215058, 78263236, 78276814, 78249916, 78228990, 78258313, 78257823, 78136576, 78001100, 78049828, 78269826, 78442685, 78452522, 78380372, 78291767, 78167246, 78071985, 78133327, 78270821, 78212144, 77916431, 77744222, 78012571, 78557399, 78941071, 78960612, 78748888, 78488689, 78261631, 78129413, 78135117, 78200204, 78182391, 78065548, 77973123, 77982216, 78040168, 78082295, 78121146, 78179356, 78216026, 78172088, 78058349, 77973859, 78030210, 78220600, 78357309, 78226160, 77861858, 77577654, 77617735, 77854287, 77962106, 77838708, 77683346, 77669689, 77730075, 77729206, 77691913, 77734436, 77860488, 77960970, 77986459, 77994459, 78003251, 77910015, 77648605, 77380431, 77379932, 77662139, 77852317, 77604366, 77110800, 76962596, 77419010, 78031760, 78173072]
9688G8173072l89576m18326m6897K22895J43534j17957k89165k30194J0987J95867
9678G7254240Q8617j85537j85569K18443N21743K43487l07548m09011K6810L34330
9668G7600005R5791k88333k75647K7923J32817o7327k09274l8779K62475L49002
9658G7588653J17555j95984k65079l9525J64783O7960j51171j00146J86061K45054
9648G7618161p1999l13333j32450J58523J28530o1080R425K52691K32853n0028
9638G7771293j44455Q5648K50610R2624j46595j72705l3249R6100J57294J11638
9628G8068203n5097j37969Q8898L99343L03136j66562l84662p4035K54333J46861
9618G8442449p3225P0588L56832K66992j09677k50331o9336N5189J4757P1370
$$ y = [78173072, 77783496, 77365170, 77318273, 77541168, 77684702, 77566745, 77277580, 77047386, 77058373, 77254240, 77342857, 77157320, 76971751, 77190194, 77711937, 77955424, 77647876, 77238865, 77265675, 77600005, 77695796, 77407463, 77131816, 77159739, 77292556, 77225229, 77015955, 76977176, 77239651, 77588653, 77706208, 77510224, 77245145, 77205620, 77370403, 77438363, 77287192, 77187046, 77373107, 77618161, 77546162, 77232829, 77100379, 77258902, 77387432, 77326352, 77335777, 77588468, 77821321, 77771293, 77626838, 77712486, 77963096, 78055720, 77909125, 77736420, 77703171, 77799271, 77956565, 78068203, 78013106, 77875137, 77964035, 78363378, 78666514, 78499952, 78115290, 78041255, 78295588, 78442449, 78369224, 78439812, 78796644, 79063636, 78953959, 78703628, 78634292, 78689481, 78704238, 78775608]
9608G8775608K48570K58865R2835P7048K38547K00739j18247k76969k8310K62720
9598G9731406K31698O9796R4342J80810O1895j25334o2710J82719K67754J35044
9588H0767420N6053J59663K76078K50264J17278m1931j67905j46446R2026L76269
9578H1738769M16892J71246q7159j04024R3951L00875L62112K63179R2994k9402
9568H3219433l5903N9800K03973L26006L29458J73208j3916l9340Q9352J75096
9558H4487167J60098K13787L78649M06624J71886j8658J42614M23147L54174k4918
9548H6694570j85816R6741M21970L85785J37031N6299J69905K07682Q9550K6243
9538H8099960J53544L26767L45738K19069J15625J44248K65364L75969M00810
$$ y = [78775608, 79024178, 79283043, 79375878, 79452926, 79691473, 79892212, 79773965, 79496996, 79468686, 79731406, 79963104, 80032900, 80127242, 80308052, 80369947, 80244613, 80181903, 80364622, 80632376, 80767420, 80823473, 80983136, 81259214, 81509478, 81626756, 81584825, 81416920, 81270474, 81362500, 81738769, 82155661, 82326907, 82239748, 82135724, 82229675, 82530550, 82892662, 83155841, 83248835, 83219433, 83183530, 83243330, 83447303, 83773309, 84102767, 84275975, 84262059, 84222719, 84312071, 84487167, 84647265, 84861052, 85239701, 85646325, 85818211, 85799553, 85942167, 86365314, 86719488, 86694570, 86508754, 86605495, 87027465, 87413250, 87550281, 87606580, 87776485, 87984167, 88073717, 88099960, 88253504, 88580271, 88926009, 89145078, 89260703, 89404951, 89670315, 90046284, 90447094]
9529I0447094L06726J11538p6598r2893J24598M26213N78682M95544K79955Q2286
9519I2683145R641J09438K90098L21195J17508m0829J45759M74548M56500R5099
9509I4662102l3597L34409O97241N63181K04884J51789L26878K92727P8234Q4603
9499I7362451L07822L39129J17694L2176K20962L81304L61264L55065M10824L36999
9489A00225690K07742L30279N70777M09390j16375k74617K17329O73680N29932
9480A02773827K08218K93302N37934M32437J78558K52154M57014L15824N4219
9471A05503487K40568O72307O18863R6234r8777L06410O77801N78449L48803L07234
9461A09251379K30412J1710M5331M76896P65166N21419J76895K47394M84130L92373
$$ y = [90447094, 90753820, 90865358, 90788760, 90695867, 90820465, 91246678, 91825360, 92320904, 92600859, 92683145, 92692786, 92802224, 93092322, 93413517, 93531025, 93490196, 93635955, 94110503, 94567003, 94662102, 94628505, 94962914, 95660155, 96223336, 96428220, 96580009, 96906887, 97199614, 97277848, 97362451, 97670273, 98009402, 98127096, 98159272, 98380234, 98761538, 99122802, 99477867, 99888691, 100225690, 100433432, 100763711, 101334488, 101743878, 101627503, 101352886, 101570215, 102243895, 102773827, 102982045, 103275347, 103813281, 104245718, 104424276, 104676430, 105133444, 105449268, 105503487, 105744055, 106416362, 107035225, 107131459, 107032682, 107339092, 108016893, 108595342, 108944145, 109251379, 109481791, 109493501, 109538832, 110015728, 110780894, 111302313, 111479208, 111726602, 112210732, 112603105]
9451A12603105J32806J97761N08613N61488L05358J88159L66596M85808L14060
9442A15663754Q9623J06538L30375N42015N87339M28528J87470J36257L95195
9433A18467094O75968O11266L01546J92463L97200N24393K98489o373J9622L30773
9423A21812441N32432M48785L02329L35077M83759N23334L91157K29922J63199
9414A25222435J80942K60384M29466O13212N82186K45643j07045r0906K90285
9405A27626602O67955P77134O54862M22138J84211J32842L74041O15875M44121
9396A31899781l173j11481K89332O08843M05271P8639J92513N60691O02534K90537
9386A34813487J01212K00176L03237K73206K72486L32962L00859K22892L07466
$$ y = [112603105, 112735911, 112933672, 113442285, 114003773, 114309131, 114497290, 114863886, 115349694, 115663754, 115753377, 115859915, 116190290, 116732305, 117319644, 117748172, 117935642, 118071899, 118467094, 119143062, 119754328, 120055874, 120248337, 120645537, 121169930, 121468419, 121462046, 121481668, 121812441, 122344873, 122793658, 123095987, 123431064, 123914823, 124438157, 124829314, 125059236, 125222435, 125403377, 125663761, 126093227, 126706439, 127288625, 127534268, 127427223, 127336317, 127626602, 128294557, 129071691, 129726553, 130148691, 130332902, 130465744, 130839785, 131455660, 131899781, 131896608, 131785127, 132074459, 132683302, 133088573, 133167212, 133359725, 133920416, 134522950, 134813487, 134914699, 135114875, 135418112, 135691318, 135963804, 136296766, 136597625, 136820517, 137127983]
9377A37127983M95962N28582M14644L73986L70731K22635R4354K71434N02196
9368A40402507K90795j37995j6746O53089R00231K88177l00985j9660O22840O30949
9358A43313202R1099j12383K27044M70357L18195J94675L53246M42213K10837
9349A45508485k0789Q6185L61137M49410L07246J30863O7251J58925L39061M02868
9339A47790642K29888L5402R6453K76956K31279L5652Q8856L53657L31799l0885
9329A49439699j05449L89716P85013M49111j72847k30449K17536L92042R8175
9320A51262547n6581K14045M12225J88063l8823J57791M48668L24229k3801m2219
9310A52846144K48771L36979J10357m581J73958K96619J48172L2192K07261M10712
$$ y = [137127983, 137623945, 138152527, 138567171, 138941157, 139311888, 139534523, 139628877, 139900311, 140402507, 140693302, 140555307, 140538561, 141191650, 142091881, 142380058, 142079073, 142059413, 142682253, 143313202, 143404301, 143291918, 143518962, 143989319, 144307514, 144502189, 144855435, 145297648, 145508485, 145487696, 145573881, 145935018, 146384428, 146691674, 146822537, 146889788, 147048713, 147387774, 147790642, 148020530, 148055932, 148152385, 148429341, 148660620, 148696272, 148785128, 149138785, 149470584, 149439699, 149334250, 149723966, 150508979, 150958090, 150785243, 150554794, 150772330, 151164372, 151262547, 151205966, 151420011, 151832236, 152020299, 151981476, 152139267, 152587935, 152912164, 152888363, 152846144, 153094915, 153431894, 153542251, 153537670, 153711628, 154008247, 154156419, 154188611, 154395872, 154806584]
9300A54806584L06931M5028k5123Q7480J44236J40782K16125K68517J13459p9542
9290A56024477K7108L55073M75507K74708R1017J18164J43254K3422k9896J36499
9280A57639333L14493K95537J95814J75071J54796O9595P7168K40806L12862J29605
9270A59605080p4697m4960J09703K07418L17726M49900L24115r5428k56602K06882
9260A60749137P27529N38375j21782l45945N3201L76685K57458J22552K60343
9251A62617553L21980J01702R000K98191N24926K99593k5491P418J82243R6390
9241A64433505m1564J94453N98322O06070K18607m1243J8102J00664P5523J52971
9231A66315410L58096L98996J90309M0637J64450L76599M10213K50694O4511K5305
$$ y = [154806584, 155113515, 155158543, 155133420, 155220900, 155365136, 155505918, 155722043, 155990560, 156104019, 156024477, 156051585, 156406658, 156882165, 157156873, 157247890, 157366054, 157509308, 157532730, 157502834, 157639333, 157953826, 158249363, 158445177, 158620248, 158775044, 158844639, 158921807, 159162613, 159475475, 159605080, 159530383, 159485423, 159595126, 159802544, 160120270, 160570170, 160894285, 160798857, 160542255, 160749137, 161476666, 162015041, 161893259, 161547314, 161600515, 161977200, 162234658, 162357210, 162617553, 162939533, 163041235, 163050235, 163348426, 163873352, 164172945, 164147454, 164154872, 164337115, 164433505, 164391941, 164586394, 165184716, 165790786, 166009393, 165968150, 165986252, 166086916, 166162439, 166315410, 166673506, 167072502, 167262811, 167303448, 167467898, 167844497, 168254710, 168505404, 168569915, 168595220]
9221A68595220K16762M88767M99436J72236n1447K05602O04744N38348J03566
9212A71373234j4218L56518N97868L19530l8642K1669K83676K91450J24380J50501
9202A73465966L43790M05843L46854M04618N22606M34126K03286J72060L58620
9193A76657769M02957K01436J16911L59089N80531M04739M5104K285L09763N09439
9183A79590023L71762K16944L50866N39477L89866M8355N4430M93483P81195N08073
9173A83344474P3819R2898M79760O38964M02893J97422K75381L79697L17064L03088
9163A86505460M66611N20857K94447J38644L56390O15200M63628J22544J40930
9154A89624711M59646N07922J89419N9524L86350O97891N51343J98083J05206
$$ y = [168595220, 168811982, 169300749, 169800185, 169972421, 169920974, 170126576, 170731320, 171269668, 171373234, 171359016, 171715534, 172313402, 172632932, 172594290, 172615959, 172899635, 173191085, 173315465, 173465966, 173809756, 174215599, 174562453, 174967071, 175489677, 175923803, 176127089, 176299149, 176657769, 177060726, 177262162, 177379073, 177738162, 178318693, 178723432, 178768536, 178770821, 179080584, 179590023, 179961785, 180178729, 180529595, 181069072, 181458938, 181507293, 181561723, 182055206, 182836401, 183344474, 183418293, 183511191, 183990951, 184629915, 185032808, 185230230, 185505611, 185885308, 186202372, 186505460, 186972071, 187492928, 187787375, 187926019, 188282409, 188897609, 189361237, 189483781, 189624711, 190084357, 190592279, 190781698, 190841222, 191227572, 191925463, 192476806, 192674889, 192780095]
9145A92780095K61288L86067M72907O43196P18574M56924P9203M8304L57702N32478
9135A96736738L78978K37737L47671M49929L10123K05043M56909P81084O36835
9126B00541047J13588j06064K52953O33980M82108N3596j7874L30658N74727M24296
9116B03283015J65770J33640K77192M07395N09687N87872M95185K00790M926J73611
9106B06239083M93973N19158K04172k1711J46337M95036O11473L99173J26680
9097B09213374O2304J98464L22990K81314J36169P2054J66607L07460L45029K59271
9087B11365036J43480R6151J66426L17638L99480K69498J0818j01140N3920K67350
9077B12988657L03500K23639K25733K94441K48874P0154n6991j1017J52849L23800
$$ y = [192780095, 193041383, 193427450, 193900357, 194543553, 195262127, 195719051, 195798254, 195846558, 196204260, 196736738, 197115716, 197353453, 197701124, 198151053, 198461176, 198666219, 199123128, 199904212, 200541047, 200654635, 200548571, 200801524, 201435504, 201917612, 201971208, 201953334, 202283992, 202858719, 203283015, 203448785, 203582425, 203859617, 204267012, 204776699, 205364571, 205859756, 206060546, 206065472, 206239083, 206733056, 207252214, 207456386, 207434675, 207581012, 208076048, 208687521, 209086694, 209213374, 209275678, 209474142, 209797132, 210078446, 210214615, 210286669, 210453276, 210760736, 211105765, 211365036, 211508516, 211604667, 211771093, 212088731, 212488211, 212757709, 212768527, 212667387, 212721307, 212988657, 213292157, 213515796, 213741529, 214035970, 214284844, 214354998, 214298007, 214286990, 214439839, 214763639]
9067B14763639L86582K21157j18630k93926l7172M04094N01406J54939j69539
9058B15812550j05830J54378K38925J16111o764o1752j17597j58025j21836n4571
9048B15695589o223R5240K48169K12647j55559n15289l66933K11291N41096K17469
9038B16177497l21526l80640M8646L12160L5657l60938k97552J11325K25520j70881
9028B15379268n38355l69105Q2006K16709p697r9474J02776J46991k62287o93084
9018B13957748n66968j1717L13576J19447k24277l10904k09990k05849l13751
9009B12547315l07124j14457L8753q3060m12105o25113m91673j25498J45198J29830
8999B10702066o6054k26340k71062k72543l04943l55841l60709k77732j42017
$$ y = [214763639, 215150221, 215371378, 215252748, 214958822, 214921650, 215325744, 215827150, 215982089, 215812550, 215706720, 215861098, 216100023, 216216134, 216209370, 216147618, 216030021, 215871996, 215750160, 215695589, 215689366, 215784606, 216032775, 216245422, 216089863, 215574574, 215207641, 215418932, 215960028, 216177497, 215855971, 215475331, 215523977, 215836137, 215871794, 215510856, 215213304, 215324629, 215550149, 215379268, 214840913, 214471808, 214553814, 214770523, 214762826, 214663352, 214766128, 214913119, 214650832, 213957748, 213390780, 213379063, 213692639, 213812086, 213587809, 213276905, 213066915, 212861066, 212547315, 212240191, 212125734, 212164487, 212081427, 211669322, 211044209, 210552536, 210427038, 210572236, 210702066, 210636012, 210409672, 210138610, 209866067, 209561124, 209205283, 208844574, 208566842, 208424825]
8990B08424825n5896r3066k13768l13575l33631k73278j53201n8118j38031m14926
8980B06377335o48277n82401k90686o9783l8161r0241j97142m12044n70461l94692
8970B03083447p13J21866j80633m60107l64598j69857k56180m55129l84439j27478
8960B00806179o2661k23456l36508l39896l61602l21501q5935R0230j47311n70400
8950A98447139n86876j70859N5450k04880m94504l83061j03832p5179k56612l57471
8940A95869315l27324k83319k35132j88550k63225m44179m83388k89689j24546
8931A93229963j67943k19663j14205p6016k98285m97567l27821J6559Q2387j38681
8921A91488728k68235j90197j56762k72985l36077k47150j85505k58435l00390
$$ y = [208424825, 208368929, 208275863, 208062095, 207748520, 207414889, 207141611, 206988410, 206930292, 206792261, 206377335, 205729058, 205146657, 204855971, 204786188, 204748027, 204657786, 204460644, 204048600, 203478139, 203083447, 203082734, 203204600, 203023967, 202563860, 202199262, 202029405, 201773225, 201318096, 200933657, 200806179, 200743518, 200520062, 200183554, 199843658, 199482056, 199160555, 199074620, 199164850, 199017539, 198447139, 197860263, 197689404, 197744854, 197539974, 197045470, 196662409, 196558577, 196483398, 196226786, 195869315, 195541991, 195258672, 195023540, 194834990, 194571765, 194127586, 193644198, 193354509, 193229963, 193062020, 192842357, 192728152, 192652136, 192353851, 191856284, 191528463, 191545022, 191627409, 191488728, 191220493, 191030296, 190873534, 190600549, 190264472, 190017322, 189831817, 189573382, 189272992]
8912A89272992j70315j2560n9277l03257m90829l99761q4549J54084Q8605j58133
8902A87837000k80912k24630k15873l20369k96847n3437J01474n5538k46192j29658
8892A86115018J04675K9720l05111m31729j76586J26051J46291q7201l63020m86927
8882A84671181l06188J36162M64298L11499j78164m89515l86694j22380O136j6929
8872A84089406q9887j78401k47487k32286j34886J812J74218L14917K50410j5085
8862A83932731j69441m4596L8679k19988m94806k76222K56902M37956J18268j82728
8852A83396755j48759k4613j3804K4562J23264P7601n5701N3944L46954L44143
8842A84124346j6906k08774k6944P1102j30817j62645K14765M47850J44763j60783
$$ y = [189272992, 189102677, 189090117, 189030840, 188727583, 188236754, 187836993, 187752444, 187906528, 187995133, 187837000, 187556088, 187331458, 187115585, 186795216, 186498369, 186444932, 186546406, 186490868, 186244676, 186115018, 186219693, 186249413, 185944302, 185512573, 185335987, 185462038, 185608329, 185521128, 185158108, 184671181, 184364993, 184501155, 184965453, 185276952, 185098788, 184609273, 184222579, 184100199, 184106335, 184089406, 183999519, 183821118, 183573631, 183341345, 183206459, 183208271, 183382489, 183697406, 183947816, 183932731, 183763290, 183718694, 183757373, 183537385, 183042579, 182766357, 183023259, 183461215, 183579483, 183396755, 183247996, 183223383, 183209579, 183234141, 183357405, 183435006, 183379305, 183433249, 183780203, 184124346, 184107440, 183898666, 183871722, 183942824, 183812007, 183649362, 183864127, 184311977, 184456740, 184295957]
8832A84295957Q1218M47526K91748j01897m3210L32905L38308n8063k56613r4016
8822A85233863L4868L1087J87136M51091M28173J45224M0175J58607J18615q8746
8812A86740093m2556K82406M04131J79647K4223J34408K17100J59744K39479M63240
8802A88801915M27700P6752j10237O1279K04839J40288K23989N61141O53332K56832
8792A91297830j23620o2828J47058J68008K25923M96841N74664K02808q9743J99302
8782A93036243O48566N84685J71641M2986K49994L73781L49783L88446L69195
8773A96215320J06351n6129K62321O48054M45285o3484j3481N83790P95731L03721
8763A99227479o7387K93178Q23475P31105J87551m9230K41522N90892N92423L47044
$$ y = [184295957, 184377175, 184824701, 185116449, 185014552, 184971342, 185304247, 185642555, 185584492, 185327879, 185233863, 185268731, 185299818, 185486954, 185938045, 186366218, 186511442, 186551617, 186710224, 186828839, 186740093, 186697537, 186979943, 187384074, 187563721, 187587944, 187722352, 187939452, 188099196, 188338675, 188801915, 189229615, 189306367, 189196130, 189257409, 189462248, 189602536, 189826525, 190387666, 191040998, 191297830, 191174210, 191111382, 191258440, 191426448, 191652371, 192149212, 192723876, 192926684, 192836941, 193036243, 193684809, 194269494, 194441135, 194484121, 194734115, 195107896, 195457679, 195846125, 196215320, 196321671, 196265542, 196527863, 197175917, 197621202, 197557718, 197544237, 198128027, 198923758, 199227479, 199160092, 199453270, 200276745, 201007850, 201195401, 201146171, 201387693, 201978585, 202571008, 202918052]
8753B02918052K14353L71763O15175N73048K03940n0279J59462N50189O19497
8744B06175200M08020L45532M80663M76494L14627L28951N08525M71908K35988
8735B09745908K68530N95054O39867K56019J08112N70215R98981P22117J22144
8726B14026947J6884M23188O85498N37374L18625K87678L46760M02901N03444
8717B17549299O20814O54456O00678M96829L57411L24133N57718Q00019N34712
8708B22496069j12064k43964N22517J273235J023237J85882r0795L52342O80613
8699B26087072N64451N22273P29027O50314J70096J8023N52874J018790O83770
8690B30996690K2101l66O40088J073965Q03626K48775M8808L10463O37009O41571
$$ y = [202918052, 203132405, 203504168, 204119343, 204692391, 204896331, 204846052, 205005514, 205555703, 206175200, 206583220, 206928752, 207409415, 207885909, 208200536, 208529487, 209038012, 209509920, 209745908, 210014438, 210609492, 211249359, 211505378, 211613490, 212183705, 213182686, 213904803, 214026947, 214043831, 214467019, 215152517, 215689891, 216008516, 216296194, 216642954, 217045855, 217549299, 218170113, 218824569, 219425247, 219922076, 220279487, 220603620, 221161338, 221961357, 222496069, 222384005, 222140041, 222662558, 223935793, 224959030, 225144912, 225054117, 225406459, 226087072, 226651523, 227173796, 227902823, 228553137, 228723233, 228741256, 229294130, 230312920, 230996690, 231018791, 231018425, 231658513, 232732478, 233536104, 233784879, 233833687, 234144150, 234781159, 235422730]
8680B35422730L56838J90620M18475P78760Q08170N21764L71737N18593O30192
8671B40017879N15114M18109M77089M44230K45290K46645N72964P31525M17754
8662B44086599J37438L97095P84624O31457J86460K22341P04767Q39836M24474
8653B48415091J57986M21991O82819M86217K30324M13362P57070P04853L43761
8644B52613474J95175L63335M83676L82848K79976L62639N48918O69808O25508
8635B56525357M14537K10283K70805N55561O38252K92901n8619J17722O53105
8626B59619904Q74819N59392J79713J43610K85182L01069K58111L66486N49579
8617B63137865N70747M18180K79915K43848K61235L20610M27887M68621L18170
$$ y = [235422730, 235779568, 235970188, 236388663, 237167423, 237975593, 238497357, 238869094, 239387687, 240017879, 240532993, 240951102, 241428191, 241872421, 242117711, 242364356, 242937320, 243668845, 244086599, 244224037, 244621132, 245405756, 246037213, 246223673, 246446014, 247150781, 247990617, 248415091, 248573077, 248995068, 249677887, 250164104, 250394428, 250807790, 251564860, 252269713, 252613474, 252808649, 253171984, 253655660, 254038508, 254318484, 254681123, 255230041, 255899849, 256525357, 256939894, 257150177, 257420982, 257976543, 258614795, 258907696, 258849077, 258966799, 259619904, 260494723, 261054115, 261233828, 261377438, 261662620, 261963689, 262221800, 262588286, 263137865, 263708612, 264126792, 264406707, 264650555, 264911790, 265232400, 265660287, 266128908, 266447078]
8608B66447078Q8790O7214L50106O76231P00164L76982J8815l1524K32721M81306
8598B69407883M47974K57196K24504L92433M91437L83345K64672K98778L21443
8589B72489665J46445o0858k1247J97574K94988K28395K37839L97539M90703L78172
8579B74779215J84766N5861P281O0758K31192L42634J98310j9053P5332M03635
8569B76319931M35400N6143j38310K18113N87224L52566j48886j51877K85518
8560B77815822M00295Q89k55732N196L00540J74306n8465O7749L57177L20669
8550B79128446j1353j91901n5487J63786K71998K66514J53338l4485j25666j6162
8540B79549028J22694J07477N3114J24985J74711n226k28342j52089J25893J75383
$$ y = [266447078, 266535868, 266603082, 266953188, 267629419, 268329583, 268706565, 268725380, 268693856, 268926577, 269407883, 269855857, 270113053, 270337557, 270729990, 271221427, 271604772, 271869444, 272168222, 272489665, 272636110, 272575252, 272554005, 272751579, 273046567, 273274962, 273512801, 273910340, 274401043, 274779215, 274963981, 275019842, 275027123, 275087881, 275319073, 275661707, 275860017, 275840964, 275916296, 276319931, 276755331, 276811474, 276673164, 276891277, 277478501, 277831067, 277682181, 277530304, 277815822, 278216117, 278217006, 277961274, 277966470, 278267010, 278441316, 278382851, 278450600, 278807777, 279128446, 279117093, 278925192, 278869705, 279033491, 279305489, 279572003, 279725341, 279690856, 279565190, 279549028, 279671722, 279779199, 279832313, 279957298, 280132009, 280126783, 279898441, 279746352, 279872245, 280047628]
8530B80047628p6142k27624m9160J92918J97125L5606p8877j16315j20248m1198
8520B79763713J10548J56004o328k05921k25109q2779N0767Q7905L6900q7108
8510B79598592k20719k31054p6384R0333R5812l8271j46640j29499l5250J9350
8500B78926270l7387j61199k26520j80037j23598j58339k08860j42423o751L3417
8490B77714573l5145p0270k5002P523q020k7393r0566k56763l84709k72768l7907
8479B76513553k1452k52630l65781j74289M1102L140j52132j75373j05071j01862
8469B75209205j43219j44581j51463j79225j14078O112q2159m03619n50779k80818
8459B73165376M9157L8996j21082n8579P8527p9902l86946m03424j91080j75917
$$ y = [280047628, 279971486, 279743862, 279694702, 279887620, 280084745, 280120351, 280041474, 279925159, 279804911, 279763713, 279874261, 280030265, 280023937, 279818016, 279592907, 279510128, 279560895, 279648800, 279685700, 279598592, 279377873, 279146819, 279070435, 279160768, 279256580, 279218309, 279071669, 278942170, 278906920, 278926270, 278888883, 278727684, 278501164, 278321127, 278197529, 278039190, 277830330, 277687907, 277681156, 277714573, 277679428, 277609158, 277584156, 277591679, 277583659, 277556266, 277465700, 277208937, 276824228, 276551460, 276513553, 276492101, 276239471, 275873690, 275699401, 275740503, 275743643, 275591511, 275416138, 275311067, 275209205, 275065986, 274921405, 274769942, 274590717, 274476639, 274482751, 274400592, 273996973, 273446194, 273165376, 273214533, 273253529, 273132447, 273073868, 273152395, 273072493, 272685547, 272282123, 272091043, 271915126]
8449B71915126l18808j88312J39007Q0054m00125n74176j19616K85013J7025n14449
8439B70320739n57929j56367Q1137k3253j32332r2664p9581j45757j74673k20228
8429B68819092m03199n36698l40430K1385J10455r8418k13950j31578j78444m29560
8419B66618655m56151m6888L10445Q8569m71032o76713l41296L7236K0527k48876
8409B64834476l71744k36617n5822k1077j13424k04720k02251r2780M4452N0415
8399B63630908j69968m60073m99074k04623P1256m0230l86264m68494j70085N8363
8389B61361716j09438l74861l16498q0050j12997l85321m11230n6765K00065n326
8379B59709295l72423m01911j14031L9368j68296m77195n10821k07345J27804
$$ y = [271915126, 271596318, 271408006, 271547013, 271627067, 271226942, 270652766, 270533150, 270818163, 270835188, 270320739, 269762810, 269606443, 269687580, 269664327, 269531995, 269439331, 269359750, 269213993, 269039320, 268819092, 268415893, 267879195, 267538765, 267560150, 267670605, 267572187, 267358237, 267226659, 267048215, 266618655, 266162504, 266115616, 266426061, 266514630, 266043598, 265366885, 265025589, 265062825, 265083352, 264834476, 264462732, 264226115, 264170293, 264149216, 264035792, 263831072, 263628821, 263536041, 263580493, 263630908, 263460940, 263000867, 262501793, 262297170, 262368426, 262328196, 261941932, 261473438, 261303353, 261361716, 261252278, 260877417, 260560919, 260480869, 260367872, 259982551, 259571321, 259514556, 259714621, 259709295, 259336872, 258934961, 258820930, 258860298, 258692002, 258214807, 257703986, 257496641, 257624445]
8370B57624445J17629k86537o65339n37885J5245L42722J4193n72930o68821j60657
8360B55222065K66558L3736n73257p79169l08447K84368L18117k01548o58047
8351B53604376o19478k96780j39535k32594l24470k92335k53980k52400j70757
8342B51022047k8948m0296k33458l24727j71511o5471k92328o39019o85500m21014
8332B48119775j91924j40460j05172m9903j57103m20393n48161m18044k68586
8323B45820029k64298k29210n3066q931l15020o55519n67915j48510P6210q5690
8313B43568080l13836l79861m49386o28215o53007l31831L0117P665l31252n43528
8303B39974946m35563k29090j46257j66919k31393l73191n47438n82338m36061
$$ y = [257624445, 257742074, 257455537, 256790198, 256252313, 256267558, 256610280, 256624473, 256051543, 255382722, 255222065, 255488623, 255522359, 254949102, 254169933, 253861486, 254145854, 254463971, 254262423, 253604376, 252984898, 252688118, 252548583, 252315989, 251991519, 251699184, 251445204, 251192804, 251022047, 250993099, 250952803, 250719345, 250394618, 250223107, 250157636, 249865308, 249226289, 248540789, 248119775, 247927851, 247787391, 247682219, 247632316, 247475213, 247054820, 246506659, 246088615, 245820029, 245555731, 245326521, 245273455, 245264524, 244949504, 244293985, 243726070, 243577560, 243653770, 243568080, 243254244, 242874383, 242424997, 241796782, 241143775, 240811944, 240842061, 240849726, 240518474, 239974946, 239539383, 239310293, 239164036, 238997117, 238765724, 238392533, 237845095, 237262757, 236826696]
8294B36826696k99528l07414l33528k33392j23244k13275m64780o19455n34075
8285B33698005l24273j91155k26118l66101m50646l67101k09580k00094l69219
8276B30993718m70291l56710k50794l85272n56956m12911q9570r8422n20022q02252
8266B27050518n71548j93894j80536m06165l91787j34081j01723m46490p44881
8257B23879413o45996l43270j91190j96538j68805j32919k62476n04714n81893
8248B20851612l91698j82887k38985n09072o65926n10346k26845j63436l75618
8239B17586799n28927l58267q5995j41065n06082o76174l80943j5275q0481m49256
8229B14364334n79313l40753j71683l55925n90499m91905j83503n7426j82524
$$ y = [236826696, 236527168, 236219754, 235886226, 235652834, 235529590, 235316315, 234851535, 234232080, 233698005, 233373732, 233182577, 232956459, 232590358, 232139712, 231772611, 231563031, 231362937, 230993718, 230523427, 230166717, 229915923, 229530651, 228973695, 228560784, 228471214, 228372792, 227852770, 227050518, 226478970, 226285076, 226104540, 225698375, 225306588, 225172507, 225070784, 224624294, 223879413, 223233417, 222890147, 222698957, 222502419, 222333614, 222200695, 221938219, 221433505, 220851612, 220459914, 220277027, 220038042, 219528970, 218863044, 218352698, 218125853, 217962417, 217586799, 217057872, 216699605, 216613610, 216472545, 215966463, 215290289, 214909346, 214894071, 214813590, 214364334, 213785021, 213444268, 213272585, 212916660, 212326161, 211834256, 211650753, 211593327, 211410803]
8220B11410803l14122l63687m64223n86248m87836j58235K9991j82069n34656
8211B08349718n82434k79809K823l4155l18629n50450m94279j76362R4552r001
8201B06001974m25248o89980m98689j26001m2926k61050l86225k46662q5877j12118
8191B03127198k28033k93357l18261k94671j69462q7750k85183n98308n22331
8182B00329842M327L38985K5784m91825n45099k47470j97274m30813m17821m4689
8172A98323947J61234o6182k95630j52198P7113k2687l18669m25850l33987k84704
8162A96662387k64962q2851J81485K25934o876k58443l47336l39241l08831k03229
8152A95258037j2902J25561R5630m1920j26825q1095J6519K3328r2546j96257
$$ y = [211410803, 211096681, 210732994, 210268771, 209682523, 209194687, 209036452, 209066443, 208884374, 208349718, 207767284, 207487475, 207490298, 207456143, 207137514, 206587064, 206092785, 205916423, 206010975, 206001974, 205576726, 204886746, 204388057, 204262056, 204219130, 203958080, 203571855, 203325193, 203239316, 203127198, 202899165, 202605808, 202287547, 201992876, 201823414, 201735664, 201450481, 200852173, 200329842, 200334169, 200673154, 200698938, 200207113, 199662014, 199414544, 199217270, 198786457, 198368636, 198323947, 198485181, 198418999, 198123369, 197971171, 198048284, 198025597, 197706928, 197281078, 196947091, 196662387, 196397425, 196314574, 196496059, 196721993, 196715117, 196456674, 196109338, 195770097, 195461266, 195258037, 195245135, 195370696, 195466326, 195424406, 195297581, 195216486, 195233005, 195256333, 195163787, 194967530]
8142A94967530j68138q6167q6197r9465L4186K06463J14619k26665l98469j75906
8132A94081791J26352J46365j5722q1999p0604j06480m9326K27060M15815J71168
8122A94844420k29628k05545K04053L62553M3014k34077p4667J88212J21008r0808
8112A94928535j3715K92434L96348J69451r7630j58231l1534J75804L60824L80286
8102A96402572J87690j5530Q42J68586K38622J70404J49748K39717K80476J77961
8092A98001088O0540O8279J64813K44946K88244L15463K97192K00181P4502K9739
8082A99744987J33998L42201N07300M95561L36198K14752K54415L52679L25290
8073B02707381J72819Q2563J63073L01422L40891L08327L59606N17111N81589
$$ y = [194967530, 194799392, 194713225, 194627028, 194527563, 194561749, 194768212, 194882831, 194656166, 194257697, 194081791, 194208143, 194354508, 194338786, 194256787, 194186183, 194079703, 194030377, 194257437, 194673252, 194844420, 194614792, 194409247, 194613300, 194975853, 195018867, 194784790, 194710123, 194898335, 195019343, 194928535, 194914820, 195207254, 195603602, 195773053, 195675423, 195517192, 195485658, 195661462, 196022286, 196402572, 196590262, 196574732, 196575574, 196744160, 196982782, 197153186, 197302934, 197542651, 197823127, 198001088, 198061628, 198129907, 198294720, 198539666, 198827910, 199143373, 199440565, 199640746, 199715248, 199744987, 199878985, 200221186, 200728486, 201224047, 201560245, 201774997, 202029412, 202382091, 202707381, 202880200, 202962763, 203125836, 203427258, 203768149, 204076476, 204436082, 204953193, 205534782]
8064B05534782L92845J15777J00286M09239O68540N45973K28500J66601M24395
8055B08586938O13298M95351K97568K93600M06254M43929M41391M89124M75104
8046B12542557L23859K77026N43464Q27270O67219J93607M7458M64632R17490
8037B16804582Q70977M82129K49207K94607L77890M13946N49229P68719Q16329
8028B21627615N91128L37171L09271M58179N91833O76229P83406Q49497P23757
8019B26948086M58795L29211M71970O81922P03956N91272N83030P13864P81176
8010B32263282O86836N67884N41472N55315N76298O85595Q48930Q33268N59852
8001B38118732L35493M70525Q13371R53358P95257O29153O57707P54603P40751
$$ y = [205534782, 205927627, 206043404, 206143690, 206552929, 207221469, 207767442, 207995942, 208162543, 208586938, 209200236, 209695587, 209993155, 210286755, 210693009, 211136938, 211578329, 212067453, 212542557, 212866416, 213143442, 213686906, 214514176, 215181395, 215375002, 215422460, 215887092, 216804582, 217675559, 218157688, 218406895, 218701502, 219079392, 219493338, 220042567, 220811286, 221627615, 222218743, 222555914, 222865185, 223323364, 223915197, 224591426, 225374832, 226224329, 226948086, 227406881, 227736092, 228208062, 228889984, 229593940, 230185212, 230768242, 231482106, 232263282, 232950118, 233518002, 234059474, 234614789, 235191087, 235876682, 236725612, 237558880, 238118732, 238454225, 238924750, 239738121, 240691479, 241486736, 242115889, 242773596, 243528199, 244268950]
7992B44268950O51027O28890P15697Q25474Q42997P33135O14842O63735Q59802
7983B50804549R57057Q28524O67171O59272O74560N58395N04583P45758J054979
7974B57454848J035685P88831P42029Q74437P58583M27332M64127R85238J269392
7965B64800502Q50551L29681M81578J057288J207470P81687M32039N43956Q05838
7956B71290590Q90256R04325R82377R64496P41484N41154O08451Q44274R66211
7947B78733618Q63562O60853N55313O53968Q59337R26921P66960O10651O86743
7938B85317926Q49270Q06912O25850O42245Q95008J037891Q82880O61651O20616
7929B92340249O86646O97979O79621P03142P08988O51668O26391O87293P17244
$$ y = [244268950, 244919977, 245548867, 246264564, 247090038, 247933035, 248666170, 249281012, 249944747, 250804549, 251761606, 252590130, 253257301, 253916573, 254591133, 255149528, 255654111, 256399869, 257454848, 258490533, 259279364, 260021393, 260895830, 261654413, 262081745, 262545872, 263531110, 264800502, 265651053, 265980734, 266462312, 267519600, 268727070, 269508757, 269940796, 270484752, 271290590, 272180846, 273085171, 274067548, 275032044, 275773528, 276314682, 276923133, 277767407, 278733618, 279597180, 280258033, 280813346, 281467314, 282326651, 283253572, 284020532, 284631183, 285317926, 286167196, 286974108, 287599958, 288242203, 289137211, 290175102, 291057982, 291719633, 292340249, 293026895, 293724874, 294404495, 295107637, 295816625, 296468293, 297094684, 297781977, 298499221]
7920B98499221O31019N43012N82827O85882P03036O00505M51778L53623M15719
7911C03466622O72552R28507Q75378M84625J28722J76725N70701R08213Q74626
7902C09086671N36498K61198L39874O37828P24879M63518K57124M52396P33624
7893C13493610N68419J10475M9748N25581Q42173N02078o5218j75394J83208N15697
7883C16550377N51687L90336J87868P1866J44023K87213K30573J7347K4658K87409
7873C18743357L24612j6069j62071K14326M90132R9864l67495o4821N90867M84394
7863C20337096l41602p09351k28446J55458j36875l89698L541L98125N6972n09030
7853C18636190m24081L7143k3430n37832o15393j01159J77667j83248n56356l79822
$$ y = [298499221, 299130240, 299673252, 300256079, 300941961, 301644997, 302245502, 302697280, 303050903, 303466622, 304139174, 305067681, 305943059, 306427684, 306556406, 306733131, 307303832, 308212045, 309086671, 309623169, 309884367, 310224241, 310862069, 311586948, 312050466, 312307590, 312759986, 313493610, 314062029, 314172504, 314222252, 314747833, 315590006, 316092084, 316026866, 315851472, 316034680, 316550377, 317102064, 317492400, 317680268, 317752134, 317896157, 318183370, 318413943, 318431290, 318455948, 318743357, 319067969, 319051900, 318889829, 319104155, 319594287, 319694151, 319326656, 319261835, 319852702, 320337096, 319995494, 319286143, 319057697, 319213155, 319076280, 318686582, 318690123, 319088248, 319145220, 318636190, 318212109, 318249252, 318225822, 317687990, 317072597, 316971438, 317149105, 316965857, 316409501, 316029679]
7843C16029679k912K504k81920m30363l97249m35342n72757o13451n14809m20118
7833C12363262l88547l52264l05910l45459n17902p37894q50342p50926n02036
7824C07611982l31108m13636o49228p69965o80900n54861n61868o55338o95076
7815C02300002o58549o35400o77637p33737p22053o48398o35829p81942r80386
7806B95826071j004513q27122o99095p88734r20326q70085p53797q33667j045209
7797B88083523j055973p83651n30037n49351p67940r92686j122866j087710q61240
7788B80332069o38846p14680j053754j259794j117115q86003q73190r87278r72023
7779B71829386q49546q35227r59386j049700j001379q54796p07063p12880j002089
$$ y = [316029679, 316026767, 316029271, 315747351, 315316988, 314919739, 314484397, 313911640, 313298189, 312783380, 312363262, 311974715, 311622451, 311316541, 310971082, 310453180, 309715286, 308864944, 308114018, 307611982, 307280874, 306867238, 306218010, 305448045, 304767145, 304212284, 303650416, 302995078, 302300002, 301641453, 301006053, 300328416, 299594679, 298872626, 298224228, 297588399, 296806457, 295826071, 294821558, 293994436, 293295341, 292506607, 291586281, 290716196, 289962399, 289128732, 288083523, 287027550, 286243899, 285713862, 285164511, 284396571, 283403885, 282281019, 281193309, 280332069, 279693223, 278978543, 277924789, 276664995, 275547880, 274661877, 273788687, 272801409, 271829386, 270979840, 270144613, 269185227, 268135527, 267134148, 266279352, 265572289, 264859409, 263857320]
7770B63857320j399742j454741j028961o28070p70084j220950j333315j023715
7762B54997742q38560j028921j184536r95130p89167r33259j169704j058110p55611
7753B46244744p85427j176417j400770j178002q37779p67844r23688j065602j134283
7744B36974932j167081j111155r62709q98238j038439j224437j228357j061369
7736B28283147q96495q21453q45648r93701j178507j152032q59394o86103r90797
7727B19859017j481893j498430r46409m97943o78471j163340j288191r60238o77483
7718B10666619p88589j112764j287127j192741r68643q00912p81499q73668r66851
7709B01893825r99504j004948j012653r90496r35926r12989r29554r05523q37853
$$ y = [263857320, 262457578, 261002837, 259973876, 259345806, 258575722, 257354772, 256021457, 254997742, 254159182, 253130261, 251945725, 250950595, 250161428, 249228169, 248058465, 247000355, 246244744, 245459317, 244282900, 242882130, 241704128, 240866349, 240098505, 239174817, 238109215, 236974932, 235807851, 234696696, 233733987, 232835749, 231797310, 230572873, 229344516, 228283147, 227386652, 226565199, 225719551, 224725850, 223547343, 222395311, 221535917, 220849814, 219859017, 218377124, 216878694, 215932285, 215434342, 214755871, 213592531, 212304340, 211344102, 210666619, 209878030, 208765266, 207478139, 206285398, 205316755, 204515843, 203734344, 202860676, 201893825, 200894321, 199889373, 198876720, 197886224, 196950298, 196037309, 195107755, 194202232, 193364379]
7700A93364379q38890r22939r52278r06084r52157j091174j041384p35384n88946
7691A85335143q85395j213735j046136o23333o10953j005205j134767p92306n71285
7682A77452028q43137j150568j014433o89268o21555p18029p09865p52358j036249
7673A69916566j218203r33045n52132o83029j131517j157001o72184l75590o32669
7664A62561196r99175j033399q76135p70009o47487n10665o31352j003628j124346
7655A54965000p30296k90707l32439o92573q98746r02101r22149r01559o83413
7646A48611017m83997o08592q65060q30311n75476n41457p67309q53587o92344
7637A42392884o10069p10087p05986n64135o61206j033683j116492o38943j90442
$$ y = [193364379, 192525489, 191602550, 190650272, 189744188, 188792031, 187700857, 186659473, 185924089, 185335143, 184449748, 183236013, 182189877, 181566544, 180955591, 179950386, 178815619, 178023313, 177452028, 176608891, 175458323, 174443890, 173754622, 173133067, 172415038, 171705173, 170952815, 169916566, 168698363, 167765318, 167213186, 166530157, 165398640, 164241639, 163569455, 163193865, 162561196, 161562021, 160528622, 159652487, 158882478, 158234991, 157724326, 157092974, 156089346, 154965000, 154234704, 153943997, 153611558, 152918985, 152020239, 151118138, 150195989, 149294430, 148611017, 148127020, 147518428, 146653368, 145823057, 145247581, 144706124, 143938815, 143085228, 142392884, 141782815, 141072728, 140366742, 139802607, 139141401, 138107718, 136991226, 136352283, 136161841]
7628A36161841l52037p70053p61385m47663m85247q76982r46281n28674l01211
7619A30692308o51568j021038q42903m58305m68180o97858n74751k11194k54660
7610A25511851p47841r96002o99081m13182n74658p91455n89553k57840l20942
7601A20121297o16490o18684m02439m99796q87037r26704m45111j10671m15089
7592A15199276r07859r07247n01497k95627m54917n76277m17627k42107l60291
7583A10535827o81148q48750o48828k22301K9805j96473p34003j037757q07840
7574A05388532l80476k81342n29265o83231n08764k54389k28816m06812n66893
7565A01548544o00918n58211n13822m84719m16378k60476j30301k60405o46694
$$ y = [136161841, 135809804, 135039751, 134278366, 133830703, 133345456, 132468474, 131522193, 130993519, 130692308, 130040740, 129019702, 128176799, 127718494, 127250314, 126552456, 125977705, 125766511, 125511851, 124764010, 123768008, 123068927, 122655745, 122081087, 121289632, 120700079, 120442239, 120121297, 119504807, 118886123, 118483684, 117983888, 117096851, 116170147, 115725036, 115614365, 115199276, 114291417, 113384170, 112882673, 112587046, 112132129, 111555852, 111138225, 110896118, 110535827, 109854679, 109005929, 108357101, 108134800, 108164605, 107968132, 107234129, 106196372, 105388532, 105008056, 104726714, 104197449, 103514218, 103005454, 102751065, 102522249, 102115437, 101548544, 100947626, 100389415, 99875593, 99390874, 98974496, 98714020, 98583719, 98323314, 97676620]
7556I7676620q79020o21148j51524n0486l80838o17789m57454k14035k25329l46237
7546I3732760l56902m33809p52773r65430o47791q3534K4505m02300o88032m39343
7536H8987351j11732k38963o01082o18592k57609k7179j95758m81348n41863l94628
7526H5518597k57282k57066l97051n82789o07829l46250l5142r1619n14927p68424
7516H1660218m92028n7213n9571m48813o18350l23330k0273j45465m79525n26011
7506G8489639k41125l3031j61484m55844o03848m81052j95191J2797p2572m11985
7496G5846304o64372n40237j78443Q648j50729m22193n17127m06552k44210j66062
7486G2565027k31566m02365n12313m05253j64331o0723k14850m54314n62991n05877
$$ y = [97676620, 96797600, 96176452, 96024928, 95974442, 95593604, 94975815, 94518361, 94304326, 94078997, 93732760, 93375858, 92942049, 92189276, 91223846, 90576055, 90492521, 90517026, 90114726, 89426694, 88987351, 88875619, 88636656, 88035574, 87416982, 87159373, 87132194, 86936436, 86455088, 85913225, 85518597, 85261315, 85004249, 84607198, 84024409, 83416580, 83070330, 83035188, 82943569, 82428642, 81660218, 81168190, 81110977, 81051406, 80602593, 79984243, 79660913, 79640640, 79495175, 79015650, 78489639, 78248514, 78215483, 78053999, 77598155, 76994307, 76513255, 76318064, 76330861, 76258289, 75846304, 75181932, 74641695, 74463252, 74471900, 74321171, 73898978, 73381851, 72975299, 72731089, 72565027, 72333461, 71931096, 71418783, 71013530, 70849199, 70788476, 70573626, 70119312, 69556321, 69050444]
7476F9050444l41879j13145O1599j2122l22093n26221l43840K4578J18345j73521
7466F7422145m79128m66307k56473j75437k70497l02982j65853n7194j53948l18299
7456F4776027l21516k33418l12380n24701n04134j22370K08143O4974l71800n69081
7446F2089744l72315j28614j26722k72939l53227l00627j46176K1996K0080k34351
7436F0196849m89061m40206k24890k26446l95067k90352R8519J87847k71831p00627
7426E7444735n50658j33949m7497k14933j54287J02846P5716k99577n33429l38396
7416E5350571J1431J38217l1978l35518n10794l44713Q143M9745l47019n70914
7406E3417171j56611L36925J05949n35657n73301K7087K09111m14575q77281m30180
$$ y = [69050444, 68708565, 68595420, 68657019, 68644897, 68322804, 67796583, 67452743, 67477321, 67595666, 67422145, 66943017, 66476710, 66220237, 66044800, 65774303, 65471321, 65305468, 65248274, 65094326, 64776027, 64454511, 64221093, 63908713, 63384012, 62879878, 62757508, 62965651, 63030625, 62658825, 62089744, 61717429, 61588815, 61462093, 61189154, 60835927, 60535300, 60389124, 60411120, 60431200, 60196849, 59707788, 59267582, 59042692, 58816246, 58421179, 58130827, 58229346, 58417193, 58145362, 57444735, 56894077, 56760128, 56712631, 56497698, 56343411, 56446257, 56521973, 56222396, 55688967, 55350571, 55362002, 55500219, 55468241, 55132723, 54621929, 54277216, 54285359, 54335104, 53988085, 53417171, 53260560, 53597485, 53703434, 53167777, 52594476, 52621563, 52830674, 52416099, 51538818, 51108638]
7396E1108638K69530K74863k16154l99582j76352k5581m9442k0998l4298k81271
7386E0449353m66339k37427O0771j24461n42302m84775L073J79200j52767l89596
7376D8294730k30512j19826l25375m20128r1734K40781J11440k43083l25938j58393
7366D6731962j22157l04478m40053l46941r7511J35436J99856M9027j82618l21326
7356D5301197l77354m25824l53214o1941J73300K6634k63833j85039J54562J24509
7346D4112997l29655n02728j19871J48744j64375n00069k63116J20924k0508m02024
7336D2080319l22404N2504J6383l49625k99336K01914L42407j58410n76273l81182
7326D0606297J1624Q0675k9288l3388q3148l02422l68410r4422J09069j00094
$$ y = [51108638, 51378168, 51653031, 51436877, 51037295, 50860943, 50835362, 50785920, 50764922, 50730624, 50449353, 49983014, 49745587, 49806358, 49681897, 49139595, 48654820, 48657893, 48837093, 48684326, 48294730, 48064218, 47944392, 47619017, 47198889, 47107155, 47347936, 47459376, 47216293, 46890355, 46731962, 46609805, 46305327, 45865274, 45518333, 45420822, 45556258, 45756114, 45805141, 45622523, 45301197, 44923843, 44498019, 44144805, 44082864, 44256164, 44282798, 44018965, 43833926, 43988488, 44112997, 43783342, 43280614, 43160743, 43309487, 43145112, 42645043, 42381927, 42502851, 42482343, 42080319, 41757915, 41810419, 41826802, 41477177, 41177841, 41379755, 41722162, 41563752, 40987479, 40606297, 40617921, 40698596, 40669308, 40635920, 40552772, 40250350, 39881940, 39787518, 39896587, 39796493]
7316C9796493l65605k40671L1344k5600k72582k53430m3334p1049k79149k11167
7306C8065250J25305K21677m9527k20315n9947L8647k12049m61584l12555J2546
7296C7147448N3398j59776k40409j15800p8268k18491k57573l5396J88366J12419
7286C6395918j53750k54430j09484k2276k19353m87646m48146r7114J67978R1768
7276C4863465j22350j76537j21862j85411l24388k89419p2329N9691l89o7796
7266C3562675m0674o4299j91720k20361o1619M7233n2719j34783M453J21110q5425
7255C2883871l88476l32188J1859J26372j19101k73889o8400J63131P4763j40024
7245C1937918j40273j3778n0612k02921k07457q4653q2874k06137k12100o4378
$$ y = [39796493, 39430888, 39190217, 39221561, 39195961, 38923379, 38669949, 38626615, 38555566, 38276417, 38065250, 38190555, 38412232, 38362705, 38142390, 38082443, 38121090, 37909041, 37447457, 37134902, 37147448, 37200846, 37041070, 36800661, 36684861, 36606593, 36388102, 36130529, 36095133, 36283499, 36395918, 36242168, 35987738, 35878254, 35855978, 35636625, 35148979, 34700833, 34603719, 34771697, 34863465, 34741115, 34564578, 34442716, 34257305, 33932917, 33643498, 33571169, 33630860, 33630471, 33562675, 33522001, 33457702, 33265982, 33045621, 32984002, 33031235, 32978516, 32843733, 32848186, 32969296, 32883871, 32495395, 32163207, 32175066, 32301438, 32182337, 31908448, 31840048, 32003179, 32077942, 31937918, 31797645, 31783867, 31733255, 31530334, 31322877, 31238224, 31155350, 30949213, 30737113, 30672735]
7235C0672735N706p4227r9547J5033O4517q0687k37482k13818r6923m5683j9482
7224B9890142O0955O7838j49456m39243m80272k20505N2321J10535N0600O7446
7214B9010361J29406M7477j85152l14569j66209P3146Q3374j36074k69213j67575
7204B8104972n7445j25588j88300m1568J15538k805k09678r1614K50363K54615
7194B8008490k27433o48732n49022j34483J64587K47239J68359j10006m31166
7185B6487833l72940R8758L56645N504m06270k11541K60455K12739k65780l44924
7175B5820479J15239L06917j55583n80120l34996J79192K65535l525r6447N9366
7165B5576057J11023n3718k32118l09819k95010j40662Q8956J10782j42183k62546
$$ y = [30672735, 30678441, 30604214, 30504667, 30519700, 30584217, 30503530, 30266048, 30052230, 29955307, 29909624, 29890142, 29951097, 30018935, 29869479, 29430236, 28949964, 28729459, 28781780, 28892315, 28942915, 29010361, 29139767, 29187244, 29002092, 28687523, 28521314, 28594460, 28677834, 28541760, 28272547, 28104972, 28047527, 27921939, 27733639, 27692071, 27807609, 27804804, 27595126, 27503512, 27753875, 28008490, 27781057, 27132325, 26583303, 26448820, 26613407, 26860646, 27029005, 26918999, 26487833, 26114893, 26213651, 26570296, 26575800, 26169530, 25957989, 26218444, 26431183, 26165403, 25820479, 25935718, 26242635, 26087052, 25506932, 25171936, 25351128, 25616663, 25613138, 25516691, 25576057, 25687080, 25633362, 25401244, 25091425, 24796415, 24655753, 24744709, 24855491, 24713308, 24450762]
7155B4450762K5412L06643N9650m47048m80681M0813M22844K32751j52080k21197
7145B4237869l8418K4434r7666j53626j8311J28540N8771j89928l14028j08607
7135B3529030K00112J78897k01095m59296k78414M2302Q7390n6217q2011n6056
7125B2904642k02610l28949q0086L45988L83654j0092k88333j91702m9924q5493
7115B2397095p3266Q9348J07158j19707k15799N406J49847q1543l43311k34147
7105B1681081L0114M2977r7236o5465N3785k0865j82072j30211M8356N2319n7380
7094B1355403l810J28728L5738j89306j64888Q8978J52121q5975k76377k27530
7084B0813082j31222r0806L1936J77782N2111k90707l68799k6400K56484J17167
$$ y = [24450762, 24476174, 24782817, 24842467, 24395419, 23914738, 23955551, 24378395, 24611146, 24459066, 24237869, 24199451, 24223885, 24126219, 23972593, 23954282, 24082822, 24141593, 23951665, 23637637, 23529030, 23729142, 23908039, 23706944, 23247648, 22969234, 23011536, 23098926, 23042709, 22960698, 22904642, 22702032, 22373083, 22292997, 22638985, 23022639, 23012547, 22724214, 22532512, 22482588, 22397095, 22323829, 22413177, 22520335, 22400628, 22184829, 22190235, 22340082, 22258539, 21915228, 21681081, 21711195, 21754172, 21656936, 21591471, 21645256, 21624391, 21442319, 21312108, 21360464, 21412783, 21355403, 21351593, 21480321, 21516059, 21326753, 21161865, 21250843, 21402964, 21316989, 21040612, 20813082, 20681860, 20591054, 20622990, 20800772, 20852883, 20562176, 20193377, 20166977, 20423461, 20540628]
7074B0540628j31074q5879O4814m9801k66489j66025J52125J86086j40386l46993
7064A9757006j65819P7539M0787j08363l8493J70832J63221j13788l13667k03222
7054A9266033J1451J1744j62116j85241N5533K76557J95242p3442j96901r3070
7044A9105790J0365l6848j10001p4165k1664q2533j56971n6975J52141J90545
7034A8919684j9843j93460p3606J63504J25816k05863l83063j12041K73197K41896
7024A8736221j62672l65411r5707K28478J44312j85847k75886m5447J47224R5390
7014A8220655k3195j4958N1161J6502j30308k60013k28078r683J97572J26742
7004A7946397j67118k71070J0358K97165J84501j16168j52172o649q8563k96815
$$ y = [20540628, 20409554, 20323675, 20388489, 20338688, 20072199, 19906174, 20058299, 20244385, 20103999, 19757006, 19591187, 19668726, 19709513, 19601150, 19562657, 19733489, 19896710, 19782922, 19469255, 19266033, 19277484, 19289228, 19127112, 18941871, 18997404, 19273961, 19469203, 19395761, 19198860, 19105790, 19116155, 19079307, 18969306, 18895141, 18873477, 18790944, 18633973, 18576998, 18729139, 18919684, 18899841, 18706381, 18632775, 18796279, 18922095, 18716232, 18333169, 18221128, 18494325, 18736221, 18573549, 18208138, 18112431, 18340909, 18485221, 18299374, 18023488, 17978041, 18125265, 18220655, 18197460, 18182502, 18233663, 18250165, 18119857, 17859844, 17631766, 17622083, 17819655, 17946397, 17779279, 17508209, 17518567, 17815732, 18000233, 17884065, 17731893, 17725244, 17636681, 17339866]
6994A7339866j41548K91855L25326j67270m34095n3089L31244O0892m37645l62699
6984A6752837J63810L54147J9633k61221j33486J30813K28212J73583Q384k68472
6974A7168240m31144k23176J36940J74510q6059j50451R9626K13248j5778j78278
6964A6707678J3338J96525k4389l96185m19188j02047J48051J63779J11794R1623
6954A6490979L7202m4919o2066l1329m3360p3551l8985J5256j1310p1876l8364
6943A6127677P0153J05847J6073j04324j64221j47126n4988Q9711J90847J39059
6933A6268708n1320k25189k26467m5651J62572K22424J22222J2887j5774n4757
6923A6169655j75080k47484j51471l6707j05110k18770o7469K83265L91823P6850
$$ y = [17339866, 17198318, 17490173, 17815499, 17648229, 17214134, 17161045, 17492289, 17553181, 17115536, 16752837, 16916647, 17270794, 17290427, 17029206, 16895720, 17026533, 17254745, 17428328, 17436712, 17168240, 16737096, 16513920, 16650860, 16825370, 16739311, 16588860, 16688486, 16901734, 16885956, 16707678, 16721016, 16917541, 16893152, 16496967, 16077779, 15975732, 16123783, 16287562, 16399356, 16490979, 16528181, 16483262, 16421196, 16389867, 16346507, 16272956, 16233971, 16249227, 16237917, 16166041, 16127677, 16197830, 16303677, 16319750, 16215426, 16051205, 15904079, 15849091, 15938802, 16129649, 16268708, 16217388, 15992199, 15765732, 15720081, 15882653, 16105077, 16227299, 16240186, 16224412, 16169655, 15994575, 15747091, 15595620, 15558913, 15453803, 15235033, 15167564, 15450829, 15842652, 15919502]
6913A5919502k98627l29379n1914K33589L43961K47686j1172k43500k16950J0094
6903A5603290J09397k6360j27020m2277j5427k01093k96634k6553L24877K99966
6893A5602166m0526k49478j56978J8371J03780J15225M7688j04536j79506l5887
6883A5120319J59763J45157l2668j31309j05315n9551L3769K05313K42882j0263
6873A5568097k73338k01140K4455m388j84807q5847K21586K18364j49899l34387
6863A4798696r5755J47422R6823J2551R1866Q8564r5391j06878J48881J69478
6853A5256257k53478m78012j8691N05728K74938l57229l75288K65615N72758R1724
6843A5484322m55337l61766R0409K69815J42148O5091Q9951q833k42444l67988
$$ y = [15919502, 15620875, 15291496, 15239582, 15473171, 15817132, 16064818, 16053646, 15810146, 15593196, 15603290, 15712687, 15686327, 15559307, 15517030, 15501603, 15300510, 15003876, 14977323, 15302200, 15602166, 15561640, 15312162, 15155184, 15173555, 15277335, 15392560, 15440248, 15335712, 15156206, 15120319, 15280082, 15425239, 15392571, 15261262, 15155947, 15096396, 15130165, 15335478, 15578360, 15568097, 15294759, 15093619, 15118074, 15113686, 14928879, 14843032, 15064618, 15282982, 15133083, 14798696, 14702941, 14850363, 14947186, 14959737, 15051603, 15140167, 15044776, 14937898, 15086779, 15256257, 15002779, 14524767, 14506076, 15011804, 15286742, 14929513, 14554225, 14819840, 15392598, 15484322, 15028985, 14667219, 14757628, 15027443, 15169591, 15234682, 15324633, 15315800, 15073356, 14705368]
6833A4705368k43993L1281K55209K61578N6313j20286n5153R4148N093k35224
6823A4754334j78550K23298L96608N743m22758k33642L31422M64533K810l62796
6813A4981002j56974K34407K49786l4739j79501j06753p0072r1329N8871L28920
6803A5213618L11965j35798n62387m61366P1093M83902M52090J52679q8783j68808
6793A5268205j70515j50774q6893L0205J35679J33986L320j46471j69056n1384
6783A4796302Q2181J49291J73945J42246j7295k13693j84489J07822L05032J45420
6773A5486762j05006p0835J02555J9045k20343j44561K30296L44418L3717j62779
6763A5513269P4500K86944M5236k94585k23774M0224r168k44453j74944J23765
$$ y = [14705368, 14461375, 14492656, 14747865, 15009443, 15065756, 14945470, 14890317, 14984465, 14989558, 14754334, 14575784, 14799082, 15195690, 15201433, 14778675, 14545033, 14876455, 15340988, 15343798, 14981002, 14824028, 15058435, 15308221, 15273482, 15093981, 14987228, 14917156, 14825827, 14884698, 15213618, 15525583, 15389785, 14827398, 14366032, 14437125, 14921027, 15373117, 15525796, 15437013, 15268205, 15097690, 14946916, 14860023, 14890228, 15025907, 15159893, 15163213, 15016742, 14847686, 14796302, 14878483, 15027774, 15201719, 15343965, 15326670, 15112977, 14928488, 15036310, 15341342, 15486762, 15381756, 15310921, 15413476, 15432521, 15212178, 15067617, 15297913, 15642331, 15676048, 15513269, 15587769, 15874713, 15919949, 15625364, 15401590, 15441814, 15432646, 15188193, 15013249, 15137014]
6753A5137014J54239n9733j026L55833M07066n8235m47164k77992J27596K41865
6743A5579463R8926M7399J35748J69434J11234N9463J5549n1114p6019l8037l6036
6732A6016010p5249q701J65501K15413M1520j44339j66427j20272r8199j920J78529
6721A6001866K32396R6994K4972J41616J82834m2926k76089k16412J600Q5394
6711A6232245M3614K6130k55o2463K4930K96475L88553P9610k49286j71749R2299
6700A6700103Q7766q7644m2165J31506O1080j12379M9180L57829J73299m29556
6690A6889019n77729M4949O10302L62019k94081m76625o0746L75782M57024K82372
6680A7612286M1010j39041j10777J14490K42064P0366j74764j80845j7554N8261
$$ y = [15137014, 15291253, 15231520, 15230494, 15586327, 15993393, 15935158, 15487994, 15210002, 15337598, 15579463, 15678389, 15725788, 15861536, 16030970, 16142204, 16201667, 16217216, 16166102, 16090083, 16052046, 16016010, 15940761, 15932060, 16097561, 16312974, 16354494, 16210155, 16043728, 15923456, 15825257, 15823337, 16001866, 16234262, 16331256, 16356228, 16497844, 16680678, 16637752, 16361663, 16145251, 16146851, 16232245, 16275859, 16301989, 16301734, 16239271, 16264201, 16560676, 16949229, 17028839, 16779553, 16607804, 16700103, 16787869, 16700225, 16658060, 16789566, 16850646, 16738267, 16787447, 17145276, 17318575, 16889019, 16311290, 16356239, 16966541, 17328560, 17034479, 16557854, 16497108, 16872890, 17329914, 17612286, 17653296, 17514255, 17403478, 17517968, 17760032, 17830398, 17655634, 17474789, 17457235, 17515496]
6670A7515496N3361J27322K05436R0518j49401k63156k00334r1216N0490K61579
6660A7600095L63768J46933k16801l13995o0239K05958K27098R8179j4402r8135
6650A7938459j40988n0893J32360J91093M6599q2500P601K07594K68380J37064
6640A8654769l7750j34263j37589o0357O8522J58739J19565k6753j60547j90526
6630A8253810j18259l70R6357J18576P0404L4329Q2852J57939J20833l3352j11687
6619A8671432J1215J48778K5225k72475l34558j9579K79337J83443j07228j35467
6609A8450123J02021J92792L015j29006K6077K35380K01587k7132k28977k99588
6599A8526292k09614L7866K55985J92598m9803p1505J78843K54448m1395k54330
$$ y = [17515496, 17568857, 17696179, 17901615, 17992133, 17842732, 17579576, 17379242, 17288026, 17338516, 17600095, 17963863, 18110796, 17893995, 17580000, 17519761, 17725719, 17952817, 18050996, 18036594, 17938459, 17797471, 17746578, 17878938, 18070031, 18116630, 18034130, 18041731, 18249325, 18517705, 18654769, 18617019, 18482756, 18345167, 18284810, 18353332, 18512071, 18631636, 18604883, 18444336, 18253810, 18135551, 18135181, 18231538, 18350114, 18420518, 18454847, 18537699, 18695638, 18816471, 18783119, 18671432, 18682647, 18831425, 18856650, 18584175, 18249617, 18230038, 18509375, 18692818, 18585590, 18450123, 18552144, 18744936, 18747951, 18618945, 18645022, 18880402, 19081989, 19054857, 18825880, 18526292, 18316678, 18354544, 18610529, 18803127, 18753324, 18681819, 18860662, 19115110, 19073715, 18819385]
6589A8819385k1062K74460J27569k22654k16902N1502M4756k20993k09973J20121
6579A8546209J83926j93124m06013o8337L24799J94059k22067l00066K5786K99757
6569A8384929K82491J46187N0508m2397j49136j82582j10143l301N7046J9232
6559A8452834j10300k03002j22921K7848l314j96180k08266Q7048L26384J81927
6549A8232058j19810j45623Q6617J84277N29k10068k38276j70744j31358n8732
6539A7428870J25570K99544K40308r0247m26462m14540n560M02523L56975j04799
6529A7812182m78309m04445n8389J53852P6363j37757k58237j47886J28083K82816
6519A6968273R7754k26658k85568o8679L9505o2117j9905K58699K99258j34396
$$ y = [18819385, 18798323, 19072783, 19200352, 18977698, 18760796, 18812298, 18857054, 18636061, 18426088, 18546209, 18730135, 18537011, 18130998, 18062661, 18387460, 18581519, 18359452, 18059386, 18085172, 18384929, 18667420, 18813607, 18864115, 18821718, 18672582, 18490000, 18379857, 18376556, 18433602, 18452834, 18342534, 18139532, 18016611, 18044459, 18041145, 17844965, 17636699, 17723747, 18050131, 18232058, 18112248, 17966625, 18053242, 18237519, 18238048, 18027980, 17789704, 17618960, 17487602, 17428870, 17554440, 17853984, 18094292, 18004045, 17577583, 17163043, 17157483, 17560006, 17916981, 17812182, 17333873, 16929428, 16871039, 17024891, 17101254, 16963497, 16705260, 16557374, 16685457, 16968273, 17066027, 16839369, 16553801, 16485122, 16524627, 16462510, 16442605, 16701304, 17000562, 16866166]
6509A6866166m89513k41989K14023J80196k20482l17637l5857R4458m9872n4080
6499A5945413J33364P1462k51946k67868J23977K37584k37743n99085k46121L06339
6489A5215376K69519j60961k31886R8060K17584k1276j38659M2151J18355j08517
6479A5299746k82430j50769K4805j1309q4301Q511J02457Q140j14248q1563p5834
6468A4643205k99741m89355k46647K59125M26036R0312k16249o3174K42033J54965
6458A4500510k54179m14947j38543J13556k6834k69381j66402J38604J30405k28611
6448A3384178l83749k6468M00194L13537j86960m71187k33209J60313K20833l5962
6438A3141520j85724n30K53130J90426j54607l67096k26191Q001K3483p5500j2442
$$ y = [16866166, 16376653, 16134664, 16348687, 16528883, 16308401, 15990764, 15954907, 16049365, 15999493, 15945413, 16078777, 16150239, 15898293, 15630425, 15754402, 15991986, 15754243, 15155158, 14909037, 15215376, 15484895, 15323934, 15092048, 15190108, 15407692, 15386416, 15247757, 15289908, 15408263, 15299746, 15017316, 14866547, 14891352, 14880043, 14795742, 14804253, 14906710, 14914850, 14800602, 14719039, 14643205, 14343464, 13854109, 13607462, 13866587, 14292623, 14382935, 14166686, 14103512, 14345545, 14500510, 14246331, 13831384, 13692841, 13806397, 13779563, 13510182, 13343780, 13482384, 13612789, 13384178, 13000429, 12973961, 13374155, 13687692, 13500732, 13029545, 12796336, 12956649, 13177482, 13141520, 12955796, 12955266, 13208396, 13398822, 13244215, 12877119, 12650928, 12658929, 12682412, 12606912, 12594470]
6427A2594470J35952N8876k14386l09791j19182M1669N320N340J42774R6140k80093
6416A2157089n17844j88721L41079L81967n7268l26690j40995Q9207Q936j68779
6406A1577981j23470M9960Q1105j4826k4160Q5206J30969l851k26367l43721k49596
6395A0939230m4651L1606j15814k57147j07823K31593L28670j1251m28785m20103
6385A0145525L7985M37524L29086j41041l95586j48024K09180J45116k11941k34159
6375A0173665K03921M30173m177n36179l93639K00369L73670l0669k88081m2560
6365A0086493J48458j66114n33046l39891K04466M37469K24487k1051p3100q4208
6355I883963j43852j46148q7669r0656j13747J3072K34330K63686M383k73696
$$ y = [12594470, 12730422, 12789298, 12574912, 12265121, 12145939, 12187608, 12192928, 12198268, 12341042, 12437182, 12157089, 11639245, 11450524, 11791603, 12173570, 12116302, 11789612, 11648617, 11737824, 11746760, 11577981, 11454511, 11504471, 11585576, 11570750, 11546590, 11631796, 11762765, 11758914, 11532547, 11188826, 10939230, 10894579, 10926185, 10810371, 10553224, 10445401, 10676994, 11005664, 10994413, 10565628, 10145525, 10183510, 10621034, 10950120, 10809079, 10413493, 10265469, 10474649, 10619765, 10407824, 10173665, 10377586, 10807759, 10803582, 10267403, 9873764, 10074133, 10447803, 10417134, 10129053, 10086493, 10234951, 10068837, 9535791, 9195900, 9400366, 9837835, 10062322, 10041271, 9968171, 9883963, 9740111, 9593963, 9506294, 9415638, 9301891, 9314963, 9549293, 9812979, 9817362, 9543666]
6345I543666k71505r810K33562K31754J0877k04239k40739j65312j44550j54633
6335H829071k6520J98043K29050k7651k57980j72879P5668J47806n798j66258
6325H822552j90396r5140O0688J62907O5297j65643k17242L0378K52047J39568
6315H865016j17702j54000r886J2510r5178r2974J1451j0586j22502m4448K03324
6304H445025K44790n4977l49182l18644p8162Q4618Q6101J1799n4966m7959L8219
6293H006662O2215r1941k51334j37434J74794L01604J04567j33196j68585j00533
6283G766819q9088r2803m3464q655k5828j0104N0756L8816o4095j25125j03438
6272G293791q9393o7688N6260J70194N8252j66965j50966J06963K07063K1842
$$ y = [9543666, 9272161, 9262351, 9495913, 9727667, 9738544, 9534305, 9293566, 9128254, 8983704, 8829071, 8802551, 9000594, 9229644, 9201993, 8944013, 8771134, 8846802, 8994608, 8988810, 8822552, 8632156, 8537016, 8597704, 8760611, 8825908, 8660265, 8443023, 8473401, 8725448, 8865016, 8747314, 8593314, 8583428, 8595938, 8500760, 8407786, 8419237, 8408651, 8286149, 8241701, 8445025, 8689815, 8634838, 8285656, 7967012, 7888850, 7973468, 8059569, 8071368, 8016402, 7968443, 8006662, 8068877, 7976936, 7725602, 7588168, 7762962, 8064566, 8169133, 8035937, 7867352, 7766819, 7677731, 7584928, 7541464, 7532809, 7506981, 7496877, 7547633, 7586449, 7522354, 7397229, 7293791, 7204398, 7136710, 7192970, 7363164, 7421416, 7254451, 7103485, 7210448, 7417511, 7439353]
6262G439353r2909M7126J27908n2086j82278k4904J09923p3944k83871j40792
6252F873526J44059J48497m6762r6583l7998r4979j10873J65152M33447J92671
6242G570157l75496n77651k43296R3711Q4702l2230k3248q548n1602J4101J53553
6231F604153P7933j73983j62187J96960L62762j708m48171m06059O81K55385K25176
6220F530942J50626R9334p2757l13806l58041j22239J71968K83041J65355o3653
6210F470770k14528j44584P7576J96050O3566j73723k69754j47280Q8489K65435
6200F212017K23499m8515l02895k59174P295J35642k311j35305m7366J06706J09299
6189E998892K1271N791M4210L5656j1765n7456j06218r0562Q7146K88162K12201
$$ y = [7439353, 7346444, 7393570, 7521478, 7469392, 7287114, 7262210, 7372133, 7298189, 7014318, 6873526, 7017585, 7166082, 7119320, 7022737, 6984739, 6889760, 6778887, 6944039, 7377486, 7570157, 7194661, 6617010, 6373714, 6467425, 6552127, 6519897, 6496649, 6488101, 6436499, 6450600, 6604153, 6682086, 6508103, 6345916, 6542876, 6905638, 6903930, 6455759, 6049700, 6050381, 6305766, 6530942, 6681568, 6780902, 6708145, 6394339, 6036298, 5914059, 6086027, 6369068, 6534423, 6470770, 6256242, 6111658, 6189234, 6385284, 6448850, 6275127, 6005373, 5858093, 5946582, 6212017, 6435516, 6387001, 6084106, 5824932, 5832227, 5967869, 5965558, 5830253, 5782887, 5889593, 5998892, 6020163, 6025954, 6070164, 6105820, 6094055, 6036599, 5930381, 5839819, 5926965, 6215127, 6427328]
6178F427328j26082l33389k15923m4493l9095k1864J26750J24988j88244m05038
6168E304938j24410L52459M38365J16439j55278j80933j23030l9137J18310J68492
6158E876215q1100l80302l23684Q723K14997K32507K64067K09856j42764m74212
6148E404303k58180K75566L34816j78164m70887j48422J91009M0016j86856K6179
6138E029380L62951K47968j80018l59889j94648j4606M6706P3554L0851q5150
6128D957099l4644K48953L50862o421l82999k41395J79522K58399k0267j74266
6118E134843j01640j03470j72998l3662J82835P7098k14827j60897J86505K00583
6108D994370k00845l44428K7284K83781K7139j96498J01383M35380J88217k78301
$$ y = [6427328, 6301246, 5967857, 5751934, 5707441, 5668346, 5646482, 5773232, 5898220, 5709976, 5304938, 5180528, 5532987, 5971352, 6087791, 5932513, 5751580, 5628550, 5589413, 5707723, 5876215, 5795115, 5414813, 5091129, 5099852, 5314849, 5547356, 5811423, 6021279, 5878515, 5404303, 5146123, 5421689, 5756505, 5578341, 5107454, 4959032, 5150041, 5190057, 5003201, 5029380, 5392331, 5640299, 5460281, 5100392, 4905744, 4891138, 4937844, 5011398, 5042249, 4957099, 4922455, 5171408, 5522270, 5515849, 5132850, 4891455, 5070977, 5329376, 5309109, 5134843, 5033203, 4929733, 4756735, 4723073, 4905908, 4983006, 4768179, 4607282, 4793787, 4994370, 4793525, 4449097, 4476381, 4760162, 4787301, 4590803, 4692186, 5127566, 5315783, 5037482]
6098E037482k25782K09290K85588j01770l62706k64890j58326j54608M9396L99141
6088D712815L66148j23992m01675q0236K95223J25344k86250k75234R6929K12048
6078D641120n2716j71386J10976L61616J75739k00305k87737p6965N6815m4483
6068D512674j63039j03314N0560J27427J07183P4046O3377M7469K721p0088j40918
6057D508098j41160l6465O9025J7089j58623k12506l0801J49261O1995j55957
6047D069956j39289J31120K66824P2750j41223o3186J23311P8105j01838o5635
6037D230895J40995J18729j68546k53674O7513L27472R1611l32028l55753r292
6027C857922J73220L2162m5461J28315K09736m5229l10752j99762J13662J79314
$$ y = [5037482, 4811700, 5020990, 5306578, 5204808, 4842102, 4577212, 4418886, 4264278, 4313674, 4712815, 5078963, 4954971, 4553296, 4473060, 4768283, 4893627, 4607377, 4332143, 4429072, 4641120, 4588404, 4417018, 4527994, 4889610, 5065349, 4865044, 4577307, 4500342, 4557157, 4512674, 4349635, 4246321, 4296881, 4424308, 4531491, 4605537, 4668914, 4716383, 4719104, 4649016, 4508098, 4366938, 4330473, 4399498, 4416587, 4257964, 4045458, 4014657, 4163918, 4225913, 4069956, 3930667, 4061787, 4328611, 4401361, 4260138, 4196952, 4320263, 4398368, 4296530, 4230895, 4371890, 4490619, 4322073, 4068399, 4135912, 4463384, 4554995, 4222967, 3867214, 3857922, 4031142, 4063304, 4017843, 4146158, 4355894, 4310665, 3999913, 3800151, 3913813, 4093127]
6017D093127n0003k23693j50383K0546J17429J22122N1673n6329o9571O7892J49781
6006D072591j9311k41759j71927J09855J95295K7448j3158J88902K34038q6699
5996D295275l54924j85819J18938P3378j89887j90938O6841J59385R181n0524
5986C750906L9937l1520k66352k20753K14104M88931K07787k32581k50879O0831
5976C760411J82348l08j33922m7480M0631k5897j04325o0398Q643j3906o0438
5965C545359k2662N2695L9027p2701j47088p1396Q6670J31576j0775j60796j22235
5954C247674J3697J4226p8422J0070K73963L40566P0028j57128m7079J01339p7480
5943C711454l23706j50206K85485L62541j0197k64268j21868O043j78954l02470
$$ y = [4093127, 4043124, 3819431, 3669048, 3689594, 3807023, 3929145, 3980818, 3924489, 3854918, 3922810, 4072591, 4053280, 3811521, 3639594, 3749449, 3944744, 3972192, 3959034, 4147936, 4381974, 4295275, 3940351, 3754532, 3873470, 3946848, 3756961, 3566023, 3632864, 3792249, 3801430, 3750906, 3790843, 3759323, 3492971, 3272218, 3486322, 3975253, 4183040, 3950459, 3699580, 3760411, 3942759, 3942451, 3808529, 3761049, 3801680, 3775783, 3671458, 3611060, 3619703, 3605797, 3545359, 3522697, 3575392, 3614419, 3541718, 3394630, 3323234, 3409904, 3541480, 3530705, 3369909, 3247674, 3261371, 3275597, 3197175, 3207245, 3481208, 3821774, 3891802, 3734674, 3687595, 3788934, 3711454, 3387748, 3237542, 3523027, 3885568, 3875371, 3611103, 3489235, 3495278, 3316324, 3013854]
5933C013854J3092M20688L37282j48478m15946k10713J16589K33746K08713J89115
5923C757942J10448q9336k47700j96283m2026j5306j11354r2105J32351L10157
5913C516788J72776j48753k52571k6728J74991O0946j50843r6486J22251J02750
5903C475121j60448k27156O6009L15104J82510j06294j81864p7325k0172M942
5893C270427J06623J59859K8745r8714p520J11872k5186k33423j24081J77183
5883C365785J64163j94576l42975k3549K96805J62666j88471k49759J627J84911
5873C176627J37364N3696P4209O9621j04395l29964l18952K3938L88954L51614
5863C522712o0074l09738p3604K46144J20091k37775j96796K07870K86508j16132
$$ y = [3013854, 3026946, 3447634, 3784916, 3636438, 3220492, 3009779, 3126368, 3360114, 3568827, 3757942, 3868390, 3779054, 3531354, 3335071, 3293045, 3277739, 3166385, 3074280, 3206631, 3516788, 3689564, 3540811, 3288240, 3261512, 3436503, 3497449, 3346606, 3250120, 3372371, 3475121, 3314673, 3087517, 3153526, 3468630, 3651140, 3544846, 3362982, 3285657, 3265485, 3270427, 3377050, 3536909, 3565654, 3466940, 3459420, 3571292, 3546106, 3312683, 3188602, 3365785, 3529948, 3335372, 2992397, 2968848, 3265653, 3428319, 3239848, 2990089, 2991716, 3176627, 3313991, 3367687, 3441896, 3511517, 3407122, 3077158, 2758206, 2782144, 3171098, 3522712, 3462638, 3152900, 3079296, 3325440, 3445531, 3207756, 3010960, 3218830, 3505338, 3389206]
5853C389206k98041Q7847L55333p0013n88574l62254K61031K88266k76773m54768
5843B331260Q4593N28491K83841j61252j75366M8677L4684j14976l9188J51490
5833B972254R8832j32321j74227K7649J93671J77656O3220q0677k01734j69980
5823B774343P376O1620j30329k43716J5916L68164L41333J1007j45479q475R4704
5812C146464M194r0631q4462p4490l1148J51924K68717J3394l75018l07411J85837
5801B807370L68227n6947m28581j87503K30797J78716j16174l6560K67309J26383
5791C153037m09671n32344L4821N63406M24712n0129k20658p0130Q408n6705m0104
5780B804643N9005K7162j21051j37163L0339J44750O5139n4581l5886N6442L3945
$$ y = [3389206, 3091165, 3179012, 3534345, 3464332, 2875758, 2513504, 2774535, 3062801, 2786028, 2331260, 2415853, 2944344, 3228185, 3066933, 2891567, 2940244, 2974928, 2859952, 2820764, 2972254, 3071086, 2938765, 2764538, 2792187, 2985858, 3163514, 3226734, 3146057, 2944323, 2774343, 2781719, 2843339, 2713010, 2469294, 2485210, 2853374, 3194707, 3205714, 3060235, 3051760, 3146464, 3150658, 3060027, 2975565, 2901075, 2869927, 3021851, 3290568, 3303962, 2928944, 2621533, 2807370, 3175597, 3118650, 2690069, 2502566, 2733363, 2912079, 2795905, 2759345, 3026654, 3153037, 2743366, 2211022, 2245843, 2809249, 3233961, 3183832, 2963174, 2893044, 2901452, 2844747, 2804643, 2863648, 2890810, 2769759, 2632596, 2662935, 2807685, 2872824, 2818243, 2782357, 2838799, 2872744]
5769B872744j30295k46026j39716J00252J88241O494j94417j26215Q6245O8423
5759B485730j86387k39584R9778L95818K17917j68675j92578J36801K57638n7745
5749B748713l72506k75721N0663K02294J40985R9469J28685Q0450n6201j03138
5739B643693J8236J60360J54300J1647j15320j07883n158K4501j21312l03222
5729B359842k65752J1433K24874J25349j31994j81744O8563L29679L09282M5272
5719B894804j93086k36950j70319j66115k22553j38687J78813M59379L24718j57440
5709B572564m30956j44733L35123M02056M2316k04500p4991R9273K7066o8112
5699B555106P4242J99735m9922m20110l31869J64195L60512k2475l48301m7350
$$ y = [2872744, 2742449, 2496423, 2356707, 2456959, 2645200, 2651694, 2457277, 2331062, 2417307, 2485730, 2299343, 2059759, 2159537, 2555355, 2773272, 2604597, 2412019, 2548820, 2806458, 2748713, 2376207, 2100486, 2151149, 2353443, 2494428, 2593897, 2722582, 2803032, 2746831, 2643693, 2661929, 2822289, 2976589, 2988236, 2872916, 2765033, 2759875, 2784376, 2663064, 2359842, 2094090, 2105523, 2330397, 2455746, 2323752, 2142008, 2210571, 2540250, 2849532, 2894804, 2701718, 2464768, 2294449, 2128334, 1905781, 1767094, 1945907, 2405286, 2730004, 2572564, 2141608, 1996875, 2331998, 2734054, 2776370, 2571870, 2496879, 2596152, 2623218, 2555106, 2629348, 2829083, 2779161, 2359051, 2027182, 2191377, 2551889, 2529414, 2181113, 2133763]
5689B133763M43150L30945k69409m83304k6923L76369J49038k81113k27135J96722
5679B342103L62031J24896j19011j93545k77255l22747l8704M28302M65874p2879
5669B699065n01174k51689L00834M39920J20432j57601j78733j25334n5221J28669
5659B419168K71268J10903j83747j84278P2215J16036j25823j79827J00585J85619
5649B602119k30889n90411k74180M00583O13974J96835k69600l56638j92562j3066
5639A886165J27202J48247m7880k66471j62450J91677L08363Q770k72766j28606
5629A792251K46865L98913K37102K0420o7097l9903L6160O8115n6579k80338l42190
5618B013719j37137O7249J3650j27850l1893K31855K85212L5445j78651q5643
$$ y = [2133763, 2576913, 2907858, 2638449, 2155145, 2128222, 2504591, 2653629, 2372516, 2145381, 2342103, 2704134, 2829030, 2710019, 2516474, 2239219, 1916472, 1877768, 2306070, 2771944, 2699065, 2197891, 1946202, 2247036, 2686956, 2807388, 2649787, 2471054, 2345720, 2290499, 2419168, 2690436, 2801339, 2617592, 2433314, 2505529, 2621565, 2495742, 2315915, 2416500, 2602119, 2371230, 1780819, 1506639, 1907222, 2521196, 2718031, 2448431, 2091793, 1899231, 1886165, 2013367, 2161614, 2113734, 1847263, 1684813, 1876490, 2184853, 2193623, 1920857, 1792251, 2039116, 2438029, 2675131, 2695551, 2628454, 2588551, 2624711, 2692826, 2636247, 2355909, 2013719, 1876582, 1943831, 1957481, 1829631, 1797738, 2029593, 2314805, 2350250, 2171599, 2085956]
5608B085956J71314K77069J11661j96084l97404k80346J02154L62556J85179j95567
5598B226488k38809J29367L67849J11089k83536k83622M2918K07430N3624j19130
5588B213668j08057m0483k6903K0253J17862J03083o1810j60260n6457Q8017R5974
5577B184887L9017L7653K0261r6982j76979n9018J41162J71852k57j82394k16630
5566A862572o9924K12492M46292L57211n9466l88364l00568m2360m4880k13570
5556A759435j11132K33201L12885J5270j49042Q0469K57126K9798k07025j6533
5546B204452K50267L1979m16033l88163Q0547K65696k0388j51587J74380L86752
5536B417902L5836m04793k97444J57738L14576Q0906j20062j25383j25869j28839
$$ y = [2085956, 2257270, 2534339, 2646000, 2449916, 2052512, 1772166, 1874320, 2236876, 2422055, 2226488, 1987679, 2117046, 2484895, 2595984, 2312448, 2028826, 2071744, 2279174, 2332798, 2213668, 2105611, 2065128, 2038225, 2058478, 2176340, 2279423, 2217613, 2057353, 2000896, 2088913, 2184887, 2223904, 2261557, 2281818, 2184836, 2007857, 1948839, 2090001, 2261853, 2261596, 2079202, 1862572, 1792648, 2005140, 2451432, 2808643, 2749177, 2360813, 2060245, 2017885, 1973005, 1759435, 1648303, 1881504, 2194389, 2209659, 2060617, 2141086, 2398212, 2428010, 2220985, 2204452, 2454719, 2486698, 2070665, 1682502, 1763049, 2028745, 2008357, 1856770, 2031150, 2417902, 2453738, 2048945, 1751501, 1909239, 2223815, 2304721, 2184659, 2059276, 1933407, 1804568]
5526A804568N0910K98284K63732m1908k27116j56586j12467k12259j71652J41657
5516A637163L74953K16972r7841j57405J3757O9724q9351k21676j57402j266R4070
5505A681698J21485J29370J02273J1537r4682j17155j5260J24721J61934P2658
5495B178579n591K0008K8278j22693k99511k29453O5334K42603J24690o2679o7956
5484A871609K9485K5535p0517j18606q6388k416J48108K83784J98760r1059k16649
5473A971646K2699K52978M4930l64094l73563N6438L47530J93885n9540p4985
5463B017924j1796r2869j57205m821J75741J12151q3725j19777R858R8258Q3903
5452B027642K5326r2805k22369j42595J64351K76490q9704m89732k90170L38376
$$ y = [1804568, 1855478, 2153762, 2417494, 2375586, 2148470, 1991884, 1879417, 1667158, 1495506, 1637163, 2012116, 2229088, 2131247, 1973842, 1987599, 2057323, 1967972, 1746296, 1588894, 1587628, 1681698, 1803183, 1932553, 2034826, 2046363, 1951681, 1834526, 1819266, 1943987, 2105921, 2178579, 2172988, 2192996, 2221274, 2098581, 1799070, 1569617, 1634951, 1877554, 2002244, 1939565, 1871609, 1901094, 1926629, 1856112, 1737506, 1651118, 1648702, 1796810, 2080594, 2279354, 2188295, 1971646, 1994345, 2247323, 2292253, 1928159, 1554596, 1611034, 1958564, 2152449, 2092909, 2017924, 2006128, 1913259, 1756054, 1751233, 1926974, 2039125, 1955400, 1835623, 1845481, 1943739, 2027642, 2052968, 1960163, 1737794, 1595199, 1759550, 2036040, 1946336, 1456604, 1166434, 1504810]
5442A504810N96530K15356k20912k32789n6509k7352J0186K42222L63469O3863
5432B458874l35458l12223L6339J75530k2393j88338j35273n7143l9099P8140
5422A658956K54006J91554j13118k47488k4293J99226J06729r1341q1108K5293
5412A878416k3927j17423j0444J68624J10218j17232j62800K5176J58997J23612
5402B033217Q7663R4704n889j61961j12585J03144R6366k22589m06082j56372
5392A349616J83016J88622K1827P1707K40749J38382j85235k82507n4793J01980
5382A773364k1212j33206J0675J95192J35649o6754j44740q0285k5966j2271J3895
5371A644341K4365O620N9719J81656J54449j07975k98777j26930J76267J49571
$$ y = [1504810, 2101340, 2316696, 2095784, 1862995, 1806486, 1779134, 1789320, 2031542, 2395011, 2458874, 2123416, 1811193, 1847532, 2023062, 2000669, 1812331, 1677058, 1619915, 1580816, 1658956, 1912962, 2104516, 1991398, 1743910, 1719617, 1918843, 2025572, 1934231, 1853123, 1878416, 1854489, 1737066, 1726622, 1895246, 2005464, 1888232, 1725432, 1750608, 1909605, 2033217, 2120880, 2215584, 2209695, 2047734, 1935149, 2038293, 2134659, 1912070, 1505988, 1349616, 1532632, 1721254, 1743081, 1814788, 2055537, 2193919, 2008684, 1726177, 1671384, 1773364, 1752152, 1618946, 1629621, 1824813, 1960462, 1893708, 1748968, 1668683, 1642717, 1630446, 1644341, 1668706, 1675326, 1735045, 1916701, 2071150, 1963175, 1664398, 1537468, 1713735, 1863306]
5361A863306j82529l20347m2688K81735K77874P1411k6267j9701q6242j48156
5351A668396Q702K51391J58290l15450n90116j83520N18186O34578l3706o43859
5341A472892m03670L27083N38376J9301l73481m9784M17691K26818l73955m89690
5331A311581J3846L59584J17657k19183j48593R9129J24907L6264O4718L4309
5321A794219k21927l50668j4528M02167L05239j41007k78285j9135J28021K8371
5311A632467P5844L05902K25687k24101l89854P142L09181R775l41822o9411M15079
5300A955889K53107l98131n71080k7822M22508K57216n3483Q677J79399J9835
5290B046115k74788k59968j5063M9214j00564j37373L9276J95916J82374P4173
$$ y = [1863306, 1680777, 1360430, 1317742, 1599477, 1877351, 1948762, 1922495, 1902794, 1816552, 1668396, 1677098, 1928489, 2086779, 1771329, 1181213, 997693, 1515879, 2150457, 2116751, 1472892, 1069222, 1396305, 1934681, 1953982, 1580501, 1530717, 1948408, 2175226, 1801271, 1311581, 1325427, 1685011, 1802668, 1583485, 1434892, 1534021, 1658928, 1695192, 1759910, 1794219, 1572292, 1221624, 1207096, 1609263, 1914502, 1773495, 1495210, 1476075, 1604096, 1632467, 1708311, 2014213, 2239900, 2015799, 1625945, 1633087, 1942268, 1952043, 1610221, 1540810, 1955889, 2208996, 1810865, 1239785, 1211963, 1634471, 1891687, 1838204, 1846881, 2026280, 2046115, 1771327, 1511359, 1496296, 1545510, 1444946, 1307573, 1346849, 1542765, 1725139, 1799312]
5280A799312o1768k08590k38934l2729K46551K85022M9908j66591j57191j3825
5270A501165R3451J14419N0808q2548j63701m3056J99714K75269O6842j81486
5260A830877j87981n793P6455p3879k80052k80590l1237K30723K32462n632j62275
5249A343078k9003J75440J07272j58279j98363R9795L14970J23059j74689r7022
5239A506258K55491L20667p8486m37738k60540K74314N55527K75720k77882n83881
5229A549450l88133J02695M23286K88219j11628l20275j56395R5164J04337p5392
5219A511328j64251q0180L6166J16574J98836K07494K2351k07812j69479R1843
5209A562870J29443k04810m03138k4071N38572N38950k4367m06141k27741M8347
$$ y = [1799312, 1737544, 1528954, 1290020, 1257291, 1503842, 1788864, 1838772, 1672181, 1514990, 1501165, 1594616, 1709035, 1759843, 1677295, 1513594, 1470538, 1670252, 1945521, 2012363, 1830877, 1642896, 1637103, 1713558, 1639679, 1359627, 1079037, 1047800, 1278523, 1510985, 1505353, 1343078, 1314075, 1489515, 1596787, 1438508, 1240145, 1339940, 1654910, 1777969, 1603280, 1506258, 1761749, 2082416, 2003930, 1566192, 1305652, 1579966, 2135493, 2411213, 2133331, 1549450, 1161317, 1264012, 1687298, 1975517, 1863889, 1543614, 1387219, 1482383, 1586720, 1511328, 1347077, 1266897, 1303063, 1419637, 1618473, 1825967, 1848318, 1640506, 1471027, 1562870, 1692313, 1487503, 1084365, 1060294, 1598866, 2137816, 2113449, 1707308, 1479567, 1527914]
5199A527914l2797k10336n9200K47654K78558J00911Q3031J53923o0178m28841
5189A600639l70646J70049M95970J91609k37827j82977J46051J64469j11300j79751
5179A686286N4700J61064o6680l11279k75609n6760J39399K54230K33853J6753
5169A835957k14167j54676J08414J26752j79936k91166J01658N03469L11211k43614
5159A903902m34644j32467Q8162q0334k51282p4532J77610J12487j13790q2596
$$ y = [1527914, 1495117, 1284781, 1225581, 1473235, 1751793, 1852704, 1935735, 2089658, 2029480, 1600639, 1229993, 1400042, 1896012, 2087621, 1849794, 1666817, 1812868, 1977337, 1866037, 1686286, 1740986, 1902050, 1835370, 1524091, 1248482, 1191722, 1331121, 1585351, 1819204, 1835957, 1621790, 1467114, 1575528, 1702280, 1522344, 1231178, 1332836, 1836305, 2147516, 1903902, 1469258, 1336791, 1424953, 1344619, 1093337, 1018805, 1196415, 1308902, 1195112, 1112516]
$$ [...]
##END NTUPLES=NMR SPECTRUM
##END=
