##TITLE=1H ikalashn
CA-9308-1
13.12.2024
##JCAMPDX= 6.0         $$ Bruker NMR JCAMP-DX V2.0
##DATA TYPE= NMR SPECTRUM
##DATA CLASS= NTUPLES
##ORIGIN= UXNMR, Bruker Analytische Messtechnik GmbH
##OWNER= root
$$ TOPSPIN		Version 1.3
$$ 2024-12-13 09:50:28.828 +0400  Irina@DPX200
$$ Compression mode = diff/dup
##.OBSERVE FREQUENCY= 200.131300845
##.OBSERVE NUCLEUS= ^1H
##.ACQUISITION MODE= SIMULTANEOUS
##.ACQUISITION SCHEME= undefined
##.AVERAGES= 8
##.DIGITISER RES= 18
##SPECTROMETER/DATA SYSTEM= spect
##.PULSE SEQUENCE= zg
##.SOLVENT NAME= DMSO
##.SHIFT REFERENCE= INTERNAL, DMSO, 1, 17.49637
##AUDIT TRAIL= $$ (NUMBER, WHEN, WHO, WHERE, WHAT)
$$ ##TITLE= Audit trail, TOPSPIN		Version 1.3
$$ ##JCAMPDX= 5.01
$$ ##ORIGIN= Bruker BioSpin GmbH
$$ ##OWNER= Irina
$$ $$ F:/spectra/data/iren/nmr/1H/4/pdata/1/auditp.txt
$$ ##AUDIT TRAIL=  $$ (NUMBER, WHEN, WHO, WHERE, VERSION, WHAT)
(   1,<2024-12-13 09:49:16.328 +0400>,<Irina>,<DPX200>,<TOPSPIN 1.3>,
      <acquisition in progress>)
(   2,<2024-12-13 09:49:53.093 +0400>,<Irina>,<DPX200>,<TOPSPIN 1.3>,
      <Start of raw data processing
       efp BC_mod = 2 LB = 0.02 FT_mod = 6 PKNL = 1 PHC0 = -30.43289 PHC1 = -1.120823 SI = 32K 
       data hash MD5: 32K
       04 82 73 5D 97 F0 81 66 4D 4F 50 96 62 6E 80 8D>)
(   3,<2024-12-13 09:49:55.250 +0400>,<Irina>,<DPX200>,<TOPSPIN 1.3>,
      <apk 
       data hash MD5: 32K
       F0 1F 94 72 83 3F 60 6E 74 C6 F7 F3 88 FF E0 9A>)
(   4,<2024-12-13 09:50:17.578 +0400>,<Irina>,<DPX200>,<TOPSPIN 1.3>,
      <pk fgphup PHC0 = -25.66321 PHC1 = 37.6 
       data hash MD5: 32K
       E4 30 2D 84 04 F7 42 26 3A E9 BB 4F 10 4C 2D B6>)
(   5,<2024-12-13 09:50:19.468 +0400>,<Irina>,<DPX200>,<TOPSPIN 1.3>,
      <abs n ABSG = 5 
       data hash MD5: 32K
       DA 6B 35 D7 7D C3 C9 1B 5E A4 41 4F 63 0B C7 0F>)
$$ ##END=
$$ 
$$ $$ hash MD5
$$ $$ 03 D4 23 38 5D 7C 2E 0E 05 7B 57 D5 D7 4E BA AD
##$RELAX= 
##$RELAX= 
##$RELAX= 
##$RELAX= 
##$RELAX= 
##$RELAX= 
##$RELAX= 
##$RELAX= 
##$RELAX= 
$$ Bruker specific parameters
$$ --------------------------
##$DU= <F:/spectra>
##$EXPNO= 4
##$NAME= <1H>
##$PROCNO= 1
##$TYPE= <nmr>
##$USER= <iren>
##$AMP= (0..31)
100 100 100 100 100 100 100 100 100 100 100 100 100 100 100 100 100 100 
100 100 100 100 100 100 100 100 100 100 100 100 100 100 
##$ANAVPT= -1
##$AQSEQ= 0
##$AQ_mod= 1
##$AUNM= <au_zg>
##$AUTOPOS= <>
##$BF1= 200.13
##$BF2= 200.13
##$BF3= 200.13
##$BF4= 200.13
##$BF5= 200.13
##$BF6= 200.13
##$BF7= 200.13
##$BF8= 200.13
##$BYTORDA= 1
##$CFDGTYP= 0
##$CFRGTYP= 5
##$CHEMSTR= <none>
##$CNST= (0..63)
1 1 145 1 1 1 1 1 1 1 1 1 1 1 1 1 1 1 1 1 1 1 1 1 1 1 1 1 1 1 1 1 1 1 
1 1 1 1 1 1 1 1 1 1 1 1 1 1 1 1 1 1 1 1 1 1 1 1 1 1 1 1 1 1 
##$CPDPRG= <>
##$CPDPRG1= <>
##$CPDPRG2= <>
##$CPDPRG3= <>
##$CPDPRG4= <mlev>
##$CPDPRG5= <mlev>
##$CPDPRG6= <mlev>
##$CPDPRG7= <mlev>
##$CPDPRG8= <mlev>
##$CPDPRGB= <>
##$CPDPRGT= <>
##$D= (0..63)
0 2 0 0 0 0 0 0 0 0.06 0 0.03 0 0 0 0 0.0002 0 0 0 0 0 0 0 0 0 0 0 0 0 
$$ [...]
##$SW_h= 4401.40845070422
##$TD= 16384
##$TD0= 1
##$TE= 300
##$TE2= 300
##$TE3= 300
##$TEG= 300
##$TL= (0..7)
0 120 120 120 120 120 120 120 
##$TP= (0..7)
150 150 150 150 150 150 150 150 
##$TP07= 0
##$TPNAME0= <>
##$TPNAME1= <>
##$TPNAME2= <>
##$TPNAME3= <>
##$TPNAME4= <>
##$TPNAME5= <>
##$TPNAME6= <>
##$TPNAME7= <>
##$TPOAL= (0..7)
0.5 0.5 0.5 0.5 0.5 0.5 0.5 0.5 
##$TPOFFS= (0..7)
0 0 0 0 0 0 0 0 
##$TUNHIN= 0
##$TUNHOUT= 0
##$TUNXOUT= 0
##$USERA1= <user>
##$USERA2= <user>
##$USERA3= <user>
##$USERA4= <user>
##$USERA5= <user>
##$V9= 5
##$VALIST= <valist>
##$VCLIST= <CCCCCCCCCCCCCCC>
##$VD= 0
##$VDLIST= <DDDDDDDDDDDDDDD>
##$VPLIST= <PPPPPPPPPPPPPPP>
##$VTLIST= <TTTTTTTTTTTTTTT>
##$WBST= 1024
##$WBSW= 25
##$XGAIN= (0..3)
0 0 0 0 
##$XL= 0
##$YL= 0
##$YMAX_a= 310684
##$YMIN_a= -496334
##$ZGOPTNS= <>
##$ZL1= 120
##$ZL2= 120
##$ZL3= 120
##$ZL4= 120
##$ABSF1= 17.49637
##$ABSF2= -4.496376
##$ABSG= 5
##$ABSL= 3
##$ALPHA= 0
##$AQORDER= 0
##$ASSFAC= 0
##$ASSFACI= 0
##$ASSFACX= 0
##$ASSWID= 0
##$AUNMP= <proc_1d>
##$AXLEFT= 0
##$AXRIGHT= 0
##$AXTYPE= 0
##$AXUNIT= <>
##$AZFE= 0.1
##$AZFW= 0.1
##$BCFW= 0
##$BC_mod= 2
##$BYTORDP= 0
##$COROFFS= 0
##$CY= 7568.61572265625
##$DATMOD= 1
##$DC= 0
##$DFILT= <>
##$DTYPP= 0
##$F1P= 17.9538593292236
##$F2P= -4.03888763876832
##$FCOR= 0.5
##$FTSIZE= 32768
##$FT_mod= 6
##$GAMMA= 0
##$GB= 0
##$INTBC= 0
##$INTSCL= 5.656564e-011
##$ISEN= 128
##$LB= 0.02
##$LEV0= 0
##$LPBIN= 0
##$MAXI= 945.577
##$MC2= 0
##$MEAN= 0
##$ME_mod= 0
##$MI= -402.1523
##$NCOEF= 0
##$NC_proc= -6
##$NLEV= 6
##$NOISF1= 8.587773
##$NOISF2= 6.764455
##$NSP= 0
##$NTH_PI= 0
##$NZP= 0
##$OFFSET= 17.49637
##$PC= 1
##$PHC0= -38.23835
##$PHC1= 6.060398
##$PH_mod= 1
##$PKNL= yes
##$PPARMOD= 0
##$PPDIAG= 0
##$PPIPTYP= 0
##$PPMPNUM= 100
##$PPRESOL= 1
##$PSCAL= 0
##$PSIGN= 0
##$REVERSE= no
##$SF= 200.13
##$SI= 32768
##$SIGF1= 16.12182
##$SIGF2= -4.496377
##$SINO= 3.521527
##$SIOLD= 32768
##$SREGLST= <1H.CDCl3>
##$SSB= 0
##$STSI= 32768
##$STSR= 0
##$SW_p= 4401.40845070422
##$SYMM= 0
##$S_DEV= 0
##$TDeff= 16384
##$TDoff= 0
##$TI= <>
##$TILT= no
##$TM1= 0
##$TM2= 0
##$TOPLEV= 0
##$USERP1= <user>
##$USERP2= <user>
##$USERP3= <user>
##$USERP4= <user>
##$USERP5= <user>
##$WDW= 1
##$XDIM= 32768
##$YMAX_p= 377412741
##$YMIN_p= -230283
$$ End of Bruker specific parameters
$$ ---------------------------------
##NTUPLES= NMR SPECTRUM
##VAR_NAME=  FREQUENCY,     SPECTRUM/REAL,   SPECTRUM/IMAG
##SYMBOL=    X,             R,               I
##VAR_TYPE=  INDEPENDENT,   DEPENDENT,       DEPENDENT
##VAR_FORM=  AFFN,          ASDF,            ASDF
##VAR_DIM=   32768,         32768,           32768
##UNITS=     HZ,            ARBITRARY UNITS, ARBITRARY UNITS
##FACTOR=    0.134324425510551, 1,           1
##FIRST=     4401.40845070422, -13606,       -965435
##LAST=      0,             -60221,          -1122822
##MIN=       0,             -230283,         0
##MAX=       4401.40845070422, 377412741,    0
$$ Real data points
##PAGE= N=1
##DATA TABLE= (X++(R..R)), XYDATA
$$ [...]
12366B46609M2473N4403O161m1586m3548K94M9353M3367k8632q4173m2476M7306
$$ 246609 289082 343485 349646 308060 264512 264806 314159 357526 328894 244721 202245 249551
12354B49551O5808N478k2532K3753N2145J783n2203k8131L4249N2986K3425j5154
$$ 249551 315359 320837 298305 322058 374203 375986 323783 295652 329901 382887 406312 391158
12342C91158n1504p0564l1302N0235P6806O981o4545m6856J0112J4500j2694K988
$$ 391158 339654 269090 237788 288023 364829 371810 307265 260409 270521 285021 272327 275315
12330B75315M1214K6427k6206l3130J0021K3941j5678m4161k0414J8610K8236
$$ 275315 316529 342956 316750 283620 293641 317582 301904 257743 237329 255939 284175
12319B84175Q221k0855l5228j1838L3305M0170m753k3484L1469P4343J3769p7328
$$ 284175 292396 271541 236313 224475 257780 297950 293197 269713 301182 375525 389294 311966
12307C11966o1047L6098N9531j6540n0443J8324O5073q63p7516m1913M9664O2983
$$ 311966 250919 287017 346548 330008 279565 297889 362962 362099 284583 242670 292334 355317
12295C55317m060m4354j6999K2139L2623K6239R001k4518m8418l0521P680J6830
$$ 355317 351257 306903 289904 312043 344666 370905 379906 355388 306970 276449 284129 300959
12283C00959n927k1997j5172J154K2586M7315M7603L72o4178r0096o1799o739
$$ 300959 295032 273035 257863 259017 281603 328918 376521 376893 312715 222619 160820 154081
12271A54081M6881P6005N4619r549n3011k5629L5237N3419K0225p382l500j388
$$ 154081 200962 276967 331586 322037 269026 243397 278634 332053 352278 344896 341396 340008
12259C40008k0909l1727r290K1354K3510k307k9156l9895l4797j8430O150L2837
$$ 340008 319099 287372 278082 299436 322946 320639 291483 251588 216791 198361 204511 237348
12247B37348M5315K2196l1345o0984j4044P3126R2482P036p8919n5274L4611N8079
$$ 237348 282663 304859 273514 212530 198486 271612 364094 371130 292211 236937 271548 329627
12235C29627q538n2752p236M9707K4653m6313n9220L640O2226N9750K0752j1223
$$ 329627 321089 268337 261101 310808 335461 289148 229928 233568 295794 355544 376296 365073
12223C65073k8962l6996k3970Q282K3181l484l5148j8653K9435L5152j8560m9199
$$ 365073 336111 299115 275145 283427 306608 303124 267976 249323 278758 313910 295350 246151
12211B46151O675Q2142O5532k7646o8006o925N0093J2086n6991n0041J2089L0370
$$ 246151 252826 334968 400500 372854 304848 297923 348016 360102 303111 253070 265159 295529
12199B95529l904j2846J8975K4824j1947k7362j393L754l0730l0374L6593Q0240
$$ 295529 291625 278779 297754 322578 310631 283269 281876 285630 254900 224526 261119 341359
12187C41359K8353m6673m0034J9684L0315j0897j9572J6585K1069k5765m9166
$$ 341359 369712 323039 283005 302689 333004 322107 302535 319120 340189 314424 265258
12176B65258j5498J0167j0859j5907L8757P8156K5412n3774m1188M0079N3949
$$ 265258 249760 259927 249068 233161 271918 350074 375486 321712 280524 320603 374552
12165C74552k8241p2649O369J02499P3904m3225r4259l5414K3640O228k6199O65
$$ 374552 346311 273662 280031 382530 456434 413209 318950 283536 307176 313404 287205 287870
12153B87870M5741K7949l3955m7562J1183O3560M0388l0997o9265l2924M1899
$$ 287870 333611 361560 327605 280043 291226 354786 395174 364177 294912 261988 303887
12142C03887P8817L5742m4894p4353k2145M3628M6529j342l3973k8993j3078L982
$$ 303887 382704 418446 373552 299199 277054 320682 367211 365869 331896 302903 289825 293807
12130B93807L1249M6218J6914k8394k9155O834J1811k3039k8155J9057M5904R126
$$ 293807 325056 371274 388188 359794 330639 337473 349284 326245 298090 317147 363051 372177
12118C72177k4792P931N7523M6303k902j9756j3327l7721o7337k6700O3296Q8750
$$ 372177 347385 355316 412839 459142 456240 436484 423157 385436 318099 291399 354695 443445
12106D43445J2604o5489n7685l339J7164M590P318K2711J1527j7172j1388L5932
$$ 443445 456049 390560 332875 329536 346700 351290 358608 381319 392846 375674 364286 400218
12094D00218O5981L5355k4474m9660j9602K9887N3454L6752k638l5343l8390q996
$$ 400218 466199 501554 477080 427420 407818 437705 491159 527911 525273 489930 451540 442544
12082D42544K8777M0359J6769j1612j1815Q151J3179o786k6557k7807j8599n343
$$ 442544 471321 511680 528449 516837 505022 513173 526352 519566 493009 465202 446603 441260
12070D41260J7137L5399J9802k1431l5366k855K2170m506m0602k3102K5551L1409
$$ 441260 458397 493796 513598 492167 456801 453946 476116 471610 431008 407906 433457 464866
12058D64866j0535l1336l217K1811O808j2344k60J1039j9106n8336l9868L3519
$$ 464866 454331 422995 419778 441589 448397 436053 435793 446832 427726 369390 329522 363041
12046C63041P9724L9982m5224q3750l9863K9429M9537J6203j5860j6319p249n734
$$ 363041 442765 482747 437523 353773 313910 343339 392876 409079 393219 376900 369651 363917
12034C63917O676L3634L7949N653j5546P380K8935R23l8433l0148j725j1720k7597
$$ 363917 370593 404227 442176 447829 432283 439663 468598 469521 431088 400940 399215 387495 359898
12021C59898K1219R1474O7437l9717q2780o483O2482K1837m8129l2257L0568L0330
$$ 359898 381117 472591 540028 500311 417531 411048 473530 495367 447238 414981 445549 475879
12009D75879k6089m1933M433M5161M5913L3592J8033j5218m3562k8325Q152O935
$$ 475879 449790 407857 412290 457451 503364 536956 554989 539771 496209 467884 476036 482971
11997D82971k9875m0686j382M6651O2738M2236l875m7633m1175K2983P1512L7605
$$ 482971 453096 412410 411028 457679 520417 562653 558778 511145 469970 492953 564465 602070
11985F02070l6413n7983j8646J5384K2832L9613O3006M6181p771m1483l9090l5286
$$ 602070 565657 507674 489028 504412 527244 566857 629863 676044 668273 626790 587700 552414
11973E52414k7602J9532P7312O9360L604k4556J3141L5848J760k3133L694K1836
$$ 552414 524812 544344 621656 691016 694620 670064 683205 719053 720813 697680 701374 723210
11961G23210j1691l6944p275J6647j6936m1371J2732Q0191O0665j4391l9783p433
$$ 723210 711519 674575 667300 683947 667011 625640 638372 718563 779228 764837 725054 717621
11949G17621Q121n699J539K5671J6312j0334R767O0235N6655m341k7194K8205
$$ 717621 725742 720043 721582 747253 763565 753231 762998 823233 879888 875547 848353 876558
11937H76558Q4034P1108K2324O68J6205N1638R6498J21969R0061J6977l6172n2322
$$ 876558 960592 1031700 1054024 1054692 1070897 1122535 1219033 1341002 1431063 1448040 1411868 1359546
11925A359546o5780p2307k7410M4320M9240k1186n0807J8345P7474K2279o9810
$$ 1359546 1293766 1221459 1194049 1238369 1287609 1266423 1215616 1233961 1311435 1333714 1263904
11914A263904o1184K3262M4719j7668m3391J7446O3127J7827m0469r310P4773
$$ 1263904 1202720 1225982 1270701 1253033 1209642 1227088 1290215 1308042 1267573 1258263 1333036
11903A333036R8567M4294L120L4024R3578J18130J11148J14119J26032R6650J576
$$ 1333036 1431603 1475897 1479017 1513041 1606619 1724749 1835897 1950016 2076048 2172698 2174274
11892B174274j06507j45600r7218k5588M031j452M550K7814L0975P817P888O3915
$$ 2174274 2067767 1922167 1824949 1799361 1803392 1801940 1806490 1834304 1865279 1873096 1880984 1944899
11880A944899J33830J52691J20038R0672Q2335M2429o7130j86067k07189j13675
$$ 1944899 2078729 2231420 2351458 2442130 2524465 2566894 2499764 2313697 2106508 1992833
11870A992833j6473k1973r5107j09635k6758M7279J2233q1969j08391m3425J2159
$$ 1992833 1976360 1954387 1859280 1749645 1722887 1770166 1782399 1700430 1592039 1548614 1560773
11859A560773r739n6116n4105k2314j9749l9544l2104m546j0827m6962m3640J4795
$$ 1560773 1551034 1494918 1440813 1418499 1398750 1359206 1327102 1322556 1311729 1264767 1221127 1235922
11847A235922M6096p149p7328o3793J8162O1563K4284k2867j4653K0712K7544
$$ 1235922 1282018 1274869 1197541 1133748 1151910 1213473 1237757 1214890 1200237 1220949 1248493
11836A248493J3543K0507M4018M4193K1101K1300O5789J20178J50908J68768J89272
$$ 1248493 1262036 1282543 1326561 1370754 1391855 1413155 1478944 1599122 1750030 1918798 2108070
11825B108070J81995J03399k5749j19038j20502p4732o8340j14052j37907r1434
$$ 2108070 2290065 2393464 2367715 2248677 2128175 2053443 1985103 1871051 1733144 1641710
11815A641710k6565j9037n4403n3911j024L2322J564m0400l0202P816R498k3513
$$ 1641710 1615145 1596108 1541705 1487794 1486770 1519092 1520656 1480256 1450054 1457870 1467368 1443855
11803A443855l5286j3493n426l4205o0745m6868j0164P187o367k8199l4142k0463
$$ 1443855 1408569 1395076 1389650 1355445 1294700 1247832 1237668 1244855 1238488 1210289 1176147 1155684
11791A155684l506j222r358n801J2822K1330R592L913J6054J0734k9199m6381
$$ 1155684 1152178 1150956 1141598 1135797 1148619 1169949 1179541 1183454 1199508 1210242 1181043 1134662
11779A134662J3235R7319J08443N3121L0577O8447P8452Q260o7440o6401k1405
$$ 1134662 1147897 1245216 1353659 1406780 1437357 1505804 1584256 1592516 1525076 1458675 1437270
11768A437270j0130l2345l7608k3615k4645l6620k9871j2971j6440l1794k6405
$$ 1437270 1427140 1394795 1357187 1333572 1308927 1272307 1242436 1229465 1213025 1181231 1154826
11757A154826o63K1520L5435M0108J3979l9063n9872j6013K9193Q686l0141J438
$$ 1154826 1154163 1175683 1211118 1251226 1265205 1226142 1166270 1150257 1179450 1188136 1157995 1159433
11745A159433P4350P5428o674n6669j5414L5739J9815j8572r170K4022K1931p22
$$ 1159433 1233783 1309211 1302537 1245868 1230454 1266193 1286008 1267436 1258266 1282288 1304219 1303497
11733A303497N790K6911J1135l1915m2308o199K9313L3584K2957J3332k49r127
$$ 1303497 1309287 1336198 1347333 1315418 1273110 1266911 1296224 1329808 1352765 1366097 1365848 1356721
11721A356721J0307M6478M8249k170m8951l2067K6635N2344K5296N985L4037N7631
$$ 1356721 1367028 1413506 1461755 1459585 1410634 1378567 1405202 1457546 1482842 1488827 1522864 1580495
11709A580495J6413m6013l5279M0096O9798J8352j0985M9710J05561M9943m8204
$$ 1580495 1596908 1550895 1515616 1555712 1625510 1643862 1632877 1682587 1788148 1838091 1789887
11698A789887m7472L6140O3273O925j9728K3737M4166N628K437P0498R6350J5684
$$ 1789887 1742415 1778555 1841828 1848753 1829025 1852762 1896928 1902556 1904993 1975491 2071841 2087525
11686B087525n3816l887P9374O7962P674J5145N8388K4300o2537p7742j4505K0068
$$ 2087525 2033709 2029822 2109196 2177158 2184832 2199977 2258365 2282665 2220128 2142386 2127881 2147949
11674B147949K697O685K8808q217p3437m2693P1628J00990q246r2709l1078O9277
$$ 2147949 2150646 2157331 2186139 2177922 2104485 2061792 2133420 2234410 2226164 2133455 2102377 2171654
11662B171654O2928p512j7037K8548L7283O644O595L8775M5461K5955K8808N2362
$$ 2171654 2234582 2227070 2210033 2238581 2275864 2282508 2289103 2327878 2373339 2399294 2428102 2480464
11650B480464N2888K8954R533j4205o0761r4199p4236l6955l6956m5267l299N4991
$$ 2480464 2533352 2562306 2571839 2557634 2496873 2402674 2328438 2291483 2254527 2209260 2205961 2260952
11638B260952M7087j1798k6432J5944K3542l8636q2180l6073M2552N9581J6852
$$ 2260952 2308039 2296241 2269809 2285753 2309295 2270659 2188479 2152406 2194958 2254539 2271391
11627B271391r290J8976O2894O4815J3568m1806m1576J0463M3905J8662j3753
$$ 2271391 2262101 2281077 2343971 2408786 2422354 2380548 2338972 2349435 2393340 2412002 2398249
11616B398249M273L4914Q348m6945l9634L1029O7902L0214j4551j5030k617R45
$$ 2398249 2402522 2437436 2445784 2398839 2359205 2390234 2458136 2488350 2473799 2458769 2456152 2457097
11604B457097L2538R2575J04948L8350k4321j0072L4708L5940J3454K4831N7538
$$ 2457097 2489635 2582210 2687158 2725508 2701187 2691115 2725823 2761763 2775217 2800048 2857586
11593B857586O8096O8987Q5902Q4859L6449j272L3932R1106Q1973L2697L9263
$$ 2857586 2925682 2994669 3080571 3165430 3201879 3200607 3234539 3325645 3407618 3440315 3479578
11582C479578R9586J18819P3230M0749N9810P9124O8401O5549Q5831Q9517P0135
$$ 3479578 3579164 3697983 3771213 3811962 3871772 3950896 4019297 4084846 4170677 4260194 4330329
11571D330329P3812J01763R8411O8020Q8735J66391J95056J26693O1299Q5404
$$ 4330329 4404141 4505904 4604315 4672335 4761070 4927461 5122517 5249210 5310509 5395913
11561E395913J33256J10875N7036N9263R1052O7178M254j0788K3241L0289P17
$$ 5395913 5529169 5640044 5697080 5756343 5847395 5914573 5918827 5908039 5931280 5961569 5962286
11550E962286l373K1482J1804l4516m2879O651M4405L1656J1774J5300J6671J3308
$$ 5962286 5958913 5980395 5992199 5957683 5914804 5921455 5965860 5997516 6009290 6024590 6041261 6054569
11538F054569M2203Q4086O2421j6722l9407L9057J07643P3981J4625M0948J08080
$$ 6054569 6096772 6180858 6243279 6226557 6187150 6226207 6333850 6407831 6422456 6463404 6571484
11527F571484R2504M66m3761O839P1013Q2315O4655N1694L6427K4785M6790Q5496
$$ 6571484 6663988 6664454 6620693 6627532 6698545 6780860 6845515 6897209 6933636 6958421 7005211 7090707
11515G090707P8097K0327p281M3665J14835J27824Q7809N4455N6711Q2618J15682
$$ 7090707 7168804 7189131 7181850 7225515 7340350 7468174 7555983 7610438 7667149 7749767 7865449
11504G865449J38114J29100R8422R2911J33329J74046J63886J19495R3829R2931
$$ 7865449 8003563 8132663 8231085 8323996 8457325 8631371 8795257 8914752 9008581 9101512
11494I101512P6602L6527K0125N8440J08677J02750M0388k005L3361J09469J44110
$$ 9101512 9178114 9214641 9234766 9293206 9401883 9504633 9545021 9543016 9576377 9685846 9829956
11483I829956J20001R6829J09566J17329Q7475O8644J15499J86706K00993J68064
$$ 9829956 9949957 10046786 10156352 10273681 10361156 10429800 10545299 10732005 10932998 11101062
11473A1101062J70797K27613K73894K87450L24147L98996M40092M13813L96437
$$ 11101062 11271859 11499472 11773366 12060816 12384963 12783959 13224051 13637864 14034301
11464A4034301M51206N22827N37665N30489N73874O44212O65845O45487O53494
$$ 14034301 14485507 15008334 15545999 16076488 16650362 17294574 17960419 18605906 19259400
11455A9259400O98925P30056P41868P76433Q24561Q35444Q26834Q74859R77662
$$ 19259400 19958325 20688381 21430249 22206682 23031243 23866687 24693521 25568380 26546042
11446B6546042J040772J033838J056754J196079J407719J609352J812034K078432
$$ 26546042 27586814 28620652 29677406 30873485 32281204 33890556 35702590 37781022
11438C7781022K399053K682887K831978K754853K345817J555645N10815m94887
$$ 37781022 40180075 42862962 45694940 48449793 50795610 52351255 52862070 52367183
11430E2367183j174202j422626j342420j123509r03810p16923n38634l52728j62465
$$ 52367183 51192981 49770355 48427935 47304426 46400616 45683693 45145059 44792331 44629866
11421D4629866L3374K40150M50189O55658Q73855J133325J443430J802761K219567
$$ 44629866 44663240 44903390 45353579 46009237 46883092 48016417 49459847 51262608 53482175
11412E3482175K692849L201964L761020M453076N350402O431240P656126R116821
$$ 53482175 56175024 59376988 63138008 67591084 72941486 79372726 87028852 96145673
11404I6145673J1032538J3579871J6705103J9935711K2213220K2082237J8491385
$$ 96145673 107178211 120758082 137463185 157398896 179612116 201694353 220185738
11397B20185738J1686103L260540m742129j0761530j4018812j4519492j3141239
$$ 220185738 231871841 235132381 230390252 219628722 205609910 191090418 177949179
11390A77949179j1374638j0372162j0119431r777774q811895p479843o249593
$$ 177949179 166574541 156202379 146082948 136305174 127493279 120013436 113763843
11383A13763843n191816m166947l276732k787854k739477k911455l136194l417742
$$ 113763843 108572027 104405080 101128348 98340494 95601017 92689562 89553368 86135626
11375H6135626l758676m069519m277726m380448m363228m190383l903854l619102
$$ 86135626 82376950 78307431 74029705 69649257 65286029 61095646 57191792 53572690
11367E3572690l383044l127753k804190k476811k234427k075950j943059j815000
$$ 53572690 50189646 47061893 44257703 41780892 39546465 37470515 35527456 33712456
11359C3712456j707255j607405j480103j333417j224984j184044j163731j099043
$$ 33712456 32005201 30397796 28917693 27584276 26359292 25175248 24011517 22912474
11351B2912474r93414r13252q96428q99816q55783p56728o56912o04261n97897
$$ 22912474 21919060 21005808 20109380 19209564 18353781 17597053 16940141 16335880 15737983
11342A5737983o04071n86946n31632m63350m32374m50383m58575l99049l02199
$$ 15737983 15133912 14546966 14015334 13551984 13119610 12669227 12210652 11811603 11509404
11333A1509404k52668k76782l17670l18046k73042k06211j53153j60306k28418
$$ 11509404 11256736 10979954 10662284 10344238 10071196 9864985 9711832 9551526 9323108
11324I323108k66771j93049p4609n7918j44404j72498o9388K6881j1285r5381
$$ 9323108 9056337 8863288 8788679 8730761 8586357 8413859 8344471 8371352 8360067 8264686
11314H264686p1944K6725M6717l5905r9159q7876p8337j19779j57027j45320j22560
$$ 8264686 8192742 8219467 8266184 8230279 8131120 8043244 7964907 7845128 7688101 7542781 7420221
11303G420221j25830j33744j29991j38811j63157j65203j37817j22452j32399
$$ 7420221 7294391 7160647 7030656 6891845 6728688 6563485 6425668 6303216 6170817
11294F170817j31887j11515j06369j18591j04290o1873m8068p6292q6642n3344
$$ 6170817 6038930 5927415 5821046 5702455 5598165 5536292 5488224 5411932 5325290 5271946
11284E271946l3469o3856r5230q1055n1579m4766m1801k8799m4103r9534j29959
$$ 5271946 5238477 5174621 5079391 4998336 4946757 4901991 4860190 4831391 4787288 4687754 4557795
11273D557795r2036m4001n4129r4716j00354o8393k9202J6400N5544L4349m5228
$$ 4557795 4465759 4421758 4367629 4272913 4172559 4104166 4074964 4091364 4146908 4181257 4136029
11262D136029q0142j5153M9511J6211l5978J3664R9507O6922n0263o6660M2498
$$ 4136029 4055887 4040734 4090245 4106456 4070478 4084142 4183649 4250571 4200308 4133648 4176146
11251D176146R3226K850p6475l0257K0420o1035j80170j67261n8024k0950p8250
$$ 4176146 4269372 4272222 4195747 4165490 4185910 4124875 3944705 3777444 3719420 3698470 3620220
11240C620220j00313m8962k9256q3064j09960m9091R187k5066r2665q5823j9445
$$ 3620220 3519907 3470945 3441689 3358625 3248665 3199574 3208761 3183695 3091030 3005207 2985762
11229B985762J489n4180j08320r4488l7849r62m175k3801l6238l6588k8222j8880
$$ 2985762 2987251 2933071 2824751 2730263 2692414 2691452 2687277 2663476 2627238 2590650 2562428 2543548
11217B543548k5777o1467j03589j00725l7447J9899r696j02232j35559n0975N0983
$$ 2543548 2517771 2456304 2352715 2251990 2214543 2234442 2224746 2122514 1986955 1935980 1986963
11206A986963M1778n2425r1301k7078L7026J5664l7755l6562L37j211m0036n3388
$$ 1986963 2028741 1976316 1885015 1857937 1894963 1910627 1872872 1836310 1836647 1835436 1795400 1742012
11194A742012l0406j9408l1791k5727P993K2883k676l0328k9718k0097j9539j1223
$$ 1742012 1711606 1692198 1660407 1634680 1642673 1665556 1662880 1632552 1602834 1582737 1563198 1551975
11182A551975J1873K3984J6083J3117J5852r489n1365m0341L3173P1154J1368
$$ 1551975 1563848 1587832 1603915 1617032 1632884 1623395 1572030 1531689 1564862 1636016 1647384
11171A647384o1007m1888K3053K0890l2113k4805M2685N1778k2919o1222n031
$$ 1647384 1586377 1544489 1567542 1588432 1556319 1531514 1574199 1625977 1603058 1541836 1536805
11160A536805M0879m173n4917j4925N1680L6722k1970j6255L5313K4460m9685
$$ 1536805 1577684 1573511 1518594 1503669 1555349 1592071 1570101 1553846 1589159 1613619 1563934
11149A563934p7383k4732K1756R119j6067j9262l1544n6167l7309K9604O0533
$$ 1563934 1486551 1461819 1483575 1492694 1476627 1457365 1425821 1369654 1332345 1361949 1422482
11138A422482J2703m0009k4617J9493J7193k1325l1940k213K4746K2243j25k5651
$$ 1422482 1435185 1395176 1370559 1390052 1407245 1385920 1353980 1351767 1376513 1398756 1398631 1372980
11126A372980l8296k5107J8M727r996q259J3075J1447k1949l5839q544O373k5773
$$ 1372980 1334684 1309577 1309595 1314322 1304326 1296067 1309142 1320589 1298640 1262801 1254257 1260630 1234857
11113A234857n1114j7111L0823J9991l1676n0848k6063q052j6535k2742j0305
$$ 1234857 1183743 1166632 1197455 1217446 1185770 1134922 1108859 1100807 1084272 1061530 1051225
11102A051225R869K9639L6411N530m7378n1448J5694O2855J1465o6263m8583L6241
$$ 1051225 1061094 1090733 1127144 1132674 1085296 1033848 1049542 1112397 1123862 1057599 1009016 1045257
11090A045257M9349l1417p5243j5367M5639J1204n6176m8609J5774L8686j804
$$ 1045257 1094606 1063189 987946 972579 1018218 1029422 973246 924637 940411 979097 977293
11079I77293m0647l8521j7444J342K1414L4644J8549k2491n2296m6763k0188m950
$$ 977293 936646 898125 880681 882023 903437 938081 956630 934139 881843 835080 814892 809942
11067H09942j6159l4555k5616J2882L4269K176m7311m8077j984K3170j797k9037
$$ 809942 793783 759228 733612 746494 780763 782939 735628 687551 685567 708737 706940 677903
11055F77903j7489Q975J5690J0639R959L425j1203j0425N782O62l0550l8278l133
$$ 677903 660414 669389 685079 695718 705677 709102 697899 687474 693256 693918 663368 625090 621957
11042F21957K1862L91k2857m079K0127L633k1488o617K0259Q898j5980m020J9718
$$ 621957 643819 644210 621353 617274 637401 641034 619546 612929 633188 642086 626106 622086 641804
11029F41804L081k4684l258L3810R176m4860k3309O0550P3408j6934p2379n182
$$ 641804 644885 620201 616943 650753 659929 615069 591760 652310 725718 708784 636405 631223
11017F31223P3738L2441o8931p5310K2585Q5377L8549l9599n5396k0557O39q726
$$ 631223 704961 737402 668471 593161 615746 701123 739672 700073 644677 624120 624759 616033
11005F16033j8224r653N465J3254J5222J9645K5857K1227j761k6765k6143J717
$$ 616033 597809 588156 593621 606875 622097 641742 667599 688826 687065 660300 634157 635874
10993F35874K4379J6140q111j4485N149K5115J9140p076j8341J0404N5176O1605
$$ 635874 660253 676393 668282 653797 658946 684061 703201 696125 677784 688188 743364 804969
10981H04969J5679k9667k6340Kj667j8640j426L4861K1710m1411o7612j7033L6274
$$ 804969 820648 790981 764641 764643 762976 744336 742910 777771 799481 758070 690458 673425 709699
10968G09699K3472j2815r91L7772L4499q236l0662k0339j6018k3378r307K4945
$$ 709699 733171 720356 719365 757137 791636 783400 752738 732399 716381 693003 683696 708641
10956G08641L9995K7813J7564J3504n604k6478j2764J9548J3233l1815m7931r040
$$ 708641 748636 776449 794013 807517 801913 775435 762671 782219 795452 763637 715706 706666
10944G06666K4832N544l0320k8884J240K2728L0253L0104Q101l1452m0348M071
$$ 706666 731498 737042 706722 677838 679078 701806 732059 762163 770264 738812 698464 702535
10932G02535M4834K2348k9073l1328J4934L4856m1l3220j8426J4200J6396o074
$$ 702535 747369 769717 740644 709316 724250 759106 759065 725845 707419 721619 738015 731941
10920G31941j6159n951K534j809p907m251P613J6917J2084o250j6647L119M1010
$$ 731941 715782 709831 712365 710556 702649 698398 706011 722928 735012 728762 712115 715234 756244
10907G56244N5548K9466nJ4073O4396R6619Q0582M8961N1846R0271J17277J00564
$$ 756244 811792 841258 841253 855326 919722 1016341 1096923 1145884 1197730 1288001 1405278 1505842
10895A505842N8132K2097p458m6011p8382p0058k8144p523l5176o7967o0264l7453
$$ 1505842 1563974 1586071 1578613 1532602 1454220 1384162 1356018 1348495 1313319 1245352 1185088 1147635
10883A147635m9377p5649m9852K1367M3902k5679r8912p3656J6586N1192k856
$$ 1147635 1098258 1022609 972757 994124 1038026 1012347 913435 839779 856365 907557 904701
10872I04701n3539k9621K1449K1290k1118m0265k1798r854k3238l2578k4752k7448
$$ 904701 851162 821541 842990 864280 843162 802897 781099 771245 748007 715429 690677 663229
10860F63229m9019m8705k850M1475K7222k3671l6674P114M5292K9149p597q082
$$ 663229 614210 565505 562655 604130 631352 607681 571007 578121 623413 652562 644965 636883
10848F36883J8930J9753j2419k5257M561K6727n449n5161n2052n45K4853n344
$$ 636883 655813 675566 663147 637890 642451 669178 663729 608568 556516 555971 580824 575480
10836E75480l1300k866L6406J7579m0793n6662q131L6327K1523k0483k6503J1770
$$ 575480 544180 541314 577720 595299 554506 497844 489713 526040 547563 527080 500577 512347
10824E12347M9221M6302J381n3079o9284k5066L8531N1561M190l5799j7835K1882
$$ 512347 561568 607870 609251 556172 486888 461822 500353 551914 556104 520305 502470 524352
10812E24352K2702q293j7634P258K7489J8315l278j2763k154K3076M0056J8568
$$ 524352 547054 538761 521127 528385 555874 574189 570911 558148 555994 579070 619126 637694
10800F37694l1941n3238j8898J2406j4976n0552r989P3282P8353j5205q4649m5201
$$ 637694 605753 552515 533617 546023 531047 480495 470506 543788 622141 606936 522287 477086
10788D77086L3853N3262K7033K0259K2553j5869o9669o3833K824M8874K6995k0087
$$ 477086 510939 564201 591234 611493 634046 618177 548508 484675 487499 536373 563368 543281
10776E43281k8850J0352N3900M7261k4061r8492q2478L0329J22735R3220o706
$$ 543281 514431 524783 578683 625944 601883 503391 420913 451242 573977 667197 660491
10765F60491m7733m242L1259M589k9863j4576K4198L3904J3844m912r268j64K0580
$$ 660491 612758 608516 639775 644364 614501 599925 624123 658027 671871 666959 657691 657527 678107
10752F78107L3896J3342k7737l9100l311L6778L7792N324k8682l8556r469M3688
$$ 678107 712003 725345 697608 658508 655197 691975 729767 735091 706409 667853 658384 702072
10740G02072O1673N066o6106n3843K6899N3079k0425q3844m0473M7875O8446K6147
$$ 702072 763745 768811 702705 648862 675761 728840 708415 624571 584098 631973 700419 726566
10728G26566J345L755j6016m9716m2974l762R234l204J3370N4735N6280R943j9323
$$ 726566 727911 731666 715650 665934 622960 619198 628432 625228 638598 693333 749613 759556 740233
10715G40233p904l772k2413j5410K6202L9346J816k1831J320Q887l5300n6268
$$ 740233 732329 728557 706144 690734 716936 756282 758098 736267 737587 746474 711174 654906
10703F54906N206O8753L0785n9109o5714K0903P3167K4371m2768l5490K1533M7378
$$ 654906 660112 728865 759650 700541 634827 655730 728897 753268 710500 675010 696543 743921
10691G43921K2125j1636k1929j5764j4087k4618k9865k285M8861O3395O152n9986
$$ 743921 766046 754410 732481 716717 702630 678012 648147 645862 694723 758118 764270 704284
10679G04284m2667M0535P1678L147o5766l4128N1765P2018Q879m1045j6300L4017
$$ 704284 661617 702152 773830 776977 711211 677083 728848 800866 809745 768700 752400 786417
10667G86417L9523M023k1580j5334N800K5380L9335L9230J6148j6886l0319j5037
$$ 786417 825940 829963 808383 793049 798849 824229 863564 902794 918942 902056 871737 856700
10655H56700K555l772k0354j1175K6538N1702L6544P030R90J0476M741p250R494
$$ 856700 859255 855483 835129 823954 850492 902194 938738 945768 946758 957234 961975 954725 964219
10642I64219M3382M0328m319k2979J9622O0042K9657l3573l8260K2651O3927L3270
$$ 964219 1007601 1047929 1043610 1020631 1040253 1100295 1129952 1096379 1058119 1080770 1144697 1177967
10630A177967k4929m1991n597M6987P3247N1811Q82k6911m099K5897R659k5159
$$ 1177967 1153038 1111047 1105450 1152437 1225684 1277495 1278377 1251466 1247367 1273264 1282923 1257764
10618A257764q921M6738N4406m450l8972M099N0056K2706k5416m650N4920N1391
$$ 1257764 1248843 1295581 1349987 1345537 1306565 1310664 1360720 1383426 1358010 1353360 1408280 1459671
10606A459671j9290n8744k4808J5747R481p265J0971M1033L8448N876k5203l8479
$$ 1459671 1440381 1381637 1356829 1372576 1382057 1374792 1385763 1426796 1465244 1471120 1445917 1407438
10594A407438k9354K939L6798M0410J9874J3674K6782K1345r966k0589J0884L6480
$$ 1407438 1378084 1381023 1417821 1458231 1478105 1491779 1518561 1539906 1529940 1509351 1520235 1556715
10582A556715J4071k4031k4634O352K6248K3801J7149J1322K353N34J1102J6139
$$ 1556715 1570786 1546755 1522121 1528473 1554721 1578522 1595671 1606993 1609346 1609880 1620982 1637121
10570A637121R263J6331M5174N3526J3802k8145j6121K6007L1088n882k6399k846
$$ 1637121 1646384 1662715 1707889 1761415 1775217 1747072 1730951 1756958 1788046 1782164 1755765 1752919
10558A752919K9812L6962K4286J1606J1502L2239O2167O1585J3652l2042j7613
$$ 1752919 1782731 1819693 1843979 1855585 1867087 1899326 1961493 2023078 2036730 2004688 1987075
10547A987075L6473N9788L5150J1794K1506M4635N9326O5278N8365L6820K6143
$$ 1987075 2023548 2083336 2118486 2130280 2151786 2196421 2255747 2321025 2379390 2416210 2442353
10536B442353M1609M4773P747n861P8385J99445K14982J11114K9703N3759R8129
$$ 2442353 2483962 2528735 2536482 2530621 2609006 2808451 3023433 3134547 3164250 3218009 3316138
10525C316138P3493K9618M5577Q8556R0413P7054J06264J45671J30241Q8744R6714
$$ 3316138 3389631 3419249 3464826 3553382 3643795 3720849 3827113 3972784 4103025 4191769 4288483
10514D288483J43265J57075J32384J18683J13790Q0493M7203P4442J34175J41940
$$ 4288483 4431748 4588823 4721207 4839890 4953680 5034173 5081376 5155818 5289993 5431933
10504E431933J04338J11882J78771K15582J82880J49833J65643J88804J87645
$$ 5431933 5536271 5648153 5826924 6042506 6225386 6375219 6540862 6729666 6917311
10495F917311K00525K44346K69103K61907K92310L84281M41967L86163K78248
$$ 6917311 7117836 7362182 7631285 7893192 8185502 8569783 9011750 9397913 9676161
10486I676161K19005K02714J70338J39377J69813K47445L10816L63967M56934
$$ 9676161 9895166 10097880 10268218 10407595 10577408 10824853 11135669 11499636 11956570
10477A1956570N70670O20276N68777M54423L13894J61915L9444n471J2712M5092
$$ 11956570 12527240 13147516 13716293 14170716 14484610 14646525 14685969 14680498 14693210 14738302
10467A4738302J01978K31376M03836N18313N40610N34666N21853M14362J55689
$$ 14738302 14840280 15071656 15475492 15993805 16534415 17069081 17590934 18005296 18160985
10458A8160985j54484l58025m10023l80590l31162k69929k01979j39194o4442
$$ 18160985 18006501 17648476 17238453 16857863 16526701 16256772 16054793 15915599 15851157
10449A5851157M1665J31770J14608l4070k33573l90890m85710n40061n52162n06849
$$ 15851157 15892822 16024592 16139200 16105130 15871557 15480667 14994957 14454896 13902734 13395885
10439A3395885m26165l59133l23683k97158k67590k56933k80438l16657l41897
$$ 13395885 12969720 12610587 12286904 11989746 11722156 11465223 11184785 10868128 10526231
10430A0526231l67905m13424m57140m59846m27155m05982m11851m03970l52435
$$ 10526231 10158326 9744902 9287762 8827916 8400761 7994779 7582928 7178958 6826523
10421F826523k90560k67928k79748k80165k49117k10209j90826j95318k12135
$$ 6826523 6535963 6268035 5988287 5708122 5459005 5248796 5057970 4862652 4650517
10412D650517k21225k01058j53407j13621j12138j35018j46498j36785j19519
$$ 4650517 4429292 4228234 4074827 3961206 3849068 3714050 3567552 3430767 3311248
10403C311248r9377p8381p7446j06391j25188q8817k5894j1692n6544q6680n7092
$$ 3311248 3211871 3133490 3056044 2949653 2824465 2735648 2709754 2698062 2641518 2554838 2497746
10392B497746j7683k8501o7069p3785m6708k9609l1860k3991l370l424l0957m6101
$$ 2497746 2480063 2451562 2384493 2310708 2264000 2234391 2202531 2178540 2175170 2171746 2140789 2094688
10380B094688k2980Q428N413k7423m7376l2310p632j0919m1331n6724k6627K1875
$$ 2094688 2071708 2080136 2085549 2058126 2010750 1978440 1970808 1959889 1918558 1861834 1835207 1857082
10368A857082L1099j1962n1802l2438K9514O5214L9069j2846l3373j2436Q261
$$ 1857082 1888181 1876219 1824417 1791979 1821493 1886707 1925776 1912930 1879557 1867121 1875382
10357A875382q083m4972n1158r052L2234J4309m7501p3901k4501M5273N6967J0122
$$ 1875382 1867299 1822327 1771169 1762117 1794351 1808660 1761159 1687258 1662757 1708030 1764997 1775119
10345A775119k8573k1956k389j0641l5511l6464l961K8973L1008R074o341k809
$$ 1775119 1746546 1724590 1722201 1711560 1676049 1639585 1635624 1664597 1695605 1704679 1698338 1695529
10333A695529J727q463j9548j2392j349j5174l9319k0908M9646J04319Q1758J2721
$$ 1695529 1697256 1688793 1669245 1656853 1655504 1640330 1601011 1580103 1629749 1734068 1815826 1828547
10321A828547k6567k2281k3614m4791l8556J4186N5777L6166m667K568M4450M3869
$$ 1828547 1801980 1779699 1756085 1711294 1672738 1686924 1742701 1778867 1774200 1776768 1821218 1865087
10309A865087j4471n1167j0293N1354M4927j8697m4785N866O2438N0506m021k1158
$$ 1865087 1850616 1799449 1789156 1840510 1885437 1866740 1821955 1827821 1890259 1940765 1936744 1915586
10297A915586J8228N5838M1479j0590n0371m3018P100N4334M2884k6877p8107
$$ 1915586 1933814 1989652 2031131 2020541 1970170 1927152 1934252 1988586 2031470 2004593 1926486
10286A926486m6822K5757M8982J6592M687L4496L6580j6308m4527N480N6968K3004
$$ 1926486 1879664 1905421 1954403 1970995 1975682 2010178 2046758 2030450 1985923 1991403 2048371 2071375
10274B071375m5091m1139J8445K7986k4552m4397k239J7004k8097n4641L886P7869
$$ 2071375 2026284 1985145 2003590 2031576 2007024 1962627 1960388 1977392 1949295 1894654 1898540 1976409
10262A976409O5019j6732o3876l2413K5313M4786J3105l5835n1759j2611L8270
$$ 1976409 2041428 2024696 1960820 1928407 1953720 1998506 2011611 1975776 1924017 1911406 1949676
10251A949676L2754k5466n5552j8120K4398J1391j8619j190M0368L7489o354k8592
$$ 1949676 1982430 1956964 1901412 1883292 1907690 1919081 1900462 1899272 1939640 1977129 1970775 1942183
10239A942183j4967p632j7610j3460N100L134j5645r487J7747J2995k8970m4753
$$ 1942183 1927216 1919584 1901974 1888514 1893614 1896748 1881103 1871616 1889363 1902358 1873388 1828635
10227A828635o827K7516J0545k2201k0192J885O548K691J2172J3041j7615m0552
$$ 1828635 1821808 1849324 1859869 1837668 1817476 1819361 1825909 1828600 1840772 1853813 1836198 1795646
10215A795646p165M8440M7654j1142m7407k1292J4604Q814j4883j5904p680j6627
$$ 1795646 1788481 1836921 1884575 1873433 1826026 1804734 1819338 1828152 1813269 1797365 1789685 1773058
10203A773058j8952J5192M7350J7661m6750n4132J0195M9719J622o2529m4885
$$ 1773058 1754106 1769298 1816648 1834309 1787559 1733427 1743622 1793341 1794963 1732434 1687549
10192A687549L0726O2469K5071j2054p271P598R445J8493L0328N017m2615l4789
$$ 1687549 1718275 1780744 1805815 1793761 1786490 1794088 1803533 1822026 1852354 1857371 1814756 1779967
10180A779967L8663P5731J6867m7772j8471M8597L5344l9008n2494J3411M8705
$$ 1779967 1818630 1894361 1911228 1863456 1844985 1893582 1928926 1889918 1837424 1850835 1899540
10169A899540K602m2533j9232K4858K6138K990k672K296K820J4629L4436K3266
$$ 1899540 1902142 1859609 1840377 1865235 1891373 1894363 1891691 1893987 1896807 1911436 1945872 1969138
10157A969138j6191k1908K2689M8396J5285j9796r955J254k1039k1177L7346P4703
$$ 1969138 1952947 1931039 1953728 2002124 2017409 1997613 1987658 1988912 1967873 1946696 1984042 2058745
10145B058745K0084m9749k6718M5064M6863j0027j7492K7586K7718j9169p957
$$ 2058745 2078829 2029080 2002362 2047426 2094289 2084262 2066770 2094356 2122074 2102905 2094948
10134B094948P0079R0148Q620n3531j4139L8971J3396l1180n139M9085M2727j764
$$ 2094948 2165027 2255175 2263795 2210264 2196125 2235096 2248492 2217312 2212173 2261258 2303985 2302221
10122B302221m334L0909M6485M4967N7141N1629o487n5580j8882N3640N2533j1608
$$ 2302221 2297887 2328796 2375281 2420248 2477389 2529018 2522531 2466951 2448069 2501709 2554242 2542634
10110B542634l0250J7150L9890L557j8242J4557M4059L1098J9237L5719L7888
$$ 2542634 2512384 2529534 2569424 2572981 2554739 2569296 2613355 2644453 2663690 2699409 2737297
10099B737297J0458J0368N4751O7777J1659k8244K2989R8435R2432K3658j3477
$$ 2737297 2747755 2758123 2812874 2880651 2892310 2864066 2887055 2985490 3077922 3101580 3088103
10088C088103m139l308r653K6662Q3407P5209l699n2160p661O8140Q6748M5259
$$ 3088103 3083964 3080656 3071003 3097665 3181072 3256281 3252582 3200422 3192761 3260901 3347649 3392908
10076C392908K016m897K2168N8869O8200K8379k7320l5987J2979O1559O3998L9176
$$ 3392908 3394924 3390027 3412195 3471064 3539264 3567643 3540323 3504336 3517315 3578874 3642872 3682048
10064C682048K3053J6535Q636R100K5231L9174L6981L0968L0826K4969J1463J1060
$$ 3682048 3705101 3721636 3730272 3739372 3764603 3803777 3840758 3871726 3902552 3927521 3938984 3950044
10052C950044K7769L5514K5527K2391L0409J8980q275M259O5289Q9782K0806o5146
$$ 3950044 3977813 4013327 4038854 4061245 4091654 4110634 4102359 4106618 4171907 4261689 4282495 4217349
10040D217349o3452K16K2730k485J0873P4531R5494L7196j3678J0151N5370N0793
$$ 4217349 4153897 4154113 4176843 4174358 4185231 4259762 4355256 4392452 4378774 4388925 4444295 4495088
10028D495088J5973k245j5173l6003j8287N8580J12198O7398j3880k3760J9237
$$ 4495088 4511061 4508816 4493643 4457640 4439353 4497933 4610131 4677529 4663649 4639889 4659126
10017D659126J6206k5949k189R3802J32944N4437l1310j5721M8837N5987J6245
$$ 4659126 4675332 4649383 4647194 4740996 4873940 4928377 4897067 4881346 4930183 4986170 5002415
10006E002415J0073L8059L8811J7232L2469P1939N9330q55o309P5666J33163P3340
$$ 5002415 5012488 5050547 5089358 5106590 5139059 5210998 5270328 5269473 5263164 5338830 5471993 5545333
9994E545333k5357k1965P7847J32883P5971J706J3233P4880Q5636L9494K2946
$$ 5545333 5519976 5498011 5575858 5708741 5784712 5786418 5799651 5874531 5960167 5999661 6022607
9983F022607P0935J16213J01887O7199P3980J04610R9273O1840N2226Q0896Q9847
$$ 6022607 6093542 6209755 6311642 6378841 6452821 6557431 6656704 6718544 6770770 6851666 6941513
9972F941513N5903L7979P9621J27227J08863N2702M8978J08592J42199R6351L6610
$$ 6941513 6997416 7035395 7115016 7242243 7351106 7403808 7452786 7561378 7703577 7799928 7836538
9961G836538N0353J18111J44612R7735N0035O9554J24050J33094Q5349N0938P7103
$$ 7836538 7886891 8005002 8149614 8247349 8297384 8366938 8490988 8624082 8709431 8760369 8837472
9950H837472J23513J28354R8998Q9794J10230J14312Q4152O3879Q5783J15739
$$ 8837472 8960985 9089339 9188337 9278131 9388361 9502673 9586825 9650704 9736487 9852226
9940I852226J11805R3289R9780J16064J02381P9017J05024J70974J90564J24926
$$ 9852226 9964031 10057320 10157100 10273164 10375545 10454562 10559586 10730560 10921124 11046050
9930A1046050M7534M2271R1156J18511J07038J03402J25679J34215J03789O9660
$$ 11046050 11093584 11135855 11227011 11345522 11452560 11555962 11681641 11815856 11919645 11989305
9920A1989305P6421J15783J43403J39188J25555J30913J52426J59737J32222Q8480
$$ 11989305 12065726 12181509 12324912 12464100 12589655 12720568 12872994 13032731 13164953 13253433
9910A3253433P0798R6630J37465J56104J50918J45552J48520J50355J53126J69782
$$ 13253433 13324231 13420861 13558326 13714430 13865348 14010900 14159420 14309775 14462901 14632683
9900A4632683J93101J99410J90023J93274K12249K09905J71533J44394J76046
$$ 14632683 14825784 15025194 15215217 15408491 15620740 15830645 16002178 16146572 16322618
9891A6322618K40662K73072K59227K43174K52201K68110K75071K82906K91464
$$ 16322618 16563280 16836352 17095579 17338753 17590954 17859064 18134135 18417041 18708505
9882A8708505K84538K77248L14420L92098M35331L98373L39378L40627L95007
$$ 18708505 18993043 19270291 19584711 19976809 20412140 20810513 21149891 21490518 21885525
9873B1885525M36984M53836M86261N32837N41108N03689M83793N20467N76296
$$ 21885525 22322509 22776345 23262606 23795443 24336551 24840240 25324033 25844500 26420796
9864B6420796O08172O26543O51062O69044O77630P07995P62651P88464P65281
$$ 26420796 27028968 27655511 28306573 28975617 29653247 30361242 31123893 31912357 32677638
9855C2677638P59997Q24744R00718R10118Q93623R47179J051049J090450J052691
$$ 32677638 33437635 34262379 35163097 36073215 36966838 37914017 38965066 40055516 41108207
9846D1108207J068595J205491J335971J304202J146464J040630J073197J162067
$$ 41108207 42176802 43382293 44718264 46022466 47168930 48209560 49282757 50444824
9838E0444824J209097J228852J284514J366724J408236J397541J405661J479291
$$ 50444824 51653921 52882773 54167287 55534011 56942247 58339788 59745449 61224740
9830F1224740J562698J576282J541140J553836J639459J712521J714297J705843
$$ 61224740 62787438 64363720 65904860 67458696 69098155 70810676 72524973 74230816
9822G4230816J761933J845125J874456J865088J892492J954249J989387K016994
$$ 74230816 75992749 77837874 79712330 81577418 83469910 85424159 87413546 89430540
9814H9430540K118300K276470K386526K459975K652932L000441L267046L191171
$$ 89430540 91548840 93825310 96211836 98671811 101324743 104325184 107592230 110783401
9806A10783401K781179K248281J745050J321408J058773J046724J217657J362820
$$ 110783401 113564580 115812861 117557911 118879319 119938092 120984816 122202473 123565293
9798A23565293J355736J257710J183786J168677J191001J231779J267880J275796
$$ 123565293 124921029 126178739 127362525 128531202 129722203 130953982 132221862 133497658
9790A33497658J266443J259859J227656J132922J017440R57647R37893Q70772
$$ 133497658 134764101 136023960 137251616 138384538 139401978 140359625 141297518 142168290
9782A42168290P45889O41349N72821M61577K88104J41831O0945m0057k02969l23868
$$ 142168290 142914179 143555528 144128349 144589926 144878030 145019861 145080806 145040749 144837780 144513912
9772A44513912l31157l42079m95190p16595q17125p72093p40060q19059r39598
$$ 144513912 144182755 143840676 143345486 142628891 141811766 141039673 140299613 139480554 138540956
9763A38540956j015102j061047j124833j204933j287002j380579j480110j553158
$$ 138540956 137525854 136464807 135339974 134135041 132848039 131467460 129987350 128434192
9755A28434192j596852j650539j733121j822159j905572j993583k069576k095767
$$ 128434192 126837340 125186801 123453680 121631521 119725949 117732366 115662790 113567023
9747A13567023k083448k091694k137317k171455k165863k153917k159224k153438
$$ 113567023 111483575 109391881 107254564 105083109 102917246 100763329 98604105 96450667
9739I6450667k120821k098081k106751k107808k073051k043532k058456k076946
$$ 96450667 94329846 92231765 90125014 88017206 85944155 83900623 81842167 79765221
9731G9765221k039759j972993j955429j998217k026718j983205j890877j807575
$$ 79765221 77725462 75752469 73797040 71798823 69772105 67788900 65898023 64090448
9723F4090448j762749j752928j760004j754343j707131j621252j535846j484367
$$ 64090448 62327699 60574771 58814767 57060424 55353293 53732041 52196195 50711828
9715E0711828j457341j420462j362607j307226j273217j245917j204851j162455
$$ 50711828 49254487 47834025 46471418 45164192 43890975 42645058 41440207 40277752
9707D0277752j140867j118506j050899r55351r13173r50486r77086r05866p83563
$$ 40277752 39136885 38018379 36967480 36012129 35098956 34148470 33171384 32265518 31481955
9698C1481955p21985p33814p31899o76182o18559n97107n86098n68708n62642
$$ 31481955 30759970 30026156 29294257 28618075 27999516 27402409 26816311 26247603 25684961
9689B5684961n51442m91048m12259m05319m61986m56648l48128k68730l15916
$$ 25684961 25133519 24642471 24230212 23824893 23362907 22906259 22558131 22289401 21973485
9680B1973485l82876l29936k17347k02426k78532k99791k31686j89484k22382
$$ 21973485 21590609 21260673 21043326 20840900 20562368 20262577 20030891 19841407 19619025
9671A9619025k38548j83646j34766j55038j88754j71792j33384j17238j02573
$$ 19619025 19380477 19196831 19062065 18907027 18718273 18546481 18413097 18295859 18193286
9662A8193286p5067q1835j39141j71132j21203m9958m2439q5324j14072j16236
$$ 18193286 18118219 18036384 17897243 17726111 17604908 17554950 17512511 17427187 17313115 17196879
9652A7196879j08659p7945k8743k6462r8047j51226r6854K646K1434l9143p4724
$$ 17196879 17088220 17010275 16981532 16955070 16857023 16705797 16608943 16611589 16633023 16593880 16519156
9641A6519156n9505o2626r3351p7975j0096J7934k5959n5806k4744j1704p2559
$$ 16519156 16459651 16397025 16303674 16225699 16215603 16233537 16207578 16151772 16127028 16115324 16042765
9630A6042765j22597p2827J0167L228p7558j08718n3755N94l602k4845k1267j7592
$$ 16042765 15920168 15847341 15857508 15860736 15783178 15674460 15620705 15621299 15617697 15592852 15571585 15553993
9618A5553993l7318n0891l5582k1716l3903m1533j6478P138j3664n2609n0508
$$ 15553993 15516675 15465784 15430202 15408486 15374583 15333050 15316572 15323710 15310046 15257437 15206929
9607A5206929j0248P169k0538m4049k3009J0247N07m7487p5658n2216q965P180
$$ 15206929 15196681 15203850 15183312 15139263 15116254 15126501 15127008 15079521 15003863 14951647 14942682 14949862
9595A4949862o170j3188O343L0376K5792o818l1417j8354K1770N0919M5507J8914
$$ 14949862 14943692 14930504 14936847 14967223 14993015 14986197 14954780 14936426 14958196 15009115 15054622 15073536
9583A5073536L155J4225L8946N3979N4104N7259P8035J00847R3981N7443L8967
$$ 15073536 15076691 15090916 15129862 15183841 15237945 15295204 15373239 15474086 15568067 15625510 15664477
9572A5664477P8445J43889J58101R9659M1411N9418J31259J68756J39388J02541
$$ 15664477 15742922 15886811 16044912 16144571 16185982 16245400 16376659 16545415 16684803 16787344
9562A6787344J17137J63810J85767J68872J45294J42464J64311K04915K43804
$$ 16787344 16904481 17068291 17254058 17422930 17568224 17710688 17874999 18079914 18323718
9553A8323718K42082J85768J27484J39527K18644K80162K63331K04059J76670
$$ 18323718 18565800 18751568 18879052 19018579 19237223 19517385 19780716 19984775 20161445
9544B0161445J95571K13789K02847J88590K00100K19452K08204J67874J43067
$$ 20161445 20357016 20570805 20773652 20962242 21162342 21381794 21589998 21757872 21900939
9535B1900939J60812J92979J97389J78368J75996J99965K11138J81510J39587
$$ 21900939 22061751 22254730 22452119 22630487 22806483 23006448 23217586 23399096 23538683
9526B3538683J31637J61307J94662K06629J95435J68577J43198J42869J64067
$$ 23538683 23670320 23831627 24026289 24232918 24428353 24596930 24740128 24882997 25047064
9517B5047064J66697J31802J01953J19381J53682J51714J32146J50191J85007
$$ 25047064 25213761 25345563 25447516 25566897 25720579 25872293 26004439 26154630 26339637
9508B6339637J62431R5015Q6642J63584K14934J64032R3005J08676J76594J97939
$$ 26339637 26502068 26597083 26683725 26847309 27062243 27226275 27319280 27427956 27604550 27802489
9498B7802489J78068J91637K28454K10985J46036J26241J77900K28412K36460
$$ 27802489 27980557 28172194 28400648 28611633 28757669 28883910 29061810 29290222 29526682
9489B9526682K38779K51021K39247K15403K42578L10169L25155K73530K63025
$$ 29526682 29765461 30016482 30255729 30471132 30713710 31023879 31349034 31622564 31885589
9480C1885589L39772L92397L31114K42890K51815L24570L46431L13729L11196
$$ 31885589 32225361 32617758 32948872 33191762 33443577 33768147 34114578 34428307 34739503
9471C4739503L51892L76699L75508L80616L75443L38245L37486M40395N59497
$$ 34739503 35091395 35468094 35843602 36224218 36599661 36937906 37275392 37715787 38275284
9462C8275284N51275M50484M30599N28376N98647N74003N67750O49099P14335
$$ 38275284 38826559 39277043 39707642 40236018 40834665 41408668 41976418 42625517 43339852
9453D3339852O89511O79062P74898Q79884Q83212Q68392R59539J079943J078360
$$ 43339852 44029363 44708425 45483323 46363207 47246419 48114811 49074350 50154293 51232653
9444E1232653J012264J071259J256233J373174J353806J351073J466092J595026
$$ 51232653 52244917 53316176 54572409 55945583 57299389 58650462 60116554 61711580
9436F1711580J635851J661079J767775J905573J983617K032265K126365K237766
$$ 61711580 63347431 65008510 66776285 68681858 70665475 72697740 74824105 77061871
9428G7061871K296381K331976K425822K563780K657862K688689K716161K759862
$$ 77061871 79358252 81690228 84116050 86679830 89337692 92026381 94742542 97502404
9420I7502404K770002K721710K654694K607537K576664K548395K518455K476262
$$ 97502404 100272406 102994116 105648810 108256347 110833011 113381406 115899861 118376123
9412A18376123K415765K362194K351264K389480K465746K579572K721015K854619
$$ 118376123 120791888 123154082 125505346 127894826 130360572 132940144 135661159 138515778
9404A38515778K971863L127758L368596L653282L910438M146963M428947M776118
$$ 138515778 141487641 144615399 147983995 151637277 155547715 159694678 164123625 168899743
9396A68899743N151770N543049N970197O421508O860554P300761P794539Q342216
$$ 168899743 174051513 179594562 185564759 191986267 198846821 206147582 213942121 222284337
9388B22284337Q885833R393559R865883J0254780J0474996J0515618J0440938
$$ 222284337 231170170 240563729 250429612 260684392 271159388 281675006 292115944
9381B92115944J0250554R845207R182817Q367390P515367O627091N672486M718205
$$ 292115944 302366498 312211705 321394522 329761912 337277279 343904370 349576856 354295061
9373C54295061L866915L132355K479784J942975J589247J394448J260156J145356
$$ 354295061 358161976 361294331 363774115 365717090 367306337 368700785 369960941 371106297
9365C71106297J084035J077516J065993J011489R15599P41609M10203j01279p35127
$$ 371106297 372190332 373267848 374333841 375345330 376260929 377002538 377412741 377311462 376576335
9356C76576335j455747k296888l271386m308983n331472o326869p298535q195517
$$ 376576335 375120588 372823700 369552314 365243331 359911859 353584990 346286455 338090938
9348C38090938q949911r542547r980611j0248931j0339097j0298174j0192456
$$ 338090938 329141027 319598480 309617869 299368938 289029841 278731667 268539211
9341B68539211j0038422r813300r516043r175918q819130q467999q152955p880491
$$ 268539211 258500789 248687489 239171446 229995528 221176398 212708399 204555444 196674953
9333A96674953p608621p302961o998746o751101o538612o285045n977938n692566
$$ 196674953 189066332 181763371 174764625 168013524 161474912 155189867 149211929 143519363
9325A43519363n477142n280876n033367m741996m465382m230402m022580l827237
$$ 143519363 138042221 132761345 127727978 122985982 118520600 114290198 110267618 106440381
9317A06440381l631805l412304l167694k947897k794184k666688k491716k275459
$$ 106440381 102808576 99396272 96228578 93280681 90486497 87819809 85328093 83052634
9309H3052634k103141k014604j948248j834638j683638j540437j411865j287335
$$ 83052634 80949493 78934889 76986641 75152003 73468365 71927928 70516063 69228728
9301F9228728j186769j128218j080563j006176r21426q56861p92010p01502o31587
$$ 69228728 68041959 66913741 65833178 64827002 63905576 63048715 62256705 61555203 60923616
9292F0923616o37589o66859o16013n02795m52604m89002m80097l58740k53475
$$ 60923616 60286027 59619168 59003155 58500360 58047756 57558754 57078657 56719917 56466442
9283E6466442k88080l71860l40299k18563j68040k14294k19293j28948n9857q8305
$$ 56466442 56178362 55806502 55466203 55247640 55079600 54865306 54646013 54517065 54457208 54368903
9273E4368903j21710o7164J1723J5746k0078J783P5978J19878J13482J02985J02019
$$ 54368903 54247193 54180029 54191752 54207498 54187420 54189203 54265181 54385059 54498541 54601526 54703545
9262E4703545R4227J06085J74041K56681K78202K48110K42665K78101L03313L12683
$$ 54703545 54797772 54903857 55077898 55334579 55612781 55860891 56103556 56381657 56684970 56997653
9252E6997653L52849M07197L95932L26486L21400M31364N30316M88476L64008
$$ 56997653 57350502 57757699 58153631 58480117 58801517 59232881 59763197 60251673 60615681
9243F0615681L13214L67776M20449M06762L81638M04967M51458M68323M51006
$$ 60615681 60928895 61296671 61717120 62123882 62505520 62910487 63361945 63830268 64281274
9234F4281274M25780M09964M19137M65453N18822N15809M42739L69002L56721
$$ 64281274 64707054 65117018 65536155 66001608 66520430 67036239 67478978 67847980 68204701
9225F8204701L73321L43483K60847J87916J55078J25026P0294K6090L0202N2871
$$ 68204701 68578022 68921505 69182352 69370268 69525346 69650372 69720666 69746756 69776958 69829829
9215F9829829L6353j4660l4192J0558P1597Q8239O9731P4530J20534J57700J42347
$$ 69829829 69866182 69851522 69817330 69827888 69899485 69987724 70057455 70131985 70252519 70410219 70552566
9204G0552566J06175J17573J83659K31154K01122J31344J10011J62937K29609
$$ 70552566 70658741 70776314 70959973 71191127 71392249 71523593 71633604 71796541 72026150
9195G2026150K51868K39862K33454K44699K72368L32603M25419M99952N13709
$$ 72026150 72278018 72517880 72751334 72996033 73268401 73601004 74026423 74526375 75040084
9186G5040084N10302N69937O85996P68358P85242Q18887R37054J084261J168708
$$ 75040084 75550386 76120323 76806319 77574677 78359919 79178806 80115860 81200121 82368829
9177H2368829J201859J267807J384744J487496J544895J609999J732298J886465
$$ 82368829 83570688 84838495 86223239 87710735 89255630 90865629 92597927 94484392
9169I4484392K020490K125922K226418K332285K439766K551127K666523K772115
$$ 94484392 96504882 98630804 100857222 103189507 105629273 108180400 110846923 113619038
9161A13619038K857938K933149L005957L063874L092844L103788L119079L137124
$$ 113619038 116476976 119410125 122416082 125479956 128572800 131676588 134795667 137932791
9153A37932791L130451L085609L033135L019827L045093L046620K980167K902597
$$ 137932791 141063242 144148851 147181986 150201813 153246906 156293526 159273693 162176290
9145A62176290K921012L042893L139625L107415L009548K983124L041792L068922
$$ 162176290 165097302 168140195 171279820 174387235 177396783 180379907 183421699 186490621
9137A86490621K997659K888525K801353K694133K510907K291145K111920J970473
$$ 186490621 189488280 192376805 195178158 197872291 200383198 202674343 204786263 206756736
9129B06756736J805106J606091J428260J300182J189617J069168R62509R03836
$$ 206756736 208561842 210167933 211596193 212896375 214085992 215155160 216117669 217021505
9121B17021505Q84256Q60382Q03612P29667O80113O70351O57122N75630M15089
$$ 217021505 217905761 218766143 219569755 220299422 220979535 221649886 222307008 222882638 223297727
9112B23297727K35075R6090k888j05499k42719m10846n78425p01799p61955p96097
$$ 223297727 223532802 223628892 223626004 223520505 223277786 222866940 222288515 221586716 220824761 220028664
9102B20028664q57292r35539r69171r47652r34497r56123r48401q76758q33577
$$ 220028664 219171372 218235833 217266662 216319010 215384513 214428390 213479989 212603231 211769654
9093B11769654r20840j087073j192757j214830j268964j423896j609157j742852
$$ 211769654 210848814 209761741 208568984 207354154 206085190 204661294 203052137 201309285
9085B01309285j851561k002929k189540k348767k459202k556867k672551k797045
$$ 201309285 199457724 197454795 195265255 192916488 190457286 187900419 185227868 182430823
9077A82430823k902159k968682k996815l002732l000835k989085k963077k936821
$$ 182430823 179528664 176559982 173563167 170560435 167559600 164570515 161607438 158670617
9069A58670617k928229k930958k925827k914095k915129k940590k993443l073231
$$ 158670617 155742388 152811430 149885603 146971508 144056379 141115789 138122346 135049115
9061A35049115l154861l192162l181859l188546l253940l320740l315165l263648
$$ 135049115 131894254 128702092 125520233 122331687 119077747 115757007 112441842 109178194
9053A09178194l237355l217361l131051l003324k933720k914786k823066k630643
$$ 109178194 105940839 102723478 99592427 96589103 93655383 90740597 87917531 85286888
9045H5286888k471794k424673k374795k206330j999752j896643j866407j770896
$$ 85286888 82815094 80390421 78015626 75809296 73809544 71912901 70046494 68275598
9037F8275598j600440j474354j427855j364439j235051j115322j060752j009378
$$ 68275598 66675158 65200804 63772949 62408510 61173459 60058137 58997385 57988007
9029E7988007q92447p49181o61180o34262o09342n52398m81877m28350m02843
$$ 57988007 57095560 56346379 55685199 55050937 54441595 53889197 53407320 52978970 52576127
9020E2576127l93371l75779l40052l08039l05039l16853l02072k46915j83373
$$ 52576127 52182756 51806977 51466925 51158886 50853847 50536994 50234922 49988007 49804634
9011D9804634j52706j65557j87706j57096m6177P7415J02289J8708m7567j586
$$ 49804634 49651928 49486371 49298665 49141569 49095392 49172807 49275096 49293804 49246237 49244651
9001D9244651Q4404Q1660m905o4728o5415q6917j75622k79393l43802l73811l83164
$$ 49244651 49329055 49410715 49405810 49341082 49275667 49188750 49013128 48733735 48389933 48016122 47632958
8990D7632958l76587l96056m86322n97808o26878n72327n40550n70174n78596
$$ 47632958 47256371 46860315 46373993 45776185 45149307 44576980 44036430 43466256 42887660
8981D2887660n27884n07281n73822o37035o03247n29004n19888n65967n95012
$$ 42887660 42359776 41852495 41278673 40641638 40038391 39509387 38989499 38423532 37828520
8972C7828520o12253o62130p12188p03336o70797o90690p43635p55100p37209
$$ 37828520 37216267 36554137 35841949 35138613 34467816 33777126 33033491 32278391 31541182
8963C1541182p58412p96681p65099o77432o43113o84291p00876o47511o03963
$$ 31541182 30782770 29986089 29220990 28543558 27900445 27216154 26515278 25867767 25263804
8954B5263804o19620o23934n63565n06057n16862n38678m97298m39637m48867
$$ 25263804 24644184 24020250 23456685 22950628 22433766 21895088 21397790 20958153 20509286
8945B0509286m88582m60552l78843l52198m00497m18902l48914k69073k64890
$$ 20509286 20020704 19560152 19181309 18829111 18428614 18009712 17660798 17391725 17126835
8936A7126835l03661l08349k83465k82317k95247k66380k07726k00649k65240
$$ 17126835 16823174 16514825 16231360 15949043 15653796 15387416 15179690 14979041 14713801
8927A4713801l12290k68583j83617j52001j78429j92046j66168j44485j54841
$$ 14713801 14401511 14132928 13949311 13797310 13618881 13426835 13260667 13116182 12961341
8918A2961341j72046j73739j66308j45725j00375o3632q7562j46178j50494q9410
$$ 12961341 12789295 12615556 12449248 12303523 12203148 12139516 12051954 11905776 11755282 11665872
8908A1665872n9060j03384j31822p4782j7207o2904j48896j36415l7291L109o4835
$$ 11665872 11606812 11503428 11371606 11296824 11279617 11216713 11067817 10931402 10894111 10897220 10832385
8897A0832385j30899j07809m7289l4732p1996j08342j10131p1161j9226j7983
$$ 10832385 10701486 10593677 10546388 10511656 10439660 10331318 10221187 10150026 10130800 10112817
8887A0112817q8976j44534r3842J964M035q3989j21106o8038m7893j17404j57636
$$ 10112817 10023841 9879307 9785465 9787429 9791464 9707475 9586369 9518331 9470438 9353034 9195398
8876I195398q5728q504l9396j06618r0331l0337l7150r2608j04799q5612j06113
$$ 9195398 9109670 9101166 9061770 8955152 8864821 8834484 8797334 8704726 8599927 8514315 8408202
8865H408202j35948r7567l4209n0902j20902j25985o8284o0713j12770j14817
$$ 8408202 8272254 8174687 8140478 8089576 7968674 7842689 7774405 7713692 7600922 7486105
8855G486105n0479l2663q9210j03462l3270m904r4829j83511j43487l4881J0722
$$ 7486105 7435626 7402963 7313753 7210291 7177021 7172117 7077288 6893777 6750290 6715409 6726131
8844F726131j5395m6292p6490j20266j21745m3911K4245j3829r6886r8114l1482
$$ 6726131 6710736 6664444 6587954 6467688 6345943 6302032 6326277 6312448 6215562 6117448 6085966
8833F085966j6085o7063q1722l1629j1275o5353j08010o9201o996o066n1360p3135
$$ 6085966 6069881 6002818 5921096 5889467 5878192 5812839 5704829 5635628 5628632 5622566 5571206 5498071
8821E498071n4971l1547k2591k4195l5253n0654n3156m1280l8163n1255n6173
$$ 5498071 5443100 5411553 5388962 5364767 5329514 5278860 5225704 5184424 5146261 5095006 5038833
8810E038833m0806k8501l5113m2250l7713m0398n5405m9777j2386O386l2753q2755
$$ 5038833 4998027 4969526 4934413 4892163 4854450 4814052 4758647 4708870 4696484 4702870 4670117 4587362
8798D587362p1909j6920p79m4041p6684n3940k2941l4135n3602k7071J6396N991
$$ 4587362 4515453 4498533 4497754 4453713 4377029 4323089 4300148 4266013 4212411 4185340 4201736 4207727
8786D207727m6064n1303J2347N2344r06q1374q2616j8574j363p0110j29945q6452
$$ 4207727 4161663 4110360 4122707 4175051 4174145 4092771 4010155 3991581 3990218 3920108 3790163 3703711
8774C703711K4900Q7598M6229m2313q6612n9100j3712j4181n2303n8210k949M7329
$$ 3703711 3728611 3816209 3862438 3820125 3733513 3674413 3660701 3646520 3594217 3536007 3533058 3580387
8762C580387K2429m1689n4802j5209p238n0229n8602N771M8874r777r4896q2861
$$ 3580387 3602816 3561127 3506325 3491116 3483878 3433649 3375047 3380818 3429692 3419915 3325019 3242158
8750C242158Q007N0230J81n7818n7242l0723k5947l1344j9634J546J3886J3618
$$ 3242158 3250165 3300395 3300576 3242758 3185516 3154793 3128846 3097502 3077868 3079414 3093300 3106918
8738C106918m077l7949n3158j7695L1550K6017k6204m6718j4256K578l0790n1793
$$ 3106918 3102841 3064892 3011734 2994039 3025589 3051606 3025402 2978684 2964428 2967006 2936216 2884423
8726B884423j2918L0075J2447l0508l1021n840j3644l9165j9664L5050M8472J303
$$ 2884423 2871505 2901580 2914027 2883519 2852498 2846658 2833014 2793849 2774185 2809235 2857707 2859010
8714B859010m1229l6832j7791j4500n189K2980K9863j1908n4936l4493L8092Q6535
$$ 2859010 2817781 2780949 2763158 2748658 2743469 2766449 2796312 2784404 2729468 2694975 2733067 2819602
8702B819602O2779o662o2012o9669m0560r199R51k850J288J6901K6275K1097J4498
$$ 2819602 2882381 2875719 2813707 2744038 2703478 2694279 2695230 2692380 2693668 2710569 2736844 2757941 2772439
8689B772439J4132O575j4553k6075n983K6717L2080M737j9299j3573Q049J8735
$$ 2772439 2786571 2793146 2778593 2752518 2746535 2773252 2805332 2810069 2790770 2777197 2785246 2803981
8677B803981J0757j0225l5107l9913K186O8806Q3962J4259n9459l6459N1715P4677
$$ 2803981 2814738 2804513 2769406 2729493 2731679 2800485 2884447 2898706 2839247 2802788 2854503 2929180
8665B929180J663m2878K1831Q9113K9138q6959q0575N1053J19158L3509o4756
$$ 2929180 2930843 2887965 2909796 2998909 3028047 2941088 2860513 2911566 3030724 3064233 2999477
8654B999477l7465L7249J3684p3548p4878J8037N6760k0983r3467n1042L9230
$$ 2999477 2962012 2999261 3012945 2939397 2864519 2882556 2939316 2918333 2824866 2773824 2813054
8643B813054N0244j1925l5570J6170N6358J3563o1905p4488j9859J6075j2495
$$ 2813054 2863298 2851373 2815803 2831973 2888331 2901894 2839989 2765501 2745642 2761717 2749222
8632B749222m5913j6806L7785K9395l8687o8425k0316K2161j1264o1030l6154
$$ 2749222 2703309 2686503 2724288 2753683 2714996 2646571 2626255 2648416 2637152 2576122 2539968
8621B539968L3509M3019k2633p2866n4097j1650J685o851j5404k6775l6779k5495
$$ 2539968 2573477 2616496 2593863 2520997 2466900 2455250 2456935 2450084 2434680 2407905 2371126 2345631
8609B345631k599l814k4673j8199K2734M4119J5113k8234m8236n2346m9084k3349
$$ 2345631 2343032 2339218 2314545 2296346 2319080 2363199 2378312 2350078 2301842 2249496 2200412 2177063
8597B177063J2873J2509k7398m5990j8070j69k7102m0174J0885O3205K6909p0310
$$ 2177063 2189936 2202445 2175047 2129057 2110987 2110818 2083716 2043542 2054427 2117632 2144541 2074231
8585B074231j16607o9508O091L9905K4152j3447m2764m0237j0814Q519j88r821
$$ 2074231 1957624 1888116 1894207 1934112 1958264 1944817 1902053 1861816 1851002 1859521 1859333 1849512
8573A849512o218k2592o6525p3904q852M9956J8095m9881l9249L5938N4758r219
$$ 1849512 1843294 1820702 1754177 1680273 1671421 1721377 1739472 1689591 1650342 1686280 1741038 1731819
8561A731819m9024q306L1134l461n7978n0712J277K9311J8671j209j8745l3035
$$ 1731819 1682795 1674489 1705623 1702162 1644184 1593472 1594749 1624060 1642731 1641522 1622777 1589742
8549A589742k8624o080L158j0719j4827L870R873j4240l2358k1301r190j1003
$$ 1589742 1561118 1555038 1558196 1547477 1532650 1536520 1546393 1532153 1499795 1478494 1469304 1458301
8537A458301L331L5079L0598j9324l9726M282L4957l532l3050K4444Q6405K6236
$$ 1458301 1461632 1496711 1527309 1507985 1468259 1472541 1507498 1503966 1470916 1495360 1581765 1608001
8525A608001j05901j38767l7454N3794L7955j6568k3413p565k1723m2156k5938
$$ 1608001 1502100 1363333 1325879 1379673 1417628 1401060 1377647 1370082 1348359 1306203 1280265
8514A280265M751P748n610k360J1795J3708M984n679k2933l6979k0105J9529K9400
$$ 1280265 1285016 1292764 1287154 1284794 1296589 1310297 1315281 1309602 1286669 1249690 1229585 1249114 1278514
8501A278514r798m6840l5291O91J2850j807j4646j1236O412K7488K3678k1796
$$ 1278514 1268716 1221876 1186585 1187276 1200126 1198319 1183673 1172437 1178849 1206337 1230015 1208219
8489A208219o4258l9244K9718M4878j4523m8211N915O6139L9036l2091n0497k2892
$$ 1208219 1143961 1104717 1134435 1179313 1164790 1116579 1122494 1188633 1227669 1195578 1145081 1122189
8477A122189j8213k8204L010M7430K5278m5230o0971j479M0070J1390k9171k6691
$$ 1122189 1103976 1075772 1078782 1126212 1151490 1106260 1045289 1043810 1083880 1095270 1066099 1039408
8465A039408p090l987l767j388k1746m9698k8393L6351O3098K5867j375K0322
$$ 1039408 1032318 1028331 1024564 1023176 1001430 951732 923339 959690 1022788 1048655 1047280 1067602
8453A067602K3108l7023q4586m8820J1443J1089j5320J2066O4551N4157p012k7460
$$ 1067602 1090710 1053687 969101 920281 931724 942813 927493 939559 1004110 1058267 1051255 1023795
8441A023795O871K2053n925k2542p925n650k5497k2950N621P411k4639l0758P711
$$ 1023795 1030666 1052719 1046794 1024252 1016327 1010677 985180 962230 967851 975262 950623 919865 927576
8428I27576L3349J6274k57P273j238l7260m1589J0679N1033K5060k2294l3084
$$ 927576 960925 977199 976942 984215 982977 945717 904128 914807 965840 990900 968606 935522
8416I35522k6627l2227j4994M4496P3381J1406p0352o5911J443K8941P504J4092
$$ 935522 908895 876668 861674 906170 979551 990957 920605 854694 856137 885078 892582 906674
8404I06674N1585L7393l7985p5777k7803K8872K5747M119J9241L7844J0216k8956
$$ 906674 958259 995652 957667 881890 854087 882959 908706 912825 932066 969910 980126 951170
8392I51170j7807K5185L4837P664k802J8327K9304P324j8908k0385o204L28o743
$$ 951170 933363 958548 993385 1001049 998247 1016574 1045878 1053202 1034294 1013909 1007705 1008033 1001290
8379A001290j6924j7098l647Q532R8j9295j4318K0977M0526R272l8095m3055q768
$$ 1001290 984366 967268 963621 972153 972251 952956 938638 959615 1000141 1009413 971318 928263 919495
8366I19495R870n287j0896K3197O1657N3112K998l2893j5951L6566P6754P4858
$$ 919495 929365 924078 913182 936379 998036 1051148 1054146 1021253 1005302 1041868 1118622 1193480
8354A193480M3459K3835N0431J20707J93140K17951J79635J11799N9554K4453
$$ 1193480 1236939 1260774 1311205 1431912 1625052 1843003 2022638 2134437 2193991 2218444
8344B218444l2210j16987j65618j19094k2374J2773m6142j03250o3131M1433R7626
$$ 2218444 2186234 2069247 1903629 1784535 1762161 1774934 1728792 1625542 1562411 1603844 1701470
8333A701470N4303l6357r8276j00858n8866j1850k887l6942o1316k6661L5118
$$ 1701470 1755773 1719416 1621140 1520282 1461416 1449566 1446679 1409737 1348421 1321760 1356878
8322A356878M0522l1186j02129r6289l4695L770j0588l2519j6380K3453M2430
$$ 1356878 1397400 1366214 1264085 1167796 1133101 1136871 1126283 1093764 1077384 1100837 1143267
8311A143267L1350K2302L2275L4456N935k2674l973N2325R0272R2603R9813J33037
$$ 1143267 1174617 1196919 1229194 1263650 1269585 1246911 1242938 1295263 1385535 1478138 1577951 1710988
8299A710988J62726J83797K47917L58815L99137K55547j0651k11252k45648j84681
$$ 1710988 1873714 2057511 2305428 2664243 3063380 3318927 3308276 3097024 2851376 2666695
8289B666695j38789j32072j32465j26641j17677r8660o9826m9600m4072l7596
$$ 2666695 2527906 2395834 2263369 2136728 2019051 1920391 1850565 1800965 1756893 1719297
8279A719297k8022l3512n2773o0058m9779m1881l7343k0362q736l7142q0891p2498
$$ 1719297 1691275 1657763 1604990 1544932 1495153 1453272 1415929 1395567 1386831 1349689 1268798 1196300
8267A196300j4778P095l8405p0456k7575K8587J5503l8273n1011j9499k6j198
$$ 1196300 1181522 1188617 1150212 1079756 1052181 1080768 1096271 1057998 1006987 987488 987462 986264
8255I86264J0303K8045K0854O401K3035M8730L6000J0014L9503J18643J69624
$$ 986264 996567 1024612 1045466 1051867 1074902 1123632 1159632 1169646 1209149 1327792 1497416
8244A497416J59902J26016Q2418N618q0777j07179p0175m9902q3256j10823q9948
$$ 1497416 1657318 1783334 1865752 1871370 1790593 1683414 1613239 1563337 1480081 1369258 1279310
8233A279310o9228r3781j16953p6778o49L6776J7940j7132l9376m3466k2326J7408
$$ 1279310 1210082 1116301 999348 922570 921921 958697 976637 959505 920129 876663 854337 871745
8221H71745L6621O620m5885p1543n7065k4686J528M638j9557m3582l0644M302
$$ 871745 908366 914986 869101 797558 740493 715807 717335 721973 702416 658834 628190 632492
8209F32492K850m2638o1924j4635L6691K1231k6072k1492L2424N3163P102m6889
$$ 632492 635342 592704 530780 516145 552836 574067 547995 526503 558927 612090 619192 572303
8197E72303m9553j3940J0012j159l1401m6526k3147K2821M3172J4438k6836l1455
$$ 572303 522750 508810 518822 517663 486262 439736 416589 439410 482582 497020 470184 438729
8185D38729j086K5743L0139J9501k697l3243m9524l3685o413n18j1657j0918M332
$$ 438729 437643 463386 493525 513026 510329 477086 427562 393877 387464 386946 375289 364371 368703
8172C68703R114n599k0414j6784L093K0949J6363r525k1953N954M0756K6669k1220
$$ 368703 377817 372218 351804 335020 338113 359062 375425 365900 343947 349901 390657 417326 396106
8159C96106l0970N176J1772l4721n4298n066L2427k178l1975J7965O8638J8175
$$ 396106 365136 370312 382084 347363 293065 287999 320426 318248 286273 304238 372876 391051
8147C91051o4936m9127K9545L4034k4610j5351N6300M7487n1158p8548J1160N9264
$$ 391051 326115 276988 306533 340567 315957 300606 356906 404393 353235 274687 285847 345111
8135C45111j4198o5196J2524R2129L8489n6365m5138K1203Q384n5397n0268J2189
$$ 345111 330913 265717 278241 370370 408859 352494 307356 328559 336943 281546 231278 243467
8123B43467L2307J3460K1984K5922l5805q7719k2339Q2211O1266n5475q4203O977
$$ 243467 275774 289234 311218 337140 301335 213616 191277 273488 334754 279279 195076 202053
8111B02053O2607K1194k318M3036N0310k6067o9125j2077L9140J975m0409q393
$$ 202053 264660 285854 283536 326572 376882 350815 281690 269613 308753 310728 270319 261926
8099B61926K7252n295l4865R107M6903p882p6474m5463L2565L2803k9287m3806
$$ 261926 289178 283883 249018 258125 305028 297146 220672 175209 207774 240577 211290 167484
8087A67484r05K2276J9775M2559O2715J1316o7977n9350L3338Q1678L1160l1494
$$ 167484 166579 188855 208630 251189 313904 325220 257243 197893 231231 312909 344069 312575
8075C12575l2881j0025j5358k9010j1480L0578O4540O4233J5255n8380q6029l2871
$$ 312575 279694 269669 254311 225301 213821 244399 308939 373172 388427 330047 244018 211147
8063B11147L2638K7919j9966k9015k198j107j3732J8028N8946J9713o5152o2368
$$ 211147 243785 271704 251738 222723 220525 219418 205686 223714 282660 302373 237221 174853
8051A74853L4319P5123P68n7001l894N6967J1707o5236m5935L1591M0954j5057
$$ 174853 209172 284295 285063 228062 224168 281135 292842 227606 181671 213262 254216 239159
8039B39159k9754J1828K3306j4619k4952J8758M5697J2376l2261l7047j7746n009
$$ 239159 209405 221233 244539 229920 204968 223726 269423 281799 249538 212491 194745 189736
8027A89736N866K2572K8549J4390l328r634o773j190k396k1833m4100k7847K6488
$$ 189736 195602 218174 246723 261113 257785 248151 241378 240188 237792 215959 171859 144012 170500
8014A70500N0703M487m8886l4175J4498J5587j6682m999L8461K5417l8810m1462
$$ 170500 221203 225690 176804 142629 157127 172714 156032 151033 189494 214911 176101 134639
8002A34639M4316R1433J4769q6687q0158M547M1460M292k3322J691L4313L5879
$$ 134639 178955 270388 285157 198470 118312 122859 164319 168611 145289 146980 181293 217172
7990B17172K0046j08k9910m8763k0732L4815M8374j680n2496m4519L369L7388
$$ 217172 237218 237110 207200 158437 137705 172520 220894 219214 166718 122199 125568 162956
7978A62956M3553L8556J9710k4433o5959n3373J2254N8540K8619l8408n2976O808
$$ 162956 206509 245065 264775 240342 174383 121010 133264 191804 220423 182015 129039 135847
7966A35847O7104N9249M657l0087k5023r506k00Q835P953j7293m0533k0714K2713
$$ 135847 202951 262200 266857 236770 211747 202241 202041 210876 218829 201536 161003 140289 163002
7953A63002K6254j4103k8259J3130M4741J2136l9571m3345j5795j1741k1983k73
$$ 163002 189256 175153 146894 160024 204765 216901 177330 133985 118190 106449 84466 84193
7941H4193L9964M3550J2476J521J9254J6857j7375l2969n654K2189J6309Q48K148
$$ 84193 124157 167707 180183 181704 200958 217815 200440 167471 161817 184006 200315 201163 203311
7928B03311J166j9923l3529j1344K4153L2081Q436k2419m3475m4316j4986K9157
$$ 203311 204477 184554 151025 139681 163834 195915 204351 181932 138457 94141 79155 108312
7916A08312M4806J4529k1526j8106J4358L1947J8629n495j8768j2304J1909L0813
$$ 108312 153118 167647 146121 128015 142373 174320 192949 187454 168686 156382 168291 199104
7904A99104R855m7519q2503m8096K4739O4944M9108J1811j7119l7446m3867j7717
$$ 199104 208959 161440 78937 30841 55580 120524 169632 181443 164324 126878 83011 65294
7892F5294L1981N9089L5487q962k4002j867J7969J707l7311n4539k5457K6821
$$ 65294 97275 156364 191851 182889 158887 157020 174989 176696 139385 84846 59389 86210
7880H6210N7330M3894j567n2289p6920m6041L2834R1812O5127j6412n1785j0821
$$ 86210 143540 187434 185867 133578 56658 10617 43451 135263 200390 183978 132193 121372
7868A21372K2534r117l4771K2600R2045M8043p4257j04845M037R5452M5114n4390
$$ 121372 143906 134789 100018 122618 214663 262706 188449 83604 87641 183093 228207 173817
7856A73817n2934K0589K4780n1714p7134j398O3532L2291k0539J891N2533K3988
$$ 173817 120883 141472 166252 114538 37404 36006 99538 131829 111290 113181 165714 189702
7844A89702o5128r3107k6463L3399J5092j9405R707O5861N7997j3218n9970m1007
$$ 189702 124574 31467 5004 38403 53495 34090 43797 109658 167655 154437 94467 53460
7832E3460o284j035k872J6802L3399J6818p385K850L4060L7112L857k6137k9439
$$ 53460 47176 46141 43269 60071 93470 110288 102903 105753 139813 176925 180782 154645 125206
7819A25206k1694j4991J737K8013L6717J2572k2297l7940k9260p325J7180K8246
$$ 125206 103512 88521 90258 118271 154988 167560 145263 107323 78063 70738 87918 116164
7807A16164Q827k9902m7076k3237O914R16k7055k3025K7259P0957N5171l750m2861
$$ 116164 124991 95089 48013 24776 31690 32606 5551 -17474 9785 80742 135913 132163 89302
7794H9302l2860n513K065k030Q721K7226K4405J097j4290j7841l1418m6753k6515
$$ 89302 56442 50929 52994 50964 59685 86911 111316 112413 98123 80282 48864 2111 -24404
7781b4404K0269L0805p482j8428L9395Q5689M1177l0481j9670M0465K6546n5079
$$ -24404 -4135 26670 19188 760 40155 125844 167021 136540 116870 157335 183881 128802
7769A28802o6554K3725P4059L334p1415l3793L8571J4573o7838p4640K317N3432
$$ 128802 62248 85973 160032 163366 91951 58158 96729 111302 43464 -31176 -28859 24573
7757B4573L8063J4583Q408j0044k8045l613L0680M865n1912m2812K8578N8514
$$ 24573 62636 77219 85627 75583 47538 43925 74605 79470 27558 -15254 13324 71838
7745G1838K0014m291J4082N139m2375l6590M3236Q0264R272o9458n9561j5949
$$ 71838 91852 87561 101643 106782 64407 27817 71053 151317 160589 91131 31570 15621
7733A5621j5586j4110M0517P4422J6714m4432N62P7952M4388o2284q1611q42L7080
$$ 15621 35 -14075 26442 100864 117578 73146 73708 151660 196048 133764 52153 51311 88391
7720H8391j1821l4309J8677M8325j50m0808j6007J151l7976n1299J8597P8430
$$ 88391 76570 42261 60938 109263 109113 68305 52298 53449 15473 -35826 -17229 61201
7708F1201L6800l3288k0588L2589J5160m7702l6981M8650Q4577K2067m7241n0877
$$ 61201 98001 64713 44125 76714 91874 44172 7191 55841 140418 162485 115244 64367
7696F4367l0241l5119l5724J687L9573L4463J1494J0645J2982j3522l8193j1804
$$ 64367 34126 -993 -36717 -35030 4543 39006 50500 61145 74127 60605 22412 10608
7684A0608L9131M0685r901l2002J2047N0201P410p4184q9797k1349M3965M5121
$$ 10608 49739 90424 80523 48521 60568 110769 118179 43995 -45802 -67151 -23186 21935
7672B1935J9747J9320K6100O384j4254J30J5686j8473o4224l6818N0840Q6082
$$ 21935 41682 61002 87102 93486 79232 79362 95048 76575 12351 -24467 26373 112455
7660A12455J9876o0710o3639j3297J4437J0090J5443L6169L7904Q169k8824m6076
$$ 112455 132331 71621 7982 -5315 9122 19212 34655 70824 108728 116897 88073 41997
7648D1997l2045N073L2318K1308o420p205O563j6577o0309m3038L8101P2536R263
$$ 41997 9952 15025 47343 68651 62231 55026 61589 45012 -15297 -58335 -20234 52302 61565
7635F1565m6396l050N7322J8410o3527n1897L2756M7867k3698m9615J6191N8947
$$ 61565 15169 12119 69441 87851 24324 -27573 5183 53050 29352 -20263 -4072 54875
7623E4875J1152l6623q301K7505k636l8422j563N5638M1445j4836j9452K4374
$$ 54875 66027 29404 21103 48608 45972 7550 5987 61625 103070 88234 68782 93156
7611I3156L5295L74j5602M820N444l6303o5456l6281K1018M6033K0334k3995m3744
$$ 93156 128451 128825 113223 118043 123487 87184 21728 -14553 6465 52498 72832 48837 5093
7598E093k3811J1527K9030K6712K3063J3678j7353m4426k1786L0488L6595j3941
$$ 5093 -18718 -7191 21839 48551 71614 85292 67939 23513 1727 32215 68810 54869
7586E4869l8766L431M1676J5165k3492p413K6025J1614k2125j4901O193j4186
$$ 54869 16103 19534 61210 76375 52883 45470 71495 83109 60984 46083 52276 38090
7574C8090l7890J345N6557L1754m3122n0597J4107L7077j2298l2297K4788O8701
$$ 38090 200 1545 58102 89856 46734 -3863 10244 47321 35023 2726 27514 96215
7562I6215L0023l0461l8135j4229j121J5362M0220K6911k9068n1676j0198J6304
$$ 96215 126238 95777 57642 43413 42292 57654 97874 124785 95717 44041 33843 50147
7550E0147k2415m9274N275O9143M3669k9103l9748R376K7328m547k2179o271m11
$$ 50147 27732 -21542 -16267 52876 96545 67442 27694 37070 64398 59851 37672 31401 30990
7537C0990j0378N134M1610M4334L746l0167l4289l4031l4551r031L4712M8233
$$ 30990 20612 25746 67356 111690 115436 85269 50980 16949 -17602 -26633 8079 56312
7525E6312J8367j1088o623J5619K4992J0118k0688l9856j8854K2923K4060k5667
$$ 56312 74679 63591 56968 72587 97579 107697 87009 47153 28299 51222 75282 49615
7513D9615n3209j7673J3318j7825m2734J7287R1753O1862l0887m3949K5874M3345
$$ 49615 -3594 -21267 -7949 -25774 -68508 -51221 40532 102394 71507 27558 53432 96777
7501I6777k5300o5636l3315k0397n1298j8364R1815J14237k2912j33617m9106
$$ 96777 71477 5841 -27474 -47871 -99169 -117533 -25718 88519 65607 -68010 -117116
7490a17116J05840J09963j0991n9907J248L2418j3043k9038K5123N4994J3607
$$ -117116 -11276 98687 87696 27789 29037 61455 48412 19374 44497 99491 113098
7479A13098k5127j9074k2955n2874l8538L1556O0290L904m8533k8847N139k660
$$ 113098 87971 68897 45942 -6932 -45470 -13914 46376 50280 1747 -27100 -21961 -24621
7467b4621j201M8567O8772l463q0448n2487K8030L3430k7253l6678K1200M0054
$$ -24621 -25822 22745 91517 88054 7606 -44881 -16851 16579 -10674 -47352 -26152 13902
7455A3902j4278m2015J5213P0574L4839m1661n8286j9622k452j4201P008O1491
$$ 13902 -376 -42391 -27178 43396 78235 36574 -21712 -41334 -43786 -57987 -50979 10512
7443A0512O4813j4685q3847n0902L7212O3235J2356j7999J8059M2995r524p6802
$$ 10512 75325 60640 -23207 -74109 -36897 26338 38694 20695 38754 81749 72225 -4577
7431d577o1467J6639N5763K5387j2888k1706k4853k6747K922M6585M0905r423
$$ -4577 -66044 -49405 6358 31745 18857 -2849 -27702 -54449 -51527 -4942 35963 26540
7419B6540k0658K6344L7796l5186r5016m3529N8434Q3837K5019k6453l4054l1486
$$ 26540 5882 32226 70022 34836 -60180 -103709 -45275 38562 63581 37128 3074 -28412
7407b8412j9635K7050O8579L7552l3366m2910J2681K9515k5846n7333o281M5528
$$ -28412 -48047 -20997 47582 85134 51768 8858 21539 51054 25208 -32125 -38406 7122
7395G122J5425m0333k2846M6123O1914o15n9836n1930m116K3984J6164O09L982
$$ 7122 22547 -17786 -40632 5491 67405 66790 6954 -44976 -49092 -25108 -8944 -8335 -4353
7382d353J7896R442k8850n1502j5225M6910N8099P477l5159k7543p060q367n904
$$ -4353 13543 22985 -5865 -57367 -72592 -25682 32417 39894 4735 -22808 -29868 -38235 -44139
7369d4139J8144K4055j0114l3642r496J3192j0613k8491J7130O5984K6923n5478
$$ -44139 -25995 -1940 -12054 -45696 -55192 -42000 -52613 -81104 -63974 2010 28933 -26545
7357b6545n5045L1577P4629J8120m0216j7933K7939J5144k6194j7213L5882N8905
$$ -26545 -81590 -50013 24616 42736 2520 -15413 12526 27670 1476 -15737 20145 79050
7345G9050K3654k6563m4834k2615J8197L9399J5466k6162k7542J3970K9976j5250
$$ 79050 102704 76141 31307 8692 26889 66288 81754 55592 28050 42020 71996 56746
7333E6746n9489l2173L7525O5675L3711m123j4668j9081l4066l9495j7395J6881
$$ 56746 -2743 -34916 2609 68284 101995 97872 83204 64123 30057 -9438 -26833 -9952
7321i952L5246K5809j228k1324j7227m260j3326l7264l0759J3781L8612R084k1511
$$ -9952 25294 51103 49875 28551 11324 7064 -6262 -43526 -74285 -60504 -21892 -12808 -34319
7308c4319M286M6334K9461k5862l3124J2719K5902j9025l9064J0146M4504j3797
$$ -34319 -30033 16301 45762 19900 -13224 -505 25397 6372 -32692 -22546 21958 8161
7296H161r3433o9322M3146J00777L6089n4482n6882Q786M2224J6266k642K3046
$$ 8161 -85272 -154594 -111448 -10671 25418 -29064 -85946 -77160 -34936 -18670 -21312 1734
7284A734L8490j0451p6887o9612J0878O6151L9740r641j2008N777j6010n0100
$$ 1734 40224 29773 -47114 -116726 -105848 -39697 43 -9598 -21606 -15829 -31839 -81939
7272h1939k2347M8185N6772k2559q2019l6960M7654N7996m108m1763j3148K7081
$$ -81939 -104286 -56101 671 -21888 -103907 -140867 -93213 -35217 -39325 -81088 -94236 -67155
7260f7155L0270J7470K1978K9415J0285k3055k9830r24K3974Q005k8951l0698
$$ -67155 -36885 -19415 2563 31978 42263 19208 -10622 -11546 12428 20433 -8518 -39216
7248c9216J5019M6330R992m9351m1743K9668O0576L406m9579n660P5126O3750
$$ -39216 -24197 22133 32125 -17226 -58969 -29301 31275 34681 -14898 -20558 54568 118318
7236A18318l7718r3918l7546L7922K7948l2510l9169J9496N5975K1812k7523k3879
$$ 118318 80600 -13318 -50864 -12942 15006 -17504 -56673 -37177 18798 40610 13087 -10792
7224a0792J4506J6673l3720p3537m9312J0441M2014L5138K5851J8252j6499n6608
$$ -10792 3714 20387 -13333 -86870 -136182 -125741 -83727 -48589 -22738 -4486 -20985 -77593
7212g7593l0151O0623J00406J9891p9441o1664L6804O4377q046n3522n485M3520
$$ -77593 -107744 -47121 53285 73176 -6265 -67929 -31125 33252 25206 -28316 -33801 9719
7200I719J2839l5266k1152J2873m038l2738q88N2439L9382j8437k8951M533j556
$$ 9719 22558 -12708 -33860 -20987 -25025 -57763 -58651 -6212 33170 14733 -14218 -9685 -11241
7187a1241m1796k0020O3729P8547k6824j16835o3842N9260R2848K0622l6946j7986
$$ -11241 -53037 -73057 -9328 69219 42395 -74440 -138282 -79022 13826 34448 -2498 -20484
7175b0484J5342L746k3739j7385J6454M0243L6755Q428l5648o8929n6551O67N4186
$$ -20484 -5142 -1396 -25135 -42520 -26066 14177 50932 59360 23712 -45217 -101768 -101101 -46915
7162d6915N9025K0348k2602l9636k4750J0686M0997L6329q953o0212o9556k2695
$$ -46915 12110 32458 9856 -29780 -54530 -43844 -2847 33482 24529 -35683 -105239 -127934
7150a27934M5356Q1550O0236M43n6176p9651o4893k3089K5099N2806M5877K3813
$$ -127934 -82578 -1028 59208 59651 3475 -76176 -141069 -164158 -139059 -86253 -40376 -16563
7138a6563J9803L1626K0142k6352n9169l4595J4505K0350j9815m0542p166L8267
$$ -16563 3240 34866 55008 28656 -30513 -65108 -50603 -30253 -50068 -90610 -97776 -59509
7126e9509M6765K5721M318j6677m0569l9996K694M6164L5804j4134l7518j1510
$$ -59509 -12744 12977 17295 618 -39951 -79947 -77253 -31089 4715 -9419 -46937 -58447
7114e8447J8189J2466j1892k2591j5692R36K6833M8088L6353l148k0777N443K4545
$$ -58447 -40258 -27792 -39684 -62275 -77967 -77031 -50198 -2110 34243 31095 10318 15761 40306
7101D0306j2774o4577m6319L9807R2192M4313m4205o8232j3191L7027J9234k7958
$$ 40306 27532 -37045 -83364 -43557 48635 92948 48743 -19489 -32680 4347 23581 -4377
7089d377k3303M1007Q2118L6183m9197p2889j6351L5821K2827j0149J899L4425
$$ -4377 -27680 13327 95445 131628 82431 9542 -6809 29012 51839 41690 43589 78014
7077G8014J9760l4812n8267k9893K135J4064L0537M5288J2760n1780o0279R073
$$ 78014 97774 62962 4695 -25198 -23063 -8999 21538 66826 79586 27806 -32473 -23400
7065b3400N3063l899q0381n6056M2708Q5835L3893k4456k2301N008N060j5720
$$ -23400 29663 25764 -54617 -110673 -67965 17870 51763 27307 5006 10014 15074 -646
7053f46k9229k9585j4562J9564M6641K9050j8655l9699j8686L942Q737J9194L3111
$$ -646 -29875 -59460 -74022 -54458 -7817 21233 2578 -37121 -55807 -51865 -43128 -23934 9177
7040I177J0462m2407n6198q059K8741j074m2133j9168L8914M8020L621j9521J2321
$$ 9177 19639 -22768 -78966 -87025 -58284 -59358 -101491 -120659 -81745 -33725 -30104 -49625 -37304
7027c7304M8719L6587j3236n1872m6942n377L3809L2964j568k5326j7023m045
$$ -37304 11415 48002 34766 -17106 -64048 -69425 -35616 -2652 -4220 -29546 -46569 -50614
7015e0614q547r483J0806K5670J0637j0081q721m105j6481j7021J6772L9046L239
$$ -50614 -59161 -68644 -57838 -32168 -21531 -31612 -40333 -44438 -60919 -77940 -61168 -22122 -18883
7002a8883m4631k5873M0558N8984K075n3743m5743J365L4342L6039J5142j1989
$$ -18883 -63514 -89387 -48829 10155 12230 -41513 -87256 -85891 -51549 -15510 -368 -12357
6990a2357j9501o19Q102j6477k7007K1143O8731K7106o2229o7974K1710O8267
$$ -12357 -31858 -32477 -24375 -40852 -67859 -46716 22015 49121 -13108 -81082 -59372 8895
6978H895J645o8795l6379L5984L4649j8878k3013K9119N3682K0384j7750k3602
$$ 8895 10540 -58255 -94634 -58650 -24001 -42879 -65892 -36773 16909 37293 19543 -4059
6966d059j2536K159K1908K7120l098m1780m3269j1710J2153J6426J8235J7766
$$ -4059 -16595 -14436 7472 34592 31494 -10286 -53555 -65265 -53112 -36686 -18451 -685
6954f85N276n425j32L036q838p402K2339L3829q935n4548l7269J4093K8320J4412
$$ -685 4591 -834 -966 2070 -6768 -14170 8169 41998 33063 -21485 -58754 -44661 -16341 -1929
6940a929K9408N4134J9860n2330o4764n259K8715o016l2989M41L1268j620m8111
$$ -1929 27479 81613 101473 49143 -15621 -20880 7835 1819 -31170 -30729 539 -1081 -49192
6927d9192l4971J3755K6702r08j9721j1334M476J4451J1458j5861m9091l7542
$$ -49192 -84163 -70408 -43706 -44614 -64335 -75669 -71193 -56742 -45284 -61145 -110236 -147778
6915a47778K5465O9959M2585j3939k9310p984n28j1707o618J6880K8299K1573
$$ -147778 -122313 -52354 -9769 -23708 -53018 -61002 -61530 -73237 -79855 -62975 -34676 -13103
6903a3103J4195L341k3803m8557l9990m995K4960M1497M9868L3993j4704n1235
$$ -13103 1092 4433 -19370 -67927 -107917 -112912 -87952 -46455 3413 37406 22702 -28533
6891b8533k3007M2396N8220l210o9348o4978n748L5116K4365j538K611K8825L1705
$$ -28533 -51540 -9144 49076 45866 -23482 -88460 -94208 -59092 -34727 -36265 -33654 -4829 26876
6878B6876j895k7748p220L0222K5931k1988o0453o0239l5713O747O6405R4040
$$ 26876 24981 -2767 -9987 20235 46166 24178 -36275 -96514 -132227 -125480 -59075 34965
6866C4965L3389o4709p5374J3896O6075P018n2095n005O2635K1907o5742m6085
$$ 34965 68354 3645 -71729 -57833 8242 15260 -36835 -41840 20795 42702 -23040 -69125
6854f9125N8123P7511j9117p5805j4143M7613P972n6159l7741K8831N2507L3432
$$ -69125 -11002 66509 47392 -28413 -42556 5057 13029 -43130 -80871 -52040 467 33899
6842C3899J8633j029m3670o0142r683M7235L1773k6605m2538j1490K812j3731
$$ 33899 52532 51503 7833 -52309 -61992 -14757 17016 -9589 -52127 -63617 -60805 -74536
6830g4536j6116P920K2967J6046R045O962l710j4123p117K272n133n633K5919
$$ -74536 -90652 -82732 -59765 -43719 -34674 -27712 -31422 -45545 -52662 -50390 -55523 -61156 -35237
6817c5237N1662J9143m1718m8306J0001N3293K8460k4315m3490k5757m781N362
$$ -35237 16425 35568 -6150 -54456 -44455 8838 37298 12983 -30507 -56264 -61045 -55683
6805e5683J3807K5077L1119K1449l871k4065j2836K1224L1432m466m4179l8112
$$ -55683 -41876 -16799 14320 35769 31898 7833 -5003 16221 47653 43187 -992 -39104
6793c9104n78J9940J7097J8917K1366o030m9634n1019O885O4189N9266M937l4478
$$ -39104 -39682 -19742 -2645 16272 37638 31608 -18026 -69045 -62160 2029 61295 66232 31754
6780C1754k2355J2913J5670k6762n9890k9002L5807M8981m769l9631j073M3361
$$ 31754 9399 22312 37982 11220 -48670 -77672 -41865 7116 2347 -37284 -38357 5004
6768E004J4606m1541k6690M3147N8010r618o3912l6713K3528M5514L0288J3469
$$ 5004 19610 -21931 -48621 -5474 52536 42918 -20994 -57707 -34179 11335 41623 55092
6756E5092M896M836J9808L0181N63n0187n2755P390N3566K7127k6910l2114R861
$$ 55092 59988 64824 84632 114813 115376 65189 12434 19824 73390 100517 73607 41493 51354
6743E1354L4600Q737l6822n1891j8241L2714M7087J0751k6697k0271L711p91j4904
$$ 51354 85954 94691 57869 5978 -12263 20451 67538 78289 51592 31321 35032 34241 19337
6730A9337L875K7929N975k1433K3716R6898P3180l5335o9309K3311R6691N3853
$$ 19337 23212 51141 57116 35683 59399 156297 229477 194142 124833 148144 244835 298688
6718B98688P422O8095J35393O7721o6542r9119l2392j985l0444k3229J9121q286
$$ 298688 306110 374205 509598 577319 510777 411658 379266 377281 346837 323608 342729 334443
6706C34443j03675j30582l8718N3281M7180o056k2762o708N952J5702K0608q27
$$ 334443 230768 100186 61468 114749 161929 155873 133111 126403 132355 148057 168665 167838
6694A67838k9243j5261K4471J9686k5949l2072R215Q428n6035q0961j0482O1654
$$ 167838 138595 123334 147805 167491 141542 109470 118685 127113 71078 -9883 -20365 41289
6682D1289M4163j0677j1957K1667K0218j0153j9563j3476k5846m1796k8480j102
$$ 41289 85452 74775 62818 84485 104703 94550 74987 61511 35665 -6131 -34611 -35713
6670c5713Q910P584O647p431k5940q148L4179K7597l3456m9748J7977O0316n746
$$ -35713 -26803 -19219 -12572 -20003 -45943 -54091 -19912 7685 -25771 -75519 -57542 2774 -2972
6657b972q4839n2973L8396N4796k154k5768L129J6602J1511L7554O1528R788o9612
$$ -2972 -87811 -140784 -102388 -47592 -49746 -75514 -72385 -55783 -44272 -6718 54810 64598 -5014
6644e014n7198K8879M9459j8227m3441K2276N9448j193n2155n91O7427L6530m5957
$$ -5014 -62212 -33333 16126 -2101 -45542 -23266 36182 34989 -17166 -17757 49670 86200 40243
6631D0243o0187o549K3059N930k861J2384R916k3571n0258l9300L443M8627N5045
$$ 40243 -19944 -26493 -3434 2496 -365 12019 21935 -1636 -51894 -91194 -87751 -39124 15921
6618A5921K890n8713n0422K1702N7358Q219m7018l0705J4283J1588j7423o120
$$ 15921 18811 -39902 -90324 -68622 -11264 -3045 -50063 -80768 -66485 -54897 -72320 -78440
6606g8440L0806K7836j0184j8588J4795L9030L0234J1204r333m0595o0408l4769
$$ -78440 -47634 -19798 -29982 -48570 -33775 5255 35489 46693 37360 -3235 -63643 -98412
6594i8412J6371L8199K2135P671J0009N879j2490k5065k3090j4593p37J2706K421
$$ -98412 -82041 -43842 -21707 -14036 -4027 1852 -10638 -35703 -58793 -73386 -74123 -61417 -58996
6581e8996l0047l5730R836N1684L5704L93J0425M0834K2123l0899m1282l152J6751
$$ -58996 -89043 -124773 -114937 -63253 -27549 -27156 -16731 24103 46226 15327 -25955 -29107 -12356
6568a2356L523P899L2690K0733k8326m3134p696Q506k0058k8494J1827L2690o839
$$ -12356 -8833 -934 31756 52489 24163 -18971 -26667 -18161 -38219 -66713 -54886 -22196 -29035
6555b9035m0891j0552L7782M1581K2088J7891L258m2398o2624j4620L8675K5049
$$ -29035 -69926 -80478 -42696 -1115 20973 38864 42122 -276 -62900 -77520 -38845 -13796
6543a3796j3518L82L6387J2134n0174n3134P635L3849j1156m9058k3012J8675
$$ -13796 -27314 -26932 9455 21589 -28585 -81719 -74084 -40235 -51391 -100449 -123461 -104786
6531a04786J6594q794r516J1901K5224K5507K1473P944j3991j8703Q732L8631
$$ -104786 -88192 -96986 -106502 -94601 -69377 -43870 -22397 -14453 -28444 -47147 -38415 216
6519B16K7670k2300n6054k3552N3243Q6542K2010p5752q7441J305P2697M4362
$$ 216 27886 5586 -50468 -74020 -20777 65765 87775 12023 -75418 -74113 -1416 42946
6507D2946j4226k695M5234K4044n9228q7554j7142N8971N4107l507m1017l9563
$$ 42946 28720 26025 71259 95303 36075 -51479 -68621 -9650 44457 40950 -67 -39630
6495c9630k2933r041o306j2577l476L1559M7192R17n7567m2127K9491N5092J4711
$$ -39630 -62563 -71604 -77910 -90487 -93963 -62404 -15212 -14295 -71862 -113989 -84498 -29406 -14695
6482a4695k510L5326M2548k1820o3139r068N8304L4994l7133n3239j7194m807
$$ -14695 -17205 18121 60669 38849 -24290 -33358 24946 59940 22807 -30432 -47626 -52433
6470e2433j6353L757M0418K8736k0729l4799k235K1001J8026J9667J9995j3139
$$ -52433 -68786 -65029 -24611 4125 -16604 -51403 -53638 -32637 -14611 5056 25051 11912
6458A1912n2880m1608L458J4474p640m592K0468J2685j3608P940N6600M1514k8930
$$ 11912 -40968 -82576 -79118 -64644 -72284 -76876 -56408 -43723 -57331 -49391 7209 48723 19793
6445A9793m3368J7600M0531j6454m2666K2549O7791J621p8669m8126L5568L7020
$$ 19793 -23575 -5975 34556 18102 -24564 -2015 65776 67397 -11272 -59398 -23830 13190
6433A3190l2238n4147o928K7964K1591J5896J4361j1864l1953K924M8763K5943
$$ 13190 -19048 -73195 -80123 -52159 -30568 -14672 -311 -12175 -44128 -41204 7559 33502
6421C3502l6314m3606j697K864k9433j6437L5856L2828k5175k8999L5884M7990
$$ 33502 -2812 -46418 -48115 -45251 -74684 -91121 -55265 -22437 -47612 -76611 -40727 7263
6409G263l0429o9543M654P2643K5017m8224j6938O5692O2627j5901n0679k2792
$$ 7263 -23166 -92709 -88055 -15412 9605 -38619 -55557 10135 72762 56861 6182 -16610
6397a6610j6200m2919k7446L7660O4896J7430l6911l8689o786K0776L1514J6270
$$ -16610 -32810 -75729 -103175 -65515 -619 16811 -20100 -58789 -65575 -44799 -13285 2985
6385B985k0352l1370J2126M8863Q652n5876l4529N3064P0774j6472q0529l3638
$$ 2985 -17367 -48737 -36611 12252 20904 -34972 -69501 -16437 54337 37865 -42664 -76302
6373g6302L9827L2220k1298k4428J6866K1989k0893m0334L964O6353P6633J6492
$$ -76302 -36475 -4255 -25553 -49981 -33115 -11126 -32019 -72353 -68389 -2036 74597 91089
6361I1089o2285q2976k6999L2741K3256j9784q669M3684L7391l6000o1992K361
$$ 91089 28804 -54172 -81171 -48430 -25174 -44958 -53627 -9943 27448 -8552 -70544 -68183
6349f8183M3470j4784o9502j2740P3618N0434m2854n7877J6381N6491K3368j846
$$ -68183 -24713 -39497 -108999 -121739 -48121 2313 -40541 -98418 -82037 -25546 -2178 -4024
6337d024O065j6478o2825m0374M7461P3067l358n5906m680N0215R009n4636k9676
$$ -4024 2041 -14437 -77262 -117636 -70175 2892 -466 -56372 -61052 -10837 -1828 -56464 -86140
6324h6140L6772K5710m9774p3609j5112M5473N6251M1155K0916r086k7706n911
$$ -86140 -49368 -23658 -73432 -147041 -162153 -116680 -60429 -19274 1642 -7444 -35150 -41061
6312d1061K8329K3307p790j0396J1947N934l0259l9882m981K8504K9408J2113
$$ -41061 -12732 10575 2785 -7611 4336 10270 -19989 -59871 -64852 -36348 -6940 5173
6300E173j3968n0143o1108n384P4685P9633m439p1786m3531K5372L5092k1755
$$ 5173 -8795 -58938 -120046 -125430 -50745 28888 24449 -47337 -90868 -65496 -30404 -52159
6288e2159o7227m5466K4339Q0505P3880R922m7556l8621J9569N3183K6732k3208
$$ -52159 -119386 -164852 -140513 -60008 13872 23794 -23762 -62383 -42814 10369 37101 13893
6276A3893n0140m3975j2076L0628M7297J4725k3066o083L5386J5489n4718o2381
$$ 13893 -36247 -80222 -92298 -61670 -14373 352 -22714 -28797 6589 22078 -32640 -95021
6264i5021K1108P3670J5743n2477j7210N3043K3561p0903p7786J8870P3070J6152
$$ -95021 -73913 -243 15500 -36977 -54187 -1144 22417 -48486 -126272 -107402 -34332 -18180
6252a8180m6704k5105K1989J4320j3922n81K2341r64l1620n03N7066M6194k8861
$$ -18180 -64884 -89989 -68000 -53680 -67602 -68183 -45842 -46806 -78426 -78929 -21863 24331 -4530
6239d530o2248r056M9137L1683k8281m6531q172L0540L1998J4017J676j1269l6400
$$ -4530 -66778 -75834 -26697 4986 -23295 -69826 -77998 -47458 -15460 -1443 233 -11036 -47436
6226d7436n4462l3910J9236N6110M1566m69j8110L26J5141m676l6840l7230J189
$$ -47436 -101898 -135808 -116572 -60462 -18896 -19365 -37475 -37149 -22008 -26684 -63524 -100754 -99565
6213i9565M1591M9270K5936k516j7530j8737j1390J958J2245J099l3464n5522
$$ -99565 -57974 -8704 17232 14716 -2814 -21551 -32941 -30983 -18738 -17639 -51103 -106625
6201a06625k5360L9315P0662L6985j3831k5865j2227j5904k8107r574K6571K7898
$$ -106625 -131985 -92670 -22008 14977 1146 -24719 -36946 -52850 -80957 -90531 -63960 -36062
6189c6062m440j4163Q508O618l5643n0822k009M2216J5910k9791q409N5301O2733
$$ -36062 -40502 -54665 -46157 -39539 -75182 -126004 -128013 -85797 -69887 -99678 -108087 -52786 9947
6176I947K001l5223l172L0496j148o1179o8422j0308N0563N5872N227n1709n8564
$$ 9947 11948 -23275 -26447 4049 2901 -58278 -126700 -137008 -86445 -30573 -25346 -77055 -135619
6163a35619o352M7774M0771j3561l7105P766O5164N9036j1444p5364p1016n348
$$ -135619 -141971 -94197 -53426 -66987 -104092 -96326 -31162 27874 16430 -58934 -129950 -135298
6151a35298N6203N4481L122k1478J8114N4215M966q7213r4631O633Q5911M4927
$$ -135298 -79095 -24614 -21492 -42970 -24856 29359 34325 -52888 -147519 -140886 -54975 -10048
6139a0048l8658l7980K7829L8599k6706o2132j0171N3748M9033M460j1792j303
$$ -10048 -48706 -86686 -58857 -20258 -46964 -109096 -119267 -65519 -16486 -12026 -23818 -25121
6127b5121n438j8270l980K6867K9293K305q465J0574J7578j2649m2460k7529J5306
$$ -25121 -30559 -48829 -52809 -25942 3351 5656 -2809 7765 25343 12694 -29766 -57295 -41989
6114d1989L4206J7547J470N075J295k9599n3481k7967K3170L1654j3643l9897
$$ -41989 -7783 9764 11234 16309 17604 -11995 -65476 -93443 -70273 -38619 -52262 -92159
$$ [...]
##END NTUPLES=NMR SPECTRUM
##END=
