##TITLE=1H ikalashn
CA-9306-2
10.12.2024
##JCAMPDX= 6.0         $$ Bruker NMR JCAMP-DX V2.0
##DATA TYPE= NMR SPECTRUM
##DATA CLASS= NTUPLES
##ORIGIN= UXNMR, Bruker Analytische Messtechnik GmbH
##OWNER= root
$$ TOPSPIN		Version 1.3
$$ 2024-12-10 14:13:36.765 +0400  Irina@DPX200
$$ Compression mode = diff/dup
##.OBSERVE FREQUENCY= 200.131300845
##.OBSERVE NUCLEUS= ^1H
##.ACQUISITION MODE= SIMULTANEOUS
##.ACQUISITION SCHEME= undefined
##.AVERAGES= 16
##.DIGITISER RES= 18
##SPECTROMETER/DATA SYSTEM= spect
##.PULSE SEQUENCE= zg
##.SOLVENT NAME= CDCl3
##.SHIFT REFERENCE= INTERNAL, CDCl3, 1, 17.49637
##AUDIT TRAIL= $$ (NUMBER, WHEN, WHO, WHERE, WHAT)
$$ ##TITLE= Audit trail, TOPSPIN		Version 1.3
$$ ##JCAMPDX= 5.01
$$ ##ORIGIN= Bruker BioSpin GmbH
$$ ##OWNER= Irina
$$ $$ F:/spectra/data/iren/nmr/1H/4/pdata/1/auditp.txt
$$ ##AUDIT TRAIL=  $$ (NUMBER, WHEN, WHO, WHERE, VERSION, WHAT)
(   1,<2024-12-10 14:13:15.718 +0400>,<Irina>,<DPX200>,<TOPSPIN 1.3>,
      <created by zg
	started at 2024-12-10 14:12:07.875 +0400,
	POWCHK disabled, PULCHK disabled
       configuration hash MD5:
       BE 6D 3F 07 2A EA 11 49 91 17 2B D3 AF B3 58 0D
       data hash MD5: 16K
       A9 D2 19 E6 48 E2 2D CC 10 24 8F 4E 44 70 C5 6B>)
(   2,<2024-12-10 14:13:15.843 +0400>,<Irina>,<DPX200>,<TOPSPIN 1.3>,
      <Start of raw data processing
       efp BC_mod = 2 LB = 0.02 FT_mod = 6 PKNL = 1 PHC0 = 122.5235 PHC1 = -3.669699 SI = 32K 
       data hash MD5: 32K
       75 CF 63 1B D4 00 80 DD CD 13 42 71 C2 4E 62 DA>)
(   3,<2024-12-10 14:13:18.453 +0400>,<Irina>,<DPX200>,<TOPSPIN 1.3>,
      <apk 
       data hash MD5: 32K
       17 7B 31 EC A0 73 4C 35 32 48 46 DE C0 2D 8B 29>)
(   4,<2024-12-10 14:13:26.000 +0400>,<Irina>,<DPX200>,<TOPSPIN 1.3>,
      <abs n ABSG = 5 
       data hash MD5: 32K
       A3 A2 D0 07 A7 85 34 88 CF B1 0B 25 1F 6B DD 08>)
$$ ##END=
$$ 
$$ $$ hash MD5
$$ $$ E0 F6 90 FA CF 70 9D 98 2F 99 06 03 75 DD 05 BB
##$RELAX= 
##$RELAX= 
##$RELAX= 
##$RELAX= 
##$RELAX= 
##$RELAX= 
##$RELAX= 
##$RELAX= 
##$RELAX= 
$$ Bruker specific parameters
$$ --------------------------
##$DU= <F:/spectra>
##$EXPNO= 4
##$NAME= <1H>
##$PROCNO= 1
##$TYPE= <nmr>
##$USER= <iren>
##$AMP= (0..31)
100 100 100 100 100 100 100 100 100 100 100 100 100 100 100 100 100 100 
100 100 100 100 100 100 100 100 100 100 100 100 100 100 
##$ANAVPT= -1
##$AQSEQ= 0
##$AQ_mod= 1
##$AUNM= <au_zg>
##$AUTOPOS= <>
##$BF1= 200.13
##$BF2= 200.13
##$BF3= 200.13
##$BF4= 200.13
##$BF5= 200.13
##$BF6= 200.13
##$BF7= 200.13
##$BF8= 200.13
##$BYTORDA= 1
##$CFDGTYP= 0
##$CFRGTYP= 5
##$CHEMSTR= <none>
##$CNST= (0..63)
1 1 145 1 1 1 1 1 1 1 1 1 1 1 1 1 1 1 1 1 1 1 1 1 1 1 1 1 1 1 1 1 1 1 
1 1 1 1 1 1 1 1 1 1 1 1 1 1 1 1 1 1 1 1 1 1 1 1 1 1 1 1 1 1 
##$CPDPRG= <>
##$CPDPRG1= <>
##$CPDPRG2= <>
##$CPDPRG3= <>
##$CPDPRG4= <mlev>
##$CPDPRG5= <mlev>
##$CPDPRG6= <mlev>
##$CPDPRG7= <mlev>
##$CPDPRG8= <mlev>
##$CPDPRGB= <>
##$CPDPRGT= <>
##$D= (0..63)
0 2 0 0 0 0 0 0 0 0.06 0 0.03 0 0 0 0 0.0002 0 0 0 0 0 0 0 0 0 0 0 0 0 
$$ [...]
##$SW_h= 4401.40845070422
##$TD= 16384
##$TD0= 1
##$TE= 300
##$TE2= 300
##$TE3= 300
##$TEG= 300
##$TL= (0..7)
0 120 120 120 120 120 120 120 
##$TP= (0..7)
150 150 150 150 150 150 150 150 
##$TP07= 0
##$TPNAME0= <>
##$TPNAME1= <>
##$TPNAME2= <>
##$TPNAME3= <>
##$TPNAME4= <>
##$TPNAME5= <>
##$TPNAME6= <>
##$TPNAME7= <>
##$TPOAL= (0..7)
0.5 0.5 0.5 0.5 0.5 0.5 0.5 0.5 
##$TPOFFS= (0..7)
0 0 0 0 0 0 0 0 
##$TUNHIN= 0
##$TUNHOUT= 0
##$TUNXOUT= 0
##$USERA1= <user>
##$USERA2= <user>
##$USERA3= <user>
##$USERA4= <user>
##$USERA5= <user>
##$V9= 5
##$VALIST= <valist>
##$VCLIST= <CCCCCCCCCCCCCCC>
##$VD= 0
##$VDLIST= <DDDDDDDDDDDDDDD>
##$VPLIST= <PPPPPPPPPPPPPPP>
##$VTLIST= <TTTTTTTTTTTTTTT>
##$WBST= 1024
##$WBSW= 25
##$XGAIN= (0..3)
0 0 0 0 
##$XL= 0
##$YL= 0
##$YMAX_a= 1943198
##$YMIN_a= -1914463
##$ZGOPTNS= <>
##$ZL1= 120
##$ZL2= 120
##$ZL3= 120
##$ZL4= 120
##$ABSF1= 17.49637
##$ABSF2= -4.496376
##$ABSG= 5
##$ABSL= 3
##$ALPHA= 0
##$AQORDER= 0
##$ASSFAC= 0
##$ASSFACI= 0
##$ASSFACX= 0
##$ASSWID= 0
##$AUNMP= <proc_1d>
##$AXLEFT= 0
##$AXRIGHT= 0
##$AXTYPE= 0
##$AXUNIT= <>
##$AZFE= 0.1
##$AZFW= 0.1
##$BCFW= 0
##$BC_mod= 2
##$BYTORDP= 0
##$COROFFS= 0
##$CY= 7568.61572265625
##$DATMOD= 1
##$DC= 0
##$DFILT= <>
##$DTYPP= 0
##$F1P= 17.9538593292236
##$F2P= -4.03888763876832
##$FCOR= 0.5
##$FTSIZE= 32768
##$FT_mod= 6
##$GAMMA= 0
##$GB= 0
##$INTBC= 0
##$INTSCL= 5.656564e-011
##$ISEN= 128
##$LB= 0.02
##$LEV0= 0
##$LPBIN= 0
##$MAXI= 945.577
##$MC2= 0
##$MEAN= 0
##$ME_mod= 0
##$MI= -402.1523
##$NCOEF= 0
##$NC_proc= -3
##$NLEV= 6
##$NOISF1= 8.587773
##$NOISF2= 6.764455
##$NSP= 0
##$NTH_PI= 0
##$NZP= 0
##$OFFSET= 17.49637
##$PC= 1
##$PHC0= 117.968
##$PHC1= 9.686533
##$PH_mod= 1
##$PKNL= yes
##$PPARMOD= 0
##$PPDIAG= 0
##$PPIPTYP= 0
##$PPMPNUM= 100
##$PPRESOL= 1
##$PSCAL= 0
##$PSIGN= 0
##$REVERSE= no
##$SF= 200.13
##$SI= 32768
##$SIGF1= 16.12182
##$SIGF2= -4.496377
##$SINO= 3.521527
##$SIOLD= 32768
##$SREGLST= <1H.CDCl3>
##$SSB= 0
##$STSI= 32768
##$STSR= 0
##$SW_p= 4401.40845070422
##$SYMM= 0
##$S_DEV= 0
##$TDeff= 16384
##$TDoff= 0
##$TI= <>
##$TILT= no
##$TM1= 0
##$TM2= 0
##$TOPLEV= 0
##$USERP1= <user>
##$USERP2= <user>
##$USERP3= <user>
##$USERP4= <user>
##$USERP5= <user>
##$WDW= 1
##$XDIM= 32768
##$YMAX_p= 331344108
##$YMIN_p= -539565
$$ End of Bruker specific parameters
$$ ---------------------------------
##NTUPLES= NMR SPECTRUM
##VAR_NAME=  FREQUENCY,     SPECTRUM/REAL,   SPECTRUM/IMAG
##SYMBOL=    X,             R,               I
##VAR_TYPE=  INDEPENDENT,   DEPENDENT,       DEPENDENT
##VAR_FORM=  AFFN,          ASDF,            ASDF
##VAR_DIM=   32768,         32768,           32768
##UNITS=     HZ,            ARBITRARY UNITS, ARBITRARY UNITS
##FACTOR=    0.134324425510551, 1,           1
##FIRST=     4401.40845070422, -126555,      -817675
##LAST=      0,             -82407,          -992365
##MIN=       0,             -539565,         0
##MAX=       4401.40845070422, 331344108,    0
$$ Real data points
##PAGE= N=1
##DATA TABLE= (X++(R..R)), XYDATA
$$ [...]
10926b93609m1521N399L9250K8749K894k997J583n415j3040j078J8213J9068L524
$$ -293609 -335130 -329731 -290481 -261732 -258838 -261835 -260252 -265667 -278707 -279785 -261572 -242504 -238980
10913b38980q298j1858j3519j0476k107j198q092O15K8494L6054O5l6012k1397
$$ -238980 -247278 -259136 -272655 -283131 -285238 -286436 -294528 -293913 -265419 -229365 -229300 -265312 -286709
10900b86709J8897K0491j8051l5688p499K3438K0226j972j7224k1945j3479J2737
$$ -286709 -267812 -247321 -265372 -301060 -308559 -285121 -264895 -266867 -284091 -306036 -319515 -306778
10888c06778L2711J4171k1466j7257K4805L6395n578l5990j1128J5904r570m3266
$$ -306778 -274067 -259896 -281362 -298619 -273814 -237419 -242997 -278987 -290115 -274211 -283781 -327047
10876c27047j7334L7614L9556q788k9449j808J3476j0051k1222Q956L0190K240
$$ -327047 -344381 -306767 -267211 -275999 -305448 -307256 -293780 -303831 -325053 -316097 -285907 -283667
10864b83667k8527l163M7514M4459j7171n5464j8211M2578M2109k1024o2155k5588
$$ -283667 -312194 -315357 -267843 -223384 -240555 -296019 -314230 -271652 -229543 -250567 -312722 -338310
10852c38310L7675L9918j8237m8316n505M4780K9624k0006k5799J0598K0283j0369
$$ -338310 -300635 -260717 -278954 -327270 -332775 -287995 -258371 -278377 -304176 -293578 -273295 -283664
10840b83664k1769P742K3748m078k7736q884J4909M792q131J0107K1840j2367
$$ -283664 -305433 -297691 -273943 -278021 -305757 -314641 -299732 -294940 -303071 -292964 -271124 -283491
10828b83491m4162r843M7807L5127l4873n4403N209M7807J2589l0881p660L7756
$$ -283491 -327653 -337496 -289689 -254562 -289435 -343838 -338629 -290822 -278233 -309114 -316774 -279018
10816b79018K4600k7114l8492n537Q415q626n065K9603M1380R064j9011j2231
$$ -279018 -254418 -281532 -320024 -325561 -317146 -325772 -330837 -301234 -259854 -250790 -269801 -282032
10804b82032m513j8674j8618J4794L0000r821m8083j9163L6111L0095k6680m1163
$$ -282032 -286545 -305219 -323837 -309043 -279043 -288864 -336947 -356110 -319999 -289904 -316584 -357747
10792c57747R606M5814K0187j3952n377J4984O754p145n1j531k9856l2758K3433
$$ -357747 -348141 -302327 -282140 -296092 -301469 -286485 -279731 -286876 -286927 -288458 -318314 -351072 -327639
10779c27639O7418K3101n3561n1050J6649L3213k3806m8099R653N7925K4228k4233
$$ -327639 -260221 -237120 -290681 -341731 -325082 -291869 -315675 -363774 -354121 -296196 -271968 -296201
10767b96201n583L3156N566n4996m7518K5455O0133J5541l5072k9653J325Q065
$$ -296201 -301784 -268628 -263062 -318058 -365576 -340121 -279988 -264447 -299519 -329172 -327847 -319782
10755c19782j832P45J0708Q923n73n224o029k929J2248L0012K2107j3903l9496
$$ -319782 -321614 -320869 -310161 -301238 -301811 -307035 -313064 -315993 -303745 -273733 -251626 -265529 -305025
10742c05025k6418M365J7244R383p48q157j6294j5439L411K3306J8891m530j5414
$$ -305025 -331443 -327078 -309834 -300451 -301199 -309356 -325650 -341089 -337678 -314372 -295481 -300011 -315425
10729c15425j480J2346J024k2070k1210J0801L6578K0332k1972m0408j7710R847
$$ -315425 -316905 -304559 -303535 -325605 -346815 -336014 -299436 -279104 -301076 -341484 -359194 -349347
10717c49347Q859m071L115K1549J7101j1126k9331k2968j1819p407M712K8843
$$ -349347 -340488 -344559 -341444 -319895 -302794 -313920 -343251 -366219 -378038 -385445 -380733 -351890
10705c51890M1460K7195L634p401q766j1655j3018o117M959J4489K1307J8244
$$ -351890 -310430 -283235 -279601 -287002 -295768 -307423 -320441 -326558 -321599 -307110 -285803 -267559
10693b67559k009k3915k0730J537N334j8729l0987m538K9476L0543R185l31L82
$$ -267559 -269568 -293483 -314213 -312676 -307342 -326071 -357058 -361596 -332120 -301577 -292392 -292723 -292341
10680b92341j2447l0240k1283J1480K7952R923j5088j6235M206K3557K4544N015
$$ -292341 -304788 -335028 -356311 -344831 -316879 -306956 -322044 -338279 -334073 -310516 -285972 -280957
10668b80957j8592j9868N797K6451J4726q776o659J2235N501k8952m2476j1600
$$ -280957 -299549 -319417 -313620 -287169 -272443 -281219 -287878 -275643 -270142 -299094 -341570 -353170
10656c53170K3919K2977J529k520J0763J5562Q519O308R607N373m143p246r429
$$ -353170 -329251 -306274 -304745 -307265 -296502 -280940 -272421 -266113 -256506 -251133 -255276 -262522 -271951
10643b71951k0917k5373j98L3847K8900j4083l3649K302L9908J5913m2333n2002
$$ -271951 -292868 -318241 -318439 -284592 -255692 -269775 -303424 -301122 -261214 -245301 -287634 -339636
10631c39636L079M9848L4501q387k3049j3999j4964j8415M632L7657L5151Q60
$$ -339636 -336557 -286709 -252208 -260595 -283644 -297643 -312607 -331022 -326390 -288733 -253582 -252722
10619b52722j1565J6257L8344J8422j7576k8985j7241n827K33M378j69r817k140
$$ -252722 -264287 -248030 -209686 -191264 -208840 -237825 -255066 -260893 -260660 -256282 -256451 -266268 -268408
10606b68408K3468L0302J614k2646n785K4035K0012o741j2551J142k475k1966
$$ -268408 -244940 -214638 -213024 -235670 -241455 -217420 -197408 -204149 -216700 -215558 -218033 -239999
10594b39999j8422J2439K9527J3486r049j5259j0744O18K1766L3478J2887j5278
$$ -239999 -258421 -245982 -216455 -202969 -212018 -227277 -238021 -237403 -215637 -182159 -169272 -184550
10582a84550m282L1703K7846k2609m4625P97M8312K8392k6641m0205p991J3093
$$ -184550 -188832 -157129 -129283 -151892 -196517 -195720 -147408 -119016 -145657 -185862 -193853 -180760
10570a80760L346k426J4408K8816J8448o177k2975k0956k675J5254J2831n114
$$ -180760 -177414 -179840 -165432 -136616 -118168 -124345 -147320 -168276 -170951 -155697 -142866 -147980
10558a47980q463J3437L1125J9875m133j6730k1252k2517m418L0081L8485L884
$$ -147980 -156443 -143006 -111881 -92006 -96139 -112869 -134121 -156638 -161056 -130975 -92490 -88606
10546h8606k2793r05K4629k478m1903j5203N1972N4020k4899p4624k4779N0809
$$ -88606 -111399 -112304 -87675 -90153 -132056 -147259 -95287 -41267 -66166 -140790 -165569 -114760
10534a14760N0052j4196n3931l5822j745J0910Q251R698K1537L5747L2668q28
$$ -114760 -64708 -78904 -132835 -168657 -170402 -159492 -151241 -141543 -120006 -84259 -51591 -52419
10522e2419m1076m2549j298K9899J4072j8395k2796q396j0823k4605j4318K0308
$$ -52419 -93495 -136044 -137342 -107443 -93371 -111766 -134562 -142958 -153781 -178386 -192704 -172396
10510a72396L9095K0730j1035k4661j5532O87Q300K956m113K101J5224R768j7656
$$ -172396 -133301 -112571 -123606 -148267 -163799 -163112 -154812 -151856 -155969 -153868 -138644 -128876 -146532
10497a46532l2133r336K1617J7554j3141k3961j656J8063R615p609p647J198l717
$$ -146532 -178665 -188001 -166384 -148830 -161971 -185932 -187588 -169525 -159910 -167519 -175166 -173968 -177685
10484a77685j8898j9408K118K2033J6572n436j2985M585K0556P824j9961k6763
$$ -177685 -196583 -215991 -213873 -191840 -175268 -180704 -193689 -189104 -168548 -160724 -180685 -207448
10472b07448p233Q670O013M603J6407K0084J124j5853o471R326Nk1700j7556J3432
$$ -207448 -214681 -206011 -199998 -195395 -178988 -158904 -157780 -173633 -180104 -170778 -170773 -192473 -210029 -196597
10458a96597L2980K1081k229j4160j4606r666R52J2530J3525J686j2622j8771
$$ -196597 -163617 -142536 -144765 -158925 -173531 -183197 -182245 -169715 -156190 -154504 -167126 -185897
10446a85897j0454J1910K9317J3467k9585m7953r221M4255M8311Q338j3838M097
$$ -185897 -196351 -184441 -155124 -141657 -171242 -219195 -228416 -184161 -135850 -127512 -141350 -137253
10434a37253K0223L539k3306l1082k3065q605J5652L7992K9882n814k7466j6985
$$ -137253 -117030 -113491 -136797 -167879 -190944 -199549 -183897 -145905 -116023 -121837 -149303 -166288
10422a66288m484q201j898K5669L3933q82l0959q438L0755K2375j9081k5655Q999
$$ -166288 -170772 -178973 -180871 -155202 -121269 -122151 -153110 -161548 -130793 -108418 -127499 -153154 -144155
10409a44155K2472o483k2284J0728M7071L4058p421k2105l352J0010j179j6702
$$ -144155 -121683 -128166 -150450 -139722 -92651 -58593 -66014 -88119 -91471 -81461 -82640 -99342
10397i9342j4561L649K2972K9404J6653o552k0667j7161p587l143J60N456L163
$$ -99342 -113903 -110254 -87282 -57878 -41225 -47777 -68444 -85605 -93192 -96335 -96175 -90719 -87556
10384h7556q010p456J6506L8655K8959R61o810P282N638k2072l3502P87M1642
$$ -87556 -95566 -103022 -86516 -47861 -18902 -17941 -24751 -17469 -11831 -33903 -67405 -66618 -24976
10371b4976L0095k6721o0958l3295K1734M8462L4891P203j3939k5101k2248k60
$$ -24976 5119 -21602 -82560 -115855 -94121 -45659 -10768 -3565 -17504 -42605 -64853 -65113
10359f5113K8723L7615J4063k1035l2353p006K9878L9974J4807j2667r090J4692
$$ -65113 -36390 1225 15288 -5747 -38100 -45106 -15228 24746 39553 26886 17796 32488
10347C2488J9999k054j8314o491J1645R004m474o258l138j3106k3264o381K9183
$$ 32488 52487 50433 32119 25628 37273 46277 41803 35545 32407 19301 -3963 -10344 18839
10334A8839M6153L2616J2383J653p179j6516j6162j0050j3827k0414n960K3389
$$ 18839 64992 97608 109991 111644 104465 87949 71787 61737 47910 27496 21536 44925
10322D4925L1846J1318m311L494J0324k265j4218p735J138j260J385J7723K3891
$$ 44925 76771 88089 83778 87272 97596 95331 81113 73378 74516 73256 74641 92364 116255
10309A16255P932j926J1690J8533m414k4154o262K1254J3944j2962j4023Q138
$$ 116255 124187 122261 133951 152484 148070 123916 117654 138908 152852 139890 125867 134005
10297A34005J5903O803Q379J8619J2311m930o401L971M675M720K0807K7377m403
$$ 134005 149908 156711 165090 183709 196020 191090 184689 188660 193335 198055 218862 246239 241836
10284B41836l8570j9861L0330M4576K0043Q616J0819j5593m6796j3751N6189N0849
$$ 241836 203266 183405 213735 258311 278354 286970 297789 282196 235400 221649 277838 328687
10272C28687l8576p7898L29Q1788N3068k3659l0441J6627K6834K306O836K6393
$$ 328687 290111 212213 212542 294330 347398 323739 293298 309925 336759 339065 345901 372294
10260C72294K607l4660j0537M4775L3705l1313l6913L5104P0505J5789l4617l459
$$ 372294 374901 340241 329704 374479 408184 376871 339958 375062 445567 461356 426739 423280
10248D23280M5642K9550j6266j4486K0772K5000k40n700J0373J2156M040J8062
$$ 423280 468922 498472 482206 467720 488492 513492 513252 507552 517925 530081 534121 552183
10236E52183M0898K8975j0656k4095K462K2311O085j4290l80L5147N2066L8213
$$ 552183 593081 622056 611400 587305 589767 612078 618163 603873 603493 638640 690706 728919
10224G28919J6697R809J5947K0530J7141J2511J4305K0802K5127K3736J7171J0465
$$ 728919 745616 755425 771372 791902 809043 821554 835859 856661 881788 905524 922695 933160
10212I33160J5443L7521N5329L8484j644j2600K3297N3346L3794J465Q510K8557
$$ 933160 948603 986124 1041453 1079937 1078293 1065693 1088990 1142336 1176130 1177595 1186105 1214662
10200A214662Q510j9962J5336Q5598Q4710P221k5770M0085J00889O5501r14J228
$$ 1214662 1223172 1203210 1218546 1304144 1388854 1396075 1370305 1410390 1511279 1576780 1575866 1577094
10188A577094M3888M5015K0309L4744O5560M7123Q247K7708Q1044P2459Q571k839
$$ 1577094 1620982 1665997 1686306 1721050 1786610 1833733 1841980 1869688 1950732 2023191 2031762 2028923
10176B028923O3604J08791P7810L7733M4191N4608L1300J8941N2385Q4814P6077
$$ 2028923 2092527 2201318 2279128 2316861 2361052 2415660 2446960 2465901 2518286 2603100 2679177
10165B679177O3829P9212P9901M0587K3031P1495J18932R1798L7269M3746R5100
$$ 2679177 2743006 2822218 2902119 2942706 2965737 3037232 3156164 3247962 3285231 3328977 3424077
10154C424077J12480R1769Q6362R2284O8900M5988Q5549J50015J38131N8026L4565
$$ 3424077 3536557 3628326 3714688 3806972 3875872 3921860 4007409 4157424 4295555 4353581 4388146
10143D388146J15961J95616J75765J02233P3364J02673J40632J62882J68439J46172
$$ 4388146 4504107 4699723 4875488 4977721 5051085 5153758 5294390 5457272 5625711 5771883
10133E771883J06899J01966J51923K00500J94022J61818J60482J82912J87966
$$ 5771883 5878782 5980748 6132671 6333171 6527193 6689011 6849493 7032405 7220371
10124G220371J82569K02119K34369K34965K05830J92787K12369K39905K62630
$$ 7220371 7402940 7605059 7839428 8074393 8280223 8473010 8685379 8925284 9187914
10115I187914K86198K95481K71070K43130K64107L21690L44293L08704K77931
$$ 9187914 9474112 9769593 10040663 10283793 10547900 10869590 11213883 11522587 11800518
10106A1800518L04563L55031L69367L50232L45651L71932L98719L98323L76446
$$ 11800518 12105081 12460112 12829479 13179711 13525362 13897294 14296013 14694336 15070782
10097A5070782L58774L66081L95113M15136L99640L67485L66099M03288M29782
$$ 15070782 15429556 15795637 16190750 16605886 17005526 17373011 17739110 18142398 18572180
10088A8572180M11220L83377M01777M60840N02493M93460M58177M38035M46357
$$ 18572180 18983400 19366777 19768554 20229394 20731887 21225347 21683524 22121559 22567916
10079B2567916M64653M64897M36645M01434L89476L95896L84828L49102L28175
$$ 22567916 23032569 23497466 23934111 24335545 24725021 25120917 25505745 25854847 26183022
10070B6183022L38528L29656K61478J90642K05648K87695L19918K52061J76173
$$ 26183022 26521550 26851206 27112684 27303326 27508974 27796669 28116587 28368648 28544821
10061B8544821J94539K75646L05868K48569J79985J71451J98755J91297J31662
$$ 28544821 28739360 29015006 29320874 29569443 29749428 29920879 30119634 30310931 30442593
10052C0442593O9482M5516L6352o343p9053j26341j25592j28255j80750k41620
$$ 30442593 30512075 30557591 30593943 30587600 30508547 30382206 30256614 30128359 29947609 29705989
10042B9705989k38779j89458j83724k43534k84924k52308k05515k16128k52348
$$ 29705989 29467210 29277752 29094028 28850494 28565570 28313262 28107747 27891619 27639271
10033B7639271k46712k20343k43285l05759l32527l14062l20491l76740m22215
$$ 27639271 27392559 27172216 26928931 26623172 26290645 25976583 25656092 25279352 24857137
10024B4857137m19783m14307m44348m76414m74758m65613m78674m87870m67366
$$ 24857137 24437354 24023047 23578699 23102285 22627527 22161914 21683240 21195370 20728004
10015B0728004m48147m57055m55958m12372l77104m06330m50700m23462l52209
$$ 20728004 20279857 19822802 19366844 18954472 18577368 18171038 17720338 17296876 16944667
10006A6944667l47786m22390m59275l96025l24860l45636m11326m10469l43266
$$ 16944667 16596881 16174491 15715216 15319191 14994331 14648695 14237369 13826900 13483634
9997A3483634l11747l56044m00817l79142l28149l20356l52723l58366l09015
$$ 13483634 13171887 12815843 12415026 12035884 11707735 11387379 11034656 10676290 10367275
9988A0367275k54276k48857k76781k78175k37988k07774k26000k55175k37432
$$ 10367275 10112999 9864142 9587361 9309186 9071198 8863424 8637424 8382249 8144817
9979H144817j88689j79111k20583k40772j96371j48551j70865k29061k27718j56230
$$ 8144817 7956128 7777017 7556434 7315662 7119291 6970740 6799875 6570814 6343096 6186866
9969F186866j05938j33632j84763j84300j40562j10299j06974j03137r7236j14289
$$ 6186866 6080928 5947296 5762533 5578233 5437671 5327372 5220398 5117261 5020025 4905736
9959D905736j45617j46727j06518p0505p5495j00105j05069q9850p8219p2614
$$ 4905736 4760119 4613392 4506874 4436369 4360874 4260769 4155700 4065850 3987631 3915017
9949C915017n9967m9066o3094r6358j13193r6898p1373o3394o7404o2385m5532
$$ 3915017 3855050 3805984 3742890 3646532 3533339 3436441 3365068 3301674 3234270 3171885 3126353
9938C126353l2899l7480n8059q0112q1278n1296j4868j4293n4032q3851o1631
$$ 3126353 3093454 3055974 2997915 2917803 2836525 2785229 2770361 2756068 2702036 2618185 2556554
9927B556554j5331q360n0754q4572o5588k2495j1790l9161n8257l9940j0563j1189
$$ 2556554 2541223 2532863 2482109 2397537 2331949 2309454 2297664 2258503 2200246 2160306 2149743 2138554
9915B138554l9674n4530l2960l679q905m5514o6320m1961Q73J5843n931l4034
$$ 2138554 2098880 2044350 2011390 2007711 1998806 1953292 1886972 1845011 1845884 1861727 1855796 1821762
9903A821762m2522l3449k1852j8820k9180m7362n4787l8064r874M515k99r101
$$ 1821762 1779240 1745791 1723939 1705119 1675939 1628577 1573790 1535726 1525852 1530367 1530068 1520967
9891A520967j4614k3134l1317k4516n014M014p108k0172k0464j7929k2588k3750
$$ 1520967 1506353 1483219 1451902 1427386 1422372 1426386 1419278 1399106 1378642 1360713 1338125 1314375
9879A314375j2628l071p622j3194n194K521r619k8748k6136l741Q146k325j5048
$$ 1314375 1301747 1298676 1291054 1277860 1272666 1275187 1265568 1236820 1210684 1206943 1215089 1212764 1197716
9866A197716j3540n232K70O424J2573N588j5730k7225j0406J5068J2818j8409
$$ 1197716 1184176 1178944 1179214 1185638 1198211 1203799 1188069 1160844 1150438 1165506 1178324 1159915
9854A159915l6794j1177L2814M0498n35m0758l2909N032J7628q460k9076j0814
$$ 1159915 1123121 1111944 1144758 1185256 1184721 1143963 1111054 1116086 1133714 1125254 1096178 1085364
9842A085364K2482K9727Q813j2946k2308k5274k3332j2560J126P333M643n245
$$ 1085364 1107846 1137573 1146386 1133440 1111132 1085858 1062526 1049966 1051092 1058425 1063068 1057823
9830A057823k1638l0370j1289K0300J5349l3240n7855j1004M6262K5607m4717
$$ 1057823 1036185 1005815 994526 1014826 1030175 996935 939080 928076 974338 999945 955228
9819I55228n3219J7695N6003m263p6511n8972Q486K0153k3352l1715J2840K8833
$$ 955228 902009 919704 975707 971444 894933 835961 844447 864600 841248 809533 822373 851206
9807H51206j8744n5900k3925K4389J5353k6705k7917J0396K0180j5425l6674j0697
$$ 851206 832462 776562 752637 777026 792379 765674 737757 748153 768333 752908 716234 705537
9795G05537J5152k983l0009j2049L0033L0566j6463m8596l1209n20N855L135J3413
$$ 705537 720689 717706 687697 675648 705681 736247 719784 671188 639979 639459 645314 648449 661862
9782F61862J6804o888k7979j1789J5138L431l2225l0262J6630M4198J3812l2902
$$ 661862 678666 671778 643799 632010 647148 650579 618354 588092 604722 648920 662732 629830
9770F29830m1221j5422N793O324m841j6865j7574J830K4015J7981j1164k2447
$$ 629830 588609 573187 578980 585304 580463 563598 546024 547854 571869 589850 578686 556239
9758E56239m004Q162k742k813K4205L4130l922m2862k6361J9797L0804M034j1636
$$ 556239 552235 560397 557655 554842 579047 613177 609255 566393 540032 559829 590633 594667 583031
9745E83031k750K607k018o6R03j3480j7242J5526M3620J3705l5698k2483L4918
$$ 583031 580281 582888 580870 580804 581707 568227 550985 566511 610131 623836 588138 565655 600573
9732F00573L5064l2712n6375J5617Q1529M7706k5621l3452P487J1781j9510j7309
$$ 600573 635637 602925 546550 562167 643696 691402 665781 632329 639816 651597 632087 614778
9720F14778J8135J8943k1080l0268J6994N7165M1888L549j2933j3544j6486j0017
$$ 614778 632913 651856 630776 600508 617502 674667 716555 720104 707171 693627 677141 667124
9708F67124J2888K5287R304r203l333J0088K760j4515r307K0168M1858L3050M836
$$ 667124 680012 705299 714603 705400 702067 712155 714915 700400 691093 711261 753119 786169 791005
9695G91005j4358p436J6381L0553K0060j002j0444q305p828n465J1388L0412K2861
$$ 791005 776647 769211 785592 816145 836205 835203 824759 816454 808626 803161 814549 844961 867822
9682H67822q706k5706q109J8375K4873J7693J4513J2225M176L528J8721K5612
$$ 867822 859116 833410 825301 843676 868549 886242 900755 912980 917156 920684 939405 965017
9670I65017q20l9050m2096l415L3703L7621K5098K2081J9662j955k5862j4640
$$ 965017 964197 925147 883051 879636 913339 950960 976058 998139 1017801 1015846 989984 975344
9658I75344K7233M7651J9417j7290j4886R574P707j4804p172L3193M6239R782
$$ 975344 1002577 1050228 1069645 1052355 1037469 1047043 1054750 1039946 1032774 1065967 1112206 1121988
9646A121988j5992J1616L9266N353m6894l0473M2482P4954L4115j0309p293J0010
$$ 1121988 1105996 1117612 1156878 1162231 1115337 1084864 1127346 1202300 1236415 1226106 1218813 1228823
9634A228823P449R312L0917L1880p040k9074J1245O2618N0456p669l4185p967
$$ 1228823 1236272 1245584 1276501 1308381 1301341 1272267 1283512 1346130 1396586 1388917 1354732 1346765
9622A346765K4547L3511L0299K0897J388p516J6960M9059M6198K2301K4179M2272
$$ 1346765 1371312 1404823 1435122 1456019 1457407 1449891 1466851 1515910 1562108 1584409 1608588 1650860
9610A650860K1770l2275m4612J0734O0369M3489L809J1531M8902M6171J94j9752
$$ 1650860 1672630 1640355 1595743 1606477 1666846 1710335 1714144 1725675 1774577 1820748 1820942 1801190
9598A801190J8765O3593N8066J9534N443K8514M4764K3364o568o4L3196L9753
$$ 1801190 1819955 1883548 1941614 1961148 1966591 1995105 2039869 2063233 2056665 2056601 2089797 2129550
9586B129550N047j8163J1388N5086M9145J694k1195L696L0760K5378R807J1395
$$ 2129550 2134597 2116434 2127822 2182908 2232053 2233747 2212552 2216248 2247008 2272386 2282193 2293588
9574B293588J9132J8510K2605L8014M1147K0243K915R396J6512L708l532K1396
$$ 2293588 2312720 2331230 2353835 2391849 2432996 2453239 2456154 2465550 2482062 2485770 2482238 2503634
9562B503634N2636N0503K5070J2030J1164K004j461K8321O9318O9448K7845r82
$$ 2503634 2556270 2606773 2631843 2643873 2655037 2657041 2655580 2683901 2753219 2822667 2850512 2849530
9550B849530J0387K9213K2893M123K27J6084M0733N8544M9413J2560j2023J0583
$$ 2849530 2859917 2889130 2912023 2916146 2916373 2932457 2973190 3031734 3081147 3093707 3081684 3092267
9538C092267M6788L3213j8593k5734L7762R0419O2838N46j2992J7316K3444o555
$$ 3092267 3139055 3172268 3153675 3127941 3165703 3256122 3318960 3319506 3306514 3323830 3347274 3340719
9526C340719j5571K2862O4372O5594M0607K6318L1956M2203M2296K6360L022j170
$$ 3340719 3325148 3348010 3412382 3477976 3518583 3544901 3576857 3619060 3661356 3687716 3690738 3689568
9514C689568L1895P7943Q9489N5781J7428J2758L5485N7443O8195P3626P3182
$$ 3689568 3721463 3799406 3888895 3944676 3962104 3974862 4010347 4067790 4135985 4209611 4282793
9503D282793N9944L7634K3225L2045O2932R5087J02556Q0404N3585M9664O7464
$$ 4282793 4342737 4380371 4403596 4435641 4498573 4593660 4696216 4776620 4830205 4879869 4947333
9492D947333Q5091R1578R2364Q9492P9766P1464P8638R5653J00484Q8396Q0398
$$ 4947333 5032424 5124002 5216366 5305858 5385624 5457088 5535726 5631379 5731863 5820259 5900657
9481E900657R1660J12013J24691J25081J15131R9159R0849J03545J27797J39235
$$ 5900657 5992317 6104330 6229021 6354102 6469233 6568392 6659241 6762786 6890583 7029818
9471G029818J32493J24472J22443J17716J13473J24218J41722J41246J30742J46609
$$ 7029818 7162311 7286783 7409226 7526942 7640415 7764633 7906355 8047601 8178343 8324952
9461H324952J84806J91589J51549J25427J55498J91980J75370J39005J49893J88726
$$ 8324952 8509758 8701347 8852896 8978323 9133821 9325801 9501171 9640176 9790069 9978795
9451I978795J84760J47346J55021K12639K31503J79340J43023J89276K56450K56656
$$ 9978795 10163555 10310901 10465922 10678561 10910064 11089404 11232427 11421703 11678153 11934809
9441A1934809K10608J96552K20004K26150K09305K17957K60859K90425K84145
$$ 11934809 12145417 12341969 12561973 12788123 12997428 13215385 13476244 13766669 14050814
9432A4050814K73097K79014K83527K75168K74696K95179L19097L31278L38476
$$ 14050814 14323911 14602925 14886452 15161620 15436316 15731495 16050592 16381870 16720346
9423A6720346L44687L42935L41095L58838L89322M03284M01950M21936M69586
$$ 16720346 17065033 17407968 17749063 18107901 18497223 18900507 19302457 19724393 20193979
9414B0193979M96429M70821M35426M53282N21044N77071N84858N71820N84726
$$ 20193979 20690408 21161229 21596655 22049937 22570981 23148052 23732910 24304730 24889456
9405B4889456O34072O91642P29299P48583P69563P97450Q18818Q37840Q87460
$$ 24889456 25523528 26215170 26944469 27693052 28462615 29260065 30078883 30916723 31804183
9396C1804183R76246J052036J067004J061305J117924J236726J327884J346389
$$ 31804183 32780429 33832465 34899469 35960774 37078698 38315424 39643308 40989697
9388D0989697J353255J406167J469504J493976J514857J587712J676835J702213
$$ 40989697 42342952 43749119 45218623 46712599 48227456 49815168 51492003 53194216
9380E3194216J668712J652347J671400J669402J627612J593074J574004J506220
$$ 53194216 54862928 56515275 58186675 59856077 61483689 63076763 64650767 66156987
9372F6156987J365447J225134J145979J083085R69558Q27367P15695O20189M86486
$$ 66156987 67522434 68747568 69893547 70976632 71946190 72773557 73489252 74109441 74595927
9363G4595927L36117K50355K38111K09983J06193k3731j02725j27567j47376j87108
$$ 74595927 74932044 75182399 75420510 75630493 75736686 75712955 75610230 75482663 75335287 75148179
9353G5148179k38915k98790l66184m25928m71171n30643o34287p61969q66818
$$ 75148179 74909264 74610474 74244290 73818362 73347191 72816548 72182261 71420292 70553474
9344G0553474r44345j034262j149851j252711j315240j365182j437965j519092
$$ 70553474 69609129 68574867 67425016 66172305 64857065 63491883 62053918 60534826
9336F0534826j571669j595689j616697j632651j620114j585404j558771j537167
$$ 60534826 58963157 57367468 55750771 54118120 52498006 50912602 49353831 47816664
9328D7816664j487104j414309j371642j373071j357430j277915j176649j118456
$$ 47816664 46329560 44915251 43543609 42170538 40813108 39535193 38358544 37240088
9320C7240088j093007j045261r71762r15792q83737q39063p76125p30311p10192
$$ 37240088 36147081 35101820 34130058 33214266 32330529 31491466 30715341 29985030 29274838
9311B9274838o85528o50422o30911o18627n70312m93731m56779m78251m87891
$$ 29274838 28589310 27938888 27307977 26689350 26119038 25625307 25168528 24690277 24202386
9302B4202386m41219l96001m10550m37888m03597l32740l05232l22480l17330
$$ 24202386 23761167 23365166 22954616 22516728 22113131 21780391 21475159 21152679 20835349
9293B0835349k76576k53899k64331k61885k32664k19889k35708k33426j97558
$$ 20835349 20558773 20304874 20040543 19778658 19545994 19326105 19090397 18856971 18659413
9284A8659413j80659k09561k28966j90889j37720j35009j68869j74895j38442
$$ 18659413 18478754 18269193 18040227 17849338 17711618 17576609 17407740 17232845 17094403
9275A7094403j04678j05044j25360j39126j33020j06826p7765p2517r0428r5163
$$ 17094403 16989725 16884681 16759321 16620195 16487175 16380349 16302584 16230067 16139639 16044476
9265A6044476o8927m6572o0747q2530o3260j3808J0455o827k6829k1316n510L51
$$ 16044476 15975549 15928977 15868230 15785700 15722440 15708632 15719087 15712260 15685431 15664115 15658605 15658956
9253A5658956o46j694l694J569K6360N7264O3205M1802K6218L7075N8933P4311
$$ 15658956 15658310 15656616 15652922 15654491 15680851 15738115 15801320 15843122 15869340 15906415 15965348 16039659
9241A6039659Q8035J04290J11508J07300J09485J24594J34209J31958J42929J79463
$$ 16039659 16127694 16231984 16343492 16450792 16560277 16684871 16819080 16951038 17093967 17273430
9231A7273430K07019J90944J57551J66332K27700K88436L03318K86174K77344
$$ 17273430 17480449 17671393 17828944 17995276 18222976 18511412 18814730 19100904 19378248
9222A9378248K89813L08975L27286L52770L86481M13717M24730M30425M46535
$$ 19378248 19668061 19977036 20304322 20657092 21043573 21457290 21882020 22312445 22758980
9213B2758980M70017M84843M88272M94410N08354N16372N13388N20259N51350
$$ 22758980 23228997 23713840 24202112 24696522 25204876 25721248 26234636 26754895 27306245
9204B7306245N79685N65336N13528M70399M57068M42849L97231L35136K87718
$$ 27306245 27885930 28451266 28964794 29435193 29892261 30335110 30732341 31067477 31355195
9195C1355195K55364K18371J74474J34213R2380L7182j8348m6884m8954n5321
$$ 31355195 31610559 31828930 32003404 32137617 32229997 32267179 32248831 32201947 32152993 32097672
9185C2097672q3019j15094j29868j26236j12663r4427q0116p7164p0665l2489
$$ 32097672 32014653 31899559 31769691 31643455 31530792 31436365 31356249 31279085 31208420 31175931
9175C1175931L3135P9958P9224O5222Q9433J46033J83160J83239J87483K29216
$$ 31175931 31209066 31289024 31368248 31433470 31522903 31668936 31852096 32035335 32222818 32452034
9165C2452034K83142L07233L06277L19368L59080L99500M22678M42964M76261
$$ 32452034 32735176 33042409 33348686 33668054 34027134 34426634 34849312 35292276 35768537
9156C5768537N13147N38989N60423N91200O24991O45848O60941O98496P67769
$$ 35768537 36281684 36820673 37381096 37972296 38597287 39243135 39904076 40602572 41370341
9147D1370341Q39765Q80132Q91704R12101R70791J056994J132921J176518J207029
$$ 41370341 42210106 43090238 43981942 44894043 45864834 46921828 48054749 49231267 50438296
9138E0438296J262692J352776J444102J506065J555993J634340J738632J819220
$$ 50438296 51700988 53053764 54497866 56003931 57559924 59194264 60932896 62752116
9130F2752116J856919J906701K024084K171591K254935K252477K248390K312296
$$ 62752116 64609035 66515736 68539820 70711411 72966346 75218823 77467213 79779509
9122G9779509K400612K424939K378998K332840K317586K287472K205024K096375
$$ 79779509 82180121 84605060 86984058 89316898 91634484 93921956 96126980 98223355
9114I8223355J992299J870588J701026J506537J328971J162653R75114P74888
$$ 98223355 100215654 102086242 103787268 105293805 106622776 107785429 108760543 109535431
9106A09535431O01375M54840K94612J12255m8022j56622k38052l22410l99326
$$ 109535431 110136806 110591646 110886258 110998513 110950491 110793869 110555817 110233407 109834081
9097A09834081m44671m58721m54267m36846m15208l98790l69655k99196k12172
$$ 109834081 109389410 108930689 108476422 108039576 107624368 107225578 106855923 106556727 106344555
9088A06344555j79935k14332k25734j43023k6346J1972l7167q7668j01780j30733
$$ 106344555 106164620 105950288 105724554 105581531 105555185 105567157 105529990 105442322 105340542 105209809
9078A05209809k06315k85253l33544l89321m96328o32880p54409q61433r78551
$$ 105209809 105003494 104718241 104384697 103995376 103499048 102866168 102111759 101250326 100271775
9069A00271775j102240j215481j326173j447914j565141j657149j736519j824788
$$ 100271775 99169535 97954054 96627881 95179967 93614826 91957677 90221158 88396370
9061H8396370j907478j953172j965709j979111k006481k027737k026142k007845
$$ 88396370 86488892 84535720 82570011 80590900 78584419 76556682 74530540 72522695
9053G2522695j983589j953048j910612j855015j794561j745380j711523j666660
$$ 72522695 70539106 68586058 66675446 64820431 63025870 61280490 59568967 57902307
9045E7902307j581643j475852j404787j380802j347584j261849j159687j100899
$$ 57902307 56320664 54844812 53440025 52059223 50711639 49449790 48290103 47189204
9037D7189204j081381j049484r85893r17124q64379q25284p95789p69196p25118
$$ 47189204 46107823 45058339 44072446 43155322 42290943 41465659 40669870 39900674 39175556
9028C9175556o57505n97488n69951n49837n05796m59838m48178m49004m15281
$$ 39175556 38518051 37920563 37350612 36800775 36294979 35835141 35386963 34937959 34522678
9019C4522678l58895l28275l17716k81394k29298k16622k33411k04763j21598
$$ 34522678 34163783 33835508 33517792 33236398 33007100 32790478 32557067 32352304 32230706
9010C2230706o9278q7846j02834n0191K0716L7459J9192K4686N1845O8014Q3767
$$ 32230706 32161428 32073582 31970748 31920557 31941273 31978732 31997924 32022610 32074455 32142469 32226236
8999C2226236J17616J38810J23705J16493J50053J63342R7959K4862N2668J42801
$$ 32226236 32343852 32482662 32606367 32722860 32872913 33036255 33134214 33159076 33211744 33354545
8989C3354545J52558N5103k5736k0544j2410p7174j53708j57041j23429j44868
$$ 33354545 33507103 33562206 33536470 33515926 33503516 33426342 33272634 33115593 32992164 32847296
8979C2847296k22873k82378k92737k89869k99380l11468l23314l45892l69979
$$ 32847296 32624423 32342045 32049308 31759439 31460059 31148591 30825277 30479385 30109406
8970C0109406l70961l46973l20490l08377l12949l26453l23989k79014k10592
$$ 30109406 29738445 29391472 29070982 28762605 28449656 28123203 27799214 27520200 27309608
8961B7309608j79764k04448k17501j58180o9307l9481p1704q2870l0094L6257
$$ 27309608 27129844 26925396 26707895 26549715 26480408 26440927 26369223 26286353 26256259 26292516
8951B6292516O0957N9776P5804J10444J38137J57772J88317K28651K57038K67414
$$ 26292516 26353473 26413249 26489053 26599497 26737634 26895406 27083723 27312374 27569412 27836826
8941B7836826K79268L05989L31158L29254L05407K98833L35274L85556L94860
$$ 27836826 28116094 28422083 28753241 29082495 29387902 29686735 30022009 30407565 30802425
8932C0802425L54223L13016L07851L12610K86426K41610K22898K36887K47177
$$ 30802425 31156648 31469664 31777515 32090125 32376551 32618161 32841059 33077946 33325123
8923C3325123K32843K08143J85054J58700J33805J24372J20230R4451N2609L1741
$$ 33325123 33557966 33766109 33951163 34109863 34243668 34368040 34488270 34582721 34635330 34667071
8913C4667071L7633K9654j1047m5551m1388k9652n4973j01669j19702j04176r7793
$$ 34667071 34704704 34734358 34723311 34677760 34636372 34606720 34551747 34450078 34330376 34226200 34128407
8902C4128407j21668j51035j62461j64925j74506j89100j99409k03714k04243
$$ 34128407 34006739 33855704 33693243 33528318 33353812 33164712 32965303 32761589 32557346
8893C2557346k04422k10494k20908k19307j96345j70031j61568j61163j46109
$$ 32557346 32352924 32142430 31921522 31702215 31505870 31335839 31174271 31013108 30866999
8884C0866999j21270j04776q3280l0065L2819M8455J6559J1634P7807J60632J90195
$$ 30866999 30745729 30640953 30557673 30527608 30560427 30608882 30625441 30637075 30714882 30875514 31065709
8873C1065709J84449K08901K68341L10925L23582L47442L96038M31267M38971
$$ 31065709 31250158 31459059 31727400 32038325 32361907 32709349 33105387 33536654 33975625
8864C3975625M62165N27793N96033O21788O22686O44895O97568P61965Q32084
$$ 33975625 34437790 34965583 35561616 36183404 36806090 37450985 38148553 38910518 39742602
8855C9742602R02273R44984R50403R63605J029164J117675J163829J163961J173629
$$ 39742602 40644875 41589859 42540262 43503867 44533031 45650706 46814535 47978496 49152125
8846D9152125J213456J244377J244380J242985J258541J262211J233861J199140
$$ 49152125 50365581 51609958 52854338 54097323 55355864 56618075 57851936 59051076
8838E9051076J176959J141390J075803J016343R93286R71909R07307Q22289P67867
$$ 59051076 60228035 61369425 62445228 63461571 64454857 65426766 66334073 67156362 67924229
8829F7924229P32969O63703N59701M78529M40920L99677L18839K23975J50166
$$ 67924229 68657198 69320901 69880602 70359131 70800051 71199728 71518567 71742542 71892708
8820G1892708R1198K8631l2123q4735j43960k15141k75863l18014l73251m59919
$$ 71892708 71983906 72012537 71980414 71895679 71751719 71536578 71260715 70942701 70569450 70109531
8810G0109531n37322n60033n54883n88801o67755p26114p28173p26099p83510
$$ 70109531 69572209 69012176 68457293 67868492 67200737 66474623 65746450 65020351 64236841
8801F4236841q78759r32301r17866q95499r20295r61433r49747q82312q27193
$$ 64236841 63358082 62425781 61507915 60612416 59692121 58730688 57780941 56898629 56071436
8792E6071436q21785q21004p73298o99904o50641o15858n46768m48348l79873
$$ 56071436 55249651 54428647 53655349 52955445 52304804 51688946 51142178 50693830 50313957
8783E0313957l56400l20232k34221j38415p6728k6777M7282J23493J66643K05154
$$ 50313957 49957557 49637325 49403104 49264689 49187961 49161184 49208466 49331959 49498602 49703756
8773D9703756K90478M00947M62689M64217M78027N55039O60037P34105P68586
$$ 49703756 49994234 50395181 50857870 51322087 51800114 52355153 53015190 53749295 54517881
8764E4517881P90317Q16994Q55325R07639R54498R63534R38756R25976R43481
$$ 54517881 55308198 56125192 56980517 57888156 58842654 59806188 60744944 61670920 62614401
8755F2614401R46234Q94500Q21349P84244P75940P39323O59357N82322N39022
$$ 62614401 63560635 64455135 65276484 66060728 66836668 67575991 68235348 68817670 69356692
8746F9356692N02317M39971L65748L08119K58786J88388R9181K7594o263k6031
$$ 69356692 69859009 70298980 70664728 70972847 71231633 71420021 71519202 71546796 71540533 71514502
8736G1514502o7680j36831k09310k66628l17457l81154m58884n30806n81751o21149
$$ 71514502 71446822 71309991 71100681 70834053 70516596 70135442 69676558 69145752 68564001 67942852
8726F7942852o72659p49100q41984r30534r95658j031522j052171j082274j131081
$$ 67942852 67270193 66521093 65679109 64748575 63752917 62721395 61669224 60586950 59455869
8717E9455869j178643j199658j198249j202486j222101j231708j208519j169535
$$ 59455869 58277226 57077568 55879319 54676833 53454732 52223024 51014505 49844970
8709D9844970j149149j147538j128073j070473j001373r56757r32568q95512q33563
$$ 49844970 48695821 47548283 46420210 45349737 44348364 43391607 42459039 41563527 40729964
8700D0729964p69537p23892o89226o50266o07161n64088n13057m49813l94071
$$ 40729964 39960427 39236535 38547309 37897043 37289882 36725794 36212737 35762924 35368853
8691C5368853l69694l67720l51647l02349k39299j92026j66445j46296j14904
$$ 35368853 34999159 34631439 34279792 33977443 33738144 33546118 33379673 33233377 33118473
8682C3118473o8304j7178J8988L0593L5685O6494J31198K00880K42568K53720
$$ 33118473 33050169 33032991 33051979 33082572 33118257 33184751 33315949 33516829 33759397 34013117
8672C4013117K55712K66542K92287L33214L81332M17974M29640M24037M19263
$$ 34013117 34268829 34535371 34827658 35160872 35542204 35960178 36389818 36813855 37233118
8663C7233118M21868M26655M30590M31575M19368L85987L42669L08415K83148
$$ 37233118 37654986 38081641 38512231 38943806 39363174 39749161 40091830 40400245 40683393
8654D0683393K51497K12438J81696J61135J31783Q7113M6752K1396r053n8659
$$ 40683393 40934890 41147328 41329024 41490159 41621942 41709055 41755807 41777203 41768150 41709491
8644D1709491j02314j13697j16962j55856k18713k46309k23665k11624k59522
$$ 41709491 41607177 41493480 41376518 41220662 41001949 40755640 40531975 40320351 40060829
8635D0060829l31127l59103l41311l32817l59943l95742m17114m33908m53042
$$ 40060829 39729702 39370599 39029288 38696471 38336528 37940786 37523672 37089764 36636722
8626C6636722m61233m59274m70616m95260m96250m58951m24583m29632m46422
$$ 36636722 36175489 35716215 35245599 34750339 34254089 33795138 33370555 32940923 32494501
8617C2494501m27443l81842l57467l63183l62022l36113l05948k81737k47054
$$ 32494501 32067058 31685216 31327749 30964566 30602544 30266431 29960483 29678746 29431692
8608B9431692k03548j83260j93354j89923j37572o4455k4462k5448k8587p529
$$ 29431692 29228144 29044884 28851530 28661607 28524035 28459580 28435118 28409670 28381083 28373554
8598B8373554K4467M6382O2551R2735J38943J74852J76786J63393J85680K63017
$$ 28373554 28398021 28444403 28506954 28599689 28738632 28913484 29090270 29253663 29439343 29702360
8588B9702360L47651L80602L69597L74166M19482M70284M95711N12737N47775
$$ 29702360 30050011 30430613 30800210 31174376 31593858 32064142 32559853 33072590 33620365
8579C3620365N96780O45255O91320P28804P45463P57872Q03770Q74831R07919
$$ 33620365 34217145 34862400 35553720 36282524 37027987 37785859 38589629 39464460 40372379
8570D0372379Q78878Q51603Q84241R37029R36291Q87378Q50634Q37797Q13756
$$ 40372379 41251257 42102860 42987101 43924130 44860421 45747799 46598433 47436230 48249986
8561D8249986P79853P67770P59073P01566O10107N59157N57955N25928M24588
$$ 48249986 49029839 49797609 50556682 51258248 51868355 52427512 52985467 53511395 53935983
8552E3935983L22625K79815K50103J68457O4794Q559j2098o6097j58401k20675
$$ 53935983 54258608 54538423 54788526 54956983 55021777 55030336 55018238 54952141 54793740 54573065
8542E4573065k22630k17117k56210l18993l49808l32326k98665k81737k78791
$$ 54573065 54350435 54133318 53877108 53558115 53208307 52875981 52577316 52295579 52016788
8533E2016788k61857k18808j73761j50600j24939n0189O1905J36271J37092J26109
$$ 52016788 51754931 51536123 51362362 51211762 51086823 51036634 51098539 51234810 51371902 51498011
8523E1498011J73819K56095K99636K97567L05779L38631L47835L11553K69126
$$ 51498011 51671830 51927925 52227561 52525128 52830907 53169538 53517373 53828926 54098052
8514E4098052K44454K02278J16090K2157m0342r8248j99636l30180m33072n00221
$$ 54098052 54342506 54544784 54660874 54683031 54642689 54544441 54344805 54014625 53581553 53081332
8504E3081332n84522p13536q42256r17769r54635j007982j089474j154370j175740
$$ 53081332 52496810 51783274 50941018 50023249 49068614 48060632 46971158 45816788 44641048
8495D4641048j187049j223845j257329j233520j163967j119457j125942j127005
$$ 44641048 43453999 42230154 40972825 39739305 38575338 37455881 36329939 35202934
8487C5202934j077778j017392r97425r87218r22862q22425p67686p73352p61231
$$ 35202934 34125156 33107764 32110339 31123121 30200259 29377834 28610148 27836796 27075565
8478B7075565o87195o12740o03454o23178n96112n30139m99317n19102n18773
$$ 27075565 26388370 25775630 25172176 24548998 23952886 23422747 22923430 22404328 21885555
8469B1885555m53059l74672l57497l91349m03079l62111l11482k91627k85295
$$ 21885555 21432496 21057824 20700327 20308978 19905899 19543788 19232306 18940679 18655384
8460A8655384k64066k46653k63253k86172k58161j89332j59132j98829k36056
$$ 18655384 18391318 18144665 17881412 17595240 17337079 17147747 16988615 16789786 16553730
8451A6553730k00766j30824j09284j38335j52502j32680j21005j26869j06759
$$ 16553730 16352964 16222140 16112856 15974521 15822019 15689339 15568334 15441465 15334706
8442A5334706n3563k2839l9261n2193k5076J399j2281k6760R175O3967P1482M1086
$$ 15334706 15281143 15258304 15219043 15166850 15141774 15143173 15130892 15104132 15113307 15177274 15248756 15289842
8430A5289842M0174Q2101J10409R7233Q3449J00560J15581R0183N0706N3290R8443
$$ 15289842 15330016 15412117 15522526 15619759 15703208 15803768 15919349 16009532 16060238 16113528 16211971
8419A6211971J23394Q3204R276l1107j9135j494k0485n9614q3173j00958j47336
$$ 16211971 16335365 16418569 16427845 16396738 16377603 16376109 16355624 16296010 16212837 16111879 15964543
8408A5964543k09907k37644k24270k22181k55562k82228k72451k63067k88004
$$ 15964543 15754636 15516992 15292722 15070541 14814979 14532751 14260300 13997233 13709229
8399A3709229l12955k96595k66943k70620k87663k70156k33390k29612k52236
$$ 13709229 13396274 13099679 12832736 12562116 12274453 12004297 11770907 11541295 11289059
8390A1289059k47401k10436j90378j99895j98513j70982j48511j42654j29643
$$ 11289059 11041658 10831222 10640844 10440949 10242436 10071454 9922943 9780289 9650646
8381I650646j12134j24325j59038j61206j16015p5551p3942q3274p9354q1489
$$ 9650646 9538512 9414187 9255149 9093943 8977928 8902377 8828435 8745161 8665807 8584318
8371H584318r5515q7246n0757l5966o5633r0001p0556m4507n3528p1036n9795
$$ 8584318 8488803 8401557 8350800 8314834 8249201 8159200 8088644 8044137 7990609 7919573 7859778
8360G859778m3216n4108o6021m5645k4364m2741o8194m9378j5041l0151p9555
$$ 7859778 7816562 7762454 7696433 7650788 7626424 7583683 7515489 7466111 7451070 7420919 7341364
8349G341364q7437m1381q213k5177n6009o3204n2505l5611j2888j811k2659n0596
$$ 7341364 7253927 7212546 7204333 7179156 7123147 7059943 7007438 6971827 6958939 6957128 6934469 6883873
8337F883873m1134n515J859k7051m4407l1414k0714k3409r847J7227P899m5045
$$ 6883873 6842739 6837224 6839083 6812032 6767625 6736211 6715497 6692088 6682241 6699468 6707367 6662322
8325F662322p4359l7654J5177J9860j2107k9770k2805j5599j6124j5025j0475
$$ 6662322 6587963 6550309 6565486 6585346 6573239 6543469 6520664 6505065 6488941 6473916 6463441
8314F463441k919R521J2662j0613l7227k4143J4880J7548k0442k5168L1201P0927
$$ 6463441 6460522 6470043 6482705 6472092 6434865 6410722 6425602 6443150 6422708 6397540 6428741 6499668
8302F499668L3872k2965k5153j716j2840k7690J1675N9383K8928m5154m6889K9689
$$ 6499668 6533540 6510575 6485422 6483706 6470866 6443176 6454851 6514234 6543162 6498008 6451119 6480808
8290F480808O9886L0543p8K9785M7894J520l8919n844M3746L2907J697K7173P6535
$$ 6480808 6550694 6581237 6581159 6610944 6658838 6660358 6621439 6615595 6659341 6692248 6693945 6721118 6797653
8277F797653O3604N830l041M4090N8802J3537j4069K1715O2536N4945L7562O0027
$$ 6797653 6861257 6867087 6864046 6908136 6966938 6980475 6966406 6988121 7050657 7105602 7143164 7203191
8265G203191Q9919P0658K0566L371L1308O1195O7601O2713N4113L5499J7898K5858
$$ 7203191 7293110 7363768 7384334 7387705 7419013 7480208 7547809 7610522 7664635 7700134 7718032 7743890
8253G743890N8313Q6379R1936Q1019O2955M6211M9520Q2275J15065J06561O3815
$$ 7743890 7802203 7888582 7980518 8061537 8124492 8170703 8220223 8302498 8417563 8524124 8587939
8242H587939L9250N9941R6394J12928J10627J02291Q3792N8624N7240R5517J37663
$$ 8587939 8627189 8687130 8783524 8896452 9007079 9109370 9193162 9251786 9309026 9404543 9542206
8231I542206J38295J05141Q3229Q9835J03934J12065J23473J38962J42701J31818
$$ 9542206 9680501 9785642 9868871 9958706 10062640 10174705 10298178 10437140 10579841 10711659
8221A0711659J23367J25859J31192J37406J50860J65229J70013J78472K07891
$$ 10711659 10835026 10960885 11092077 11229483 11380343 11545572 11715585 11894057 12101948
8212A2101948K32452K07180J49525J37700J98891K57077K39134J84025J83836
$$ 12101948 12334400 12541580 12691105 12828805 13027696 13284773 13523907 13707932 13891768
8203A3891768K48124K98209K86247K50964K45614K67961K84268K82876K79190
$$ 13891768 14139892 14438101 14724348 14975312 15220926 15488887 15773155 16056031 16335221
8194A6335221K90238L20158L56212L74645L65983L51854L58425L81330L99851
$$ 16335221 16625459 16945617 17301829 17676474 18042457 18394311 18752736 19134066 19533917
8185A9533917M12810M28682M33193M08308L76560L80162M15898M37596M26705
$$ 19533917 19946727 20375409 20808602 21216910 21593470 21973632 22389530 22827126 23253831
8176B3253831M11362M09137M04709L96928M10885M42814M51311M30767M32862
$$ 23253831 23665193 24074330 24479039 24875967 25286852 25729666 26180977 26611744 27044606
8167B7044606M78159N08910M80887M43617M63643N17412N38041N31433N57434
$$ 27044606 27522765 28031675 28512562 28956179 29419822 29937234 30475275 31006708 31564142
8158C1564142O14690O38228O14790O11119O65448P28781P48709P46120P65535
$$ 31564142 32178832 32817060 33431850 34042969 34708417 35437198 36185907 36932027 37697562
8149C7697562Q01379Q22643Q34367Q64866R11616R42776R45512R41830R57270
$$ 37697562 38498941 39321584 40155951 41020817 41932433 42875209 43820721 44762551 45719821
8140D5719821R92078J023329J030171J021664J033437J080823J127547J132695
$$ 45719821 46711899 47735228 48765399 49787063 50820500 51901323 53028870 54161565
8132E4161565J119307J149751J231347J301720J323862J337998J388474J455087
$$ 54161565 55280872 56430623 57661970 58963690 60287552 61625550 63014024 64469111
8124F4469111J502577J549904J631841J726566J786697J822774J890634K002674
$$ 64469111 65971688 67521592 69153433 70879999 72666696 74489470 76380104 78382778
8116G8382778K113176K194744K273195K377229K504320K649674K821651L011134
$$ 78382778 80495954 82690698 84963893 87341122 89845442 92495116 95316767 98327901
8108I8327901L189353L357075L555421L803811M066294M310026M561539M865251
$$ 98327901 101517254 104874329 108429750 112233561 116299855 120609881 125171420 130036671
8100A30036671N211688N552778N877208O225085O623667P047211P456693P852663
$$ 130036671 135248359 140801137 146678345 152903430 159527097 166574308 174031001 181883664
8092A81883664Q265034Q702433R136317R538699R916761J0293850J0660388J0959135
$$ 181883664 190148698 198851131 207987448 217526147 227442908 237736758 248397146 259356281
8084B59356281J1120114J1091107J0823254J0246018R282385P890690O084595
$$ 259356281 270476395 281567502 292390756 302636774 311919159 319809849 325894444
8077C25894444L926735J522929r88419l468916n804957p890458r608374j0870284
$$ 325894444 329821179 331344108 330355689 326886773 321081816 313191358 303582984 292712700
8069B92712700j1674861j2094661j2204040j2050703j1691219j1203322j0646126
$$ 292712700 281037839 268943178 256739138 244688435 232997216 221793894 211147768
8062B11147768j0045156r428967q838849q285538p741398p200170o701432o268656
$$ 211147768 201102612 191673645 182834796 174549258 166807860 159607690 152906258 146637602
8054A46637602n870784n481924n130856m843595m583638m310136m055539l871569
$$ 146637602 140766818 135284894 130154038 125310443 120726805 116416669 112361130 108489561
8046A08489561l726225l538631l305886l107814k978435k858475k699609k535929
$$ 108489561 104763336 101224705 97918819 94811005 91832570 88974095 86274486 83738557
8038H3738557k411241k303623k175635k047692j961085j900576j813697j693376
$$ 83738557 81327316 79023693 76848058 74800366 72839281 70938705 69125008 67431632
8030F7431632j589426j536244j507145j452098j361534j279022j248888j256302
$$ 67431632 65842206 64305962 62798817 61346719 59985185 58706163 57457275 56200973
8022E6200973j238563j168197j096392j079722j093038j072433j024434j013911
$$ 56200973 54962410 53794213 52697821 51618099 50525061 49452628 48428194 47414283
8014D7414283j044670j043714r87532r49703r75654r98644r48259q66048q30971
$$ 47414283 46369613 45325899 44338367 43388664 42413010 41414366 40466107 39600059 38769088
8005C8769088q31597q04019p50776p26343p33843p27527o97738o69451o37269
$$ 38769088 37937491 37133472 36382696 35656353 34922510 34194983 33497245 32827794 32190525
7996C2190525n86274n54816n84725o27804o00156n17256m72262m87334m95839
$$ 32190525 31604251 31049435 30464710 29836906 29236750 28719494 28247232 27759898 27264059
7987B7264059m71591m58135m60164m29978l83185l98071m65207m72221l88176
$$ 27264059 26792468 26334333 25874169 25444191 25061006 24662935 24197728 23725507 23337331
7978B3337331l25396l51271l79657l37454k97731l32026l62566l02448k28245
$$ 23337331 23011935 22660664 22281007 21943553 21645822 21313796 20951230 20648782 20420537
7969B0420537k52217l17752k99023k30283k42596l19310l19780k33068k01342
$$ 20420537 20168320 19850568 19551545 19321262 19078666 18759356 18439576 18206508 18005166
7960A8005166k70475l15291k61788k00737k11004k36869k24570k26241k70155
$$ 18005166 17734691 17419400 17157612 16956875 16745871 16509002 16284432 16058191 15788036
7951A5788036k70298j79713j08211j59250k54712k58486j88779j63401j97333
$$ 15788036 15517738 15338025 15229814 15070564 14815852 14557366 14368587 14205186 14007853
7942A4007853k03921j62782j43898j73469j99619j95094j88609j88493j69586
$$ 14007853 13803932 13641150 13497252 13323783 13124164 12929070 12740461 12551968 12382382
7933A2382382j41945j45355j70440j68952j46330j57573k02180k11678j61981
$$ 12382382 12240437 12095082 11924642 11755690 11609360 11451787 11249607 11037929 10875948
7924A0875948j14700j17362j38012j35066j24846j36557j54227j48771j28920
$$ 10875948 10761248 10643886 10505874 10370808 10245962 10109405 9955178 9806407 9677487
7915I677487j20964j26641j31400j29710j19893r8481p6976p8215j01049j15101
$$ 9677487 9556523 9429882 9298482 9168772 9048879 8950398 8873422 8795207 8694158 8579057
7905H579057j04741r2004j00763j21266j25613j03182p1812o2627q9652j24898
$$ 8579057 8474316 8382312 8281549 8160283 8034670 7931488 7859676 7797049 7707397 7582499
7895G582499j21430p7894n0138p0074r3368p5493n4629q5134j25422r1014m563
$$ 7582499 7461069 7383175 7333037 7262963 7169595 7094102 7039473 6954339 6828917 6737903 6733340
7884F733340J9006n1702j16991j06849p7108q9995j04937o7891k1248k9782o4241
$$ 6733340 6752346 6700644 6583653 6476804 6399696 6309701 6204764 6136873 6115625 6085843 6021602
7873F021602n9240l6413o3244j20946j22689n5481k868j7314n8248p5648p6333
$$ 6021602 5962362 5925949 5862705 5741759 5619070 5563589 5560721 5543407 5485159 5409511 5333178
7862E333178p8537o7795l5796j4264l1818o8887q5303p0615m6315l6284m8550
$$ 5333178 5254641 5186846 5151050 5136786 5104968 5036081 4950778 4880163 4833848 4797564 4749014
7851D749014p0824p8237o0740m0336m1068n0295l8994j3226p983l0150m8211m5909
$$ 4749014 4678190 4599953 4539213 4498877 4457809 4407514 4368520 4355294 4347311 4317161 4268950 4223041
7839D223041m5109n9669o5292m1376j3391k0705n7771p9060n9668k4617j0966
$$ 4223041 4177932 4118263 4052971 4011595 3998204 3977499 3919728 3840668 3781000 3756383 3745417
7828C745417k0312k5478j5704j0630k1974k8048j2125m154l9909q7620p4156K958
$$ 3745417 3725105 3699627 3683923 3673293 3651319 3623271 3611146 3606992 3567083 3479463 3405307 3408265
7816C408265N2097J0178o7000q6375m3208m298r05q553j4910l5912o5509p1739
$$ 3408265 3460362 3470540 3403540 3317165 3273957 3269659 3268754 3260201 3245291 3209379 3143870 3072131
7804C072131m9957k9769k4478j9053r424q948j5477j4624j2239k1482k7536j2390
$$ 3072131 3022174 2992405 2967927 2948874 2939450 2930502 2915025 2900401 2888162 2866680 2839144 2826754
7792B826754L47j8704m1355k1578J6665J0855k9704l5985l150p57m2704n5306
$$ 2826754 2827101 2808397 2767042 2745464 2762129 2772984 2743280 2707295 2704145 2703388 2660684 2605378
7780B605378j0243J9804q693l1240K321K8104j7308p1043m2915K6811K9663l3277
$$ 2605378 2595135 2614939 2606246 2575006 2577327 2605431 2588123 2517080 2474165 2500976 2530639 2497362
7768B497362n9226j2616L0048J0109l8061o0424n2044l1296q525J922j1571l0235
$$ 2497362 2438136 2425520 2455568 2465677 2427616 2367192 2315148 2283852 2275327 2277249 2265678 2235443
7756B235443k6659j0893j1193k1212j6537p814k1111m1312l5410j5203j2764j3935
$$ 2235443 2208784 2197891 2186698 2165486 2148949 2141135 2120024 2078712 2043302 2028099 2015335 2001400
7744B001400J1011L2226J369m8971m4415J072L295m0290l8863K6042N1667j4471
$$ 2001400 2012411 2044637 2046006 1997035 1952620 1953692 1956987 1916697 1877834 1903876 1955543 1941072
7732A941072p4837l4968M4951N0240j3355n0785l2052j0813j6768k3491j3279
$$ 1941072 1866235 1831267 1876218 1926458 1913103 1862318 1830266 1819453 1802685 1779194 1765915
7721A765915J043J3113K3158J3688k2166m6404k3466J7856K3177p019k9070k7304
$$ 1765915 1766958 1780071 1803229 1816917 1794751 1748347 1724881 1742737 1765914 1758895 1729825 1702521
7709A702521j8815p931Q362J0547j1445k0744J0708L6693L89o0215n7164P492
$$ 1702521 1683706 1675775 1684137 1694684 1683239 1662495 1673203 1709896 1710285 1650070 1592906 1600398
7697A600398L9850r59m8299m0929m961J1386R624O299q295l2227k9316J0547L8219
$$ 1600398 1640248 1639289 1590990 1550061 1545100 1556486 1566110 1572409 1564114 1531887 1502571 1513118 1551337
7684A551337J6889j9434k3851q092o980j2456J810K1841J6138n373q602N397Q762
$$ 1551337 1568226 1548792 1524941 1516849 1509869 1497413 1499223 1521064 1537202 1531829 1523227 1528624 1537386
7671A537386L95J550Q507q52j9538j9035j928R41j2906j2337Q883J6271p626l2593
$$ 1537386 1537781 1539331 1547838 1546986 1527448 1508413 1506485 1507426 1494520 1482183 1491066 1507337 1499711 1467118
7657A467118k8058m300J4813K5716K8595J1683j8366k3242J1911L8133N568n1179
$$ 1467118 1439060 1434760 1449573 1475289 1503884 1515567 1497201 1473959 1485870 1524003 1529571 1478392
7645A478392m8670K4415Q2682O0734Q5j8784J0993L0640J2839p884L1K2794L5456
$$ 1478392 1429722 1454137 1536819 1597553 1597638 1578854 1589847 1620487 1633326 1625442 1625473 1648267 1683723
7632A683723L5931K8978J2764j557Q221L5538M3493K4418K0336N3759Q1218N9638
$$ 1683723 1719654 1748632 1761396 1759839 1768060 1803598 1847091 1871509 1891845 1945604 2026822 2086460
7620B086460K0324K0043M7805M7703J8236J4304M8688O5393K9984j7768k9523
$$ 2086460 2106784 2126827 2174632 2222335 2240571 2254875 2303563 2368956 2398940 2381172 2351649
7609B351649j3310k195l938j3136l3480n7631o0861m1862l3681m9547n8848m4075
$$ 2351649 2338339 2336144 2332206 2319070 2285590 2227959 2167098 2125236 2091555 2042008 1983160 1939085
7597A939085l5774n5931p2874n5640l0595l5470n5549n7712n2067o2886p0456
$$ 1939085 1903311 1847380 1774506 1718866 1688271 1652801 1597252 1539540 1487473 1424587 1354131
7586A354131m3751m844K643j3318j5968j3383l7654o7748n1741M53K4631K421
$$ 1354131 1310380 1305536 1308179 1294861 1278893 1265510 1227856 1160108 1108367 1108820 1133451 1135872
7574A135872k2718l0689m4295n7638l2806J5837K3462j5448l1317l500J040m1559
$$ 1135872 1113154 1082465 1038170 980532 947726 963563 987025 971577 940260 936760 937800 896241
7562H96241n1314J4472O3582J0305p3604o7706M329K3923k2114l4479J5646M0328
$$ 896241 844927 859399 922981 933286 859682 791976 796305 820228 798114 763635 779281 819609
7550H19609m873m4437j6160K7118J4637k7540l2361k820O435j7703l6557k4382
$$ 819609 814736 770299 754139 781257 795894 768354 735993 733173 739608 721905 685348 660966
7538F60966N067K5863K2029m536k8217k2021L24m235l8701m9002l615N0765N1629
$$ 660966 666033 691896 713925 709389 681172 659151 659475 655240 616539 567537 563922 614687 666316
7525F66316O188k8115k4902p578j421o557j3155j4121o577J392l761j6488j3709
$$ 666316 672504 644389 619487 611909 610488 603931 590776 576655 570078 571470 567709 551221 537512
7512E37512N815J2393n835j8858m608J2537M455j4316j8534j5736j8549j0543
$$ 537512 543327 555720 549885 531027 526419 538956 543411 529095 510561 494825 476276 465733
7500D65733J4655J9099j9272m9329j6214M2840M7681j629l2644j9154n262j2275
$$ 465733 480388 499487 480215 430886 414672 457512 505193 503564 470920 451766 446504 434229
7488D34229j0641M932N22j8073J18M9897N3017j5717p1494m4019J7820L0697j07
$$ 434229 423588 428520 429042 410969 411087 460984 514001 498284 426790 382771 400591 431288 431181
7475D31181j4731k734K788k366K405J1953Q130p63j745q342k6012k5504L249J7943
$$ 431181 416450 413716 416504 414138 416543 428496 436626 435863 434118 425776 399764 374260 377509 395452
7461C95452m141j6586J2267K8579j5330o1179l3797K5050K4635j7443j2853L2868
$$ 395452 391311 374725 386992 415571 400241 339062 305265 330315 354950 337507 324654 357522
7449C57522L2554j6946k7039J6278K5772k0644l4307J7936M5714k851m7181k0777
$$ 357522 390076 373130 346091 362369 388141 367497 333190 351126 396840 393989 346808 326031
7437C26031J5511l052k7254p28K5843k117k8647M356L2039j7029o9755k3893O1328
$$ 326031 341542 338490 311236 310508 336351 334234 305587 309943 341982 324953 255198 231305 292633
7424B92633N4667k4107m5946J58O977l7336k8157M6160O4155j2241n9938n429
$$ 292633 347300 323193 277247 277405 284382 247046 218889 265049 329204 316963 257025 251596
7412B51596N0475J2396m9904l3941K2680K4743j7077k8214p431m891j3846O333
$$ 251596 302071 314467 264563 230622 253302 278045 260968 232754 225323 220432 206586 212919
7400B12919L5877K3172j9624l7196k2747j0229k562J4930J8106j8332n1731k3307
$$ 212919 248796 271968 252344 215148 192401 182172 179610 194540 212646 194314 142583 119276
7388A19276L9240N4171R354k8429k3104p967j0443j2770n17J1716J5245J6224
$$ 119276 158516 212687 222041 193612 170508 162541 152098 139328 138811 150527 165772 181996
7376A81996O058k5362m8381k2956K9247M1789m24l9510l0502M687K3789J7203
$$ 181996 188054 162692 114311 91355 120602 162391 161967 122457 91955 96642 120431 137634
7364A37634j246j7251j8334m960M82j2945j5990J4582M2537K1916k0443k3186
$$ 137634 136388 119137 100803 95843 96325 83380 67390 81972 124509 146425 125982 102796
7352A02796M469J113k9253j7539L9590N5866j385m7904j9304K4329O476l5929
$$ 102796 107265 108378 79125 61586 101176 157042 155657 107753 88449 112778 119254 83325
7340H3325k3728K5351L2012p956k6098m219M458j9296k5229J3900M9782L4195
$$ 83325 59597 84948 116960 109004 82906 78687 83145 63849 38620 52520 102302 136497
7328A36497q331k3776p249K103j4450l1464j8726J6969L7710J8567k0698l6630
$$ 136497 128166 104390 97141 99244 84794 53330 34604 51573 89283 107850 87152 50522
7316E0522j4512J4883J7276l118j6520q482Q131J3752J887j6401k2099r450L821
$$ 50522 36010 50893 68169 65051 48531 40049 48180 61932 63819 47418 25319 15869 19690
7303A9690J334l607J0348K8315J4060k7739m7067j9396K0889L5066K5927R361
$$ 19690 21024 17417 27765 56080 70140 42401 -4666 -24062 -3173 31893 57820 67181
7291F7181j3969l3199k0960J5932K7114m348k6059l2L0849J4672k1720k2429K812
$$ 67181 53212 20013 -947 14985 42099 37751 11692 11660 42509 57181 35461 13032 15844
7278A5844O321r754r857r46j2574k4056M244M3394K8881k6236m2613j679K9764
$$ 15844 22165 12411 2554 1608 -10966 -35022 -30778 12616 41497 15261 -27352 -29031 733
7265G33J3548j0064o304L942J784K26m514l2784n5401j7146N2615N5628j4941
$$ 733 14281 4217 -2087 1855 3639 3865 -649 -33433 -88834 -105980 -53365 2263 -12678
7252a2678m3861K1241P4034K2716n4357m0121K7960L2532k2498l4800Q886K0974
$$ -12678 -56539 -35298 38736 61452 7095 -33026 -5066 27466 4968 -29832 -20946 28
7240B8j7976k6857J9825M1290k768l8541r594K7125R234k0546J999M2178K5808
$$ 28 -17948 -44805 -24980 16310 13542 -24999 -34593 -7468 1766 -18780 -16781 25397 51205
7227E1205l0271m5242n904K1792N422j4955q494J703m108n188J0581J5181o613
$$ 51205 20934 -24308 -30212 -8420 -2998 -17953 -26447 -24744 -28852 -34040 -23459 -8278 -14891
7214a4891j9328O028L4989J9758k1086k9863k040J0987r107k1556n704N38k3381
$$ -14891 -34219 -28191 6798 26556 5470 -24393 -26433 -15446 -24553 -46109 -51813 -51275 -74656
7201g4656k9470J8193O4199L7365k9763m3492N562L3805M960k0209q06J4904j3250
$$ -74656 -104126 -85933 -21734 15631 -14132 -57624 -52062 -18257 -13297 -33506 -34312 -19408 -32658
7188c2658l8080j0192L0981K8942R615K1521L1341j7112p7771n3860L7668P4191
$$ -32658 -70738 -80930 -49949 -21007 -11392 10129 41470 24358 -53413 -107273 -69605 4586
7176D586J4194m0640r891M4594K7954l8608o0062j1398M0508M0354N272j7553
$$ 4586 18780 -21860 -31751 12843 40797 2189 -57873 -69271 -28763 11591 16863 -690
7164f90j0109P610O888j5998l3004j9979P537J7330J0090R266R142j5608m7614
$$ -690 -10799 -3189 3699 -12299 -45303 -65282 -57745 -40415 -30325 -21059 -11917 -27525 -75139
7151g5139l6521J4264L6716J812l2352j5814J5407J0014j0230K04K2076Q227k5573
$$ -75139 -111660 -97396 -60680 -58868 -91220 -107034 -91627 -81613 -91843 -91639 -69563 -61336 -86909
7138h6909k5236P996K4704J3954Q503J2069l445k9803k5964N653J8594M924L527
$$ -86909 -112145 -104149 -79445 -65491 -56988 -44919 -48364 -78167 -104131 -98478 -79884 -74960 -71433
7125g1433J5918k586m5606m0329K7973O5081P190o6589m7402L5896O3749P800
$$ -71433 -55515 -58101 -103707 -144036 -116063 -50982 -43792 -110381 -157783 -121887 -58138 -50338
7113e0338m2007k7802L567J065j0081O925K8198J8401r16P006K2079J255l8668
$$ -50338 -92345 -120147 -116580 -115515 -125596 -118671 -90473 -72072 -72988 -65982 -43903 -42648 -81316
7100h1316l8683Q009M2027K6174q473k2272k1292k3726j6589J4345M2632L3636
$$ -81316 -119999 -111990 -69963 -43789 -52262 -74534 -95826 -119552 -136141 -121796 -79164 -45528
7088d5528R25j2633m60L494j5334k9218j4187J4644K7752J7150m223j9676j7259
$$ -45528 -44603 -57236 -57696 -54202 -69536 -98754 -112941 -98297 -70545 -53395 -57618 -77294 -94553
7075i4553Q66J2955J188j8021j2246J6139K8444P122j8346j7732k45J1084J4951
$$ -94553 -93687 -80732 -79544 -97565 -109811 -93672 -65228 -58106 -76452 -94184 -94429 -83345 -68394
7062f8394J7550R751j3438l1636k4924m049R080J2833J4702R885k807n400R369
$$ -68394 -50844 -41093 -54531 -86167 -111091 -115140 -106060 -93227 -78525 -68640 -71447 -76847 -67478
7049f7478J4631j0185l6662k5731P688J4438j2095k7134n520K2681K0798m370
$$ -67478 -52847 -63032 -99694 -125425 -117737 -103299 -115394 -142528 -148048 -125367 -104569 -108939
7037a08939j8414l884K4272L6200J6011j8686l1599j1139J4498J7791N922l547
$$ -108939 -127353 -131237 -106965 -70765 -54754 -73440 -105039 -116178 -101680 -83889 -77967 -81514
7025h1514j3181k4358j6128J6756L4084N299l2180k4589J1449J7828o287p931
$$ -81514 -94695 -119053 -135181 -118425 -84341 -79042 -111222 -135811 -124362 -106534 -112821 -120752
7013a20752K2158L3167M716k0097j1188O009O817L728M178p108k2027q504K2199
$$ -120752 -98594 -65427 -60711 -80808 -91996 -85987 -79170 -75442 -71264 -78372 -100399 -108903 -86704
7000h6704J7004k3818k9954K2885O0484K6199k7190k7498L727M403j9175j9417
$$ -86704 -69700 -93518 -123472 -100587 -40103 -13904 -41094 -68592 -64865 -60462 -79637 -99054
6988i9054P99O008K976J7651K7880l26l5407k1480K3247L2556K131j1261O747
$$ -99054 -98255 -92247 -89271 -71620 -43740 -44066 -79473 -100953 -77706 -45150 -43019 -54280 -47533
6975d7533J1211j2712k5207q513N190k082p101K503P987L241L832N571j0451k8654
$$ -47533 -36322 -49034 -74241 -82754 -77564 -79646 -86747 -84244 -76257 -73016 -69184 -63613 -74064 -102718
6961a02718j3919K2198L2369J2379L630J5427J5307n05k882O07k4140n2199k0935
$$ -102718 -116637 -94439 -62070 -49691 -46061 -30634 -15327 -15832 -18714 -18107 -42247 -94446 -115381
6948a15381M6959N0617k4106o1530L378P2907L9578m4831n8298L936M3968K0327
$$ -115381 -68422 -17805 -41911 -103441 -100063 -27156 12422 -32409 -90707 -86771 -42803 -22476
6936b2476j5928k3629j5291n564O856J0588l194q458J7362M3232K9607k777j0981
$$ -22476 -38404 -62033 -77324 -82888 -76032 -65444 -68638 -77096 -59734 -16502 13105 10328 -653
6923f53o714k4408m1390j2163L7130L7258q584k7155L843K6013N848j5535m322
$$ -653 -7367 -31775 -73165 -85328 -48198 -10940 -19524 -46679 -42836 -16823 -10975 -26510 -30832
6910c0832J1703M957k994P658J2867o286k1548n515J7816J0690j9556l4598j8072
$$ -30832 -19129 -14172 -17166 -9508 3359 -2927 -24475 -29990 -12174 -1484 -21040 -55638 -73710
6897g3710J1956K8563J9089k828n336K1198L8544Q267m2760m9717j939M2824M2567
$$ -73710 -61754 -33191 -14102 -16930 -22266 -1068 37476 45743 2983 -46734 -48673 -5849 36718
6884C6718J7463K38p549j1193l035J1875J2382m41l437J437r003k1164M673N0488
$$ 36718 54181 54419 46870 35677 32642 44517 56899 56458 53021 54458 45455 24291 28964 79452
6870G9452M3722k4038o1350j0624N7025M8379j3214l6080j223L1015K7980J4478
$$ 79452 123174 99136 37786 27162 84187 132566 119352 83272 82049 113064 141044 155522
6858A55522P138n116j6231m550J7883J5091r887j4832J3309L8922L4807J5463
$$ 155522 162660 157544 141313 136763 154646 169737 159850 145018 158327 197249 232056 247519
6846B47519L643J158L029J0349K0244K4443J9765N833j6571k9978p708L9572N7253
$$ 247519 251162 252320 255349 265698 285942 310385 330150 335983 319412 289434 281726 321298 378551
6833C78551K1682j4500J052L5552K5301j5982j9656K3184N1668L8280K0577K0403
$$ 378551 400233 385733 386785 422337 447638 431656 412000 435184 486852 525132 545709 566112
6821E66112J0807j6245k3732Q21J7196M840m78K3307L9557J8146r887n710J8333
$$ 566112 576919 560674 536942 537763 554959 559799 559321 582628 622185 640331 630444 624734 643067
6808F43067L3606M1207M3950K3841r643m150N0670P9738K9790l2067r916O8356
$$ 643067 676673 717880 761830 785671 776028 771878 822548 902286 932076 900009 890093 958449
6796I58449Q6327J4890m5608j5825N5096P2471K6384j1408R100O0340Q0536M7561
$$ 958449 1044776 1059666 1014058 998233 1053329 1125800 1152184 1140776 1149876 1210216 1290752 1338313
6784A338313J528m189L2360O2337N3619K9253K3057L0184L1543L6400O0459Q5576
$$ 1338313 1339841 1335652 1368012 1430349 1483968 1513221 1536278 1566462 1598005 1634405 1694864 1780440
6772A780440Q5103O9661O3474N7162L5214K7372O8913J25363J30182R2679Q8184
$$ 1780440 1865543 1935204 1998678 2055840 2091054 2118426 2187339 2312702 2442884 2535563 2623747
6761B623747J33303J57626J25494R9095J33397J85316J90857J70888J86638K34505
$$ 2623747 2757050 2914676 3040170 3139265 3272662 3457978 3648835 3819723 4006361 4240866
6751D240866K62803K65665K84167L27096L61076L77238M06153M64650N41399O31593
$$ 4240866 4503669 4769334 5053501 5380597 5741673 6118911 6525064 6989714 7531113 8162706
6741H162706P26378P68733O90341N08585L19471J67452j0047k65887n34540p04207
$$ 8162706 8889084 9657817 10348158 10856743 11176214 11343666 11333619 11067732 10533192 9828985
6731I828985p53994p47196p16693o41644n34762m63569m53502m40389l67670k77797
$$ 9828985 9074991 8327795 7611102 6969458 6434696 5971127 5517625 5077236 4709566 4431769
6721D431769k46809k64797k53468j89124j32890j27885j36658j12971p7256p2731
$$ 4431769 4184960 3920163 3666695 3477571 3344681 3216796 3080138 2967167 2889911 2817180
6711B817180q9778r1163q3617j00454j27567j15904p0385n6094r4989j22979q8822
$$ 2817180 2727402 2636239 2552622 2452168 2324601 2208697 2138312 2082218 1987229 1864250 1775428
6700A775428l8031m1818q3997q7820l6563M459r998m6040n5551m6678n3200o9770
$$ 1775428 1737397 1695579 1611582 1523762 1487199 1491658 1481660 1435620 1380069 1333391 1280191 1210421
6688A210421o1812k5408K473m742k9763l7902j9785L003O517j0824l0585l5512
$$ 1210421 1148609 1123201 1125674 1120932 1091169 1053267 1033482 1036485 1043002 1032178 1001593 966081
6676I66081k6088j7495k2278l7120m6606m0100k3952j3696j3941j4257j0520j7629
$$ 966081 939993 922498 900220 863100 816494 776394 752442 738746 724805 710548 700028 682399
6664F82399m4132o4063m2353J0458M0995K1866j4087k7394k6191l5793m4445k4388
$$ 682399 638267 574204 531851 542309 583304 605170 591083 563689 537498 501705 457260 432872
6652D32872J0468J8064n272k0502j1549p267k5634m0730k6020N435K5263K4191
$$ 432872 443340 461404 456132 435630 424081 416814 391180 350450 324430 329865 355128 379319
6640C79319N088k6740m9722l7165q55J3644m928j4344N786J2815k1592m7303j3035
$$ 379319 384407 357667 307945 270780 269925 283569 278641 264297 270083 282898 261306 214003 200968
6627B00968L6763K4069l1475l7752J9029M8923L820m8078l8115k968q803l5662
$$ 200968 237731 261800 230325 192573 211602 260525 264345 216267 178152 175184 166381 130719
6615A30719j9272L1466M4921K095l6507k6365L256O141j5759k9000j7129R823
$$ 130719 111447 142913 187834 189929 153422 127057 130313 136454 120695 91695 74566 84389
6603H4389L1937L0461J654k9971l1536l309J9689J4874j961p868n076n555n764
$$ 84389 116326 146787 148441 118470 86934 83625 103314 118188 116227 108359 103283 97728 91964
6590I1964P38J798j5562l4457k3533J5324L9804J8762k6158m5939k2726J3205
$$ 91964 92702 94500 78938 44481 20948 36272 76076 94838 68680 22741 15 13220
6578A3220K3765M692j9001k6523j7868l140R847J6433J5075R429K794q261k4196
$$ 13220 36985 41677 22676 -3847 -21715 -24855 -15008 1425 16500 25929 28723 20462 -3734
6565c734l0136j1156J9576K9612R920j3663j9742j6025j2309LJ9514J8099j4613
$$ -3734 -33870 -45026 -25450 4162 14082 419 -19323 -35348 -47657 -47654 -28140 -10041 -24654
6552b4654l8712j7719J9027J8124j1564j4828J4742K4603k628j6933R409K8126
$$ -24654 -63366 -81085 -62058 -43934 -55498 -70326 -55584 -30981 -33609 -50542 -41133 -13007
6540a3007l771m6725m1044k344J1945M70Q405L4604K7386j9651m2326n107L6327
$$ -13007 -16778 -63503 -104547 -106891 -94946 -94476 -86071 -51467 -24081 -43732 -86058 -91165 -54838
6527e4838J6381m0127n3854o504L5936J9531k5029l1035J0850M3885K6179j4642
$$ -54838 -38457 -78584 -132438 -138942 -103006 -83475 -108504 -139539 -128689 -84804 -58625 -73267
6515g3267k5138j03J8842R152o614p247o972k1782l3467j8350R830J9897J1887
$$ -73267 -98405 -98508 -79666 -70514 -77128 -84375 -91347 -113129 -146596 -164946 -155116 -135219 -123332
6502a23332J1291K3068K5765R053j3511k8861l4561k6678n019J2314Q379j820
$$ -123332 -112041 -88973 -63208 -54155 -67666 -96527 -131088 -157766 -162785 -150471 -142092 -143912
6490a43912Q299K8860K3374j0874l3033j9805K824N916o05M276J3517Q492o295
$$ -143912 -135613 -106753 -83379 -94253 -127286 -147091 -144267 -138351 -138956 -134680 -121163 -112671 -118966
6477a18966j1575l357O313R038M955l184r617p760N28O685P646N116k817j3425
$$ -118966 -130541 -133898 -127585 -118547 -113592 -116776 -126393 -134153 -133625 -126940 -119294 -114178 -116995 -130420
6463a30420j2321L067P434j3172k4596O108M1666K0072l7495m5099J0481M1861
$$ -130420 -142741 -139674 -132240 -145412 -170008 -163900 -122234 -102162 -139657 -184756 -174275 -132414
6451a32414L873l1289j171L5912M009n1223l5318L2874N1762O391j5553K0134
$$ -132414 -128541 -159830 -161001 -125089 -121080 -172303 -207621 -174747 -122985 -116594 -132147 -112013
6439a12013M1092P29m1492k2786K1882K1988k1642n0393l3558O153L1143K2460
$$ -112013 -70921 -70192 -111684 -134470 -112588 -90600 -112242 -162635 -196193 -190040 -158897 -136437
6427a36437p467k1302J511K7873J1452l2151m1183l113K5722J0924j2337p551
$$ -136437 -143904 -165206 -163695 -135822 -124370 -156521 -197704 -200817 -175095 -164171 -176508 -184059
6415a84059Q576J2476J6126K5437J2439k8085m7376j5342K5081K5388N063M668
$$ -184059 -175483 -163007 -146881 -121444 -109005 -137090 -184466 -199808 -174727 -149339 -144276 -139608
6403a39608J3168J635j3360l871R574l078j8776n018J0532j1174l7180j3264L0481
$$ -139608 -126440 -124805 -138165 -142036 -132462 -135540 -154316 -159334 -148802 -159976 -197156 -210420 -179939
6390a79939K1229k5874k4419L4476N9307P293m6851l2744J5103L1099J6597N266
$$ -179939 -158710 -184584 -209003 -174527 -115220 -107927 -154778 -187522 -172419 -141320 -124723 -119457
6378a19457o129k9450l7134m539L6196L9630J3973l541p547j4386k0782j8288
$$ -119457 -125586 -155036 -192170 -196709 -160513 -120883 -106910 -110451 -117998 -132384 -153166 -171454
6366a71454j9763k7877j1560L6737N8578P736o0730n5226J6367N7492K7280j1368
$$ -171454 -191217 -219094 -230654 -193917 -135339 -127603 -188333 -243559 -227192 -169700 -142420 -153788
6354a53788m796J3668k176k9226k1560J0090K3425J5598J2134R018j4586l9082
$$ -153788 -158584 -144916 -147092 -176318 -197878 -187788 -164363 -148765 -136631 -127613 -142199 -181281
6342a81281k2705K2231L3636m426k9967J363M2424K5573l1217n1186j3391K5272
$$ -181281 -203986 -181755 -148119 -152545 -182512 -181149 -138725 -113152 -144369 -195555 -208946 -183674
6330a83674K2993M281J683M334n405j2355k631K868j1047j6874P290K7748P000
$$ -183674 -160681 -156400 -154717 -150383 -155788 -168143 -170774 -167906 -178953 -195827 -188537 -160789 -153789
6317a53789k5357j6449J8482K0369j0884j7607J0853J9264j0394k2122J3210M0440
$$ -153789 -179146 -195595 -177113 -156744 -167628 -185235 -174382 -155118 -165512 -187634 -174424 -133984
6305a33984J4034k1988j1590J6308L818k8784j6906L2931M8287P120l0511j9181
$$ -133984 -119950 -141938 -153528 -137220 -133402 -162186 -179092 -146161 -97874 -90754 -121265 -140446
6293a40446J1295J5437j694q715j027K094o333j2812m976J0786J4001m313k1312
$$ -140446 -129151 -113714 -115408 -124123 -125150 -123056 -129389 -142201 -147177 -136391 -122390 -126703 -148015
6280a48015o048K9191L1329j8282o4358m9671K603K5825P357o631P076K1402J5128
$$ -148015 -154063 -124872 -93543 -111825 -176183 -225854 -223251 -197426 -190069 -196700 -189624 -168222 -153094
6267a53094J133r673k2222k5414K427M2057L9440j3708n3818l0503K3334M2212
$$ -153094 -151961 -161634 -183856 -209270 -206843 -164786 -125346 -139054 -192872 -223375 -200041 -157829
6255a57829J6289j0701j1098j443n948k1069k2937m75K3832J5460k1533l4720
$$ -157829 -141540 -152241 -163339 -164782 -170730 -191799 -214736 -215211 -191379 -175919 -197452 -232172
6243b32172Q063N8896M5191k1871n3366q925M4272L0884k6573m8646j1746L2187
$$ -232172 -224109 -165213 -120022 -141893 -195259 -204184 -159912 -129028 -155601 -204247 -215993 -183806
6231a83806L4357K370k5311k6367q712O985J1939J4582J8669J0021j5723k9192
$$ -183806 -149449 -147079 -172390 -198757 -207469 -200484 -188545 -173963 -155294 -145273 -160996 -190188
6219a90188o331K2338R978k6648k7172R781J7830k2864m2027P041O3733N1450
$$ -190188 -196519 -174181 -164203 -190851 -218023 -208242 -190412 -213276 -255303 -248262 -184529 -133079
6207a33079o796l4839j9786p157j2034j0131J712M708M839J9739L2362J5125j4685
$$ -133079 -139875 -174714 -194500 -201657 -213691 -223822 -222110 -217402 -212563 -192824 -160462 -145337 -160022
6194a60022j9937o202j981Q53K2608L6337P393k9002j4284K4872J0698m7219n4766
$$ -160022 -179959 -186161 -188142 -187289 -164681 -128344 -120951 -149953 -164237 -139365 -128667 -175886 -230652
6181b30652J0112N3573J6282l5476k5426J5944K0284n754j2946p1K656k81J0764
$$ -230652 -220540 -166967 -150685 -186161 -211587 -195643 -175359 -181113 -194059 -194130 -191474 -191755 -180991
6168a80991J8463j05j9868o907J6883R912j4129j2194Q095L213k3197k2644J2228
$$ -180991 -162528 -162633 -182501 -189408 -172525 -162613 -176742 -188936 -180841 -177628 -200825 -223469 -211241
6155b11241L1506J0623j1013K493K6276J6890k0589m1090k0934J5150K7006N153
$$ -211241 -179735 -169112 -180125 -177632 -151356 -134466 -155055 -196145 -217079 -201929 -174923 -169770
6143a69770k1176k0291M963K5794K6412J4303n298l4483n6617m1646O073L9952
$$ -169770 -190946 -211237 -206274 -180480 -154068 -139765 -145063 -179546 -236163 -277809 -271736 -231784
6131b31784L2379R887M369O980k92o838l035p659k4835j6939K8683N1326K514
$$ -231784 -199405 -189518 -185149 -178169 -178461 -185299 -188334 -195993 -220828 -237767 -209084 -157758 -155244
6118a55244n9030m1337L5981O4724J1424l9822k5065J2123R614j6371j7234M112
$$ -155244 -214274 -255611 -219630 -154906 -143482 -183304 -208369 -196246 -186632 -203003 -220237 -216125
6106b16125J3518R887J4604K2434J0880j5837k9549j6272J2572L5681L2886o12
$$ -216125 -202607 -192720 -178116 -155682 -144802 -160639 -190188 -206460 -193888 -158207 -125321 -125933
6094a25933l6334l2811R443L9314K0915j9271l4357j9269k264L530P350J2618
$$ -125933 -162267 -195078 -185635 -146321 -125406 -144677 -179034 -198303 -200567 -197037 -189687 -177069
6082a77069J1995N282m25n009j2869j9873j6363j539J2628J1551n770j7366J979
$$ -177069 -165074 -159792 -160217 -165226 -178095 -197968 -214331 -215870 -203242 -191691 -197461 -214827 -212848
6069b12848L9400M3719o304n6634m3641J3582M2426K5513J0427J3012m570m1878
$$ -212848 -173448 -129729 -136033 -192667 -236308 -222726 -180300 -154787 -144360 -131348 -135918 -177796
6057a77796l7963J8616M7091K311l9097r45N8917L9136l6242n6669l682L1422
$$ -177796 -215759 -197143 -150052 -147741 -186838 -187783 -128866 -89730 -125972 -182641 -186323 -154901
6045a54901N071k2148o431J0459p835k5310p516J3783L431j2960j776J5849Q498
$$ -154901 -149830 -171978 -178409 -167950 -175785 -201095 -208611 -194828 -191397 -204357 -206133 -190284 -181786
6032a81786n780L85O397j4498l2590n477M1344M5093L537k4402j4016n032k3693
$$ -181786 -187566 -187181 -180784 -195282 -227872 -233349 -192005 -146912 -143375 -167777 -181793 -186825 -210518
6019b10518l5052l474M3154M9032P223l5264l9990j4456J2788K7841L1380K1047
$$ -210518 -245570 -249044 -205890 -156858 -149635 -184899 -224889 -239345 -226557 -198716 -167336 -146289
6007a46289n529l2934l3674j881L1634L2852N570j7231j7338o408J123N740P500
$$ -146289 -151818 -184752 -218426 -220307 -188673 -155821 -150251 -167482 -184820 -191228 -190105 -184365 -176865
5994a76865k644k2042k6485r69L1488L3234J039k6828j6824J9080L8152J8535
$$ -176865 -179509 -201551 -228036 -229005 -197517 -164283 -163244 -190072 -206896 -187816 -149664 -131129
5982a31129j4930k2986j534J7713J5022O463Q946Q530j1427l2431k5768j692N009
$$ -131129 -146059 -169045 -170579 -152866 -137844 -131381 -122435 -113905 -125332 -157763 -183531 -185223 -180214
5969a80214q426j2771k436n079k6552l1419K352M6457O1383M2083P217k5555l7130
$$ -180214 -188640 -201411 -203847 -208926 -235478 -266897 -264545 -218088 -156705 -114622 -107405 -132960 -170090
5956a70090j4649J9107J9924j3551k9619k417K4288Q179k1607j4380J8631K7435
$$ -170090 -184739 -165632 -145708 -159259 -188878 -191295 -167007 -158828 -180435 -194815 -176184 -148749
5944a48749N059j2357j2020j3717j9588q981J5794K5819J1008r635k1887k4095
$$ -148749 -143690 -156047 -168067 -181784 -201372 -210353 -194559 -168740 -157732 -167367 -189254 -213349
5932b13349q763K2871L7791R267l0487k7242J1756K8601P217q766K147O656j4965
$$ -213349 -222112 -199241 -161450 -152183 -182670 -209912 -198156 -169555 -162338 -171104 -168957 -162301 -177266
5919a77266l1428j8860L93O947J7051L3909K3177k2382m7634j3320L7071M1341
$$ -177266 -208694 -227554 -227161 -220214 -203163 -169254 -146077 -168459 -216093 -229413 -192342 -151001
5907a51001Q793r321m028l243r554m604L470n122j5076o8K1236J0965j8632k2027
$$ -151001 -142208 -151529 -155557 -158800 -168354 -172958 -169488 -174610 -189686 -189754 -168518 -157553 -176185 -198212
5893a98212K029J2718K638M245J8637Q630k4173k6826J5327M3428J5330k8162
$$ -198212 -196183 -183465 -180827 -176582 -157945 -149315 -173488 -200314 -184987 -141559 -126229 -154391
5881a54391l0644l349P944j382m248J930r42j0349r503p53L383O454J2988Q526
$$ -154391 -185035 -188384 -180440 -181822 -186070 -184140 -185082 -195431 -204934 -205687 -202304 -195850 -182862 -174336
5867a74336j0580j2927K0622N0305K8345k3131m0504j1697J7593K1738J6120M125
$$ -174336 -184916 -197843 -177221 -126916 -98571 -121702 -162206 -173903 -156310 -134572 -118452 -114327
5855a14327k6516m9424j8734L9927M0348k8670o4893n670O4186L9865l7461m8209
$$ -114327 -140843 -190267 -209001 -169074 -128726 -157396 -222289 -227959 -163773 -123908 -161369 -209578
5843b09578J6254N2297J7730j7150o204M600j5522j8614J8271K7504l0492p2133
$$ -209578 -193324 -141027 -123297 -140447 -146651 -142051 -157573 -176187 -157916 -130412 -160904 -233037
5831b33037j6055O7296N3239l4818n7372J8382O9769J9450m7915l2104K9118L9495
$$ -233037 -249092 -181796 -128557 -163375 -220747 -202365 -132596 -113146 -161061 -193165 -164047 -124552
5819a24552j726k2504n925R52j6727k3325n142J0899J2268J3601J3620l927k5195
$$ -124552 -126278 -148782 -154707 -153755 -170482 -193807 -198949 -188050 -175782 -162181 -148561 -152488 -177683
5806a77683j8573N633O073j4661j0265K2067K5792j5953l6977R064O4597N0528
$$ -177683 -196256 -190623 -184550 -199211 -209476 -187409 -161617 -177570 -214547 -205483 -140886 -90358
5794i0358j3477m4382k2487l365j2774j1453K0823L9732R863l2041l1931K014
$$ -90358 -103835 -148217 -170704 -174069 -186843 -198296 -177473 -137741 -127878 -159919 -191850 -189836
5782a89836K1935J6298J3124J9810J1237j7622l2357j0502K0723K1808n637k7569
$$ -189836 -167901 -151603 -138479 -118669 -107432 -125054 -157411 -167913 -147190 -125382 -131019 -158588
5770a58588k5832j2750l990k65L738J0611K1508L1114K2868j1827m8899m8797
$$ -158588 -184420 -197170 -201160 -201425 -197687 -187076 -165568 -134454 -111586 -123413 -172312 -221109
5758b21109o447L6397M0453J2553j3597k2141k1130j7396q087P405K4133L6287
$$ -221109 -227556 -191159 -150706 -138153 -151750 -173891 -195021 -212417 -220504 -213099 -188966 -152679
5746a52679L4445R624k5677l6600q446K4569K1664n725j3332M675P873k0480m0634
$$ -152679 -118234 -108610 -134287 -170887 -179333 -154764 -133100 -138825 -152157 -147482 -139609 -160089 -200723
5733b00723j5644L1244M8283K2919j1052k2118j2224l129q123j7809j1352J2588
$$ -200723 -216367 -185123 -136840 -113921 -124973 -147091 -159315 -162444 -170567 -188376 -199728 -187140
5721a87140K3494k063l5805k6763K2411N0931K6773p791n796J3682O450k1469
$$ -187140 -163646 -165709 -201514 -228277 -205866 -154935 -128162 -135953 -141749 -128067 -121617 -143086
5709a43086l0571j4886L93R800K2246K1025j0788l5957l030N8909O0899j3226
$$ -143086 -173657 -188543 -188150 -178350 -156104 -135079 -145867 -181824 -184854 -125945 -65046 -78272
5697g8272p0382l9850K6963L9207o661m3955l8976j1681K0380N2290N9268J8105
$$ -78272 -148654 -188504 -161541 -122334 -128995 -172950 -211926 -223607 -203227 -150937 -91669 -73564
5685g3564m0300n6470k3726P699J0678R072J6357P648k2298l0623N395L9277K2051
$$ -73564 -113864 -170334 -194060 -186361 -175683 -166611 -150254 -142606 -164904 -195527 -190132 -150855 -128804
5672a28804j9426k5435K290J1400q554j1884J7889L3541K394l4312k2438K1400
$$ -128804 -148230 -173665 -171375 -159975 -168529 -180413 -162524 -128983 -126589 -160901 -183339 -161939
5660a61939L6426Q136j8643j3375J582k430j4792r947Q422J4833J811j1663q782
$$ -161939 -125513 -117377 -136020 -149395 -147813 -150243 -165035 -174982 -166560 -151727 -149916 -161579 -170361
5647a70361N174J2745L988j4001k1520m384K5930L7184J2393k4167l1690l231
$$ -170361 -165187 -152442 -148454 -162455 -183975 -188359 -162429 -125245 -112852 -137019 -168709 -171940
5635a71940K4331J6954j3486k6183n231K1331K1279J376o023P167J2667q871l3987
$$ -171940 -147609 -130655 -144141 -170324 -175555 -154224 -132945 -131569 -137592 -130425 -117758 -126629 -160616
5622a60616k8548K209K3068J9609Q462M98r610j3410Q834M0375K8773l4247p6295
$$ -160616 -189164 -186955 -163887 -144278 -135816 -135318 -144928 -158338 -149504 -109129 -80356 -114603 -190898
5609a90898l5022M5942P0119K0597k5539j5267J4714J1101j5479k1095k98J5180
$$ -190898 -225920 -179978 -109859 -89262 -114801 -130068 -115354 -104253 -119732 -140827 -141125 -125945
5597a25945Q455p965j8721j9194r430N465J4573J3473Q580K582p767j2759N820
$$ -125945 -117490 -125455 -144176 -163370 -172800 -167335 -152762 -139289 -130709 -128127 -135894 -148653 -142833
5584a42833L7287L8245r017n8769n4498l362L5141K6495m836j7245l3K5030L1347
$$ -142833 -105546 -67301 -76318 -135087 -189585 -192947 -157806 -131311 -136147 -153392 -153425 -128395 -97048
5571i7048J1694j5583k5064j3402j108j118k583N067J2603R648K365k453q942
$$ -97048 -85354 -100937 -126001 -139403 -140511 -141629 -144212 -139145 -126542 -116894 -114529 -116982 -125924
5558a25924j3767m324R251j893k7463j4373M0892N5038k1361r8948n9968N7279
$$ -125924 -139691 -144015 -134764 -136657 -164120 -178493 -137601 -82563 -103924 -202872 -262840 -205561
5546b05561R8222J6829n9798k7221M9089N1784j2471m6870j8643J5848J5392j008
$$ -205561 -107339 -90510 -150308 -177529 -128440 -76656 -89127 -135997 -154640 -138792 -123400 -124408
5534a24408q789j0231q442J91N256n117j4828j681J9159J5021q436j5224J485
$$ -124408 -133197 -143428 -151870 -151679 -146423 -151540 -166368 -168049 -148890 -133869 -142305 -157529 -156044
5521a56044J2658N292l188m345q889j3359m83K0382J7318r620k2496p367M278
$$ -156044 -143386 -138094 -141282 -145627 -154516 -167875 -168358 -147976 -130658 -140278 -162774 -170141 -165863
5508a65863m889n239K3311M6220K6015j4938k8260j1406J103P63Q260K0317P089
$$ -165863 -170752 -175991 -152680 -106460 -80445 -95383 -123643 -135049 -133946 -133183 -124923 -104606 -97517
5495i7517k8475l8207O87M1855L0602j7484l9153j3132J6894J3968p31P270K3587
$$ -97517 -125992 -164199 -163512 -121657 -91055 -108539 -147692 -160824 -143930 -129962 -130693 -123423 -99836
5482i9836R784k4907k7688J4758M6066K0141k8164l4184L02J4263j6287m3668
$$ -99836 -90052 -114959 -142647 -127889 -81823 -61682 -89846 -124030 -123728 -109465 -125752 -169420
5470a69420k3230K3092M3952K6712j586j9067k2935j1374J5923M0537L5643O15
$$ -169420 -192650 -169558 -125606 -98894 -100480 -119547 -142482 -153856 -137933 -97396 -61753 -61138
5458f1138l2201l3972j1698M612N11q258j658J4297J6108J76q157N484J5409p375
$$ -61138 -93339 -127311 -139009 -134397 -133886 -142144 -143802 -129505 -113397 -113221 -121378 -115894 -100485 -107860
5444a07860m1164l3431K1454O2360L8702k2245n2870k9712J0576K7428J5429r322
$$ -107860 -149024 -182455 -161001 -98641 -59939 -82184 -135054 -164766 -154190 -126762 -111333 -120655
5432a20655k8797k3573J5216N9855N8487k248o4723o1529k790L3373M695l9032
$$ -120655 -149452 -173025 -157809 -97954 -39467 -41715 -106438 -167967 -170757 -137384 -132689 -171721
5420a71721k9424K3010M9327K4192p647j0137l017q612p555J4119K3205m294k7363
$$ -171721 -201145 -178135 -128808 -104616 -112263 -122400 -125417 -134029 -141584 -127465 -104260 -108554 -135917
5407a35917k247L5238K3320j7637j7923J6305J2075l3178l6398K0996M5211j0818
$$ -135917 -138164 -102926 -79606 -97243 -115166 -98861 -86786 -119964 -156362 -135366 -90155 -100973
5395a00973n4060m030O1485K8515o0810p2548O611O1878L9934O597N839l505l6747
$$ -100973 -155033 -159063 -97578 -69063 -129873 -202421 -195810 -133932 -93998 -87401 -81562 -85067 -121814
5382a21814l4480K1045N0331M726m4954k4220K4010K0456j7817k1399O978J1888
$$ -121814 -156294 -135249 -84918 -80192 -125146 -149366 -125356 -104900 -122717 -144116 -137138 -125250
5370a25250n660J175K4528J0974l2960l9519N669L6183J3828j5634p476J3530
$$ -125250 -130910 -129735 -105207 -94233 -127193 -166712 -161043 -124860 -111032 -126666 -134142 -120612
5358a20612J0193l294m95N917p23k31J9838K1176k4978o9253m4175K7799N8926
$$ -120612 -110419 -113713 -114208 -108291 -109014 -109245 -89407 -68231 -93209 -162462 -206637 -178838 -119912
5345a19912K2745j8100j8228o973j3247p954K9183M8424M806m9947l2254L8559
$$ -119912 -97167 -115267 -133495 -140468 -153715 -161669 -132486 -84062 -79256 -129203 -161457 -122898
5333a22898N9540ln2439k8681K2964K5597q225j6111N597J0740p069j1458J802
$$ -122898 -63358 -63361 -115800 -144481 -121517 -95920 -104145 -120256 -114659 -103919 -110988 -122446 -120644
5320a20644L93j5272q223K2668L2756P524j3927q338n32o194l769J1703Q671j7488
$$ -120644 -120251 -135523 -143746 -121078 -88322 -80798 -94725 -103063 -103595 -109789 -113558 -101855 -93184 -110672
5306a10672k3766L809J8748n17o231K4985L1811k4294o6038j3315P0108O1266
$$ -110672 -134438 -130629 -111881 -112398 -118629 -93644 -61833 -86127 -152165 -165480 -95372 -34106
5294c4106k7303o7510j9267K2172N8j8238K0270N1919J1785m4813l2071K2427
$$ -34106 -61409 -128919 -148186 -126014 -125956 -144194 -123924 -72005 -60220 -105033 -137104 -114677
5282a14677K6885k1051l5142J3462M8665J1132m7939m1263K8475P1228L1407l9556
$$ -114677 -87792 -108843 -143985 -130523 -81858 -70726 -118665 -159928 -131453 -60225 -28818 -68374
5270f8374n5327j0223K3282Q383o071K1141M3319L547n4765m5278J7538L6293
$$ -68374 -123701 -133924 -110642 -102259 -108330 -87189 -43870 -40323 -95088 -140366 -122828 -86535
5258h6535q977l1439Q533L6779K180l1756n267K8602M778l2052j2723K3843L216
$$ -86535 -95512 -126951 -118418 -81639 -79459 -111215 -116482 -87880 -83102 -115154 -127877 -104034 -100818
5245a00818l8525j4306M8091M2610k8479n1236P253M6611P714l5301j3780K4135
$$ -100818 -139343 -153649 -105558 -62948 -91427 -142663 -135410 -88799 -81085 -116386 -130166 -106031
5233a06031J4068j2942k571J8880N12l3123k3863K0022M2778K9174O654j2708
$$ -106031 -91963 -104905 -107476 -88596 -88084 -121207 -145070 -125048 -82270 -53096 -46442 -59150
5221e9150l1258l2210m459K1269J2588j1482j4931m092l439l557J1844J7909j0862
$$ -59150 -90408 -122618 -127077 -105808 -93220 -104702 -119633 -123725 -127164 -130721 -118877 -100968 -111830
5208a11830l9013j6114L5778N0132J7911q919p503m630q417N368K9691K1892j8903
$$ -111830 -150843 -166957 -131179 -81047 -63136 -72055 -79558 -84188 -92605 -87237 -57546 -35654 -54557
5195e4557l7556r872J9778J5820M269J2199J3300j8578m9419l3629R822K4485
$$ -54557 -92113 -101985 -82207 -66387 -62118 -49919 -36619 -55197 -104616 -138245 -128423 -103938
5183a03938M8k1473j3662N500J2608R685Q618R525M359r100k1216j6967N743K5397
$$ -103938 -103890 -125363 -139025 -133525 -120917 -111232 -102614 -93089 -88730 -97830 -119046 -136013 -130270 -104873
5169a04873J9366k528q859N606J1676m470j6148j246J8605J3161o978j0261L785
$$ -104873 -85507 -88035 -96894 -91288 -79612 -84082 -100230 -101476 -82871 -69710 -76688 -86949 -83164
5156h3164Q453l891j3998j0764l448P48M719P065L837L618J6012K6410J0811k1420
$$ -83164 -74711 -78602 -92600 -103364 -106812 -106064 -101345 -94280 -90443 -86825 -70813 -44403 -33592 -55012
5142e5012l0672l424K3743J4493j7275l1692j9379m010K610J3845L1770L0671
$$ -55012 -85684 -89108 -65365 -50872 -68147 -99839 -119218 -123228 -120618 -106773 -75003 -44332
5130d4332k285l3618k1939K0302L8294R994k5854k9243j0685M59N782J9153K4699
$$ -44332 -46617 -80235 -102174 -81872 -43578 -33584 -59438 -88681 -99366 -98907 -93125 -73972 -49273
5117d9273P77k9639k5054L940O383k3608l3565J01L2383K4627K299J364R266K744
$$ -49273 -48496 -78135 -103189 -99249 -92866 -116474 -150039 -149938 -117555 -92928 -90629 -89265 -79999 -77255
5103g7255l585M964K847k3979l2041R186M5020J2728m5226l8546K2569M1770l731
$$ -77255 -80840 -75876 -73029 -97008 -129049 -119863 -74843 -62115 -107341 -145887 -123318 -81548 -85279
5090h5279l0464L497L0464j025l5155j1246K8952J8460j7471j1423K6310L0561
$$ -85279 -115743 -112246 -81782 -82807 -117962 -129208 -100256 -81796 -99267 -110690 -84380 -53819
5078e3819m872k5486j3556l985q026M20J9934J6799o434p429J7911K2524p545
$$ -53819 -58691 -84177 -97733 -101718 -109744 -109324 -89390 -72591 -79025 -86454 -68543 -46019 -53564
5065e3564k4167j229J7621m258k9716r725L2245L5780m070l6213l0971p675R175
$$ -53564 -77731 -78960 -61339 -65597 -95313 -105038 -72793 -37013 -41083 -77296 -108267 -115942 -106767
5052a06767J6488J4445K43j4253r403J0745J8881K529j9780k6237j6042o7J4268
$$ -106767 -90279 -75834 -75591 -89844 -99247 -88502 -69621 -67092 -86872 -113109 -129151 -129218 -114950
5039a14950K0754J2735n805j7457q819J4258L3004L2592J2164j4696k8568k1147
$$ -114950 -94196 -81461 -87266 -104723 -113542 -99284 -66280 -33688 -21524 -36220 -64788 -85935
5027h5935m946J532j891J314J5696K0899j049l4456m3042j5276J8935K5456P576
$$ -85935 -90881 -89349 -91240 -89926 -74230 -53331 -54380 -88836 -131878 -147154 -128219 -102763 -95187
5014i5187m423J798P906k13q670r60J2332J1305R12J294J1903J4272P122O291
$$ -95187 -99610 -97812 -89906 -90119 -98789 -99749 -87417 -76112 -75200 -73906 -62003 -47731 -40609 -34318
5000c4318Q561p091l3012k9225J2105L8790R916l8235m2650o256J3369k694j2048
$$ -34318 -25757 -32848 -65860 -95085 -82980 -44190 -34274 -72509 -115159 -121415 -108046 -110740 -122788
4987a22788J0957L1502J4424j6995j9295L870J3321k251j4337l974J1770J1388
$$ -122788 -111831 -80329 -65905 -82900 -102195 -98325 -85004 -87255 -101592 -105566 -93796 -82408
4975h2408J187L45R110J0687K83o012K645J1365M12k0855k3150k062J2730M845
$$ -82408 -81221 -80876 -71766 -61079 -60796 -66808 -64163 -52798 -52386 -73241 -96391 -98453 -85723 -80878
4961h0878j504J3700K3126m913m0705k6543K7823M7115L923l5054j3210K5387
$$ -80878 -82382 -68682 -45556 -50469 -91174 -117717 -89894 -42779 -38856 -73910 -87120 -61733
4949f1733R121m1043m1754J9032N9516K6956k7416k9175J5874M2943K2110j4188
$$ -61733 -52612 -93655 -135409 -116377 -56861 -29905 -57321 -86496 -70622 -27679 -5569 -19757
4937a9757k6536j4333k583n463j2811p515Q647J3870k152j6953n685J5849R941
$$ -19757 -46293 -60626 -63209 -68672 -81483 -88998 -80351 -66481 -68633 -85586 -91271 -75422 -65481
4924f5481k1297l2188m440J9338J364k7999j4980L2025N1471J8581k1574k1374
$$ -65481 -86778 -118966 -123406 -104068 -102704 -130703 -145683 -113658 -62187 -43606 -65180 -86554
4912h6554P505K0324J875k1129j9611M382K3008J4160j2530k4117m241K3100K3741
$$ -86554 -79049 -58725 -56850 -77979 -97590 -93208 -70200 -56040 -68570 -92687 -96928 -73828 -50087
4899e0087Q42r915O406K0868L052l3243m6062j8490K2144L7990K1126m354j4604
$$ -50087 -49245 -59160 -52754 -31886 -28834 -62077 -108139 -126629 -104485 -66495 -45369 -49723 -64327
4886f4327j1700j2264j6983q550J4992K6537Q790j1406J447L1979K9633j3981
$$ -64327 -76027 -88291 -105274 -113824 -98832 -72295 -63505 -74911 -73464 -41485 -11852 -25833
4874b5833m6646l0459N415J4787K261K036J4014Q837j2707j4344J4620L4835J3033
$$ -25833 -72479 -102938 -97523 -82736 -80475 -78439 -64425 -55588 -68295 -82639 -68019 -33184 -20151
4861b0151k6545l2278O370M3274K9876k5715o2650l6006K4349M5099N138l2857
$$ -20151 -46696 -78974 -72604 -29330 546 -25169 -87819 -123825 -99476 -54377 -49239 -82096
4849h2096j2196L1386K4102k6291l6669J9910O5206L3167l0450m2405n571J2269
$$ -82096 -94292 -62906 -38804 -65095 -101764 -81854 -16648 16519 -13931 -56336 -61907 -49638
4837d9638p703k0887q554k958j4408p047K8148M2474Q387k7884j8669Q898M261
$$ -49638 -57341 -78228 -86782 -89740 -104148 -111195 -83047 -40573 -32186 -60070 -78739 -69841 -65580
4824f5580j8004o649L2541M2185P330k3808k1801j5192k6782k8223P080M9538
$$ -65580 -83584 -90233 -57692 -15507 -8177 -31985 -53786 -68978 -95760 -123983 -116903 -67365
4812f7365N2160J5423k1648l2970j8833Q444K3738R78m2021m1690K5718Q7201
$$ -67365 -15205 218 -21430 -54400 -73233 -64789 -41051 -40073 -82094 -123784 -98066 -10865
4800a0865N9085l0513p3703l1248K5700L2788J2843P192J074k7602m3963j0300
$$ -10865 48220 17707 -55996 -87244 -61544 -28756 -15913 -8721 -7647 -35249 -79212 -89512
4788h9512L4321K4093k4725l2946J6076M7580J0942m3524m1233J1162M3316J9305
$$ -89512 -55191 -31098 -55823 -88769 -72693 -25113 -14171 -57695 -98928 -87766 -44450 -25145
4776b5145k4875l6516q484K0421J5842r710j3473J5701L4556P721l1131k4767
$$ -25145 -50020 -86536 -95020 -74599 -58757 -68467 -81940 -66239 -31683 -23962 -55093 -79860
4764g9860J4783J9400k4968n0056j3005L4811L2173K260Q87J7767M477k8698k5879
$$ -79860 -65077 -45677 -70645 -120701 -133706 -98895 -66722 -64462 -63575 -45808 -41331 -70029 -95908
4751i5908J5210L7257J9259J710M673k322k6229k3820J4435K8184j3911m7600
$$ -95908 -80698 -43441 -24182 -22472 -17799 -20121 -46350 -70170 -55735 -27551 -41462 -89062
$$ [...]
##END NTUPLES=NMR SPECTRUM
##END=
