##TITLE=1H ikalashn
CA-9304-2
11.12.2024
##JCAMPDX= 6.0         $$ Bruker NMR JCAMP-DX V2.0
##DATA TYPE= NMR SPECTRUM
##DATA CLASS= NTUPLES
##ORIGIN= UXNMR, Bruker Analytische Messtechnik GmbH
##OWNER= root
$$ TOPSPIN		Version 1.3
$$ 2024-12-11 11:13:22.609 +0400  Irina@DPX200
$$ Compression mode = diff/dup
##.OBSERVE FREQUENCY= 200.131300845
##.OBSERVE NUCLEUS= ^1H
##.ACQUISITION MODE= SIMULTANEOUS
##.ACQUISITION SCHEME= undefined
##.AVERAGES= 8
##.DIGITISER RES= 18
##SPECTROMETER/DATA SYSTEM= spect
##.PULSE SEQUENCE= zg
##.SOLVENT NAME= CDCl3
##.SHIFT REFERENCE= INTERNAL, CDCl3, 1, 17.49637
##AUDIT TRAIL= $$ (NUMBER, WHEN, WHO, WHERE, WHAT)
$$ ##TITLE= Audit trail, TOPSPIN		Version 1.3
$$ ##JCAMPDX= 5.01
$$ ##ORIGIN= Bruker BioSpin GmbH
$$ ##OWNER= Irina
$$ $$ F:/spectra/data/iren/nmr/1H/4/pdata/1/auditp.txt
$$ ##AUDIT TRAIL=  $$ (NUMBER, WHEN, WHO, WHERE, VERSION, WHAT)
(   1,<2024-12-11 11:12:52.531 +0400>,<Irina>,<DPX200>,<TOPSPIN 1.3>,
      <created by zg
	started at 2024-12-11 11:12:14.687 +0400,
	POWCHK disabled, PULCHK disabled
       configuration hash MD5:
       BE 6D 3F 07 2A EA 11 49 91 17 2B D3 AF B3 58 0D
       data hash MD5: 16K
       F1 34 13 2A D4 B8 05 92 FC 50 D9 44 80 E3 46 34>)
(   2,<2024-12-11 11:12:55.015 +0400>,<Irina>,<DPX200>,<TOPSPIN 1.3>,
      <Start of raw data processing
       fp BC_mod = 2 FT_mod = 6 PKNL = 1 PHC0 = 140.3902 PHC1 = -14.48437 SI = 32K 
       data hash MD5: 32K
       0A 6F 65 51 EB 5E AD 1F DA 2A FE C6 85 61 B3 5C>)
(   3,<2024-12-11 11:12:57.187 +0400>,<Irina>,<DPX200>,<TOPSPIN 1.3>,
      <apk 
       data hash MD5: 32K
       42 46 47 47 55 94 FA 8B 9D 41 58 F1 5F BF 8A DD>)
(   4,<2024-12-11 11:13:12.609 +0400>,<Irina>,<DPX200>,<TOPSPIN 1.3>,
      <abs n ABSG = 5 
       data hash MD5: 32K
       DD D5 97 1F 60 9C 01 4D 14 DC E9 42 DA D3 83 A3>)
$$ ##END=
$$ 
$$ $$ hash MD5
$$ $$ C3 DE 7C 45 13 26 FF E0 5C 3C 25 FF C7 1D E0 D7
##$RELAX= 
##$RELAX= 
##$RELAX= 
##$RELAX= 
##$RELAX= 
##$RELAX= 
##$RELAX= 
##$RELAX= 
##$RELAX= 
$$ Bruker specific parameters
$$ --------------------------
##$DU= <F:/spectra>
##$EXPNO= 4
##$NAME= <1H>
##$PROCNO= 1
##$TYPE= <nmr>
##$USER= <iren>
##$AMP= (0..31)
100 100 100 100 100 100 100 100 100 100 100 100 100 100 100 100 100 100 
100 100 100 100 100 100 100 100 100 100 100 100 100 100 
##$ANAVPT= -1
##$AQSEQ= 0
##$AQ_mod= 1
##$AUNM= <au_zg>
##$AUTOPOS= <>
##$BF1= 200.13
##$BF2= 200.13
##$BF3= 200.13
##$BF4= 200.13
##$BF5= 200.13
##$BF6= 200.13
##$BF7= 200.13
##$BF8= 200.13
##$BYTORDA= 1
##$CFDGTYP= 0
##$CFRGTYP= 5
##$CHEMSTR= <none>
##$CNST= (0..63)
1 1 145 1 1 1 1 1 1 1 1 1 1 1 1 1 1 1 1 1 1 1 1 1 1 1 1 1 1 1 1 1 1 1 
1 1 1 1 1 1 1 1 1 1 1 1 1 1 1 1 1 1 1 1 1 1 1 1 1 1 1 1 1 1 
##$CPDPRG= <>
##$CPDPRG1= <>
##$CPDPRG2= <>
##$CPDPRG3= <>
##$CPDPRG4= <mlev>
##$CPDPRG5= <mlev>
##$CPDPRG6= <mlev>
##$CPDPRG7= <mlev>
##$CPDPRG8= <mlev>
##$CPDPRGB= <>
##$CPDPRGT= <>
##$D= (0..63)
0 2 0 0 0 0 0 0 0 0.06 0 0.03 0 0 0 0 0.0002 0 0 0 0 0 0 0 0 0 0 0 0 0 
$$ [...]
##$SW_h= 4401.40845070422
##$TD= 16384
##$TD0= 1
##$TE= 300
##$TE2= 300
##$TE3= 300
##$TEG= 300
##$TL= (0..7)
0 120 120 120 120 120 120 120 
##$TP= (0..7)
150 150 150 150 150 150 150 150 
##$TP07= 0
##$TPNAME0= <>
##$TPNAME1= <>
##$TPNAME2= <>
##$TPNAME3= <>
##$TPNAME4= <>
##$TPNAME5= <>
##$TPNAME6= <>
##$TPNAME7= <>
##$TPOAL= (0..7)
0.5 0.5 0.5 0.5 0.5 0.5 0.5 0.5 
##$TPOFFS= (0..7)
0 0 0 0 0 0 0 0 
##$TUNHIN= 0
##$TUNHOUT= 0
##$TUNXOUT= 0
##$USERA1= <user>
##$USERA2= <user>
##$USERA3= <user>
##$USERA4= <user>
##$USERA5= <user>
##$V9= 5
##$VALIST= <valist>
##$VCLIST= <CCCCCCCCCCCCCCC>
##$VD= 0
##$VDLIST= <DDDDDDDDDDDDDDD>
##$VPLIST= <PPPPPPPPPPPPPPP>
##$VTLIST= <TTTTTTTTTTTTTTT>
##$WBST= 1024
##$WBSW= 25
##$XGAIN= (0..3)
0 0 0 0 
##$XL= 0
##$YL= 0
##$YMAX_a= 282318
##$YMIN_a= -644278
##$ZGOPTNS= <>
##$ZL1= 120
##$ZL2= 120
##$ZL3= 120
##$ZL4= 120
##$ABSF1= 17.49637
##$ABSF2= -4.496376
##$ABSG= 5
##$ABSL= 3
##$ALPHA= 0
##$AQORDER= 0
##$ASSFAC= 0
##$ASSFACI= 0
##$ASSFACX= 0
##$ASSWID= 0
##$AUNMP= <proc_1d>
##$AXLEFT= 0
##$AXRIGHT= 0
##$AXTYPE= 0
##$AXUNIT= <>
##$AZFE= 0.1
##$AZFW= 0.1
##$BCFW= 0
##$BC_mod= 2
##$BYTORDP= 0
##$COROFFS= 0
##$CY= 7568.61572265625
##$DATMOD= 1
##$DC= 0
##$DFILT= <>
##$DTYPP= 0
##$F1P= 17.9538593292236
##$F2P= -4.03888763876832
##$FCOR= 0.5
##$FTSIZE= 32768
##$FT_mod= 6
##$GAMMA= 0
##$GB= 0
##$INTBC= 0
##$INTSCL= 5.656564e-011
##$ISEN= 128
##$LB= 0
##$LEV0= 0
##$LPBIN= 0
##$MAXI= 945.577
##$MC2= 0
##$MEAN= 0
##$ME_mod= 0
##$MI= -402.1523
##$NCOEF= 0
##$NC_proc= -7
##$NLEV= 6
##$NOISF1= 8.587773
##$NOISF2= 6.764455
##$NSP= 0
##$NTH_PI= 0
##$NZP= 0
##$OFFSET= 17.49637
##$PC= 1
##$PHC0= 341.3103
##$PHC1= -13.36521
##$PH_mod= 1
##$PKNL= yes
##$PPARMOD= 0
##$PPDIAG= 0
##$PPIPTYP= 0
##$PPMPNUM= 100
##$PPRESOL= 1
##$PSCAL= 0
##$PSIGN= 0
##$REVERSE= no
##$SF= 200.13
##$SI= 32768
##$SIGF1= 16.12182
##$SIGF2= -4.496377
##$SINO= 3.521527
##$SIOLD= 32768
##$SREGLST= <1H.CDCl3>
##$SSB= 0
##$STSI= 32768
##$STSR= 0
##$SW_p= 4401.40845070422
##$SYMM= 0
##$S_DEV= 0
##$TDeff= 16384
##$TDoff= 0
##$TI= <>
##$TILT= no
##$TM1= 0
##$TM2= 0
##$TOPLEV= 0
##$USERP1= <user>
##$USERP2= <user>
##$USERP3= <user>
##$USERP4= <user>
##$USERP5= <user>
##$WDW= 0
##$XDIM= 32768
##$YMAX_p= 508471387
##$YMIN_p= -1060631
$$ End of Bruker specific parameters
$$ ---------------------------------
##NTUPLES= NMR SPECTRUM
##VAR_NAME=  FREQUENCY,     SPECTRUM/REAL,   SPECTRUM/IMAG
##SYMBOL=    X,             R,               I
##VAR_TYPE=  INDEPENDENT,   DEPENDENT,       DEPENDENT
##VAR_FORM=  AFFN,          ASDF,            ASDF
##VAR_DIM=   32768,         32768,           32768
##UNITS=     HZ,            ARBITRARY UNITS, ARBITRARY UNITS
##FACTOR=    0.134324425510551, 1,           1
##FIRST=     4401.40845070422, 450268,       -2992375
##LAST=      0,             -341250,         -2892798
##MIN=       0,             -1060631,        0
##MAX=       4401.40845070422, 508471387,    0
$$ Real data points
##PAGE= N=1
##DATA TABLE= (X++(R..R)), XYDATA
$$ [...]
14159 411234 140577 -147398 -144664 93067 206789 28040 -186058 -130710 109330 209133
14149 209133 85361 -28851 24826 124542 121937 78135 122105 231701 287822 241389 122592
14138 122592 -22409 -119512 -90950 28561 102579 89154 99329 179794 195199 54363 -100287
14127 -100287 -99533 -14235 -17981 -86858 -63181 42539 56062 -59970 -137936 -76244 15014 -758
14115 -758 -108734 -203290 -201206 -66615 150743 294934 265784 194794 278155 439150 400880
14104 400880 145325 15011 212102 463792 416447 150869 17220 93567 125905 -39789
14094 -39789 -264380 -370466 -335866 -197397 4721 139804 74779 -83511 -62467 169734
14084 169734 304750 132714 -140724 -192152 -9126 179133 248966 248282 231821 234682 309920
14073 309920 406506 336305 68212 -104437 39267 244670 129547 -189065 -257030 -27718
14063 -27718 63532 -156835 -313657 -144653 54512 -31170 -186997 -62752 227175 335469
14053 335469 247479 177349 125089 -18174 -125006 -47820 18271 -125218 -195258 138460 527042
14042 527042 357275 -195330 -327109 126335 433582 193091 -53678 161315 427600 256357
14032 256357 -23775 106566 400203 314560 15646 62042 374227 393327 111479 65143
14022 65143 334267 418669 198627 164471 472532 584794 198366 -198356 -153045 8865
14012 8865 -173263 -436831 -242287 260274 407085 42294 -264808 -76344 341812 471295
14002 471295 220544 -69091 -121218 -11063 38166 -185 50559 236661 332586 189377
13992 189377 37800 156710 376338 308134 10142 -62099 181014 288374 40277 -151327
13982 -151327 61060 360547 300193 29645 -19280 140619 185024 114149 188920 357070
13972 357070 299374 14423 -149215 -55967 81019 145752 247158 354291 258269 -213
13962 -213 -88227 96496 244286 134818 -32044 10252 216711 393616 476982 475823 373173
13951 373173 236512 206317 251984 176913 -23151 -85880 88706 230888 125755 -27949
13941 -27949 64008 333691 482468 410029 255304 134389 82478 160348 380024 576652
13931 576652 557338 350598 156991 96671 139495 224169 302121 303872 193118 39126 -48328
13920 -48328 -28997 67453 186441 255027 230816 181514 216572 317656 362740 328432 300385
13909 300385 271114 151117 25881 130999 459846 669609 541518 276132 142951 108501
13899 108501 54383 89087 311215 476490 288083 -100598 -252864 -60982 169050 227112
13889 227112 233572 316921 386619 343695 267208 257356 267112 206138 95900 38441 101046 260607
13877 260607 408548 432745 349202 290195 310873 328023 317627 381305 491558 415369 105808
13866 105808 -87932 91261 351265 278977 24235 60463 373518 456872 144690 -114836
13856 -114836 23752 310905 361766 196571 58937 30427 84305 244229 458394 561533
13846 561533 544257 597339 736926 706939 434626 226683 282795 381756 322656 287667 422391
13835 422391 451371 159370 -89162 153437 652057 791572 487708 214488 206933 233872
13825 233872 174506 230755 446802 539638 386614 241666 288469 382077 408058 493958 663212
13814 663212 679458 479031 377798 563352 741963 626140 441048 537652 763768 688904
13804 688904 309013 54172 128920 281332 283291 257837 390522 601982 685761 603746 500967
13793 500967 518000 666136 820670 817150 628208 424368 366870 401269 397337 409431 568025
13782 568025 751107 665319 322889 135569 362487 717421 770170 552633 461399 646080
13772 646080 823807 735285 499972 397544 499791 666735 769760 771928 683801 579640
13762 579640 588105 739028 882877 887892 837974 872252 907880 760716 526534 551549 924033
13751 924033 1266103 1224843 952685 838426 919380 893880 665753 513710 638101 853954
13741 853954 906437 849642 887158 1001424 998590 850254 751121 838534 1044239 1239020 1356794
13730 1356794 1353790 1215150 1051732 1029913 1136210 1171790 1074022 1064322 1311002 1601886 1600339
13719 1600339 1347729 1218116 1360635 1499164 1404940 1270744 1382282 1645951 1754477 1681709
13709 1681709 1655413 1690656 1545737 1205580 1021183 1192618 1447228 1477549 1413057 1543283
13699 1543283 1796355 1868205 1738458 1663312 1707686 1684323 1577491 1621919 1851693 1951526
13689 1951526 1750902 1541165 1645515 1929888 2035655 1915077 1821376 1875851 1959961 2001229
13679 2001229 2071436 2174917 2195878 2120351 2088298 2134174 2079024 1820978 1575522 1641212 2002259
13668 2002259 2345576 2455151 2416145 2393189 2380745 2295940 2197869 2225618 2349204 2382675 2283733
13657 2283733 2238155 2342268 2403267 2244879 2048581 2125782 2436008 2625533 2529042 2334875
13647 2334875 2222125 2151714 2110556 2231880 2491633 2587974 2378743 2186508 2354048 2687462
13637 2687462 2710032 2370229 2104309 2184156 2374141 2352596 2170654 2097477 2208575 2349381
13627 2349381 2416719 2472344 2573546 2643063 2582048 2440908 2375512 2431534 2481254 2439224 2425019
13616 2425019 2568407 2749963 2758372 2654910 2692017 2857372 2848641 2605814 2487183 2702481
13606 2702481 2941718 2875328 2681516 2684750 2773539 2656131 2458030 2516542 2731190 2707695
13596 2707695 2483549 2497209 2816623 3021443 2946527 2908474 3020442 2932539 2536212 2296766
13586 2296766 2494768 2714478 2562128 2368556 2610057 3069687 3212345 3058083 3008192 3050573
13576 3050573 2858444 2548527 2597781 2992260 3163019 2896154 2660879 2812127 3047334 2972826
13566 2972826 2737723 2726345 2953923 3140240 3167085 3136057 3105483 3035844 2927142 2833122
13556 2833122 2789895 2815833 2898789 2956617 2941511 2968903 3141842 3276459 3097898 2729493
13546 2729493 2624975 2908326 3163020 3068547 2868158 2918858 3112534 3116437 2943874 2876822
13536 2876822 2968484 3021357 2985372 3009088 3124941 3221967 3318484 3522343 3701076 3550193
13526 3550193 3094162 2800573 3018582 3536257 3882389 3886861 3737369 3608034 3473577 3288268
13516 3288268 3159869 3247078 3534161 3786311 3771982 3525647 3334584 3424311 3706307 3902815
13506 3902815 3876668 3743497 3681378 3745125 3887911 4059262 4216503 4297213 4256746 4136863
13496 4136863 4055106 4088988 4168936 4138881 3971661 3863234 3995772 4238207 4263581 4009309
13486 4009309 3821599 4011699 4433034 4680430 4592926 4359129 4205711 4198107 4309703 4471758
13476 4471758 4554311 4484812 4383346 4400892 4453216 4348618 4174652 4260498 4664203 4992315
13466 4992315 4919948 4656442 4641032 4928374 5162768 5108418 4926377 4879331 4982905 5065699
13456 5065699 5043956 4997841 5009128 5034990 4988803 4904350 4936997 5154528 5388496 5408939 5246007
13445 5246007 5199684 5465291 5868790 6077103 5978436 5732585 5525725 5434084 5484517 5659084
13435 5659084 5820106 5811141 5697339 5739408 6024002 6276887 6210957 5944281 5845920 6009836
13425 6009836 6149627 6075692 6004418 6205428 6544742 6658575 6493097 6365436 6470752 6625066
13415 6625066 6610721 6523888 6591205 6817177 7020811 7108846 7120852 7096040 7082257 7185800 7408564
13404 7408564 7525056 7362997 7138292 7222588 7593224 7833563 7736692 7583571 7682250 7925906
13394 7925906 8020477 7924365 7822757 7827241 7931311 8133176 8375265 8473695 8343110 8203523
13384 8203523 8324506 8632703 8819190 8782420 8701229 8700826 8736783 8817785 9029321 9268830 9275123
13373 9275123 9051200 8950260 9150902 9346527 9233983 9049267 9232954 9715759 9982751
13364 9982751 9840129 9679897 9859305 10201822 10339376 10249353 10167407 10184141 10242489 10387216
13354 10387216 10676275 10918909 10855733 10601500 10565641 10873848 11204522 11306867 11333312 11470587
13344 11470587 11580404 11497038 11408032 11580576 11896730 12041699 12029138 12135256 12373347 12462131
13334 12462131 12339474 12294011 12496446 12778780 12994419 13218718 13437005 13426194 13180715 13091498
13324 13091498 13399112 13784297 13850996 13744664 13884221 14277419 14546719 14538030 14475770 14536543
13314 14536543 14660222 14804694 15028072 15265387 15353515 15349762 15515748 15895457 16211186 16300996
13304 16300996 16371176 16639922 16972314 17089600 16987457 16931380 17103996 17422379 17694822 17857742
13294 17857742 18024018 18298797 18579612 18655206 18551638 18598616 18991753 19472559 19693561 19735026
13284 19735026 19923289 20266008 20494009 20611979 20915699 21403962 21684521 21635537 21672950 22095925
13274 22095925 22605763 22810450 22830518 23021925 23404862 23767328 24086607 24449661 24764720
13265 24764720 24940378 25155122 25562003 25937418 26055327 26194633 26747884 27477537 27774243
13256 27774243 27631040 27718279 28361963 29055537 29260350 29182205 29376034 29946600 30556314 31002821
13246 31002821 31388617 31808084 32200535 32526043 32868392 33322875 33894456 34517417 35113846
13237 35113846 35644687 36134153 36627188 37137604 37674311 38261993 38871584 39424216 39956855
13228 39956855 40638546 41474010 42187370 42644652 43175854 44108467 45165064 45822362 46177181
13219 46177181 46855432 48009590 49056643 49634800 50189332 51214077 52444908 53323694 53881786
13210 53881786 54611953 55705246 56929122 58098797 59200110 60175966 61036798 62071075
13202 62071075 63507398 65061420 66258483 67127946 68122388 69408003 70732416 71994805
13194 71994805 73413847 75020750 76487171 77663338 78872037 80420318 82149219 83721807
13186 83721807 85097630 86475574 87960548 89504468 91042526 92529654 93948879 95365519
13178 95365519 96847486 98313665 99644355 100930845 102358134 103843338 105123989 106247362
13170 106247362 107571691 109149889 110538111 111459707 112269160 113428503 114846596 116116569
13162 116116569 117158046 118218154 119405472 120619763 121839716 123123397 124405878 125622946
13154 125622946 126940369 128522908 130176325 131597617 132904064 134483348 136335334 138038623
13146 138038623 139457436 141000398 142963469 145041467 146819814 148436851 150360405 152675229
13138 152675229 154989767 157014639 158887497 160868438 163001867 165212171 167511472 169900913
13130 169900913 172179922 174105511 175759635 177527841 179588162 181606834 183154568 184293980
13122 184293980 185447773 186722163 187748094 188306796 188714444 189310012 189891333 190056186 189884002
13113 189884002 189815168 189947842 189930710 189568905 189083584 188673960 188239013 187692354 187180642
13104 187180642 186788600 186349334 185759539 185188722 184761301 184329258 183801633 183390768 183229113
13095 183229113 183036753 182550291 182042909 181974598 182278724 182469141 182390307 182374065 182619748 182900575
13085 182900575 183039549 183265584 183850979 184681023 185433959 185995941 186481892 186990111 187524069
13076 187524069 188048031 188470946 188676476 188687264 188683570 188747987 188725130 188457924 188015961 187528374
13066 187528374 186919892 186010089 184799067 183466691 182126136 180736379 179229494 177586131
13058 177586131 175811853 173951404 172074468 170140976 167980901 165562590 163165508 161061681
13050 161061681 159114453 156980157 154666925 152534230 150668816 148648018 146150442 143497356
13042 143497356 141261188 139514233 137811695 135843145 133759669 131836623 130116061 128483870
13034 128483870 126880407 125314584 123812028 122427526 121179490 119930189 118498288 116952338
13026 116952338 115603071 114595043 113680537 112539568 111173134 109821670 108629143 107565816
13018 107565816 106569291 105566794 104442667 103175831 101932589 100827422 99678430 98236461
13010 98236461 96592997 95086052 93815257 92534248 91053743 89468123 87914884 86387836
13002 86387836 84891942 83515831 82216359 80781064 79155836 77570246 76178714 74830346
12994 74830346 73378844 71943753 70622852 69230140 67641795 66143684 65027615 64036827
12986 64036827 62690313 61059795 59705618 58818580 57937807 56662946 55191657 53922578
12978 53922578 52900280 51933378 50976374 50094958 49243293 48341616 47443731 46622218 45819381
12969 45819381 44986803 44218069 43560383 42857663 41986042 41094996 40396700 39851267 39281109
12960 39281109 38657782 38030914 37314518 36446298 35662866 35270207 35151136 34837661 34132898
12951 34132898 33356906 32861893 32571186 32172626 31576991 30983582 30583700 30361246 30155066
12942 30155066 29819651 29344427 28866015 28531339 28323053 28070136 27651692 27130647 26661480
12933 26661480 26326318 26094633 25893487 25672559 25415714 25120745 24794573 24487500 24291574
12924 24291574 24221619 24116044 23788345 23297692 22905177 22703823 22491427 22124217 21770401
12915 21770401 21617046 21540815 21339667 21106741 21038188 21010775 20752150 20359016 20194379 20252174
12905 20252174 20106383 19621527 19237693 19294547 19482373 19314212 18835055 18465304 18341387
12896 18341387 18223818 17972760 17731588 17620165 17547578 17403080 17228286 17120823 17085927 17032914
12886 17032914 16866881 16595496 16368332 16331216 16407117 16346161 16050943 15702546 15491163 15400861
12876 15400861 15355354 15362727 15375396 15229374 14902667 14619592 14510076 14408548 14211098 14138375
12866 14138375 14326415 14446022 14153556 13692180 13549126 13670396 13570609 13163671 12895552
12857 12895552 12991133 13133397 13042408 12856540 12732584 12549602 12272878 12175004 12382820 12576870
12847 12576870 12465900 12228466 12147577 12116800 11884648 11535351 11336132 11298868 11263857 11247932
12837 11247932 11334651 11366799 11145525 10840572 10804920 11018364 11091804 10839006 10506965 10385991
12827 10385991 10470479 10566152 10512015 10263938 9946991 9809512 9930174 10026474 9791849 9362607
12817 9362607 9163470 9318106 9527826 9549549 9462400 9385762 9257102 9039154 8887249 8927312
12807 8927312 9040905 9026066 8852213 8651978 8563710 8637266 8783897 8803262 8596773 8340975
12797 8340975 8271510 8323871 8229666 7965991 7812908 7902335 8015722 7953245 7817825 7768928
12787 7768928 7755752 7688196 7640252 7670167 7638849 7428246 7171701 7057685 7063791 7084466 7144179
12776 7144179 7255715 7246549 7003840 6753454 6793827 7040884 7139213 6976859 6789919 6758653
12766 6758653 6782928 6706318 6535466 6380165 6342399 6470821 6658426 6627916 6245480 5818963
12756 5818963 5802076 6176675 6434097 6261635 5936236 5859561 5985695 5986387 5794272 5649423
12746 5649423 5666581 5677270 5558969 5458768 5542593 5690853 5640094 5371235 5164447 5224804
12736 5224804 5404283 5413279 5221939 5085545 5171921 5335057 5342536 5195102 5081730 5090281 5123853
12725 5123853 5097979 5069199 5109293 5155283 5082815 4901446 4785338 4864574 5032051 5051213 4873905
12714 4873905 4731137 4808944 4952722 4886336 4650886 4548383 4635973 4607563 4314199 4074414
12704 4074414 4208483 4528213 4627425 4492263 4432379 4510681 4474462 4261163 4146223 4271443
12694 4271443 4398802 4320697 4202981 4278148 4440546 4433380 4284668 4249772 4367911 4370082 4099863
12683 4099863 3803276 3830668 4145640 4334048 4141866 3819146 3764084 3955992 4028362 3882477
12673 3882477 3850564 4108169 4314502 4141563 3832369 3817089 4026034 4077733 3966429 3988303
12663 3988303 4080856 3887782 3507361 3479600 3863414 4032284 3693864 3421328 3709094 4131556
12653 4131556 4057318 3689561 3663250 3956971 4001404 3703880 3571213 3802582 3984159 3829355
12643 3829355 3604286 3595737 3666399 3601224 3491836 3506972 3584995 3594086 3568951 3604970 3707047
12632 3707047 3858671 4040539 4109421 3901825 3539494 3373207 3521733 3720589 3737999 3679235
12622 3679235 3730527 3833798 3798811 3591184 3368957 3319123 3497863 3734488 3745225 3503492
12612 3503492 3379141 3647437 4006950 3981022 3682196 3642854 3899174 3887499 3413831 3061986
12602 3061986 3289973 3712994 3762988 3570769 3621693 3894153 3955780 3708453 3466258 3406897
12592 3406897 3441929 3535866 3694288 3732998 3514618 3313349 3464844 3746879 3647373 3217396
12582 3217396 3071547 3457862 3898714 3943947 3760712 3697963 3709275 3569045 3351415 3317974
12572 3317974 3495925 3671217 3706587 3644756 3569317 3527368 3528507 3518717 3437184 3355933 3429213
12561 3429213 3636351 3735713 3581726 3349267 3314687 3502070 3658763 3545335 3195848 2906122
12551 2906122 2941958 3225447 3402315 3298689 3155406 3249121 3469863 3541354 3490788 3540573
12541 3540573 3651344 3597033 3437545 3444381 3550722 3397131 3016315 2918475 3286535 3615970
12531 3615970 3460795 3068488 2915025 3025332 3146872 3223888 3282899 3186806 2937084 2901121
12521 2901121 3281998 3672527 3631014 3390147 3425161 3605502 3454818 3062617 2981267 3267411
12511 3267411 3390690 3163537 3006843 3113245 3086192 2721473 2472987 2717260 3121574 3222906
12501 3222906 3154490 3266853 3423591 3268757 2932352 2864164 3087725 3174769 2935761 2643663
12491 2643663 2533655 2518128 2496949 2578753 2836695 3107409 3188248 3072306 2892732 2758296
12481 2758296 2693061 2640375 2529732 2422073 2497733 2760477 2897082 2673222 2342596 2328895
12471 2328895 2569436 2589910 2271856 2086384 2368072 2774415 2802139 2528868 2419692 2578379
12461 2578379 2657557 2483224 2316202 2375382 2475229 2358175 2124470 2061581 2196132 2289645
12451 2289645 2226550 2155150 2215385 2330970 2358163 2302196 2273606 2300285 2294568 2204540 2121187
12440 2121187 2183239 2378731 2502332 2390534 2179633 2182986 2450479 2631797 2452696 2163211
12430 2163211 2210246 2535547 2593884 2155443 1691935 1728249 2140717 2434409 2464235 2460257
12420 2460257 2482160 2331443 2022613 1894088 2106513 2378866 2408828 2280963 2253426 2354819
12410 2354819 2410286 2325639 2158538 2008860 1980851 2150511 2438749 2610472 2518604 2272584
12400 2272584 2084585 2047419 2132743 2282324 2412554 2442225 2392387 2352800 2318616 2215134
12390 2215134 2105599 2156509 2341545 2430491 2357066 2317137 2389543 2390106 2274941 2315513 2601622
12379 2601622 2744658 2451837 2064552 2069096 2349999 2454784 2377159 2466621 2686070 2637464
12369 2637464 2342170 2312959 2696017 2980562 2820192 2557697 2581362 2678935 2482339 2152402
12359 2152402 2115655 2374653 2560867 2529144 2479304 2563679 2721899 2858116 2908477 2797957
12349 2797957 2564039 2426922 2514519 2644297 2608252 2515041 2576832 2720069 2733567 2670606
12339 2670606 2741645 2894972 2886140 2727968 2686929 2820607 2894100 2808064 2748702 2826434 2909805
12328 2909805 2928865 3004761 3134172 3083205 2797546 2609553 2777742 3070294 3099797 2887382
12318 2887382 2782295 2929916 3124686 3159691 3060607 2953589 2900978 2900099 2903381 2835921 2713995
12307 2713995 2707486 2927650 3192098 3208450 3000325 2912872 3107652 3289053 3126271 2777195
12297 2777195 2712537 3058256 3402428 3344025 2994505 2755392 2764696 2811268 2735356 2647457 2699885
12286 2699885 2856389 2992798 3072557 3115447 3116773 3097373 3116623 3144320 3055206 2856529 2762462
12275 2762462 2895167 3072668 3085138 3027947 3113153 3273771 3261997 3091657 3058499 3282946
12265 3282946 3518847 3503284 3268341 3020436 2907650 2978471 3180218 3328752 3260110 3067575
12255 3067575 3006359 3131561 3247287 3248725 3254685 3329434 3349814 3259933 3187083 3177638 3100138
12244 3100138 2958352 2989299 3246785 3402249 3225552 2972457 2982353 3157813 3201163 3130753
12234 3130753 3154815 3220786 3135135 3001588 3074490 3251768 3200019 2972595 3001822 3400448
12224 3400448 3746228 3706648 3451199 3264868 3153301 3054107 3074514 3249556 3362611 3276284
12214 3276284 3183949 3273943 3399783 3371327 3335553 3530553 3834176 3912355 3721196 3531747
12204 3531747 3499258 3506276 3432032 3323922 3277470 3335760 3505600 3710664 3771270 3612598 3440375
12193 3440375 3501792 3713898 3763061 3562937 3365791 3379901 3509319 3556815 3490168 3397575
12183 3397575 3323726 3260774 3208573 3166602 3138749 3180111 3342734 3546172 3620853 3531497 3439794
12172 3439794 3470130 3517598 3394535 3108086 2878804 2879458 3029285 3089886 2949328 2757419
12162 2757419 2730878 2863485 2944530 2877664 2819802 2906264 2999457 2896085 2678079 2624122 2800541
12151 2800541 2967349 2917375 2713810 2546421 2523561 2652016 2856319 2967033 2854180 2629896
12141 2629896 2557251 2702069 2852653 2855355 2827631 2914157 3017156 2945501 2712773 2519221
12131 2519221 2508224 2662654 2866119 2963427 2851042 2610749 2459861 2477305 2499289 2391585
12121 2391585 2280262 2362479 2613116 2844305 2951050 2938389 2817815 2652219 2594616 2697444
12111 2697444 2793714 2756120 2730421 2869498 2989275 2819954 2503427 2453305 2726939 2928345
12101 2928345 2801098 2541804 2407331 2377392 2383791 2527234 2817876 2986493 2838769 2581823
12091 2581823 2520948 2616346 2623197 2508990 2426136 2392230 2318633 2285346 2461031 2756451 2859562
12080 2859562 2666760 2433405 2420820 2583188 2682655 2584637 2384932 2316934 2514812 2805202
12070 2805202 2836916 2531012 2244159 2290573 2479347 2424274 2171462 2128647 2418813 2720594
12060 2720594 2782938 2688608 2533487 2275585 2037809 2113443 2452517 2575127 2281156 2023255
12050 2023255 2205883 2518364 2447691 2123339 2066531 2302973 2362568 2106248 1924647 2039091
12040 2039091 2181888 2138902 2091622 2181824 2193748 1967466 1745629 1779448 1908469 1880157
12030 1880157 1811930 1944836 2143846 2072301 1766257 1621217 1808084 2064434 2127002 2057845
12020 2057845 2022575 1995849 1862236 1667258 1594755 1725845 1923282 1976359 1836282 1678645
12010 1678645 1695662 1850501 1935674 1880910 1852454 1978536 2139181 2158563 2066104 2003574 1988696
11999 1988696 1954279 1929298 1985242 2071615 2097370 2109728 2190156 2241337 2110830 1879925 1776133
11988 1776133 1820549 1832906 1787685 1859903 2058273 2129311 1962516 1809894 1913322 2142315
11978 2142315 2218414 2121599 2043368 2061377 2090910 2088165 2093417 2102947 2072173 2037001 2090235 2230918
11966 2230918 2340100 2314309 2162903 1989688 1919958 2008421 2186324 2343148 2457270 2556623
11956 2556623 2570095 2386148 2092326 1960209 2099919 2311064 2387121 2376203 2395788 2387221
11946 2387221 2253328 2077958 1994408 1973926 1957022 2042057 2290378 2486861 2399170 2179577
11936 2179577 2181912 2430457 2610372 2574838 2504968 2517840 2471289 2278942 2109959 2116780 2216290
11925 2216290 2293888 2390759 2529151 2576635 2470443 2385474 2481719 2637318 2623233 2420397
11915 2420397 2190986 2045685 2001020 2066235 2216421 2358520 2444164 2524429 2600977 2564354
11905 2564354 2398747 2287643 2360172 2483580 2483659 2426681 2482967 2638620 2758023 2821220 2871042
11894 2871042 2820457 2563106 2222723 2057099 2141560 2345775 2566307 2766132 2851285 2761200
11884 2761200 2642515 2679811 2792540 2772774 2678324 2751016 2940186 2900126 2568657 2361209
11874 2361209 2576534 2933447 2979136 2718469 2527376 2596927 2780391 2922563 3041994 3163142
11864 3163142 3197566 3076295 2880699 2771386 2820688 2929392 2917731 2747263 2626638 2774390
11854 2774390 3079800 3186477 2973299 2743757 2808838 3074634 3223906 3150331 3005269 2928541
11844 2928541 2943043 3034112 3137859 3122712 2962831 2844112 2913300 3031801 3000946 2914080
11834 2914080 2997834 3181528 3161235 2892946 2691210 2776507 3020103 3214772 3313780 3312537
11824 3312537 3184734 3051259 3119173 3314929 3288405 2962282 2747577 2951025 3278227 3272715
11814 3272715 2997023 2864457 2963599 3006849 2887179 2831582 2963002 3112134 3151713 3159757
11804 3159757 3146703 2972892 2684749 2595720 2830499 3080072 3036680 2815280 2701107 2722139
11794 2722139 2750479 2807625 2940097 2962162 2693330 2358505 2372813 2745353 3052421 3034958
11784 3034958 2886388 2869822 2960466 2991879 2902109 2713824 2496302 2440490 2713454 3120181
11774 3120181 3193215 2793453 2349057 2279151 2448334 2474994 2337279 2308587 2449168 2556152
11764 2556152 2551160 2542026 2519899 2365407 2178961 2231698 2506459 2645757 2490781 2335769
11754 2335769 2457684 2693475 2724812 2542679 2365443 2272688 2182572 2073955 2003682 1996218
11744 1996218 2087868 2340438 2632401 2635442 2260579 1934938 2083179 2471476 2495049 2073737
11734 2073737 1778906 1973614 2301839 2279777 1999777 1881859 1990641 2028160 1897427 1847641
11724 1847641 2016270 2182131 2121435 1953653 1931868 2049271 2084327 1974312 1906769 1997617
11714 1997617 2087796 2000960 1857120 1905910 2093702 2069994 1712149 1384694 1461423 1777010
11704 1777010 1862707 1644784 1539139 1791695 2093624 2067757 1852197 1868865 2153745 2293586
11694 2293586 2054222 1738536 1754465 2048886 2209546 2039722 1780064 1721646 1812297 1796679
11684 1796679 1625807 1520203 1635663 1862108 2015116 2052885 1998616 1819221 1553605 1427151
11674 1427151 1614084 1956229 2142081 2114919 2061884 2042606 1933936 1764333 1762731 1960509
11664 1960509 2064548 1904261 1713612 1742464 1855699 1803111 1663910 1687359 1847429 1913894
11654 1913894 1878481 1947654 2129112 2169822 1957003 1697787 1627208 1757841 1962675 2101236
11644 2101236 2047294 1810000 1634898 1748635 2004678 2058324 1903818 1899280 2176508 2391295
11634 2391295 2247383 1948039 1866238 2008477 2096138 2016698 1907261 1877884 1900198 1931306
11624 1931306 1959439 1956966 1921501 1907774 1917128 1858136 1728510 1700931 1880855 2108352 2163406
11613 2163406 2049210 1913839 1825129 1793396 1865109 1994600 1983023 1776707 1657793 1856364
11603 1856364 2136334 2116364 1877212 1835834 2067305 2205452 2062068 1893233 1914459 1968967
11593 1968967 1886279 1806936 1895969 2036223 2076285 2118587 2275167 2373301 2219555 1968018
11583 1968018 1901764 1999951 2048660 2042760 2114127 2165465 1994187 1759545 1880686 2373775 2705072
11572 2705072 2503211 2075697 1949099 2157777 2314764 2233607 2122981 2174964 2268862 2194276
11562 2194276 1979347 1849111 1926103 2089653 2142530 2055029 1988964 2075444 2236438 2300287
11552 2300287 2245958 2196951 2171281 2022821 1729519 1569998 1821415 2360661 2763419 2779126
11542 2779126 2535014 2285497 2156578 2160502 2254178 2307609 2200872 2043021 2100447 2387307
11532 2387307 2544635 2322424 1982847 1952715 2223282 2424330 2408744 2381597 2444158 2418623
11522 2418623 2241656 2149612 2274415 2394556 2335449 2297515 2470035 2608233 2399086 2037692
11512 2037692 1980266 2242085 2423276 2391395 2425780 2620148 2659853 2389242 2152301 2286125
11502 2286125 2619521 2770827 2667443 2483238 2311361 2198958 2280828 2555214 2711460 2509145
11492 2509145 2174972 2098090 2281436 2444242 2518715 2625649 2654609 2360374 1903003 1801634
11482 1801634 2201554 2610700 2581254 2289994 2172807 2290971 2396141 2412629 2478352 2586454
11472 2586454 2538890 2296377 2103023 2154650 2324390 2357566 2239869 2210542 2411480 2673918
11462 2673918 2750478 2653489 2580860 2545004 2345982 2004218 1916550 2325498 2864995 2990678
11452 2990678 2722214 2548817 2662408 2757599 2645653 2569138 2706149 2801139 2594474 2284498
11442 2284498 2224627 2406352 2565880 2601744 2576015 2485243 2345927 2343554 2576303 2798765
11432 2798765 2745216 2561699 2568391 2731795 2765314 2649337 2623307 2715163 2721870 2644613 2683487
11421 2683487 2776428 2640881 2360365 2392479 2800730 3020069 2708214 2334929 2477999 2932375
11411 2932375 3066437 2804675 2654204 2843923 3026910 2916267 2713562 2710430 2843653 2894009
11401 2894009 2868757 2930269 3095173 3229933 3271671 3275835 3274145 3220358 3082232 2906834 2785155
11390 2785155 2789593 2936560 3175706 3409538 3533407 3479184 3271673 3062006 3030830 3185787
11380 3185787 3313440 3232007 3045724 3015158 3192653 3354151 3336313 3267913 3344587 3508284
11370 3508284 3542536 3436572 3431033 3640132 3824678 3701976 3363208 3167069 3249410 3379957
11360 3379957 3366560 3353234 3543834 3828615 3944126 3888203 3877241 3933361 3844920 3585331
11350 3585331 3440275 3582299 3813382 3916217 3982509 4141784 4219521 4007825 3706574 3704828
11340 3704828 3992214 4180779 4119025 4082242 4249410 4380890 4242514 4041193 4121046 4408505
11330 4408505 4510232 4315076 4162307 4323440 4582100 4532964 4168963 3921972 4095043 4471327
11320 4471327 4635197 4536599 4490641 4648501 4769747 4640901 4453231 4523216 4810092 4999697
11310 4999697 4979906 4934351 4986656 5046809 5044343 5040142 5042561 4973807 4903448 5044064 5380817
11299 5380817 5566944 5383704 5091358 5089765 5380608 5611141 5567886 5397310 5353874 5502658
11289 5502658 5690779 5725234 5584665 5474957 5595568 5847168 5933983 5794083 5699471 5819706
11279 5819706 5946232 5853444 5693788 5749550 5970044 6079108 6027466 6001503 6044762 6012105
11269 6012105 5893678 5862484 5969260 6081323 6158237 6296425 6452160 6423262 6195154 6026267
11259 6026267 6087438 6273591 6456895 6640117 6760308 6669059 6466883 6519070 6909875 7199190
11249 7199190 7014108 6604277 6472296 6690854 6963990 7161292 7349768 7427080 7214210 6892728
11239 6892728 6870500 7150094 7286429 7092056 6925534 7066828 7245039 7116843 6858036 6862840
11229 6862840 7093931 7185776 7072310 7051505 7234380 7367302 7298263 7236181 7370645 7548830
11219 7548830 7560752 7502597 7589428 7773934 7833557 7742205 7681627 7727922 7795550 7887669 8118503
11208 8118503 8421985 8511090 8272048 7982091 7950812 8113772 8196007 8152312 8187639 8384225
11198 8384225 8567832 8589065 8531270 8552684 8670450 8794589 8870671 8903124 8912294 8937431 9024174
11187 9024174 9160796 9280490 9353256 9410787 9468325 9511462 9576803 9732328 9940033 10061838
11177 10061838 10063442 10086869 10235804 10413636 10489315 10510980 10605673 10746105 10787717 10711496 10672688
11166 10672688 10791982 11015360 11204464 11277802 11244670 11173627 11149828 11217505 11352180 11499481
11156 11499481 11606226 11605086 11459300 11275782 11267266 11501895 11780455 11878622 11819304 11760726
11146 11760726 11711795 11567105 11380015 11358731 11550384 11737549 11735362 11631458 11629966 11772067
11136 11772067 11905204 11856931 11589144 11257946 11141091 11392944 11835388 12109315 12070313 11902923
11126 11902923 11807446 11755620 11659606 11603607 11722395 11950729 12090406 12092081 12092307 12161801 12183740
11115 12183740 12056725 11906390 11970355 12282759 12577786 12577736 12332078 12161518 12257047 12473282
11105 12473282 12589853 12615710 12676226 12747573 12751233 12813998 13110577 13463479 13471227 13127647 12941594
11094 12941594 13246011 13726115 13910393 13836087 13866230 14058305 14140006 14031284 13983904 14177784
11084 14177784 14505735 14805166 15022099 15101203 14990084 14827426 14878821 15194273 15536458 15716609
11074 15716609 15788655 15845030 15858204 15835572 15913404 16151858 16403285 16515013 16521620 16533590 16588434
11063 16588434 16711332 16952729 17244424 17386239 17319654 17265837 17440959 17769074 18031412 18171622
11053 18171622 18284176 18408850 18511844 18590082 18636894 18582617 18420797 18311301 18396272 18583606
11043 18583606 18676842 18660586 18690728 18845512 19049870 19220911 19340506 19401573 19412185 19432963
11033 19432963 19498668 19539174 19485564 19400828 19390423 19445048 19491182 19524971 19572791 19611074 19662308
11022 19662308 19850039 20179815 20397846 20306411 20111532 20171207 20466190 20641264 20556450 20457753
11012 20457753 20552706 20746896 20903168 21056142 21226286 21290259 21205447 21146650 21267006 21514035
11002 21514035 21795232 22101107 22348099 22366838 22213218 22226013 22572176 22987273 23186494 23267021
10992 23267021 23441689 23649959 23764849 23937076 24340354 24771111 24925194 24913411 25048086
10983 25048086 25258979 25250075 25154030 25415430 25980894 26256326 26056237 25957324 26383363 26936310
10973 26936310 27106639 27136522 27567220 28284746 28701988 28715344 28794029 29140082 29416936 29432998
10963 29432998 29501516 29875895 30312170 30508974 30610411 30925675 31418366 31819705 32063812
10954 32063812 32287168 32525166 32715003 32920370 33272252 33726040 34121155 34449251 34830485
10945 34830485 35249671 35561124 35764655 36035582 36432900 36802444 37053007 37326452 37769681
10936 37769681 38290814 38685069 38912640 39127188 39475164 39957284 40467556 40918863 41334482
10927 41334482 41803079 42318647 42746479 43050018 43441259 44092328 44771058 45082969 45104661
10918 45104661 45395364 46206389 47055288 47405871 47466591 47870139 48735523 49556090 49997629
10909 49997629 50305219 50800952 51424288 51992277 52559617 53242359 53939430 54506697 55023592
10900 55023592 55639100 56312301 56937473 57573831 58321240 59121330 59914451 60814564 61849541
10891 61849541 62720750 63190875 63569624 64374262 65566582 66608995 67309144 68088858 69252317
10882 69252317 70494483 71443464 72269743 73348395 74616189 75719479 76628829 77657158
10874 77657158 78930408 80246014 81467024 82707888 84077431 85524270 86993297 88495109
10866 88495109 89990823 91441647 92973605 94724841 96526839 98057700 99358994 100844607
10858 100844607 102683684 104548923 106175849 107807083 109780888 111976758 114034289 115911747
10850 115911747 117846902 119912932 122003016 124153571 126476618 128823419 130938640 132951174
10842 132951174 135270306 137926053 140470422 142687220 144939859 147552568 150270772 152710567
10834 152710567 155005046 157545181 160297281 162871660 165177737 167533765 170117334 172742913
10826 172742913 175264235 177805325 180455527 183074035 185570074 188092431 190752841 193402391
10818 193402391 195874903 198244761 200657948 203103049 205535770 208031012 210602403 213066561
10810 213066561 215328122 217615746 220151729 222746668 225058829 227153080 229426413 231998463
10802 231998463 234556184 236866879 239088295 241428157 243799659 246012872 248084026 250148340
10794 250148340 252226675 254266973 256286055 258288544 260152787 261783901 263312336 264966058
10786 264966058 266772437 268521894 270007170 271188671 272146455 272979571 273763335 274537397
10778 274537397 275311294 276074353 276765009 277258846 277486187 277554562 277623753 277653261 277442587 276953711
10768 276953711 276385285 275847827 275198260 274336096 273423775 272602522 271705842 270524491 269176225
10759 269176225 267891439 266564868 264898337 262943765 261107486 259555565 257973193 256046722
10751 256046722 253884853 251782944 249797538 247751360 245513030 243101415 240601383 238095578
10743 238095578 235622407 233148931 230643823 228151693 225678341 223070078 220210366 217278981
10735 217278981 214541563 211910861 209061230 205999269 203098931 200444562 197596850 194275381
10727 194275381 190858537 187840469 185133737 182331517 179376333 176487731 173636253 170617907
10719 170617907 167544006 164731429 162136517 159405554 156503763 153781670 151341226 148852601
10711 148852601 146150024 143505107 141084129 138620168 135942022 133394161 131318238 129448082
10703 129448082 127282481 124846567 122614908 120778261 119025540 117059109 114966112 113012620
10695 113012620 111324498 109824807 108302695 106546159 104585781 102772140 101412417 100372154
10687 100372154 99255843 97931571 96604861 95387999 94126114 92741366 91438257 90377541
10679 90377541 89383632 88220661 87004796 86060636 85416819 84725633 83747711 82682033 81857993
10670 81857993 81262210 80602654 79777364 78995704 78377791 77736510 76954954 76304760 76044069
10661 76044069 75884697 75321105 74433882 73826807 73667650 73381672 72598127 71837009 71732715
10652 71732715 71991707 71789244 70995746 70307414 70169151 70227389 70001305 69538991 69160215
10643 69160215 68970996 68889638 68836612 68694928 68365443 68011783 67946021 68141123 68205936 67990817
10633 67990817 67817648 67900997 67971377 67779548 67572605 67677428 67941007 68012317 67914642 67898138
10623 67898138 67944804 67876577 67785326 67897285 68138621 68283392 68413862 68756891 69148425 69180092
10613 69180092 68881864 68760968 69092459 69615699 70018155 70296785 70538440 70746052 71001984
10604 71001984 71433992 71919118 72189617 72305764 72613047 73155145 73605616 73903841 74415096
10595 74415096 75229571 75861225 76003404 76083620 76620567 77455452 78126746 78652551 79369604
10586 79369604 80235841 80884701 81269303 81726722 82433046 83238651 84025477 84834119 85655289
10577 85655289 86444630 87301992 88315635 89325995 90183282 91087470 92262632 93467123 94342467
10568 94342467 95108073 96279759 97742142 98823653 99415332 100275909 101918609 103856982
10560 103856982 105393471 106599488 107978866 109589162 111101019 112475214 114001764 115775778
10552 115775778 117612550 119419755 121246323 123021193 124633946 126247533 128165880 130380617
10544 130380617 132567415 134553235 136503691 138618327 140889899 143198746 145442206 147565111
10536 147565111 149640968 151888070 154424478 157077171 159628394 162135536 164759543 167417431
10528 167417431 169942993 172486056 175337145 178382954 181188095 183679516 186290259 189271758
10520 189271758 192306845 195046977 197631032 200343796 203091555 205614248 207993190 210530746
10512 210530746 213249965 215912880 218475675 221126083 223846077 226323571 228429478 230472516
10504 230472516 232783880 235266738 237579856 239628381 241628997 243735799 245844299 247825761
10496 247825761 249758106 251769401 253759905 255489526 256944342 258401648 260031717 261634886
10488 261634886 262969347 264173917 265553907 267011936 268087607 268658797 269202532 270099746
10480 270099746 271025372 271446368 271508220 271875584 272683076 273217018 272906877 272183388 271895498
10471 271895498 272115194 272064881 271231487 270028159 269125951 268542418 267788681 266682002 265514752
10462 265514752 264430715 263122568 261345907 259365242 257584407 255972585 254195514 252166970
10454 252166970 250102023 248078545 245921971 243570995 241221903 239002214 236784384 234448596
10446 234448596 232068471 229694295 227213075 224604415 222086930 219784965 217468865 214887184
10438 214887184 212170369 209610442 207190376 204666713 202029333 199515774 197167314 194710788
10430 194710788 191960172 189063161 186252246 183577515 180982954 178441056 175897444 173249593
10422 173249593 170491234 167748555 165098112 162482481 159859831 157272698 154697737 152008411
10414 152008411 149193416 146441056 143874660 141362377 138748264 136129598 133703167 131426233
10406 131426233 129051287 126481711 123900620 121514503 119316755 117156550 114927345 112619104
10398 112619104 110262963 107907918 105627596 103483673 101468728 99516071 97582261 95696080
10390 95696080 93895776 92138958 90339420 88506877 86774793 85237735 83818884 82358817
10382 82358817 80785120 79139678 77508522 75997352 74693915 73555011 72406826 71157686
10374 71157686 69909839 68740286 67518278 66141760 64814542 63802745 62998973 62056937
10366 62056937 60929508 59912490 59126876 58344444 57422965 56520807 55718532 54821340 53770696
10357 53770696 52878024 52348061 51903591 51226672 50462071 49885349 49355792 48575366 47678245
10348 47678245 47034845 46598139 46001346 45259487 44787201 44648578 44361984 43642105 42836404
10339 42836404 42361417 42125152 41806973 41355722 40886171 40374646 39797790 39340514 39121969
10330 39121969 38895450 38362954 37651104 37129044 36844907 36501298 35970702 35483940 35232101
10321 35232101 35070524 34759237 34303017 33896928 33644200 33469736 33269141 33025041 32760175
10312 32760175 32456138 32085976 31704811 31416243 31216343 30972577 30634089 30341362 30186318
10303 30186318 29993777 29571864 29083950 28860786 28868952 28726598 28299616 27893527 27721693 27589970
10293 27589970 27332173 27150886 27195758 27170603 26782258 26281388 26073362 26029163 25733307 25255225
10283 25255225 25049383 25124597 24972562 24436281 24010118 24019156 24074457 23728739 23213146 23052111
10273 23052111 23253705 23358749 23117426 22696198 22326332 22118385 22133184 22283847 22244734 21813519
10263 21813519 21303515 21193621 21409287 21378274 20873334 20361178 20313224 20549528 20573252 20277143
10253 20277143 19945985 19719921 19463406 19147500 18980989 19053493 19140211 19022825 18784097 18602692
10243 18602692 18447215 18209046 17999677 18022832 18193428 18181569 17874267 17518109 17320003 17186482
10233 17186482 17006895 16912846 17009956 17080647 16873819 16542512 16437350 16535806 16459003 16078456
10223 16078456 15732741 15725017 15921326 16011342 15910834 15727069 15539606 15399644 15371485 15405761
10213 15405761 15330359 15113283 14956499 14977069 15000550 14862123 14698235 14688556 14698822 14488736
10203 14488736 14145681 13979169 14044866 14095127 13988863 13844872 13762611 13673691 13528803 13387000
10193 13387000 13259053 13088685 12943753 12989594 13192181 13274505 13076101 12762321 12571178 12533195
10183 12533195 12546266 12548515 12499928 12360246 12207255 12216410 12394440 12492557 12332038 12069421
10173 12069421 11971100 12048991 12104595 12046626 11974713 11982027 12026301 11988696 11774805 11407731 11094314
10162 11094314 11100490 11445294 11805512 11849570 11588380 11278416 11082705 10985063 10945787 10948486
10152 10948486 10938878 10890416 10884549 10959123 10952850 10720380 10443513 10451373 10725308 10879319 10707165
10141 10707165 10454704 10404524 10463791 10383803 10172356 10020745 9967368 9918196 9912088 10065795
10131 10065795 10280252 10301404 10109946 9965059 9978492 9934906 9691679 9482643 9570135 9796237
10121 9796237 9799554 9575528 9475757 9652886 9847244 9818203 9678994 9628283 9604385 9447763
10111 9447763 9230517 9152294 9205921 9214995 9161889 9214815 9417877 9598742 9633429 9580640 9486893
10100 9486893 9289506 9032753 8961934 9207820 9521581 9542548 9264458 9032245 9085553 9287624
10090 9287624 9355008 9221514 9082014 9126134 9309243 9407867 9278222 9019591 8856117 8888987
10080 8888987 9018058 9085956 9028847 8895166 8792715 8812390 8929516 9001333 8948579 8890863
10070 8890863 8971442 9107411 9110193 9018363 9052058 9218667 9268054 9131100 9074726 9241455 9356688
10059 9356688 9165978 8886389 8878614 9078445 9139672 9004972 8930323 9012450 9099441 9157906 9320088
10048 9320088 9515075 9449674 9082550 8778668 8828396 9083320 9226322 9171492 9049774 8999123
10038 8999123 9096317 9319102 9485241 9410208 9181042 9067015 9131142 9190013 9184672 9262868 9423069
10027 9423069 9447653 9317820 9308704 9499325 9596853 9475689 9456662 9739647 9992477 9902805
10017 9902805 9727541 9809748 9928517 9714746 9404148 9495011 9849791 9873591 9525597 9400677
10007 9400677 9728817 10018291 9894198 9638411 9616133 9738127 9808051 9891703 10010636 9949230
9997 9949230 9713714 9710021 10078484 10324470 10070403 9722671 9832540 10183128 10170689 9822231
9987 9822231 9711055 9979473 10172280 10069672 10001724 10183145 10345209 10273066 10188339 10291997
9977 10291997 10361427 10162362 9934640 10078283 10545296 10887210 10818295 10479890 10208274 10224047
9967 10224047 10488556 10732045 10693100 10414234 10193211 10192223 10276716 10313103 10375526 10501883 10505566
9956 10505566 10278797 10072983 10172648 10434351 10482613 10289314 10211938 10445350 10752262 10817126
9946 10817126 10617889 10357712 10236354 10365326 10699278 10958193 10827896 10367008 10027424
9937 10027424 10119280 10428768 10552025 10449230 10410550 10552075 10646016 10508332 10310156 10349923
9927 10349923 10644454 10908817 10906333 10695223 10519922 10544474 10725311 10893952 10920559 10812340
9917 10812340 10683646 10631424 10633283 10589358 10484162 10462116 10661632 10979448 11120920 10960355
9907 10960355 10749752 10828034 11171235 11410910 11320067 11092437 11042024 11185966 11288800 11226207
9897 11226207 11118219 11121837 11247982 11395831 11452242 11360199 11199793 11174848 11376064 11585100
9887 11585100 11508937 11219258 11122235 11409832 11782707 11872844 11722600 11627769 11687983 11787205
9877 11787205 11894218 12062852 12181298 12055771 11781153 11716103 11984802 12271620 12255525 12026793
9867 12026793 11907522 12033731 12279655 12459262 12461111 12306643 12184557 12283498 12501158 12518963
9857 12518963 12278090 12121047 12275319 12488720 12465616 12382229 12563697 12868239 12895883 12696554
9847 12696554 12706465 12970184 13022510 12700929 12496614 12789655 13231164 13299951 13086770 13049566
9837 13049566 13263501 13418115 13398741 13379547 13410716 13366231 13278235 13300759 13349121 13209146 13026600
9826 13026600 13211894 13748123 14075715 13880669 13554042 13566467 13785545 13817473 13711965 13827098
9816 13827098 14153001 14288694 14090895 13887729 13947456 14118995 14163973 14133522 14206160 14380594
9806 14380594 14542319 14662912 14732284 14648466 14398077 14222222 14349309 14634064 14729160 14593609
9796 14593609 14543968 14752113 14984845 14985917 14864667 14881156 15023120 15068567 14977539 14934342 15006006
9785 15006006 15031471 14918662 14819817 14894741 15079942 15227237 15330230 15468622 15629253 15719356
9775 15719356 15690499 15554500 15365417 15269323 15435166 15803516 16043265 15938858 15705278 15709549
9765 15709549 15976112 16212512 16260849 16243132 16264237 16258082 16187661 16145859 16175908 16211697 16263763
9754 16263763 16429305 16643363 16687949 16562665 16558922 16797380 16988827 16897097 16756229 16896809
9744 16896809 17185097 17240830 17080422 17094977 17402664 17659276 17604569 17415855 17364840 17454337
9734 17454337 17595469 17848686 18215807 18413911 18191584 17779221 17700419 18107638 18563359 18584182
9724 18584182 18228365 18001586 18260212 18844931 19301847 19359519 19137238 18950063 19002408 19268325
9714 19268325 19574184 19746864 19743339 19693354 19770839 19981286 20141162 20120104 20016311 20007701 20120727
9703 20120727 20264666 20411173 20585758 20735541 20776236 20754614 20810376 20982469 21187075 21360888
9693 21360888 21482369 21497372 21403232 21368627 21565089 21903072 22151173 22284687 22456954 22650627
9683 22650627 22685963 22613111 22734162 23117550 23440388 23482498 23439740 23535833 23656839 23641350
9673 23641350 23631025 23817663 24094605 24276961 24432288 24675237 24889239 25004475 25270380 25816316
9663 25816316 26214118 26023500 25577494 25607041 26178037 26651657 26696345 26658224 26823536 27004269
9653 27004269 27084781 27326327 27794523 28071014 27936720 27817856 28102724 28497508 28576459 28541031
9643 28541031 28831761 29318449 29533926 29506246 29689522 30149542 30459709 30435261 30393981 30585122
9633 30585122 30861272 31057618 31258158 31517872 31693811 31728594 31797669 32025863 32321158 32596084
9623 32596084 32888614 33176162 33347232 33446872 33672205 34038761 34336350 34497511 34701552 35016103
9613 35016103 35264531 35376861 35534438 35803898 35969902 35942620 36008957 36421274 37004370 37427029
9603 37427029 37629762 37751765 37879868 38107996 38584309 39230806 39672654 39738692 39776663 40147909
9593 40147909 40670805 40954530 41054218 41336244 41843125 42274091 42532227 42827533 43240891 43619854
9583 43619854 43942344 44377591 44921173 45345077 45588506 45845367 46186450 46457263 46658196
9574 46658196 47062355 47790386 48577063 49135199 49491930 49818099 50185897 50644626 51277874
9565 51277874 52018930 52634574 53034961 53382257 53792318 54202723 54652833 55364417 56348946
9556 56348946 57246629 57795475 58181839 58681342 59245510 59739640 60306508 61127135 62034985
9547 62034985 62749083 63328839 64023207 64810757 65486308 66100464 66895375 67848562 68692552
9538 68692552 69392261 70202673 71201129 72145684 72900648 73656069 74583372 75573690 76484867
9529 76484867 77398626 78448511 79573820 80613293 81528937 82425858 83435874 84622210 85897616
9520 85897616 87048718 87984928 88925051 90144462 91578816 92917321 94058139 95189036
9512 95189036 96424116 97682548 98956866 100352554 101794818 103070312 104265183 105748562
9504 105748562 107546155 109169868 110347024 111495006 113088639 114926370 116506391 117855501
9496 117855501 119423771 121286499 123024678 124425855 125800299 127465932 129314973 131073932
9488 131073932 132705314 134364766 136146142 138013872 139876936 141665236 143420763 145291077
9480 145291077 147314696 149299459 151098614 152896185 154952505 157161121 159200959 161087870
9472 161087870 163172612 165541175 167838733 169846250 171848565 174190495 176775666 179278520
9464 179278520 181613378 183913019 186230900 188553578 190985176 193652331 196491420 199333553
9456 199333553 202131583 204934551 207731188 210495824 213307180 216258751 219327345 222456953
9448 222456953 225657469 228897193 232065848 235207499 238589144 242309523 246041706 249463912
9440 249463912 252772988 256405410 260370367 264282190 268009078 271823799 275849982 279833890
9432 279833890 283654890 287638091 292057614 296645030 300947565 304976038 309134726 313603880
9424 313603880 318137413 322481482 326710362 331061824 335619760 340257619 344809715 349239321
9416 349239321 353666976 358230117 362898171 367491145 371929062 376366242 380980284 385719364
9408 385719364 390398217 394976894 399568733 404194235 408725647 413127175 417571630 422195279
9400 422195279 426848478 431247372 435345982 439409922 443673986 448035619 452192818 456038804
9392 456038804 459778021 463611037 467439010 471007511 474268002 477422070 480602956 483688185
9384 483688185 486501837 489061153 491504475 493865389 496050807 498005393 499782811 501456673
9376 501456673 503039496 504488352 505731560 506694383 507351280 507763616 508045292 508283434 508468800
9367 508468800 508471387 508125916 507418942 506546969 505667547 504643549 503235350 501533069 499906199
9358 499906199 498423911 496644783 494220804 491442637 488844403 486445498 483787283 480649995
9350 480649995 477306710 474020767 470688166 467119584 463350352 459481339 455463679 451239151
9342 451239151 446905054 442563593 438161930 433622119 428974595 424248484 419411298 414526308
9334 414526308 409743100 404993720 399968338 394600977 389298758 384394936 379627483 374534674
9326 374534674 369170206 363980315 359081920 354152571 349033826 343950033 339030935 334092778
9318 334092778 329082383 324289219 319820532 315249472 310181449 304905574 300040095 295671615
9310 295671615 291301245 286626732 281932190 277572368 273435205 269166846 264715068 260363388
9302 260363388 256289870 252340202 248285555 244133182 240074336 236219344 232517451 228907394
9294 228907394 225392094 221916779 218318868 214525213 210714052 207139822 203850897 200720756
9286 200720756 197687561 194760220 191824060 188701873 185455739 182374296 179563646 176802689
9278 176802689 173946527 171210072 168820003 166601850 164212644 161654217 159241508 157113265
9270 157113265 155070142 152903315 150626112 148350885 146162071 144142403 142308577 140483934
9262 140483934 138450939 136279936 134286999 132591958 130938836 129067935 127069356 125223533
9254 125223533 123645887 122235439 120845542 119352923 117660930 115800026 113979115 112407058
9246 112407058 111080675 109825204 108501138 107097834 105668134 104248529 102830323 101376509
9238 101376509 99888233 98444683 97117209 95867796 94627828 93444992 92408954 91447261
9230 91447261 90377572 89179629 88013487 86925093 85762573 84471656 83235513 82185422
9222 82185422 81199642 80154971 79148609 78259010 77309806 76150982 75004245 74205981 73694492
9213 73694492 73062161 72087866 70949873 69924657 69117476 68482737 67885337 67144441 66211301
9204 66211301 65274601 64510600 63819663 63034921 62259293 61676341 61139250 60358801 59458597
9195 59458597 58870514 58617967 58197569 57344872 56444311 55907073 55565651 55042157 54368513
9186 54368513 53820688 53383870 52822008 52136497 51550144 51116763 50707357 50314927 50015782
9177 50015782 49676346 49076441 48338127 47862860 47755525 47631994 47135765 46391051 45786027
9168 45786027 45495940 45380054 45226147 44951009 44607023 44275390 43956220 43586023 43186847
9159 43186847 42892644 42726367 42481803 42009143 41506000 41282261 41304567 41244965 40949319 40567131
9149 40567131 40218925 39853956 39487810 39253888 39114684 38836197 38389722 38070230 38033130 38014756
9139 38014756 37748171 37378979 37180211 37092734 36886308 36596925 36430919 36341345 36087027 35685811
9129 35685811 35434037 35429096 35415028 35206744 34963289 34878915 34848744 34645796 34268440 33909337
9119 33909337 33674080 33513408 33386961 33326984 33328566 33297134 33153428 32937757 32769584 32715122
9109 32715122 32720734 32690278 32604653 32509839 32387354 32138584 31766613 31478488 31474516 31673216 31780219
9098 31780219 31628481 31331837 31094717 30985923 30925428 30802717 30591040 30409289 30427974 30609367
9088 30609367 30629749 30269810 29828924 29840353 30314880 30617047 30293918 29708828 29521632 29773701
9078 29773701 29927148 29717274 29470615 29490176 29585245 29459696 29220494 29163158 29264252 29243263
9068 29243263 29028447 28828049 28769302 28775292 28814806 28971667 29193159 29252208 29088889 28947869
9058 28947869 29017196 29144006 29098691 28934772 28860477 28897400 28913520 28891617 28907521 28914343 28821316
9047 28821316 28745408 28884270 29127852 29116017 28772652 28482688 28574808 28873204 28969083 28759059
9037 28759059 28498613 28437621 28598634 28841019 28984256 28928146 28771621 28735778 28877649 29009239
9027 29009239 29008113 29021181 29172414 29260102 29038139 28689358 28677052 29116201 29594142 29693072
9017 29693072 29450854 29208232 29201659 29422902 29723783 29930396 29943640 29824337 29740564 29805785
9007 29805785 30011329 30278337 30483738 30496148 30328526 30202224 30293776 30480980 30547086 30563120
8997 30563120 30775752 31138067 31310222 31202882 31153117 31391421 31676988 31711833 31620967 31704071
8987 31704071 31933917 32058128 32059364 32152639 32390462 32611920 32769282 32982270 33239868 33356858
8977 33356858 33308407 33333685 33578959 33858633 33924693 33813539 33771456 33942225 34262295 34592645
8967 34592645 34841038 34998785 35140996 35360073 35650923 35905794 36054801 36148323 36266456 36427645
8957 36427645 36636838 36928778 37272579 37515480 37561693 37581514 37882075 38516564 39150859 39423846
8947 39423846 39357888 39286602 39438296 39762123 40143062 40554912 40926171 41099431 41102249 41252548
8937 41252548 41747900 42314231 42565032 42581374 42765415 43192608 43553183 43752340 44069865 44585892
8927 44585892 44956930 45024834 45169837 45692079 46276169 46532656 46694412 47209149 47917578 48281743
8917 48281743 48291336 48478173 49035255 49563010 49801896 50034141 50555078 51228834 51796084 52228515
8907 52228515 52585744 52882931 53248505 53831591 54432034 54670674 54676973 55085386 56101043 57110060
8897 57110060 57572022 57775650 58251438 58923243 59424554 59865978 60608845 61509656 62083588
8888 62083588 62331693 62760067 63572420 64435997 65113733 65772700 66534531 67225299 67762173
8879 67762173 68358348 69131601 69877668 70452785 71059190 71913933 72895796 73756846 74487144
8870 74487144 75261572 76174600 77191958 78239767 79225958 80101774 80980153 82042534 83265376
8861 83265376 84414613 85381166 86336505 87474540 88781957 90150258 91537935 92931652
8853 92931652 94307874 95709027 97208940 98765204 100277413 101798984 103467423 105217070
8845 105217070 106844554 108400055 110181604 112241773 114257393 116058279 117924565 120112363
8837 120112363 122419038 124537086 126556739 128748129 131065983 133283972 135485073 137987452
8829 137987452 140812379 143617044 146202348 148757610 151512033 154416572 157300893 160153819
8821 160153819 163110390 166259621 169556733 172882469 176156164 179407219 182714330 186079744
8813 186079744 189461919 192940241 196665348 200569378 204343610 207856862 211376424 215153228
8805 215153228 218994899 222548331 225854156 229268448 232891644 236418455 239576559 242433241
8797 242433241 245224790 248101670 251052607 253880856 256290973 258221617 260026281 262054946
8789 262054946 264138744 265839051 267155240 268542501 270175088 271676874 272779324 273800701
8781 273800701 275150458 276702046 278048132 279152897 280337411 281722704 283089375 284316550
8773 284316550 285637542 287335932 289368568 291412569 293219621 294858765 296618910 298686479
8765 298686479 300962610 303266329 305653796 308348253 311343565 314326362 317109794 319904408
8757 319904408 322949613 326074998 328926021 331533181 334327627 337545427 340878805 343840029
8749 343840029 346294608 348481401 350603622 352576464 354190773 355384252 356241110 356776632
8741 356776632 356880239 356528189 355906762 355178811 354220844 352780958 350853838 348686115 346411161
8732 346411161 343909438 341078216 338010115 334815509 331482003 328023787 324570548 321173425
8724 321173425 317696460 314030015 310250801 306469926 302719015 299086278 295709792 292486102
8716 292486102 289074546 285410656 281921018 278938225 276191449 273255779 270254041 267634477
8708 267634477 265405841 263126543 260630546 258250039 256242585 254462760 252734623 251121899
8700 251121899 249638463 248064236 246281747 244497969 242902300 241352780 239617894 237710107
8692 237710107 235772661 233831260 231851144 229858211 227821183 225583197 223068619 220378329
8684 220378329 217547474 214447692 211105593 207849084 204880687 201935139 198651202 195084398
8676 195084398 191534722 188048995 184469793 180857421 177445378 174190971 170758649 167013481
8668 167013481 163211916 159623332 156238085 152925287 149614008 146232411 142726603 139247762
8660 139247762 136078556 133250858 130460766 127488894 124474746 121624477 118887818 116135585
8652 116135585 113446192 110949793 108538068 106020769 103483917 101191709 99159256 97125883
8644 97125883 94990105 92972739 91231330 89575821 87758146 85849316 84096151 82529595
8636 82529595 80975444 79399463 77960363 76681252 75336683 73798170 72276365 71022300
8628 71022300 69939208 68738312 67408505 66251575 65414361 64641375 63620393 62388155
8620 62388155 61224867 60268837 59424686 58593096 57793722 57041581 56260492 55391979 54502332
8611 54502332 53710915 53050132 52441095 51789186 51078986 50383493 49785017 49278729 48764052
8602 48764052 48147751 47441935 46739059 46106704 45538156 44998058 44475312 43968742 43443053
8593 43443053 42850644 42228605 41725903 41437080 41209271 40756186 40038273 39377785 39043773
8584 39043773 38860845 38461923 37830426 37281516 36933649 36573237 36118510 35807375 35716241 35479996
8574 35479996 34824394 34066462 33674684 33565969 33311774 32880325 32618747 32530105 32171841 31423442
8564 31423442 30800014 30697366 30767160 30441881 29771111 29289653 29222329 29260159 29088517 28747077
8554 28747077 28401504 28071869 27727896 27446191 27302819 27199293 26933627 26440971 25893749
8545 25893749 25534409 25423065 25385344 25225212 24931609 24611104 24288196 23912638 23536041 23302351
8535 23302351 23231391 23175154 23034787 22861047 22695745 22494546 22263550 22071629 21858614 21465875
8525 21465875 20956484 20636390 20606986 20583443 20360345 20144445 20135541 20093204 19728201 19271289
8515 19271289 19153520 19276430 19151228 18711124 18403758 18414069 18378932 18058738 17747679 17722038
8505 17722038 17747472 17500850 17107048 16863788 16739139 16550916 16390091 16431180 16514466 16363601
8495 16363601 16085281 16003920 16086530 15993173 15669337 15420136 15362020 15266908 15051859 14965743
8485 14965743 15107411 15175026 14937589 14593680 14390361 14227352 13967225 13823968 14021968 14286405
8475 14286405 14143663 13632173 13254369 13232531 13263513 13090839 12886797 12877739 12949089 12885859
8465 12885859 12747145 12713974 12735202 12612784 12350399 12155810 12121564 12114110 11983319 11722728
8455 11722728 11428348 11237220 11282286 11552709 11802533 11749480 11386647 10980827 10760860 10729220
8445 10729220 10773022 10808454 10783239 10670936 10518533 10412513 10374902 10368901 10381765 10388342 10279630
8434 10279630 10003053 9750591 9786231 10059219 10221190 10090979 9860249 9741468 9676805 9556016
8424 9556016 9462195 9469923 9418567 9163698 8887678 8862199 9023145 9089109 9012367 8979974 9006586
8413 9006586 8877688 8543324 8260000 8242454 8403790 8521197 8469306 8248822 7976413 7859313
8403 7859313 7970526 8064425 7872418 7557536 7538885 7839290 8007025 7806973 7575978 7661107
8393 7661107 7875085 7826634 7511263 7233580 7144159 7175917 7281043 7427779 7492289 7423856
8383 7423856 7380878 7456692 7456624 7232536 7023905 7104212 7282440 7188491 6907656 6837931 6992534
8372 6992534 6987059 6743087 6643536 6850683 7003863 6834009 6603513 6624438 6749134 6705549
8362 6705549 6596794 6651650 6739260 6585995 6315683 6311348 6592296 6766026 6638656 6475143
8352 6475143 6524302 6624184 6502165 6238742 6154727 6322884 6461982 6363791 6205830 6272832
8342 6272832 6493188 6513592 6249260 6060572 6209506 6416563 6284030 5966457 5968686 6332255
8332 6332255 6539803 6330621 6090064 6181427 6378334 6340343 6229591 6350362 6490531 6227642
8322 6227642 5734995 5638711 6050674 6352340 6114743 5710891 5721807 6127696 6440944 6392659
8312 6392659 6141061 5928092 5833991 5843309 5930160 6044950 6125701 6138268 6076127 5965467 5885805
8301 5885805 5905094 5976626 5992951 5949577 5939975 5981416 5983536 5906745 5803564 5686121 5526482
8290 5526482 5419311 5538370 5850929 6071377 6014449 5826820 5744106 5775634 5778262 5718750 5703106
8279 5703106 5807474 5987493 6110531 6042850 5800026 5618768 5718157 5965678 5995341 5722163
8269 5722163 5485997 5556432 5756834 5776197 5616321 5481242 5421328 5371036 5390561 5567471
8259 5567471 5767018 5762693 5562433 5363788 5252960 5187664 5193013 5301061 5360507 5196009 4919609
8248 4919609 4799020 4850606 4864315 4804588 4843812 4979472 4980938 4797984 4674401 4729968 4759441
8237 4759441 4613177 4467452 4500805 4568584 4455563 4254628 4229891 4423821 4625881 4653821
8227 4653821 4494561 4242300 4040049 4009070 4122417 4222811 4234931 4243622 4302174 4324752 4255054
8216 4255054 4171432 4129653 4080636 4035685 4100446 4231876 4202293 3955428 3749385 3766596 3842647
8205 3842647 3794648 3738874 3812231 3854052 3695915 3521522 3566667 3680442 3590517 3403521 3389748
8194 3389748 3449976 3312528 3124191 3252860 3552871 3477896 2999411 2750594 3048458 3397716
8184 3397716 3292304 2958396 2885641 3072885 3203502 3217170 3230517 3160708 2903977 2687061
8174 2687061 2775943 2980302 2901091 2574258 2420178 2590674 2795737 2800952 2702044 2631651 2542912
8163 2542912 2406686 2345680 2428871 2525910 2488517 2350041 2266824 2343175 2532560 2649902 2531702
8152 2531702 2260446 2125324 2254197 2436206 2459016 2423575 2492575 2534394 2349669 2099421
8142 2099421 2115052 2356716 2463402 2322071 2184246 2196218 2222066 2202206 2284794 2482149
8132 2482149 2570527 2473305 2392557 2413183 2334547 2071217 1863386 1875262 1926941 1867524 1875662
8121 1875662 2092654 2262946 2092949 1743804 1615455 1794472 2026756 2111215 2044998 1896044
8111 1896044 1773447 1800198 1914412 1873974 1658440 1614338 1926050 2218011 2060619 1642583
8101 1642583 1493697 1697438 1867975 1835587 1841003 2004331 2076350 1873577 1602296 1562584
8091 1562584 1758501 1938821 1884885 1618729 1432120 1625101 2068594 2220537 1835959 1415006
8081 1415006 1538718 1988791 2086917 1768799 1631140 1886970 2023039 1724729 1439010 1614396
8071 1614396 1956291 1934825 1602952 1395597 1432014 1515375 1588650 1714760 1774315 1625569
8061 1625569 1444047 1506757 1740440 1845015 1762569 1673221 1627062 1539627 1476569 1586115 1787273
8050 1787273 1845359 1723393 1571614 1432116 1256299 1148229 1262578 1496529 1599167 1556615
8040 1556615 1553948 1590666 1484231 1265393 1216873 1446328 1716920 1782562 1644390 1423962
8030 1423962 1226214 1175641 1353278 1641732 1820180 1819218 1707305 1502524 1244641 1154161
8020 1154161 1384259 1668412 1590388 1202416 989165 1182426 1502534 1646344 1632403 1554106
8010 1554106 1383826 1176710 1119822 1224808 1287117 1257862 1305968 1420210 1368560 1183738
8000 1183738 1221555 1540376 1711621 1509932 1290550 1345512 1396672 1165516 958410 1135533
7990 1135533 1412183 1323193 1063848 1170465 1565669 1654207 1304059 1015647 1059240 1118033
7980 1118033 953827 822973 966814 1175675 1164808 1022677 1000321 1123132 1246257 1281099
7970 1281099 1192134 969822 740386 703706 861249 1006430 1041587 1061495 1078409 967456
7960 967456 772015 740792 928015 1069999 1016463 967434 1086292 1192248 1089514 926439
7950 926439 941334 1079377 1158956 1219462 1379294 1498892 1332529 944216 654860 603133
7940 603133 647569 697173 838997 1071417 1178028 1014314 750801 668115 792801 887257
7930 887257 789308 629566 642529 836718 978765 913660 763894 734293 844658 975737
7920 975737 1060676 1074232 956074 749423 688429 878955 1012262 751606 326733 296766
7910 296766 706161 986168 833685 650915 823400 1067983 943330 615740 576364 837976
7900 837976 969430 816960 662691 681887 727764 712161 763270 888050 857995 600152 399299
7889 399299 515028 811431 952765 827850 626165 571069 684654 791058 724114 545361
7879 545361 498535 692261 930734 966267 807895 642214 569481 584270 691149 844282
7869 844282 891224 777494 673351 692108 670859 497500 427431 694555 1005425 902918
7859 902918 513067 384776 619809 752688 566771 419979 567111 737598 677451 587395
7849 587395 665658 690664 479995 343805 591023 923291 861539 536409 485908 791363
7839 791363 974818 751266 385156 222139 279427 413022 549856 624474 558272 426107
7829 426107 429311 607154 760072 728872 575065 431823 353999 366210 474625 562042 450204
7818 450204 166757 4530 191429 587010 818273 683720 347879 141325 217463 439464
7808 439464 596948 650951 679000 662582 528090 386279 464949 715466 766295 449397 114118
7797 114118 162715 495822 731207 787266 865583 963564 843367 506467 292065 383221 542696
7786 542696 498147 326696 272212 370709 447337 382841 238610 160540 228897 374827 446316
7775 446316 401203 374742 473708 606088 649906 666527 752427 805122 687386 513859 476921
7764 476921 481919 306505 55681 44210 237004 273430 115236 158928 521932 734638 465635
7753 465635 101351 167149 510894 569932 253044 31293 188033 442021 409846 112671
7743 112671 -115586 -37416 266735 491403 407225 129554 12454 196561 409567 363807
7733 363807 180947 183569 392372 528940 476104 431248 555051 726253 754206 651857 565658
7722 565658 537942 467552 291403 123626 155017 399857 616764 586150 415383 391239 540348
7711 540348 582679 390023 212489 282655 448349 439306 298702 267839 375813 431879 355683
7700 355683 258900 232470 257608 293519 298559 235709 179259 272720 444920 391458 49353
7689 49353 -170188 68288 482977 568073 328781 181577 269518 364393 367401 400776 426903
7678 426903 285666 124441 272953 639081 756196 516099 313908 354293 396065 345607
7668 345607 464804 732440 671370 195411 -41679 330967 661808 251274 -458005 -506842
7658 -506842 103352 480683 263173 31508 202035 386394 183351 -102604 -4382 336853
7648 336853 438830 216827 8984 31427 183808 315798 381779 353481 214103 55460
7638 55460 18478 107294 164617 66994 -101879 -110444 162576 533071 657576 435967 171163
7627 171163 204787 477107 621079 447986 140252 -46206 -77239 -76804 -116017 -153236 -112387
7616 -112387 31462 217402 352006 406610 401455 296512 48826 -186728 -147630 128279
7606 128279 263781 114183 51832 344567 591596 304411 -198817 -166583 389205 638978
7596 638978 217833 -210446 -24698 416793 450456 160900 88233 256213 230440 -24308
7586 -24308 -67513 230595 467431 392578 262764 322666 404745 296118 117366 57346 41878
7575 41878 -47589 -90136 31789 123502 -47416 -321367 -354648 -167087 -88180 -166193 -68935
7564 -68935 294443 485391 179784 -230205 -127566 401710 651453 320172 -80941 -44539
7554 -44539 201507 164403 -86483 -86665 222696 423687 319318 164207 125036 31931 -156487
7543 -156487 -135770 208702 471919 300708 -38341 -64768 199413 345686 227958 58572
7533 58572 -35021 -122702 -187554 -129689 -48171 -145291 -335160 -316396 -77526 42582 -107393
7522 -107393 -246725 -104228 198107 375893 347981 200754 577 -187926 -266623 -230825
7512 -230825 -190496 -179458 -118709 -33158 -69157 -198400 -174162 65732 231688 126451 -21218
7501 -21218 51962 169721 2732 -339623 -428927 -176688 49400 16886 -60117 56382 238986
7490 238986 255227 157848 141419 181811 117853 3542 60073 263552 289109 -11601 -331900
7479 -331900 -313981 -49016 92831 28451 31707 225455 352453 207853 -977 6690 104351
7468 104351 -35697 -360553 -449682 -142615 204924 233469 56683 11752 141373 192255
7458 192255 42900 -126531 -124646 -26225 -49987 -228105 -327272 -159630 106604 110765 -196161
7447 -196161 -414345 -214495 184119 301937 43334 -253654 -348976 -327494 -281906 -149422
7437 -149422 30242 50192 -108133 -175356 -31383 75099 -42807 -181962 -118789 -2374
7427 -2374 -57179 -161531 -84682 77496 84497 -16966 -31524 -15162 -122794 -210384 -48849
7416 -48849 178423 91346 -233172 -352791 -203281 -183939 -413536 -487151 -183810 128168
7406 128168 96800 -77218 -71928 2432 -93283 -203238 -36068 264146 285429 -11836 -251090
7395 -251090 -210340 -65910 -43141 -132208 -204266 -174215 -6550 252083 430947 392766 224739
7384 224739 117028 94680 52363 593 43834 125118 48599 -184761 -296174 -102872 198458
7373 198458 271147 62254 -160735 -164335 -10746 72158 1665 -74224 -6046 149220 235282
7362 235282 226834 205175 157203 5607 -158185 -118296 112499 235105 98290 -51065 49134
7351 49134 257121 245624 -14289 -255814 -304334 -216441 -107054 -55909 -104640 -155382 -7452
7340 -7452 287596 307637 -178081 -713300 -655760 -74194 344010 267691 74362 133470 282868
7329 282868 259172 171165 204274 224874 51325 -162238 -176972 -72352 -44799 -20949 145627
7318 145627 280614 126176 -144655 -111779 220904 394994 196614 -49731 -31941 97856
7308 97856 56751 -94869 -113194 -9743 -12924 -162584 -221706 -23855 282173 411757 274437
7297 274437 55930 -9466 86056 114491 -86136 -354276 -376886 -124601 60798 -82991
7287 -82991 -356859 -358485 -38764 235081 185807 -34667 -115052 -7951 84708 35003 -92700
7276 -92700 -195220 -216777 -97789 173570 437954 478896 310022 168054 161132 137173 5448
7265 5448 -56673 86398 231007 117033 -150092 -262837 -182679 -117356 -107175 -10452 115166
7254 115166 24887 -252293 -361379 -160157 62038 68796 9259 54783 72104 -61780 -154901
7243 -154901 -37263 96346 35335 -37330 114627 292174 176015 -82136 -98689 67715
7233 67715 48458 -116570 -22200 312844 358599 -48199 -358419 -146694 243857 284691 46219
7222 46219 -56326 35189 65999 -2441 7803 75307 10765 -133712 -93759 143725 267170
7211 267170 113159 -86840 -58348 141878 250107 153821 -10398 -54363 61622 216380
7201 216380 271928 207523 100526 18341 1546 104590 308090 414094 238275 -61698
7191 -61698 -94627 235671 567061 583150 405024 280393 178060 -3625 -82132 154023
7181 154023 492227 523831 254345 72428 136235 214989 171051 161109 244611 209698 -16160
7170 -16160 -143085 45969 325978 363236 190664 78673 110813 167119 207406 295768 398156
7159 398156 389478 249603 81628 -43737 -121848 -130500 -52497 44686 72454 40930 21933
7148 21933 37428 75348 153357 263664 320041 270572 194084 164671 104248 -67576 -203519
7137 -203519 -64975 300527 533203 406630 137399 102309 336548 496208 336355 60877
7127 60877 64735 395435 655893 503588 91041 -141607 -23267 197395 243749 140428
7117 140428 78386 122961 182244 171553 99225 34592 50518 151529 238504 215669 130118
7106 130118 98955 112398 66957 -4921 52837 230749 308113 194584 86476 149077 277709
7095 277709 343408 427290 579301 584515 279541 -80167 -118317 116792 266507 242748 297724
7084 297724 511653 613749 424063 146421 68747 213686 417079 545559 528433 372899
7074 372899 243092 321844 507321 478128 176871 -23237 174625 531810 580967 272969
7064 272969 40270 211097 583635 692889 401415 74623 115937 438643 591763 409793
7054 409793 252004 434058 720960 714413 505071 477466 607768 523016 252712 286706 718443
7043 718443 960384 642872 230210 284378 594842 606786 355607 330131 601449 734624
7033 734624 527936 270830 220668 302266 399307 528898 646914 639067 564400 584122 640369
7022 640369 551124 401305 433523 558078 440886 127883 69751 389504 641250 521912
7012 521912 336374 453160 726494 811165 696605 573603 481766 431664 567314 846934
7002 846934 875711 463959 56680 149498 543705 697132 583590 601488 772510 711306
6992 711306 401548 320420 630079 867342 709305 498413 640409 938295 967918 772958
6982 772958 698903 753980 638179 328983 173334 354231 640778 770651 784094 836949
6972 836949 904170 844293 645767 467744 468329 649669 843902 853298 666495 512091 594971
6961 594971 802864 828359 598264 393230 454717 660539 753332 736547 804312 958495 985669
6950 985669 839857 759863 888551 1036114 1012800 964532 1100738 1263851 1134526 800303
6940 800303 714207 1020622 1307314 1204779 904203 823857 1013808 1197438 1236590 1233873 1257069
6929 1257069 1264249 1280278 1386253 1527054 1551576 1453105 1370356 1349873 1308930 1241570 1258608
6918 1258608 1393345 1541291 1612335 1590172 1462538 1271961 1195796 1354304 1571192 1579887
6908 1579887 1443528 1464820 1671333 1754273 1605439 1530069 1741584 2000677 2018906 1917795
6898 1917795 1965667 2092710 2033464 1815153 1740694 1922071 2133709 2147448 1988155 1836239
6888 1836239 1842083 2034444 2281562 2374082 2255151 2099476 2064139 2084565 2053994 2053911 2209414
6877 2209414 2437832 2555384 2542225 2507495 2493922 2507321 2610318 2777808 2814193 2655682
6867 2655682 2571703 2763414 2957939 2796964 2469045 2472967 2830336 3066801 2991435 2935397
6857 2935397 3097361 3210389 3090685 3004930 3171174 3333899 3211019 3000907 3041786 3261422
6847 3261422 3380248 3420279 3578933 3774030 3756370 3578693 3541882 3714052 3867492 3881874
6837 3881874 3883036 3970946 4092774 4200063 4295035 4334593 4306269 4347750 4558077 4764337 4743373
6826 4743373 4606160 4663663 4953962 5212194 5292632 5314159 5389803 5510619 5692650 5940391
6816 5940391 6091559 6030601 6013129 6371061 6907133 7070590 6809626 6713356 7113353 7581748
6806 7581748 7644220 7505189 7629047 7989944 8248395 8408944 8763462 9305026 9693894 9788074
6796 9788074 9808768 9969731 10261979 10596963 10888878 11039984 11097974 11324190 11822592 12256601
6786 12256601 12302545 12229080 12555746 13230350 13696107 13780799 13923363 14392352 14880974 15127600
6776 15127600 15370029 15822051 16206169 16262977 16301965 16721256 17314487 17632377 17783786 18233439
6766 18233439 18922376 19268869 19096964 18935885 19208611 19658571 19855457 19829357 19862856 19975362
6756 19975362 19975507 19831762 19675672 19552173 19411913 19259098 19113783 18921774 18658321 18403664
6746 18403664 18171150 17811838 17261618 16725285 16410678 16220810 15929354 15529856 15169883
6737 15169883 14856502 14492941 14115505 13814944 13495610 13008880 12469768 12116425 11884870
6728 11884870 11488980 10947389 10628240 10650513 10629782 10229615 9634940 9217583 9007757 8793830
6718 8793830 8526313 8295915 8057576 7700308 7307736 7056813 6915165 6710699 6450513 6289678
6708 6289678 6209124 6016181 5685239 5419953 5319895 5240526 5067001 4891602 4809301 4745545
6698 4745545 4619314 4500482 4455492 4376231 4127373 3781752 3558988 3557882 3652686 3649752 3491444
6687 3491444 3302257 3237748 3284379 3268883 3115478 2984932 3025700 3099368 2974221 2720313
6677 2720313 2621897 2698611 2648641 2358997 2127998 2185315 2296799 2130974 1795058 1677794
6667 1677794 1885705 2153261 2251247 2189025 2030909 1795104 1573948 1519644 1640270 1776968
6657 1776968 1827316 1843302 1883176 1918951 1923780 1911795 1862022 1735704 1593683 1558226 1620881
6646 1620881 1619330 1458095 1245463 1157686 1247354 1425117 1568468 1624758 1642179 1679392 1661291
6635 1661291 1426744 1013259 765808 973013 1460954 1755136 1623530 1265904 988000 906143
6625 906143 981997 1124971 1209279 1171132 1121085 1191290 1285456 1199520 976917 872586 946005
6614 946005 992343 925605 893712 926641 845152 664763 684483 949932 1050383 768662 513964
6603 513964 678419 952100 835312 517770 561654 891006 884154 478042 348176 761211
6593 761211 1049176 682209 184884 336684 941264 1151932 774870 464280 640859 949263
6583 949263 969653 849285 898575 1015761 914781 644628 496020 544600 613830 602254 571094
6572 571094 563143 564124 587321 598132 451535 134514 -49147 157671 506308 525329 237218
6561 237218 147165 441962 692667 567642 348569 377876 444549 228853 -1044 220606
6551 220606 680744 721028 303999 97416 374807 584237 313668 -15281 109141 436595
6541 436595 438797 206565 205665 430042 475271 295932 233338 351839 373618 277551 350642
6530 350642 572001 545631 195569 -40580 74982 208494 69207 -106893 -36290 92268
6520 92268 -6021 -168782 -73473 182805 243079 73213 -33708 53343 179886 223312 211870
6509 211870 153478 24959 -83229 -46729 89847 183724 212355 236849 235302 172118 131058
6498 131058 165041 134940 -53231 -181051 2292 325169 373684 104797 -81585 64366
6488 64366 308544 305568 38300 -248568 -351769 -228418 24786 212163 186975 21803
6478 21803 -80199 -55075 -17855 -37334 -47873 -6907 29276 17322 -28808 -106084 -193683 -194854
6466 -194854 -75578 9416 -55084 -83977 144079 433877 368097 -38041 -298788 -168564
6456 -168564 40763 29743 -35262 73043 166331 -34861 -355758 -374250 -54257 206021
6446 206021 125041 -163682 -358814 -299152 -24962 278453 395826 268188 36072 -169414
6436 -169414 -354178 -491183 -427135 -143714 75309 -20441 -284195 -384956 -256873 -87144
6426 -87144 17689 75800 48379 -85353 -147943 31850 281996 265717 -25982 -269106 -287968
6415 -287968 -227708 -227935 -242608 -239605 -277683 -309473 -193308 14362 60034 -112980 -249130
6404 -249130 -182827 -86259 -155054 -286746 -268758 -112269 -7392 -49731 -149282 -147469 29553
6393 29553 259586 293062 64608 -146779 -85673 61649 -55134 -345155 -394292 -172581
6383 -172581 -87189 -237501 -219339 98952 234763 -88352 -379998 -176575 138914 -24673
6373 -24673 -446995 -494777 -227560 -231328 -499892 -416678 102490 369779 53078 -304355 -241049
6362 -241049 -74241 -177945 -276768 -52271 144732 -114533 -484637 -344753 139743 234204
6352 234204 -210406 -571966 -454168 -183964 -156332 -263483 -230529 -85275 -19256 -73113
6342 -73113 -173405 -263578 -267174 -135211 -5406 -70670 -240890 -229216 -34165 10495 -219688
6331 -219688 -412832 -321984 -142978 -148380 -256269 -246961 -144942 -88362 -49067 20415 -13982
6320 -13982 -206118 -293361 -81697 144251 13024 -305943 -342300 -79720 58148 -49132
6310 -49132 -55267 183537 335114 190777 24237 60436 49565 -249926 -552416 -463423 -136158
6299 -136158 -28166 -185239 -258050 -137308 -77713 -184016 -242543 -161914 -162212 -351996 -472469
6288 -472469 -301242 -42846 -41846 -276596 -417005 -310919 -156842 -176943 -317099 -358563
6278 -358563 -221219 -49525 -13695 -106210 -176103 -123489 3802 89142 45675 -147904 -400748
6267 -400748 -505906 -337716 -75370 -35652 -227730 -319575 -160643 -38680 -197418 -408959
6257 -408959 -364869 -217719 -284827 -421028 -235989 160397 238167 -96491 -342500 -241139
6247 -241139 -156582 -367967 -573792 -471146 -300815 -360838 -431424 -205667 75286 -20450
6237 -20450 -398356 -634016 -661702 -704718 -713935 -481819 -189617 -213771 -440090 -397071 -74166
6226 -74166 30599 -251138 -510088 -490036 -442515 -542510 -554954 -365249 -274341 -425966 -470464
6215 -470464 -191462 29248 -169191 -482056 -430152 -140314 -87240 -318159 -479006 -430187
6205 -430187 -324071 -211002 -54706 -16737 -244915 -486401 -398670 -149622 -187761 -478730
6195 -478730 -542852 -271984 -112812 -302061 -482705 -322975 -38339 4703 -173396 -330582
6185 -330582 -403585 -448626 -426001 -311574 -221914 -211926 -162268 -60932 -129328 -423304 -590667
6174 -590667 -357407 -22793 -72474 -446528 -628457 -421816 -196649 -274877 -461796 -404535
6164 -404535 -151075 -70180 -313202 -607026 -616316 -348556 -95366 -44343 -97033 -105396 -130125
6153 -130125 -300351 -508446 -499147 -286896 -210443 -438001 -666423 -540347 -184046 -21247
6143 -21247 -165285 -317794 -276121 -213824 -342905 -566421 -660595 -623088 -612936 -637627 -541357
6132 -541357 -306570 -146178 -204597 -331083 -300279 -158505 -154388 -339022 -448179 -269915
6122 -269915 43625 182169 77215 -83637 -169709 -232729 -334565 -438599 -494320 -478683
6112 -478683 -352621 -136041 -6128 -115630 -318434 -322226 -135305 -67548 -215402 -286699
6102 -286699 -100770 83944 1574 -176826 -173231 -111418 -270027 -509251 -436696 -88919 55861
6091 55861 -186319 -423065 -309828 -53478 -36526 -245911 -382884 -349425 -316038 -386901 -462730
6080 -462730 -439625 -356776 -305191 -299402 -287856 -248269 -233626 -298875 -385763 -361064 -227277 -186465
6068 -186465 -362237 -563883 -534474 -363163 -377937 -626978 -769767 -575616 -252236 -125172
6058 -125172 -224262 -373895 -499687 -628056 -708692 -647656 -460399 -255332 -126020 -136581
6048 -136581 -294037 -453881 -415702 -220699 -165157 -376335 -588933 -542839 -385576 -404777
6038 -404777 -543940 -529937 -374512 -362324 -543974 -617015 -407533 -154911 -157785 -368241 -516575
6027 -516575 -483324 -373252 -306488 -286138 -255749 -202912 -189863 -282258 -440598 -533746 -505672
6016 -505672 -453302 -464577 -479933 -427687 -378524 -401021 -381496 -205887 -23616 -65846 -263943
6005 -263943 -345463 -278238 -283617 -394916 -382277 -211668 -186886 -442134 -648981 -498354 -184237
5994 -184237 -98397 -271054 -441011 -501493 -530332 -505181 -350565 -205211 -287585 -497754 -483448
5983 -483448 -150658 180401 202005 -47958 -354848 -590651 -707582 -679460 -575255 -537612
5973 -537612 -590810 -606177 -519213 -414838 -332422 -189529 -10765 -19113 -314893 -629144 -624231
5962 -624231 -347549 -162303 -268841 -507590 -636901 -602010 -475726 -306781 -132189 -33250
5952 -33250 -64488 -166693 -231034 -232802 -244549 -324241 -438399 -507512 -500597 -463357 -451829 -453689
5940 -453689 -403588 -291320 -221625 -307576 -496283 -570844 -391997 -104413 -6734 -200983 -472881
5929 -472881 -579396 -545843 -549211 -590546 -492732 -231894 -43010 -95185 -257549 -335477 -357967
5918 -357967 -427822 -452261 -305364 -152376 -266328 -539196 -555606 -236816 -21352 -204371
5908 -204371 -459913 -345453 -2585 67162 -224170 -460266 -386796 -221842 -201440 -224963
5898 -224963 -160154 -159730 -379157 -617997 -577156 -334971 -229329 -330796 -380033 -266226 -218960
5887 -218960 -401532 -616027 -618684 -495011 -461620 -466163 -306821 -74152 -105990 -438449 -645954
5876 -645954 -419722 -40350 1747 -311825 -553606 -499814 -400707 -521519 -721875 -694973
5866 -694973 -434953 -225123 -234360 -340057 -360977 -306484 -332627 -519949 -741597 -757574 -471350
5855 -471350 -90132 60764 -80726 -235623 -166486 -659 -22432 -253392 -446121 -448194
5845 -448194 -353079 -280934 -221403 -154213 -149296 -258356 -424226 -552276 -569574 -414570 -127060
5834 -127060 54163 -91024 -402184 -457110 -163789 51065 -157118 -534958 -609478 -367572
5824 -367572 -191961 -244577 -315288 -260071 -195879 -199636 -169720 -94724 -133901 -288748 -305556
5813 -305556 -90784 65333 -85809 -352924 -406012 -272339 -226303 -331362 -414712 -413828 -429005
5802 -429005 -460018 -388190 -231656 -154458 -197882 -241898 -247455 -290575 -341414 -280372 -170054
5791 -170054 -219394 -409844 -468930 -324899 -255419 -412711 -538586 -400258 -193385 -191457 -275220
5780 -275220 -201195 -104907 -267476 -531927 -482044 -161615 -58314 -300236 -436582 -214743
5770 -214743 -20521 -201224 -438035 -274263 89352 96163 -268013 -469387 -277993 -66656
5760 -66656 -169339 -426616 -548041 -529164 -487856 -406875 -272887 -211129 -259744 -248445 -119412
5749 -119412 -116149 -384474 -623357 -474703 -93993 44459 -175691 -411939 -419782 -331455 -319969
5738 -319969 -334549 -297724 -276377 -303221 -266199 -127921 -39509 -82424 -110430 -23287 14392
5727 14392 -153663 -370491 -397235 -309901 -367439 -556324 -580337 -321348 -33269 3036 -192194
5716 -192194 -403531 -483808 -418944 -272296 -169202 -237176 -462955 -663537 -660587 -447090 -168036
5705 -168036 3008 -29890 -214432 -374202 -383667 -317916 -342107 -473231 -570377 -549151 -465955
5694 -465955 -385656 -314021 -274140 -292234 -292563 -184722 -75632 -176417 -440862 -541397 -321378
5683 -321378 -36173 10387 -155518 -343514 -508239 -653930 -648392 -434532 -258131 -346982
5673 -346982 -492208 -329199 41742 147009 -129774 -353769 -209531 39127 -4231 -277678
5663 -277678 -411036 -269195 -61210 -8919 -132571 -308297 -378654 -266483 -91524 -81051
5653 -81051 -267425 -409871 -336809 -204094 -244112 -411693 -496956 -477268 -511994 -639194 -710460
5642 -710460 -624678 -438647 -244879 -102670 -80915 -204542 -355308 -374246 -266893 -178970
5632 -178970 -185956 -239290 -288722 -308452 -236911 -58298 84049 34007 -141048 -245466 -251749
5621 -251749 -280950 -316667 -216778 -34469 -21339 -217715 -341358 -234552 -132894 -276547
5611 -276547 -510751 -544877 -411640 -362007 -430394 -420313 -269117 -139086 -151186 -266964 -425450
5600 -425450 -572125 -573090 -349082 -93087 -89140 -289297 -354978 -182117 -74963 -258502 -517061
5589 -517061 -538939 -375735 -286852 -310851 -297778 -251077 -312797 -452690 -486990 -413357 -419669
5578 -419669 -512355 -456069 -200569 -52987 -218580 -438066 -363530 -98487 -26922 -212119
5568 -212119 -335798 -236074 -138552 -237579 -365322 -287502 -102955 -90003 -273568 -401556 -328415
5557 -328415 -209613 -271022 -518448 -728477 -665714 -303660 117810 278154 81194 -252147
5547 -252147 -442120 -431278 -333658 -210151 -55752 43932 -54324 -327773 -554824 -567231 -422965
5536 -422965 -283480 -233767 -278642 -403201 -552474 -627882 -584719 -488565 -424177 -396373 -362475
5525 -362475 -312034 -271709 -270262 -327455 -439795 -558693 -617438 -585719 -473332 -314016 -191474
5514 -191474 -213841 -366833 -459540 -351321 -175321 -167870 -323517 -431553 -432168 -474645 -587938
5503 -587938 -583289 -396052 -249078 -302924 -383944 -274433 -73765 -30647 -168758 -322889 -428800
5492 -428800 -534398 -610691 -586249 -511711 -485815 -477488 -405522 -314073 -279916 -244445 -146383 -109232
5480 -109232 -251782 -417175 -371599 -191488 -146464 -251379 -267331 -136343 -71213 -173828
5470 -173828 -290852 -319933 -355141 -440528 -462734 -380796 -297641 -229182 -82766 67218 3183
5459 3183 -235642 -318322 -133492 8521 -122682 -311829 -283839 -154785 -203689 -426343 -601872
5448 -601872 -619680 -497060 -261204 -37069 -39196 -250711 -350688 -197489 -94108 -276732
5438 -276732 -463678 -317811 -65419 -148327 -463487 -510985 -202726 44664 14151 -73675
5428 -73675 -93320 -236887 -540007 -676948 -468504 -195525 -151876 -220518 -156724 -12195 -4768
5417 -4768 -166950 -355279 -457043 -423786 -258681 -95493 -111232 -259887 -299341 -165831 -66695
5406 -66695 -107749 -139140 -111967 -234261 -547321 -701348 -470309 -180135 -235663 -468206 -404356
5395 -404356 -30904 191491 42363 -189863 -215261 -116886 -90138 -144520 -235388 -417611 -665411
5384 -665411 -751968 -538776 -248907 -217956 -438515 -581389 -470176 -302551 -301215 -350290 -206016
5373 -206016 27857 -47297 -519075 -915403 -793359 -354430 -151856 -322632 -495240 -417078
5363 -417078 -249386 -175560 -134373 -89782 -175443 -370517 -400305 -195910 -87133 -260524 -406929
5352 -406929 -260053 -101155 -268903 -510616 -392694 -107017 -211767 -683456 -914500 -679425
5342 -679425 -428934 -470763 -495295 -201528 143562 144604 -123099 -328920 -396355 -439819 -434984
5331 -434984 -304450 -165093 -173301 -237741 -157313 37550 111678 -56750 -347587 -537508 -476125
5320 -476125 -219777 -42703 -161866 -414660 -433917 -189490 -47277 -181502 -301193 -175831
5310 -175831 -45372 -171419 -328619 -188926 49571 -56207 -425202 -525081 -212733 41322
5300 41322 -100067 -349447 -297615 -39993 22211 -207010 -425580 -378841 -148878 16077
5290 16077 -447 -116614 -210622 -263041 -310353 -310976 -178116 27290 84633 -102598 -339929
5279 -339929 -396455 -307233 -254797 -265261 -237547 -193731 -254056 -388289 -426531 -325359 -216421
5268 -216421 -182715 -184881 -210571 -287354 -338989 -248774 -88705 -62618 -188204 -265413 -206373
5257 -206373 -154003 -202966 -251294 -228680 -226313 -272281 -220712 -30413 70636 -95264 -352893
5246 -352893 -410897 -261131 -123005 -103498 -138533 -192367 -284728 -352528 -294780 -158637 -106707
5235 -106707 -183138 -257156 -216811 -91901 33431 110830 104166 -9627 -164560 -219708 -121512
5224 -121512 -2447 -39683 -225428 -361038 -322959 -255637 -374801 -605310 -618864 -321633
5214 -321633 -79073 -225525 -522035 -454017 -15724 220953 -71703 -485390 -462470 -77603
5204 -77603 112395 -150544 -537869 -607289 -301410 66791 164108 -61402 -343340 -372430
5194 -372430 -145663 49252 36783 -33877 13162 79884 -4751 -158359 -184733 -129613 -213981
5183 -213981 -457634 -631814 -581372 -373843 -142012 12117 -15265 -230258 -423414 -379181
5173 -379181 -192201 -143122 -278438 -379099 -346059 -315702 -345906 -304957 -179523 -186895 -414176
5162 -414176 -610185 -536706 -310188 -184310 -178392 -149056 -88061 -111420 -232835 -351288 -415280
5151 -415280 -441269 -422600 -358606 -316760 -343444 -379149 -369950 -368583 -403611 -366886 -196666 -64243
5139 -64243 -165226 -384697 -403806 -147185 91160 33974 -233813 -404644 -330934 -163854
5129 -163854 -142148 -313386 -484110 -439866 -192528 33634 59752 -72640 -201717 -232259
5119 -232259 -175366 -87830 -42232 -94442 -220448 -337766 -415017 -474452 -475198 -341018 -149000
5108 -149000 -104958 -233248 -288870 -123480 68252 69840 1755 78321 180976 37674 -261997
5097 -261997 -335247 -99349 98405 26380 -136924 -201679 -286849 -497625 -599349 -344560
5087 -344560 73109 228694 23419 -264492 -408088 -414149 -322239 -138976 -3005 -114159
5077 -114159 -395864 -485063 -210976 123906 135006 -122355 -254979 -90877 106317 21768
5067 21768 -303893 -562485 -561402 -388644 -234963 -174763 -150684 -98342 -33088 -33844 -162570
5056 -162570 -377937 -520972 -434855 -142401 124328 130186 -119338 -375564 -400273 -202073
5046 -202073 -8956 -15641 -174323 -256977 -132332 64047 95038 -76143 -260355 -328653 -372217
5035 -372217 -483405 -520381 -279697 146254 389000 225077 -164264 -411759 -341450 -85992
5025 -85992 78009 -24999 -298691 -426287 -200829 177168 279375 -20312 -366474 -381480
5015 -381480 -132889 35764 3139 -49438 -925 44907 9148 -1372 77124 70824 -189829
5004 -189829 -541722 -641144 -432853 -236063 -290309 -428032 -367469 -177458 -188818 -469587
4994 -469587 -671824 -513711 -189664 -97860 -296178 -474777 -426552 -294077 -297053 -416557
4984 -416557 -458504 -306931 -19944 238232 295285 95624 -203976 -350834 -272403 -148724
4974 -148724 -154337 -241063 -263171 -207145 -175162 -212473 -268985 -287228 -238631 -126350 -30139 -72227
4962 -72227 -248638 -384312 -364236 -304057 -343839 -379586 -212697 87881 222365 86223 -75241
4951 -75241 -34210 92315 38153 -205385 -356218 -203882 115799 253461 20437 -399153
4941 -399153 -625910 -472967 -117801 127832 143250 29813 -96295 -205516 -276476 -263201
4931 -263201 -173574 -85081 -59754 -112997 -248077 -422533 -507486 -416981 -271780 -276952 -416414
4920 -416414 -443078 -233422 18705 64090 -90130 -255326 -331911 -360416 -374352 -344971 -253454
4909 -253454 -125822 -13422 14673 -78912 -204595 -190986 -12466 117515 -2291 -283318
4899 -283318 -450684 -381863 -209735 -108545 -110028 -140969 -127744 -36974 96682 157150 40398
4888 40398 -210317 -427643 -499283 -458106 -374582 -247421 -67169 74950 51957 -114236 -227403
4877 -227403 -142059 43042 112822 29210 -40563 -9398 -4227 -104258 -128067 99255 387352
4866 387352 375859 52388 -230550 -278270 -261381 -312732 -279567 -72734 77840 3476 -61004
4855 -61004 126212 317795 119861 -315541 -436749 -116352 157371 14599 -303035 -372684
4845 -372684 -165353 41592 72269 -51223 -233523 -340576 -262939 -84558 -29891 -138288
4835 -138288 -189578 -61736 78019 81887 54704 84248 15130 -241543 -423193 -272408 10591
4824 10591 31833 -213756 -392932 -372110 -313778 -277799 -134306 91802 172489 57983 -34379
4813 -34379 -6678 -18245 -121487 -112515 78280 182476 16559 -186181 -144810 21133 31232
4802 31232 -69769 -26558 146458 172122 -30153 -229110 -256622 -203757 -177623 -130017 -40597
4791 -40597 -47963 -237657 -437431 -387650 -70570 238286 252360 -24959 -291134 -267930 -38672
4780 -38672 37010 -199466 -465918 -424008 -149281 26506 29713 69477 171836 77757 -281220
4769 -281220 -567029 -511247 -315808 -310664 -447882 -451323 -298008 -199088 -193466 -121283 11138
4758 11138 -10321 -222013 -364290 -263087 -72141 1845 -11380 3297 -2458 -133866 -315597
4747 -315597 -359484 -220082 -33932 65160 57062 -9977 -85180 -153419 -249795 -388077 -465148
4736 -465148 -354894 -136886 -68422 -230088 -369771 -255434 -26348 15774 -158235 -327802
4726 -327802 -396504 -455893 -499055 -383231 -142006 -44569 -211304 -410731 -401312 -266742 -217364
4715 -217364 -238228 -178251 -75530 -124518 -341196 -497611 -429139 -228182 -78673 -42494 -76390
4704 -76390 -149040 -261184 -401822 -524824 -542348 -372086 -72772 109493 -21446 -321956
4694 -321956 -428723 -226121 -10637 -69362 -272552 -289512 -86410 58834 778 -110554
4684 -110554 -165432 -288119 -527976 -628062 -383227 -50296 -52574 -347327 -467023 -223612
4674 -223612 22284 -51203 -240278 -191395 31122 119189 66259 116692 257944 213193 -28476
4663 -28476 -113368 106892 302856 187584 -34050 -33833 98896 50866 -160717 -231704 -103501
4652 -103501 -53268 -207776 -321620 -174919 84526 180222 94252 15378 20566 12222 -69491
4641 -69491 -150636 -161607 -141374 -147975 -153051 -111525 -93207 -224241 -463428 -558997 -349598 -31881
4629 -31881 52148 -121903 -230611 -90400 69692 -24997 -276374 -396921 -347367 -305513 -300942
4618 -300942 -207596 -77521 -137168 -375093 -447011 -151179 243116 339084 117728 -103942
4608 -103942 -117144 -20797 -164 -71095 -100839 -18031 72885 34569 -73830 -45719 131131
4597 131131 164984 -122143 -435156 -363603 462 175769 9114 -142649 -35210 98764
4587 98764 9089 -158490 -201396 -255149 -485965 -677997 -538204 -206149 -47015 -95778 -121391
4576 -121391 -104012 -193885 -285184 -122918 175580 200823 -87819 -269421 -155411 -89554 -333598
4565 -333598 -600805 -524428 -241681 -137995 -247662 -287228 -152581 -36022 -86464 -217847
4555 -217847 -259727 -130414 117638 310161 275563 59386 -83802 -12863 115428 100033
4545 100033 -19849 -85037 -73111 -59433 -49368 -25360 -38362 -79831 -3144 231588 383954
4534 383954 240546 -35190 -123542 -9530 62541 7374 -45346 -66244 -162489 -294059 -284020
4523 -284020 -158137 -156656 -333207 -454853 -404878 -367156 -456199 -473705 -256961 -12154 -29057
4512 -29057 -239810 -333170 -199919 -22638 10059 -124351 -337390 -479377 -395568 -102382
4502 -102382 148334 137491 -51077 -176688 -170152 -137501 -122450 -84562 -67177 -160117 -307754
4491 -307754 -368099 -353884 -388571 -424192 -271903 29845 160166 -33067 -267263 -199794 113065
4480 113065 339609 320786 175953 47149 -39853 -86710 -86813 -85001 -127971 -159981 -101112 -12108
4468 -12108 -32867 -161813 -254336 -255781 -270262 -349582 -375096 -244057 -54624 6711 -103250
4457 -103250 -255908 -316006 -269522 -205051 -200366 -222498 -166792 -28491 43042 -36253 -104535
4446 -104535 23962 227932 228509 43030 -41153 12591 -95667 -404717 -464234 -43724 347249
4435 347249 151488 -335843 -387381 14153 179039 -145402 -407108 -232504 -32847 -221123
4425 -221123 -467522 -302675 28814 -22289 -374048 -476084 -227853 -51647 -106797 -95484
4415 -95484 87823 133500 -92023 -270108 -167297 8088 26967 8406 103757 173904 67632
4404 67632 -81575 -114210 -128793 -242455 -329775 -268961 -191232 -205177 -136918 134444 332071
4393 332071 143768 -266520 -491004 -458416 -390089 -325875 -136090 80601 74114 -98174 -134797
4382 -134797 -26326 -65205 -256804 -219271 156816 427552 257562 -45061 -22467 217110
4372 217110 208121 -128320 -391967 -318963 -107161 -57717 -176976 -257202 -175993 5577 151582
4361 151582 171978 76716 -41521 -88448 -43579 37128 67948 -6242 -143089 -209827 -136546
4350 -136546 -44494 -102285 -257851 -273091 -62293 176828 243392 173043 99471 52002 22655
4339 22655 66361 171083 177694 7980 -166866 -173582 -102450 -105337 -93444 66719 189326
4328 189326 -19285 -427020 -565190 -309951 -71020 -154285 -320893 -224119 43635 164836
4318 164836 118325 118472 172847 81222 -159307 -295209 -201493 -38941 34644 53775 68249
$$ [...]
##END NTUPLES=NMR SPECTRUM
##END=
