##TITLE=1H ikalashn
CA-9302
19.11.2024
##JCAMPDX= 6.0         $$ Bruker NMR JCAMP-DX V2.0
##DATA TYPE= NMR SPECTRUM
##DATA CLASS= NTUPLES
##ORIGIN= UXNMR, Bruker Analytische Messtechnik GmbH
##OWNER= root
$$ TOPSPIN		Version 1.3
$$ 2024-11-19 09:25:51.109 +0400  Irina@DPX200
$$ Compression mode = diff/dup
##.OBSERVE FREQUENCY= 200.131300845
##.OBSERVE NUCLEUS= ^1H
##.ACQUISITION MODE= SIMULTANEOUS
##.ACQUISITION SCHEME= undefined
##.AVERAGES= 16
##.DIGITISER RES= 18
##SPECTROMETER/DATA SYSTEM= spect
##.PULSE SEQUENCE= zg
##.SOLVENT NAME= CDCl3
##.SHIFT REFERENCE= INTERNAL, CDCl3, 1, 17.49637
##AUDIT TRAIL= $$ (NUMBER, WHEN, WHO, WHERE, WHAT)
$$ ##TITLE= Audit trail, TOPSPIN		Version 1.3
$$ ##JCAMPDX= 5.01
$$ ##ORIGIN= Bruker BioSpin GmbH
$$ ##OWNER= Irina
$$ $$ F:/spectra/data/iren/nmr/1H/4/pdata/1/auditp.txt
$$ ##AUDIT TRAIL=  $$ (NUMBER, WHEN, WHO, WHERE, VERSION, WHAT)
(   1,<2024-11-19 09:24:28.687 +0400>,<Irina>,<DPX200>,<TOPSPIN 1.3>,
      <acquisition in progress>)
(   2,<2024-11-19 09:25:35.437 +0400>,<Irina>,<DPX200>,<TOPSPIN 1.3>,
      <Start of raw data processing
       efp BC_mod = 2 LB = 0.02 FT_mod = 6 PKNL = 1 PHC0 = 322.1802 PHC1 = 4.635242 SI = 32K 
       data hash MD5: 32K
       48 31 91 08 78 05 8B 9A 61 70 52 D8 67 FC 23 3F>)
(   3,<2024-11-19 09:25:38.453 +0400>,<Irina>,<DPX200>,<TOPSPIN 1.3>,
      <apk 
       data hash MD5: 32K
       95 8D AA 8E 77 16 6F C0 20 0B 74 28 2E 15 E1 63>)
(   4,<2024-11-19 09:25:40.812 +0400>,<Irina>,<DPX200>,<TOPSPIN 1.3>,
      <abs n ABSG = 5 
       data hash MD5: 32K
       78 53 E5 DE AB 78 DE 0A 47 74 55 4D B4 CA C7 1C>)
$$ ##END=
$$ 
$$ $$ hash MD5
$$ $$ 31 02 A6 3C 1C 05 35 2C FC 15 BA CE 37 7A CF C9
##$RELAX= 
##$RELAX= 
##$RELAX= 
##$RELAX= 
##$RELAX= 
##$RELAX= 
##$RELAX= 
##$RELAX= 
##$RELAX= 
$$ Bruker specific parameters
$$ --------------------------
##$DU= <F:/spectra>
##$EXPNO= 4
##$NAME= <1H>
##$PROCNO= 1
##$TYPE= <nmr>
##$USER= <iren>
##$AMP= (0..31)
100 100 100 100 100 100 100 100 100 100 100 100 100 100 100 100 100 100 
100 100 100 100 100 100 100 100 100 100 100 100 100 100 
##$ANAVPT= -1
##$AQSEQ= 0
##$AQ_mod= 1
##$AUNM= <au_zg>
##$AUTOPOS= <>
##$BF1= 200.13
##$BF2= 200.13
##$BF3= 200.13
##$BF4= 200.13
##$BF5= 200.13
##$BF6= 200.13
##$BF7= 200.13
##$BF8= 200.13
##$BYTORDA= 1
##$CFDGTYP= 0
##$CFRGTYP= 5
##$CHEMSTR= <none>
##$CNST= (0..63)
1 1 145 1 1 1 1 1 1 1 1 1 1 1 1 1 1 1 1 1 1 1 1 1 1 1 1 1 1 1 1 1 1 1 
1 1 1 1 1 1 1 1 1 1 1 1 1 1 1 1 1 1 1 1 1 1 1 1 1 1 1 1 1 1 
##$CPDPRG= <>
##$CPDPRG1= <>
##$CPDPRG2= <>
##$CPDPRG3= <>
##$CPDPRG4= <mlev>
##$CPDPRG5= <mlev>
##$CPDPRG6= <mlev>
##$CPDPRG7= <mlev>
##$CPDPRG8= <mlev>
##$CPDPRGB= <>
##$CPDPRGT= <>
##$D= (0..63)
0 2 0 0 0 0 0 0 0 0.06 0 0.03 0 0 0 0 0.0002 0 0 0 0 0 0 0 0 0 0 0 0 0 
0 0 0 0 0 0 0 0 0 0 0 0 0 0 0 0 0 0 0 0 0 0 0 0 0 0 0 0 0 0 0 0 0 0 
##$DATE= 1731993933
##$DBL= (0..7)
120 120 120 120 120 120 120 120 
##$DBP= (0..7)
150 150 150 150 150 150 150 150 
##$DBP07= 0
##$DBPNAM0= <>
##$DBPNAM1= <>
$$ [...]
##$SW_h= 4401.40845070422
##$TD= 16384
##$TD0= 1
##$TE= 300
##$TE2= 300
##$TE3= 300
##$TEG= 300
##$TL= (0..7)
0 120 120 120 120 120 120 120 
##$TP= (0..7)
150 150 150 150 150 150 150 150 
##$TP07= 0
##$TPNAME0= <>
##$TPNAME1= <>
##$TPNAME2= <>
##$TPNAME3= <>
##$TPNAME4= <>
##$TPNAME5= <>
##$TPNAME6= <>
##$TPNAME7= <>
##$TPOAL= (0..7)
0.5 0.5 0.5 0.5 0.5 0.5 0.5 0.5 
##$TPOFFS= (0..7)
0 0 0 0 0 0 0 0 
##$TUNHIN= 0
##$TUNHOUT= 0
##$TUNXOUT= 0
##$USERA1= <user>
##$USERA2= <user>
##$USERA3= <user>
##$USERA4= <user>
##$USERA5= <user>
##$V9= 5
##$VALIST= <valist>
##$VCLIST= <CCCCCCCCCCCCCCC>
##$VD= 0
##$VDLIST= <DDDDDDDDDDDDDDD>
##$VPLIST= <PPPPPPPPPPPPPPP>
##$VTLIST= <TTTTTTTTTTTTTTT>
##$WBST= 1024
##$WBSW= 25
##$XGAIN= (0..3)
0 0 0 0 
##$XL= 0
##$YL= 0
##$YMAX_a= 387317
##$YMIN_a= -376894
##$ZGOPTNS= <>
##$ZL1= 120
##$ZL2= 120
##$ZL3= 120
##$ZL4= 120
##$ABSF1= 17.49637
##$ABSF2= -4.496376
##$ABSG= 5
##$ABSL= 3
##$ALPHA= 0
##$AQORDER= 0
##$ASSFAC= 0
##$ASSFACI= 0
##$ASSFACX= 0
##$ASSWID= 0
##$AUNMP= <proc_1d>
##$AXLEFT= 0
##$AXRIGHT= 0
##$AXTYPE= 0
##$AXUNIT= <>
##$AZFE= 0.1
##$AZFW= 0.1
##$BCFW= 0
##$BC_mod= 2
##$BYTORDP= 0
##$COROFFS= 0
##$CY= 7568.61572265625
##$DATMOD= 1
##$DC= 0
##$DFILT= <>
##$DTYPP= 0
##$F1P= 17.9538593292236
##$F2P= -4.03888763876832
##$FCOR= 0.5
##$FTSIZE= 32768
##$FT_mod= 6
##$GAMMA= 0
##$GB= 0
##$INTBC= 0
##$INTSCL= 1.367314e-010
##$ISEN= 128
##$LB= 0.02
##$LEV0= 0
##$LPBIN= 0
##$MAXI= 945.577
##$MC2= 0
##$MEAN= 0
##$ME_mod= 0
##$MI= -402.1523
##$NCOEF= 0
##$NC_proc= -6
##$NLEV= 6
##$NOISF1= 8.587773
##$NOISF2= 6.764455
##$NSP= 0
##$NTH_PI= 0
##$NZP= 0
##$OFFSET= 17.49637
##$PC= 1
##$PHC0= 322.109
##$PHC1= 2.778671
##$PH_mod= 1
##$PKNL= yes
##$PPARMOD= 0
##$PPDIAG= 0
##$PPIPTYP= 0
##$PPMPNUM= 100
##$PPRESOL= 1
##$PSCAL= 0
##$PSIGN= 0
##$REVERSE= no
##$SF= 200.13
##$SI= 32768
##$SIGF1= 16.12182
##$SIGF2= -4.496377
##$SINO= 3.521527
##$SIOLD= 32768
##$SREGLST= <1H.CDCl3>
##$SSB= 0
##$STSI= 32768
##$STSR= 0
##$SW_p= 4401.40845070422
##$SYMM= 0
##$S_DEV= 0
##$TDeff= 16384
##$TDoff= 0
##$TI= <>
##$TILT= no
##$TM1= 0
##$TM2= 0
##$TOPLEV= 0
##$USERP1= <user>
##$USERP2= <user>
##$USERP3= <user>
##$USERP4= <user>
##$USERP5= <user>
##$WDW= 1
##$XDIM= 32768
##$YMAX_p= 425956783
##$YMIN_p= -597096
$$ End of Bruker specific parameters
$$ ---------------------------------
##NTUPLES= NMR SPECTRUM
##VAR_NAME=  FREQUENCY,     SPECTRUM/REAL,   SPECTRUM/IMAG
##SYMBOL=    X,             R,               I
##VAR_TYPE=  INDEPENDENT,   DEPENDENT,       DEPENDENT
##VAR_FORM=  AFFN,          ASDF,            ASDF
##VAR_DIM=   32768,         32768,           32768
##UNITS=     HZ,            ARBITRARY UNITS, ARBITRARY UNITS
##FACTOR=    0.134324425510551, 1,           1
##FIRST=     4401.40845070422, 70870,        -344690
##LAST=      0,             -22829,          -420754
##MIN=       0,             -597096,         0
##MAX=       4401.40845070422, 425956783,    0
$$ Real data points
##PAGE= N=1
##DATA TABLE= (X++(R..R)), XYDATA
$$ [...]
14890a8953M0069m9290o9208J581P1736N8691j2338n5095l4832L515P677j9378
14878g5825l8079k8251o296P359J8058M0461N9118L3247l9840q9930m6788N4552
14866a12214R5774K4239p2045q0019p285M7233L6742N966k794l425j2253j1235
14854i1316P786J9144J1351O999J0056q919m5650m5280N515L6913K796l6955j3300
14841a40860L4640K9810p105j703K9264L368o6196p0307J3131O9002K8116k3883
14829a02723K295M9668K0742n0051n2732J6250N2909J3301l0987j7221K2605K8516
14817d7428m470m0070m7918j7370L3258N1752L571o3748o2003J6634P6944M6302
14805e4546k9791n7377j7371K9276L4855J2966k006k092j043n729q927n809m215
$$ y = [-18953, 21116, -28174, -97382, -95801, -24065, 34626, 22288, -32807, -67639, -64124, -56447, -75825, -113904, -142155, -148451, -141092, -123034, -82573, -23455, 9792, -30048, -119978, -166766, -112214, -16440, 7799, -64246, -144265, -151550, -104317, -67575, -61609, -64403, -67828, -80081, -91316, -83530, -64386, -53035, -46036, -35980, -44899, -90549, -135829, -130314, -93401, -90605, -127560, -140860, -106220, -76410, -83515, -85218, -55954, -52586, -118782, -189089, -175958, -106956, -78840, -102723, -100428, -50760, -30018, -80069, -132801, -116551, -63642, -50341, -81328, -98549, -75944, -47428, -51898, -91968, -139886, -157256, -123998, -72246, -68675, -132423, -194426, -177792, -100848, -54546, -84337, -141714, -159085, -129809, -94954, -81988, -83994, -86086, -87129, -92858, -101785, -107594, -111809]
14792a11809r289n507K3130N2294L2718l2266o5699j7466N0524M4659j9104l8550
14780i6365J3363M7399O021m2958j9427M0052M5566n542l6863j4596J9517K7611
14768a6222J7467L527j4251k5938j4733Q244J1935q249k5923k3982p783J4253
14756h1655L1121K3783n407j6635J2336L8187J0608m3541n6152j9813J4420K5876
14744f6872L3904K9798j2342n7666m0155J9846L0545j8927l4298J9181N0560L388
14732d3038m1034r528K8980r824o4732l2179M6578N3513l429j6142K4152J9974
14720d6709m1941n8783M881N5497L3543l739j0884k5361n1952j9179P0687R0039
14708c901j3544r8597l8585O9784O0425l5551n5454K0917N4158r608o0691k2960
$$ y = [-111809, -121098, -126605, -103475, -51181, -18463, -50729, -116428, -133894, -83370, -38711, -57815, -96365, -83002, -35603, -29582, -72540, -91967, -51915, -6349, -11891, -48754, -63350, -43833, -16222, 1245, 4772, -9479, -35417, -50150, -41906, -29971, -38220, -64143, -88125, -95908, -81655, -50534, -26751, -32158, -48793, -36457, 1730, 12338, -31203, -87355, -107168, -92748, -66872, -32968, -3170, -15512, -73178, -113333, -93487, -62942, -81869, -116167, -96986, -46426, -43038, -84072, -93600, -64620, -74444, -139176, -171355, -124777, -71264, -74693, -90835, -66683, -46709, -88650, -147433, -142552, -87055, -53512, -57251, -68135, -93496, -145448, -164627, -93940, -3901, -17445, -116042, -154627, -84843, -24418, -59969, -115423, -94506, -40348, -49956, -110647, -133607]
14696a33607L1880K5242m831N233L1605J9899j7682l3601k1056j214K0910L9753
14684c7469L0664q295l5419k5047q509j7482k7860l876L6404M6013J6170k1286
14672e5992m0718l8953j9865R536L6557N0246M1483J052n4393o7517m430P1006
14660g1988N8107l4085q3830l0079M1420L8791q96L41J8784j4590o8844n1382
14648a98251K8882O3797J8701j8323Q847L4077p406n9652l4725L9867N6718j0240
14636g7708o6298k9820N8500R4657M5127k2480l9250k1485k6657n0693k9898M6487
14624a19518R3437M4817m2166o3423j3881K0853J183k3638j2311J2827K6297L8803
14612c6720M7584K0154l5314n1797j744M8580L5305j0533k6481j9816l2052m6050
$$ y = [-133607, -101727, -76485, -81316, -76083, -44478, -24579, -42261, -75862, -96918, -98132, -77222, -37469, -6805, -15100, -50519, -75566, -84075, -101557, -129417, -133293, -96889, -50876, -34706, -55992, -96710, -135663, -155528, -145992, -109435, -59189, -17706, -16654, -71047, -138564, -142994, -71988, -13881, -47966, -131796, -161875, -120455, -81664, -82560, -82219, -63435, -78025, -146869, -198251, -169369, -105572, -86871, -105194, -96347, -62270, -69676, -129328, -164053, -124186, -67468, -77708, -144006, -173826, -115326, -20669, 24458, 1978, -37272, -58757, -85414, -136107, -166005, -119518, -26081, 18736, -23430, -86853, -100734, -79881, -78698, -102336, -114647, -101820, -75523, -36720, 10864, 31018, -4296, -56093, -57837, -9257, 26048, 15515, -10966, -30782, -62834, -108884]
14600a08884j4492M1542M9615j147m3092l4437q207Q78R595L4113M2272K939n3483
14587h2788o8290k9110K3881N3112N4040L7761J2408j4102l0435k9004j3246L178
14575h2595N580o814j5264j049K7090L7577J4463k0255l2827j7470K319O522k237
14562h4960j1528j4278n669J7816M2414L6893o930m4306k4021L4860N6257J1458
14550H006l8204l3983m487n529k0792O88L6544J6065m8825o0101J2597P2491L9644
14537b5886l1921m7255p768K2369K7784L3006K6266j5725n4695l4168J8984K4859
14525f4150k2593m5385m009N0077N9176K6846j5060m4623m2304m146K8216R120
14513f8835l6020m0659j431K2670J6573K4532M6859K4470m0233n4519J5378O7784
$$ y = [-108884, -123376, -81834, -32219, -33366, -76458, -110895, -119102, -118224, -108629, -74516, -32244, -29305, -82788, -151078, -180188, -156307, -103195, -49155, -11394, 1014, -13088, -43523, -72527, -85773, -82595, -77015, -83829, -99093, -100142, -73052, -35475, -21012, -41267, -74094, -91564, -89245, -82723, -84960, -96488, -110766, -116435, -98619, -56205, -19312, -26242, -70548, -94569, -59709, -3452, 8006, -30198, -64181, -68668, -74197, -94989, -94301, -57757, -41692, -90517, -150618, -138021, -65530, -25886, -57807, -105062, -112830, -90461, -62677, -29671, -3405, -19130, -73825, -107993, -89009, -64150, -86743, -132128, -136137, -86060, -26884, -38, -15098, -59721, -102025, -106171, -77955, -68835, -104855, -145514, -146945, -124275, -107702, -83170, -36311, -11841, -52074, -106593, -91215, -23431]
14501b3431J8002o2105n6251J3960L3832j8616n1432j4376L4060L3190N768L676
14489h3723K9362M6360L1207r680n0647o1707l2648J1539L3619K1027r496l1811
14477a06598k5085J0526M1230L0280o789j5734J1691J8287k3717n7049k7071K8800
14465a21229M0566R669j3467j7125k1853j8961R439L4391J8515j2030p021K0794
14453g8312K4251R948J3574J5087k4724o5258l2803M3742N9476j089m2363j5062
14441i3533K2886K5656K0543J7911j9224p3824o4069J4471N6135J3477k5488K147
14429a02912K6527j2283m2736M801O0493L8707o827Q122L2500j8497q0952l9411
14417a32468N5577N8504j9732l2421M0302N7382k8352q4837l2336K6293k307m3898
$$ y = [-23431, -5429, -67534, -123785, -109825, -75993, -94609, -146041, -160417, -126357, -93167, -87399, -83723, -54361, -8001, 23206, 13526, -37121, -98828, -131476, -119937, -86318, -65291, -74787, -106598, -131683, -121157, -79927, -49647, -56436, -72170, -60479, -42192, -65909, -122958, -150029, -121229, -80663, -70994, -84461, -101586, -123439, -142400, -132961, -98570, -80055, -92085, -99106, -78312, -54061, -44113, -30539, -15452, -40176, -105434, -138237, -94495, -35019, -36108, -78471, -93533, -70647, -44991, -24448, -6537, -25761, -99585, -163654, -149183, -93048, -79571, -105059, -102912, -76385, -88668, -131404, -126603, -66110, -27403, -34230, -26108, 6392, -12105, -93057, -132468, -76891, -18387, -38119, -70540, -30238, 27144, -1208, -86045, -118381, -92088, -94395, -138293]
14405a38293n332N3731K9195m5870o0190n53M9951M7271J7021j8576n3423n8975
14393a84043j1606N4260Q0030N5177J2339k2276l3893j1514K3221K1036k1192
14382c8461m1695j0984J5212n825k4664O846L4828o054o1217l3368M7180N9500
14370e8702j2394n3816n807M8200K5652l2200m2862o646J9800J7031O336j147
14358i6555m900O377L2220M1260J2364k6833l4704q818K1710L4666K2177j3810
14346a4846m7315l7317J7669N8780L6065k1656m5793k2454k160j5796k8778J05
14334a23496M8531N5309N126m6659m4006Q20L0398J8804n772j1626j615Q489J6193
14321d9504J9583Q827r367r695P367O160k0901k6546J1100L1872j6285p3640m4605
$$ y = [-138293, -143625, -89894, -60699, -106569, -166759, -167312, -117361, -70090, -53069, -71645, -125068, -184043, -195649, -141389, -61359, -6182, 6157, -16119, -50012, -61526, -38305, -17269, -38461, -80156, -91140, -75928, -81753, -106417, -99571, -64743, -70797, -132014, -165382, -118202, -58702, -71096, -124912, -130719, -82519, -56867, -89067, -131929, -138575, -118775, -101744, -95408, -96555, -101455, -95078, -62858, -21598, -9234, -36067, -70771, -79589, -57879, -23213, -1036, -14846, -62161, -99478, -81809, -23029, 13036, -8620, -54413, -76867, -79027, -94823, -123601, -123496, -74965, -19656, -14530, -61189, -105195, -104375, -73977, -55173, -60945, -72571, -74186, -65697, -49504, -29921, -21094, -30461, -40156, -32789, -26629, -47530, -74076, -62976, -31104, -47389, -121029, -165634]
14308a65634M6267P7082Q811o1727n2494m65K5501K4590K2343R710j3887q105
14296h8008L1826L5788k9156p6195k0632P3634P9071j583m5908l783M1846K0303
14284A7203l1311n2497m5494l2192l455L7415M5066K78m2346k6816K3573M6103
14272f4473K6522J716j307J0113J4175n971m2367n0719K849P1445O2261k9535
14260e291r0169m1937L9933M0946k1281l9927M199K7047l291j7537K2026N1672
14248c3610K0540k0685j2354J1769p439m6485m3894o384J5315K0214L8166M6884
14236a7963M943n0258m2132J2067J9633k6043k5527M9581Q7928J6080p3368o8681
14224a13740j1996n002k5840J3477Q1838O5880k4762n6564O365M3216j3153o3036
$$ y = [-165634, -119367, -42285, -33474, -95201, -147695, -148160, -122659, -98069, -75726, -66016, -79903, -88008, -56182, -20394, -49550, -125745, -146377, -72743, 6328, 4745, -41163, -44946, -3100, 17203, -14108, -66605, -112099, -144291, -147746, -110331, -65265, -64987, -107333, -134149, -110576, -64473, -37951, -36235, -37542, -27429, -13254, -19225, -61592, -112311, -109462, -38017, 24244, -5291, -95460, -137397, -97464, -56518, -77799, -117726, -113527, -86480, -89771, -107308, -85282, -33610, -13070, -33755, -46109, -34340, -41779, -88264, -132158, -138542, -123227, -103013, -64847, -17963, -13020, -63278, -105410, -93343, -73710, -99753, -125280, -75699, 12229, 28309, -45059, -113740, -125736, -130738, -156578, -143101, -61263, 4617, -20145, -76709, -70344, -27128, -40281, -103317]
14212a03317j7776M8054L1252k5946k3842J7101N426m7976m7108K0093O1109K8926
14200e4004k0709l4302k3124m372K9020N8879M4736j351j8536M631J1380k3151
14188c0903n0531l4908n673O245J3255K1610R408j3685j036M0003L4356l5709
14176d7568p7775k6754M5555L9898j9759l7889J782L4671L0485J5744K482j8210
14164e7338k6248K880L6722K6324p196o312J9174J0513k8397l4653k116P466j8206
14151g7387j7662K4044L5529j4583n0370j1321M3993L4482j4196k4170M271J0506
14139e6864j1544j1197J8824K8582K003j6784m690K051k1270l7576q608L6458
14127h0615L9833mk8030j1621K0666K7770J0716k503m860j2696k6966k5467j480
$$ y = [-103317, -121093, -73039, -41787, -67733, -91575, -74474, -69048, -117024, -164132, -144039, -82930, -54004, -74713, -109015, -132139, -136511, -107491, -48612, -3876, -5227, -23763, -19132, -7752, -30903, -81434, -116342, -122015, -115770, -102515, -80905, -71497, -85182, -86218, -46215, -11859, -47568, -125343, -152097, -106542, -66644, -86403, -124292, -122510, -87839, -57354, -41610, -39128, -57338, -83586, -80706, -43984, -17660, -24856, -31168, -11994, -1481, -29878, -64531, -66647, -59181, -77387, -95049, -71005, -35476, -50059, -100429, -111750, -67757, -33275, -47471, -71641, -67370, -56864, -68408, -79605, -60781, -32199, -30196, -46980, -51670, -49619, -70889, -108465, -117073, -80615, -40782, -40786, -68816, -80437, -59771, -32001, -21285, -23788, -28648, -41344, -68310, -93777, -95257]
14114i5257J9122J5485J691n52M556M178L300N904m225k9446l3929J723L0999
14101g6451N517l6598k0930L9163N6952J2966j6734L768Q787m4336q4405l6911
14089a89212M7840O6468J3529k8284j7954Q830J8323J5870R587m58j232J4379
14077d2314K0982J116j1966J1384K9564j1293p3410o8373L811M6518J0620l7747
14065a21108k4223K9338M9804J4373l2811l9225M326N3549N0863k096l0124J6543
14053c0791P3728M0156o9386j28976o9706L5588Q0693M9747n98k4395j5110P394
14041e1656J2651o226j2687J6342L1288k0394q2232m9582N5205R2296J8567m2893
14029c9321q396L1171j8649p8158k8281P2037P0637k6990o5566R200P3585L1605
$$ y = [-95257, -76135, -60650, -58959, -59511, -54955, -50777, -47477, -41573, -45798, -75244, -109173, -107450, -76451, -70934, -107532, -128462, -89299, -32347, -19381, -36115, -32347, -23560, -67896, -152301, -189212, -141372, -74904, -61375, -89659, -107613, -98783, -80460, -64590, -55003, -55461, -56693, -42314, -21332, -20216, -32182, -20798, 8766, -2527, -75937, -144310, -140499, -93981, -83361, -121108, -145331, -115993, -66189, -51816, -84627, -123852, -119526, -65977, -15114, -17210, -47334, -30791, 42937, 83093, 13707, -115269, -184975, -149387, -68694, -18947, -19545, -43940, -59050, -51656, -39005, -45231, -57918, -41576, -10288, -30682, -112914, -162496, -107291, -14995, 3572, -39321, -47717, -16546, -35195, -113353, -141634, -69597, 1040, -25950, -91516, -82316, -8731, 22874]
14017B2874m5888n1280j53J8587j7005n0268m0410m840K3687L8432M8954N0467
14005f843K2863k9749n7345k0214L9404M0925j1443k7862J7348L3639k7742p0765
13993i7784j0439O5936L0977o4006o6988K2398O0266P523j9090K9419M9047j5959
13981h700o1613q036N5596K3773n0267n4480L217L7155K8924J5388m666m2120
13969f5829n0497O688O7972N3851p627l1868j2668p064k1803j6786L786J112j5676
13956i6409n851K1430K4882J0340J1734J7002m300k5849m717K9071J5789k4289
13944c1167k2641J4078J5402k6776m6237j6834J7402K8967L2890K6868m677l0779
13932d3504r289K7172J6173k0559j6620O546k3161p2120l4515P0195R8432J3131
$$ y = [22874, -23014, -74294, -74447, -55860, -72865, -123133, -163543, -168383, -144696, -106264, -57310, -6843, 16020, -13729, -71074, -91288, -51884, -10959, -22402, -50264, -32916, 723, -27019, -97784, -108223, -42287, -11310, -75316, -142304, -119906, -59640, -52117, -71207, -41788, 7259, -8700, -70313, -78349, -22753, 1020, -49247, -103727, -100510, -63355, -34431, -19043, -23709, -65829, -116326, -109638, -41666, 12185, 4558, -27310, -39978, -47042, -68845, -85631, -81845, -80733, -96409, -102260, -80830, -55948, -45608, -33874, -16872, -21172, -47021, -51738, -22667, -6878, -31167, -53808, -39730, -24328, -51104, -97341, -114175, -96773, -67806, -34916, -8048, -12725, -43504, -52793, -25621, -9448, -30007, -46627, -40081, -63242, -135362, -169877, -99682, -1250, 11881]
13920A1881n5181l0155J87k8792l5164L6477Q2570J8752n3101j4388N6888K1456
13908A1430o9301n5811N2772Q9038J634p3494m0249K7522L3474j499j3051l093
13896d0628o179j6484q631J1650J9239O024j3574j5037J4638M8757L8925j2173
13884B6527l8233r092J3949j8727n1819j8162L7708L4077l919J825K6934j3445
13872a2377q7954p1534M4486J18388O9645j6542m4950l6957l8512k5746J8036
13861h4017L6504l262l5593j075M9352L7865j7269m3086k3746L366J9551K7476
13849c3934K0052P76j825J7798K2817k875k4044j8300j0850j4727m684J8488J5204
13836a6104j0274m029K7624J0283n2664n3896L1673P4761J768o7309j9788N0508
$$ y = [11881, -43300, -73455, -73268, -102060, -137224, -100747, -18177, 575, -52526, -66914, -10026, 11430, -57871, -113682, -60910, 28128, 29762, -43732, -83981, -56459, -22985, -24484, -37535, -40628, -46807, -63291, -71922, -60272, -41033, -35009, -48583, -63620, -48982, -225, 38700, 26527, -11706, -20798, -6849, -25576, -77395, -95557, -57849, -23772, -27691, -25866, 1068, -12377, -100331, -171865, -127379, -8991, 60654, 44112, -838, -37795, -76307, -102053, -84017, -47513, -50775, -86368, -87443, -38091, -226, -17495, -60581, -84327, -80961, -61410, -33934, -13882, -13106, -14931, 2867, 25684, 22809, -1235, -19535, -30385, -45112, -49796, -31308, -16104, -26378, -30407, -2783, 7500, -45164, -99060, -67387, 7374, 9142, -58167, -77955, -27447]
13824b7447J0029p1155m1762N6700O0673k4600l8791M3464P1257q642o0770l992
13812c5036N7656L0803j9889j7286n212k9910l1597K9061O2477n671q8141o5398
13800a18143K4393N7371J9583k513J7474K3826k858j8723n616M296m510j1879
13788a7299j0737j4815j9124l664K4922L5867J5870j8570m1247l3492l66K4272
13776e8383J7512O665K3233L4195o994n6614l3334K8309J2489o9496o8799M5388
13764a25829J02307Q725p3534Q097J23116O5922r0591j08772J8317O6101l5399
13753d1540r5825q08J02473O4579l3396m4031J2483K4927j5559l5252j0670K7739
13741d4880N9081N9459O7p7336p4284J0887N1668j0454o3876j8222L7203q51n3277
$$ y = [-27447, -17418, -88573, -130335, -73635, -12962, -37562, -76353, -32889, 38368, 29726, -31044, -35036, 22620, 53423, 33534, 16248, 11036, -18874, -50471, -21410, 41067, 35396, -52745, -118143, -93750, -36379, -16796, -19309, -1835, 21991, 19133, 410, -5206, -910, -5420, -17299, -28036, -42851, -61975, -65639, -40717, -4850, 11020, -7550, -48797, -82289, -82655, -58383, -40871, -34206, -10973, 23222, 16228, -40386, -73720, -45411, -32922, -102418, -171217, -125829, -23522, -14797, -88331, -80234, 42882, 108804, 18213, -90559, -72242, -6141, -41540, -137365, -138173, -35700, 28879, -4517, -48548, -36065, -11138, -26697, -61949, -72619, -44880, 14201, 73660, 73727, -3609, -77893, -67006, -15338, -25792, -89668, -107890, -70687, -71538, -124815]
13728a24815J474R3756O8695l9653n6495L5373O7694k1665q4912j9534O4795L9131
13716B3844m1149n1924q99K2277J1275K1303L7513Q97o0095n2980K2235N6642
13704a1061j720o6175m3110L2573N8362J2174l0857j3210L6144N6062L1138o149
13692E4171k4097j8362l018M656l346j4164l656K7458M0749P448m3029n5578k5316
13679e6084K10j611K026L2329N0647J7087l7255m6229j930L3376R111n1456p7429
13666a27208k5695O7753J11321N2108n2318r0729l3707L5078M0013O152o236K680
13654b0788J125j754J6212K8129j040m1159l9676j0459j987m960J9732M4900J0792
13641i33n5364o1187N047N6041M5069J8432J0426n153l1415k5191R651J4252p871
$$ y = [-124815, -123341, -29585, 39110, -543, -57038, -21665, 46029, 24364, -60548, -80082, -15287, 23844, -17305, -69229, -70128, -47851, -36576, -15273, 22240, 23137, -36958, -89938, -67703, -11061, -12781, -78956, -122066, -89493, -31131, -18957, -49814, -63024, -26880, 29182, 60320, 54171, 30074, 11712, 8694, 13350, 10004, -4160, -7816, 19642, 60391, 67839, 24810, -30768, -56084, -55874, -57485, -55459, -23130, 27517, 44604, 7349, -38880, -40810, -7434, 1677, -49779, -127208, -152903, -85150, 26171, 78279, 25961, -64768, -98475, -63397, -23384, -17232, -23468, -20788, -19663, -21417, -5205, 22924, 21884, -19275, -58951, -69410, -71397, -76357, -56625, -11725, -933, -56297, -117484, -112437, -56396, -11327, 7105, 17531, 12378, -19037, -44228, -34577, -20325, -28196]
13628b8196J3812O6474M0564p1248j15286j3298R2543N8764l4657l5961K4681
13617a808K0057l0494j1586N3244L5500n3925p2413j004K4423l3724m6694L5785
13605h2639Q2148J2161n8715k4882L1214K564n1189k8419K5094J4121k2121O806
13593i3857N8272L0658l9542l4248L1648L4481l4249n0332K2880P0141K1276m2440
13581b5312l8415n201m467j3903M942K3850Q029j4880j1444k056p631l318K1448
13568f8358K5781n593k0390Q394K5012o491k4173K2696O6052K6645l9017k5923
13556a5365L4350K1902n7493o6278L4202J01986L0496q3896q8722M605O2480L2930
13544A1197j2179j7246j0361j8337j2639K1541L7389R93l8764j7136M0603M8614
$$ y = [-28196, -14384, 52090, 92654, 21406, -93880, -107178, -14635, 44129, 9472, -26489, -1808, 18249, -12245, -23831, 29413, 64913, 10988, -61425, -62429, -38006, -71730, -118424, -82639, -491, 11670, -47045, -71927, -40713, -38149, -89338, -117757, -92663, -78542, -100663, -93857, -35585, -4927, -44469, -78717, -47069, -12588, -46837, -97169, -74289, -4148, 17128, -25312, -63727, -68928, -73395, -87298, -82356, -58506, -50477, -65357, -76801, -78857, -86488, -89806, -68358, -42577, -48170, -68560, -60166, -35154, -41645, -65818, -43122, 22930, 49575, 10558, -15365, 18985, 40887, -16606, -82884, -48682, 53304, 83800, -96, -88818, -84213, -21733, 11197, -982, -18228, -28589, -46926, -59565, -38024, -635, 358, -38406, -55542, -14939, 33675]
13532C3675j1202n9450l5722J7000K5471m245j0571J7120K7429J19k1175p288
13520b8839J1469R198J0186K8130K1893k8382n8580j2667M9155L0955m0395n0302
13508e8179J7013N2230M553l6671j242M0424M788n5135m2093J5778J8483k5897
13496f5948j6652N3521P2368k575o0967j1290P0176N2890n2716j12156n2709N3361
13484g2697R4857M9938j1347k1180J1739K3291j4832m8795j8726L9955L5697l5503
13472C2397o7595k760O9043L9050n5195q7373k8590K8216K2286j887L043Q340
13460d1025j8661l8813m020N1475N3411K57l1914J020N0807M7160o158l9342j2681
13447A1516K9395K0249l2756n4469r463M3820L7324r954l0920j5421q803j9847
$$ y = [33675, 22473, -36977, -72699, -55699, -30228, -34473, -45044, -27924, -495, -376, -21551, -28839, -17370, -8172, 2014, 30144, 52037, 23655, -34925, -47592, 1563, 32518, -7877, -58179, -41166, 11064, 15617, -21054, -22296, 18128, 22916, -32219, -74312, -58534, -40051, -65948, -82600, -29079, 43289, 40714, -20253, -31543, 38633, 91523, 38807, -73349, -126058, -72697, 22160, 72098, 60751, 39571, 51310, 74601, 59769, 10974, -7752, 32203, 67900, 32397, -35198, -37958, 31085, 70135, 14940, -72433, -101023, -72807, -50521, -52408, -49365, -41025, -59686, -98499, -102519, -51044, 2367, 2624, -29290, -28270, 22537, 69697, 63539, 24197, 11516, 40911, 61160, 28404, -26065, -35528, 8292, 45616, 35662, 4742, -10679, -19482, -39329]
13435c9329q710K7040L4792K37j8240J2103L7632R381l0083j8443K0319J9609
13423D6308j7155k9624m682J2882L863p015j2482k8854l9787q381M6671O0255
13411B1999K0447j2802o864j75j9406k7966K074L3749K8559P478L39q561l1724
13398G147l3415L968K3474k1604p2543m1183M9813R3907N2653q987l5003l5981
13386a7754k7032K957L7583K9605j7692l7884l589K8787J4870q237J008R927k2712
13373a0163n6072k1501O2510J05394O3094j9411p5078p1813j5178N1826O3148
13362G6756p65o7269n2175K3356O0201K0877l0342l4478r955M643Q937Q905q983
13349b92l2976j6482M0907O2277J26p8032p7488q583M0131K9859p74j3999o075
$$ y = [-39329, -48039, -20999, 13793, 14030, -4210, 7893, 45525, 54906, 24823, 6380, 26699, 46308, 29153, -471, -5153, 7729, 11592, 4577, -7905, -36759, -76546, -84927, -38256, 21999, 42446, 29644, 22780, 22605, 3199, -24767, -22693, 11056, 39615, 47093, 47432, 38871, 7147, -26268, -22300, 1174, -20430, -92973, -134156, -84343, 9564, 62217, 53230, 18227, -17754, -44786, -41829, -4246, 25359, 7667, -30217, -33806, -5019, 9851, 1614, 2622, 12549, -10163, -66235, -87736, -25226, 80168, 143262, 123851, 48773, -23040, -38218, 13608, 76756, 75991, 8722, -43453, -20097, 40104, 60981, 30639, -3839, -13794, -9151, -214, 8691, -292, -33268, -49750, -8843, 53434, 53560, -24472, -101960, -110543, -70412, -40553, -41327, -55326, -61401]
13336f1401K1142N1665L8155l0757p1383q989Q0580N6988n6769q2254L7972J31739
13324A06688N7200p5893q4124O869L3048k8944n0924M157L1275m321m67P4433
13312F8997R1269j9723j18315o0604O8992R0432L568m1100L064L0911j4858o0769
13300D1864m6879j4508n745O272L4783L1087k1561n4797j9125L4997M2299J8965
13288D7652R212J857k7389m6978k0626J7199J3799j0829k542K9795L6022J8106
13276F5278J7396K5113m835n6083n3874J4567O5759L6721l0655n8370l2763J721
13264a0025J1187L32n695J1632L8374L1742k0853n9932k2277N7144P8649J8178
13252A28456m0982l5486j257Q817O364J5087J0593k2134l6202j783K2408j7429
$$ y = [-61401, -40259, 11406, 49561, 18804, -52579, -61568, 19012, 76000, 19231, -63023, -25051, 106688, 163888, 87995, 3871, 10740, 43788, 14844, -36080, -31923, -648, -4969, -5436, 68997, 160266, 140543, 22228, -38376, 30616, 121048, 124616, 83516, 86580, 117491, 102633, 41864, -5015, -19523, -25268, -18996, 15787, 46874, 25313, -29484, -48609, -13612, 28687, 47652, 56864, 58721, 31332, -15646, -36272, -19073, -5274, -16103, -18645, 11150, 47172, 65278, 82674, 107787, 102952, 46869, -7005, 7562, 73321, 110042, 79387, 21017, -11746, -10025, 1162, 1494, -4201, 7431, 45805, 77547, 56694, -3238, -25515, 31629, 110278, 128456, 87474, 51988, 50731, 59548, 65912, 80999, 91592, 69458, 33256, 31473, 53881, 36452]
13240C6452n9713j6017O8883O9726j7343n9759Q39N5404P188p0268n2883L5822
13228a669O5311K137m6994o280N8679M8670k2086n5271j3712L4300K2675j9846
13216F5914k1933K0684M4041J9187m802J4111L7823J1096m0135m1720J2019M8084
13204A64369K7252o016r047n761k4570l4031R0M0295L0152p811l382M3317N5496
13191B70353L502m1385j3912M4622M8806m267l6320p727K8157J1087l5764m4247
13179B22905l462K9182J7495n458Q01J9977J4701o787q802O440N569j2681j7543
13166B62337q232j5068l2060j5898K8899L6195j5366n3792k2998K6391K2701q793
13154B04316L101M8676N5007R794k3864j2340J1935K2267L0191L8222K8490O109
$$ y = [36452, -23261, -39278, 29605, 99331, 81988, 22229, 23068, 78472, 85660, 15392, -37491, -1669, 63642, 65779, 18785, 12505, 71184, 119854, 97768, 42497, 28785, 63085, 85760, 65914, 43981, 64665, 108706, 127893, 123091, 137202, 175025, 186121, 145986, 104266, 116285, 164369, 191621, 185605, 176558, 170797, 146227, 112196, 112286, 152581, 182733, 174922, 171540, 214857, 270353, 273855, 232470, 218558, 263180, 311986, 307719, 271399, 263672, 291829, 302916, 267152, 222905, 219443, 248625, 266120, 260662, 261463, 281440, 296141, 289354, 280552, 286992, 292561, 279880, 262337, 254105, 239037, 206977, 191079, 219978, 256173, 240807, 187015, 164017, 190408, 213109, 204316, 207417, 256093, 311100, 320894, 297030, 284690, 296625, 318892, 349083, 387305, 415795, 421904]
13142D21904o487j5509l3161k6184L1397P5347K9198m5969j5178J03939J35875
13131F55172J9880p8664k7517O0192K0069q5749p3417N5699J15919K7067q4200
13120F04451r4793l6681M977J1145n785m5846p9205n2506J9664N4220K1927j8227
13108C83341l0837m6061o0193j5151P2264Q7867J027n7530L045P5899K8517p2073
13096C70115o6352L5398P5926J0082l6932J2530P2918M9278k1626n1091k4125
13085D26121J9190N4365O7719M1847n025j8331J5310M4009L5732K3054K5790L494
13073G33275n8957q9708l0318N5781O1570j0478o1091m3691j3560k3562n0434
13062D68827m9356k2153O74O210n71j5763l3431m1050l2384j3171Q867K5093K2274
$$ y = [421904, 415417, 399908, 366747, 340563, 371960, 447307, 476505, 430536, 415358, 519297, 655172, 675052, 596388, 568871, 629063, 649132, 563383, 489966, 545665, 661584, 688651, 604451, 509658, 472977, 477954, 489099, 483314, 437468, 358263, 305757, 325421, 379641, 401568, 383341, 352504, 306443, 246250, 231099, 303363, 391230, 392257, 334727, 337772, 413671, 442188, 370115, 303763, 339161, 415087, 425169, 388237, 400767, 473685, 522963, 501337, 450246, 426121, 445311, 499676, 567395, 609242, 604217, 585886, 601196, 645205, 680937, 703991, 729781, 733275, 674318, 584610, 554292, 610073, 671643, 661165, 600074, 556383, 542823, 519261, 468827, 419471, 397318, 397992, 404202, 403631, 387868, 354437, 313387, 281003, 267832, 276699, 301792, 324066]
13049C24066Q4j4054K957K7305J4213l1910n4956k6431J4721K3012Q172N459J7463
13036C10101K3481K1943K1772J0233k4462n0573k5005L3064N5095J9093k2414
13025C72328k8659k4594l3870k0939L8049P7338K1713p8630r1955P662R2920N9416
13013C90779l6083p2213k9481J5395J6311l106j5832k0810j2286J4876L2045Q854
13001B88449k6070j9752J3382P868l7595m3859K1178P7766M7523l1384o4173l0761
12989B02572P639O966j6642l2069k9265j0225J6964L2365K0258p893k4577j6452
12977A49641P719K8203K5391k480k7557k3199o976j3665k5229J0496P5759P7262
12965B75365j1210q2535m6397K7881J9760m7139m5438M2634R1962L4202l9970
$$ y = [324066, 324150, 310096, 313053, 340358, 354571, 322661, 267705, 241274, 255995, 279007, 287179, 292638, 310101, 333582, 355525, 377297, 387530, 363068, 312495, 287490, 320554, 375649, 394742, 372328, 343669, 319075, 285205, 264266, 302315, 379653, 401366, 322736, 230781, 238443, 331363, 390779, 354696, 282483, 253002, 268397, 284708, 281602, 265770, 244960, 232674, 247550, 279595, 288449, 262379, 242627, 256009, 263877, 226282, 182423, 203601, 281367, 328890, 297506, 233333, 202572, 210211, 217177, 200535, 168466, 139201, 128976, 145940, 178305, 198563, 190670, 166093, 149641, 157360, 185563, 210954, 208474, 180917, 157718, 150742, 137077, 111848, 122344, 198103, 275365, 264155, 181620, 135223, 163104, 182864, 135725, 90287, 132921, 224883, 259085, 219115]
12954B19115l2479J6739J4359l4387m8796n083L8756L6723P795p040K795J5003
12942B23500K753l3920n7949l2011K8104O1869L6161j8206n2449n0887k3808J4271
12930I7428M0395L1618o78j5563L26J4112K965j0143j213J2305L486k1137l6953
12917A16948l1493j854M2587O2211K1076m3397m5749K3069O6201K1562m0591k8138
12905A62432K9686L6809j7053n3347l1971P459K3850J7473k045k4553k2838J3310
12893A39212M1412K3905m489M652K1820o686m6271k3168L3908K5679m3940n9875
12881A06159J3573O9195L3051k3864k0072O846p054l0704j0394J7714n493m5082
12869A03875k9280K3090L6564N608j2717n885q169j4656J0257M6762L4462k3960
$$ y = [219115, 186636, 203375, 217734, 183347, 134551, 129468, 168224, 204947, 212742, 205702, 208497, 223500, 226253, 192333, 134384, 102373, 130477, 192346, 228507, 210301, 157852, 106965, 83157, 97428, 137823, 169441, 168763, 153200, 153526, 167638, 170603, 160460, 159247, 171552, 175038, 153901, 116948, 85455, 83601, 126188, 188399, 209475, 166078, 120329, 143398, 209599, 231161, 190570, 162432, 192118, 228927, 211874, 158527, 126556, 134015, 157865, 175338, 173293, 148740, 125902, 139212, 180624, 204529, 200040, 204692, 226512, 219826, 173555, 150387, 184295, 209974, 166034, 106159, 119732, 188927, 221978, 198114, 178042, 184888, 177834, 147130, 136736, 154450, 148957, 103875, 74595, 97685, 134249, 139857, 127140, 121255, 113086, 98430, 108687, 155449, 189911, 165951]
12857A65951n6130k5062K9208N8247N2145J8056k6057m0099n969K6829N368l4378
12845A68109j9459L2352L5785j3445k5758K5863N2180k599o3957m8272Q618K5083
12833A74500M105R67J4404L815j8337l579L7664M3006j51l4444k3923j15J651
12820A99563m258Q244K7447K5046J739j8143k4348k7190k9910j7590J6803M8941
12808B06344M4858O238k6517k6036j0581p367r575p52L640j5511l0900m836L5955
12795A64960K9912j5187k5189J9571N0169K5575l322O986J5488j5568l6814L28
12783B16909M1881J6098l6796k9867J8503J8933k8044l5005J2643L1425q468l3408
12771A84804k995K3394M829j0249J0010J4148k1887k5353M2368Q6961K3422p0203
$$ y = [165951, 109821, 84759, 113967, 172214, 224359, 242415, 216358, 176259, 170290, 197119, 202487, 168109, 148650, 181002, 216787, 203342, 177584, 203447, 255627, 253028, 189071, 140799, 149417, 174500, 178605, 179572, 193976, 197791, 179454, 175875, 213539, 256545, 256394, 221950, 198027, 197912, 199563, 195305, 203549, 230996, 256042, 257781, 239638, 215290, 188100, 158190, 140600, 157403, 206344, 251202, 257440, 230923, 204887, 194306, 186939, 177364, 176612, 180252, 164741, 133841, 129005, 164960, 194872, 179685, 154496, 174067, 224236, 249811, 246489, 253475, 268963, 253395, 216581, 216909, 258790, 274888, 238092, 208225, 226728, 245661, 217617, 182612, 195255, 226680, 218212, 184804, 181809, 205203, 210032, 199783, 209793, 223941, 202054, 176701, 219069, 306030, 329452, 259249]
12759B59249o9458l464P206l6698k6792M2760N3697k2425n8969J2151P6210K5670
12747B59137n5657l1033O1031P1877j4102o3858j9236K0819j7885n8011o256Q5522
12735B32348R7973K3797l6987l5067k0495k9732k2963K8286O8817L6968l2090
12724C10855m9263J58L8345J2057l2046k1978K9785M2825j2619o5907m0882L4343
12712B45673O1874J1989l4127q349L5777O269o9871p1866K4124Q9326L2837n2448
12700B71208l3664M6876L7531p1186j17508j8161R9017Q6170j7487o9829l2366
12689A80601J9823L8693L7834J7658l1454o4187k4958M5265N1221m218k1575K4955
12677B69658M2167j3041m4853J9521Q7987L9105p5280r6853K845Q7177O0039j5690
$$ y = [259249, 189791, 186327, 193533, 156835, 130043, 172803, 226500, 204075, 145106, 157257, 233467, 259137, 203480, 172447, 233478, 305355, 291253, 227395, 208159, 228978, 211093, 153082, 146826, 232348, 330321, 354118, 317131, 282064, 261569, 231837, 208874, 237160, 305977, 342945, 310855, 261592, 261750, 300095, 312152, 280106, 258128, 287913, 330738, 318119, 252212, 211330, 245673, 307547, 319536, 285409, 277060, 312837, 319106, 249235, 177369, 201493, 290819, 323656, 271208, 237544, 284420, 321951, 250765, 133257, 115096, 214113, 300283, 282796, 212967, 180601, 200424, 239117, 276951, 294609, 263155, 198968, 174010, 219275, 270496, 266278, 244703, 269658, 311825, 298784, 253931, 273452, 361439, 400544, 325264, 228411, 231256, 318433, 378472, 362782]
12665C62782m1380k1749j7877l2586k0030K1984L9735L811m6070n1021l667M6733
12653B40665N2687J9340r488r139J611j35m676M269J0107j1881m1843l3279J3190
12640B31428L9539J1127l1175k8006J5913M0548J2694l1666l5283O214L6972J4360
12628B82665k7086j6979M5167P4101J7979n6620n6388J004K1848j0896j9031K8796
12616B84560O2174L3675j477Q950K0269j6082m5453J370P2140O2360j5161n1478
12604D15847j6796R845q664j2751K7865N0844J5225k2081o228K5171J9372O91
12592D98340J2060K9682J4337o117J3797M8710M3812R547m142J758r668k9939
12580F22177j9572J2680K2503Q482L533M283j2463k0629J8581O4131L9005l6192
$$ y = [362782, 321402, 299653, 281776, 249190, 229160, 251144, 290879, 294690, 248620, 197599, 193932, 240665, 293352, 312692, 303204, 294065, 295676, 295541, 290865, 295134, 305241, 293360, 251517, 218238, 231428, 270967, 282094, 250919, 222913, 238826, 279374, 292068, 260402, 225119, 231333, 268305, 282665, 255579, 238600, 283767, 357868, 375847, 319227, 262839, 263843, 285691, 274795, 255764, 284560, 346734, 380409, 378932, 387882, 408151, 392069, 346616, 347986, 420126, 482486, 467325, 415847, 399051, 408896, 400232, 387481, 415346, 466190, 481415, 459334, 453106, 478277, 497649, 498340, 510400, 540082, 554419, 548302, 562099, 610809, 654621, 664168, 660026, 661784, 652116, 622177, 602605, 615285, 637788, 646270, 649803, 654086, 641623, 620994, 639575, 703706, 742711, 706519]
12568G06519o1001j4547J8518K726N054M8738M7780l3670q1640m131R9205P5831
12556H09382m0826q1110N299R3107Q2521K0284r154J269J8817L2994L5076R533
12544I77192j6288J4798R0541J17884N6432j1449l201M0271K9460k9314n3411
12533A212915j7897J9780K0592P105M77j0952k4666j4012J1823K998m3954n8849
12521A105360m704M7999K0883m5201m8161J5286M6794O398l0163q492J2831k4594
12509A094236o3257k4788M4670M3183j0933o344O5139Q3921M511n8315j0822P4850
12497A236051Q5755L4591m33j3016l1785k2034M7779J00581M9466m0768l6055
12486A410132N0000P5972J501o3755n4265l0724l3650j4305L2989K3455n9523
$$ y = [706519, 645518, 630971, 649489, 652215, 657269, 706007, 753787, 720117, 638477, 634346, 733551, 809382, 768556, 687446, 692745, 785852, 868373, 888657, 879503, 880772, 899589, 932583, 967659, 977192, 960904, 975702, 1066243, 1184127, 1240559, 1229110, 1225909, 1266180, 1295640, 1266326, 1212915, 1195018, 1214798, 1235390, 1242495, 1242972, 1232020, 1207354, 1193342, 1205165, 1208163, 1164209, 1105360, 1100656, 1148655, 1169538, 1124337, 1076176, 1091462, 1138256, 1144654, 1114491, 1105999, 1118830, 1094236, 1030979, 1006191, 1050861, 1094044, 1083111, 1076767, 1141906, 1225827, 1230338, 1172023, 1161201, 1236051, 1321806, 1356397, 1355964, 1342948, 1311163, 1289129, 1336908, 1437489, 1486955, 1446187, 1410132, 1460132, 1536104, 1537605, 1473850, 1419585, 1388861, 1355211, 1340906, 1373895, 1397350, 1337827]
12475A337827j03133m8822K495l1900p1979k8568K9028L017m8642k0544L9519
12464A058298J4566o3415o3049J7867N4933J2016k0620l263M043j7416j1468K3685
12452A006177J9839k3608k8888J0807J6621j7986r598M3596L8223l9177o5346
12441I50660N542N4082O446m0067o934K1403k8428o3820K507P4513L6456l8022
12429I74338k5172K0571j8420q2928l8068O1261M8007n7046p2381K6351O6487
12418I03000j6900p9159k9027L1479J4335j1767J4071K3290k8504n4807j416M0880
12406H05475O610j6363L9276P2249p081r0750m5486N0610M0355m0408l5991M9070
12394H27566O5981j0130m8146l608J6334l3460n2619J1593O0414J5186n3333n6310
$$ y = [1337827, 1234694, 1185872, 1188367, 1156467, 1084488, 1055920, 1084948, 1087965, 1039323, 1018779, 1058298, 1072864, 1009449, 946400, 964267, 1019200, 1031216, 1010596, 1007333, 1011376, 993960, 982492, 1006177, 1026016, 1002408, 973520, 984327, 1000948, 982962, 973364, 1016960, 1055183, 1016006, 950660, 956202, 1010284, 1016730, 976663, 969729, 991132, 962704, 898884, 901391, 975904, 1012360, 974338, 949166, 969737, 951317, 868389, 830321, 891582, 939589, 882543, 810162, 836513, 903000, 886100, 806941, 777914, 809393, 823728, 811961, 826032, 849322, 820818, 766011, 764595, 805475, 812085, 795722, 834998, 907247, 900166, 809416, 763930, 814540, 854895, 814487, 778496, 827566, 893547, 883417, 835271, 831663, 847997, 814537, 761918, 773511, 833925, 849111, 795778, 739468]
12382G39468k1491n181J6221O7530Q7474K7638m1562l2178J9710K2597j5773j8969
12370H45484J1389L753m0101l3421M4308R3632M0018n0412o4642n44M0541J278
12358H91283n8289n1716J4805N5434K4287k5185k0199K9648N4081K6511q531j3123
12346I19006l514k145M036K5678L6932J8491j442R527L4346L8492K7308K5047
12334A131762K1897n057l5016k5094J6882L7094J7383k21J6959M5146M7329K6865
12322A295929J3554K0845L7317M4533L1599P043l3K8033O2800N6885J2613j2604
12310A598514J2377M3006K5140j7335j0109O2575J27909J20895O9239M6297O5188
12299B143696P0385L2826k987O813L2707K2852o665n68L0115J3252n9670r9435
$$ y = [739468, 717977, 712796, 729017, 796547, 884021, 911659, 870097, 837919, 857629, 880226, 864453, 845484, 856873, 860626, 820525, 787104, 831412, 925044, 965062, 914650, 850008, 849464, 890005, 891283, 832994, 781278, 796083, 851517, 875804, 850619, 830420, 860068, 914149, 940660, 932129, 919006, 915492, 913347, 917383, 943061, 979993, 998484, 997042, 1006569, 1040915, 1079407, 1106715, 1131762, 1153659, 1148602, 1113586, 1088492, 1105374, 1142468, 1159851, 1159630, 1176589, 1221735, 1269064, 1295929, 1309483, 1330328, 1367645, 1412178, 1443777, 1450820, 1450787, 1478820, 1541620, 1598505, 1611118, 1598514, 1610891, 1653897, 1679037, 1661702, 1651593, 1714168, 1842077, 1962972, 2032211, 2078508, 2143696, 2214081, 2246907, 2243920, 2250733, 2283440, 2306292, 2299627, 2299059, 2329174, 2342426, 2282756, 2183321]
12287B183321n2252J1208O080l4721k6830J8146K0905j5200n446N7195P0314q206
12275B224514p3777l0770N9517P8656K8255J571K2920L0478O326J1051O9024J13709
12263B541474Q8512L3101K1223N9698R7076J03920J00791J16498J48481J67098
12253C477872J52395J27967J44586K10558K58887K24582J39441R2168R8949Q7795
12243E015200K6032k2366j0358M206m3628j08358j08228o8971q2901j47675j67084
12232D285869j17090q5170j09906j07400k6725L5953j5626j03896q2765L2395
12222C705639Q5035J9429m2316J372Q4898R5180L8658J908J2553L1699M6739Q2676
12210D163470J32933J52984J27364R1430Q3492J12006J63093K06974K12893J92724
$$ y = [2183321, 2131069, 2142277, 2148357, 2113636, 2086806, 2104952, 2125857, 2110657, 2105211, 2162406, 2232720, 2224514, 2150737, 2119967, 2179484, 2258140, 2286395, 2287966, 2310886, 2341364, 2347690, 2358741, 2427765, 2541474, 2629986, 2663087, 2684310, 2744008, 2841084, 2945004, 3045795, 3162293, 3310774, 3477872, 3630267, 3758234, 3902820, 4113378, 4372265, 4596847, 4736288, 4828456, 4927405, 5015200, 5041232, 5018866, 5008508, 5012714, 4969086, 4860728, 4752500, 4683529, 4600628, 4452953, 4285869, 4168779, 4083609, 3973703, 3866303, 3839578, 3875531, 3859905, 3756009, 3673244, 3705639, 3790674, 3810103, 3767787, 3769159, 3854057, 3949237, 3987895, 3989803, 4002356, 4034055, 4080794, 4163470, 4296403, 4449387, 4576751, 4668181, 4751673, 4863679, 5026772, 5233746, 5446639, 5639363]
12200E639363K04979K72931L32216L18594K72792K76651L08812K67306J38911
12191H032555L5439K8575N1035J5858n7480j05879j33247j75783k17455k26544
12181G247074k28679k56201k67160k09497j32084j26971j79227j83684j09375
12172E554196l7813k5296l6502m0769o4147j01937q6318l414N4198K7600n694
12161E234104L9016J02524P6228q757k0164O8127J39532J17326O3886O0536R0280
12150E962638R6554Q1575Q2207R9991J13779J25136J40984J42121J15560R1757
12140G052302J04357J33979J35434J04201P4507O5116O8156Q0941J06023J24234
12130H049250J10579P9795P6814J13404J49937J53527J42643J54368J91079K22799
$$ y = [5639363, 5844342, 6117273, 6449489, 6768083, 7040875, 7317526, 7626338, 7893644, 8032555, 8067994, 8096569, 8147604, 8163462, 8105982, 8000103, 7866856, 7691073, 7473618, 7247074, 7018395, 6762194, 6495034, 6285537, 6153453, 6026482, 5847255, 5663571, 5554196, 5516383, 5491087, 5454585, 5413816, 5349669, 5247732, 5161414, 5158000, 5212198, 5239798, 5234104, 5273120, 5375644, 5451872, 5443115, 5422951, 5491078, 5630610, 5747936, 5811822, 5872358, 5962638, 6059192, 6140767, 6222974, 6322965, 6436744, 6561880, 6702864, 6844985, 6960545, 7052302, 7156659, 7290638, 7426072, 7530273, 7604780, 7669896, 7738052, 7818993, 7925016, 8049250, 8159829, 8239624, 8316438, 8429842, 8579779, 8733306, 8875949, 9030317, 9221396, 9444195]
12120I444195K29569K21076K18537K31083K50654K65091K75224K93963L22299
12111A1751691L37051L21711L03438L30318M05816M74992M91461M71738M61039
12102A5349255M69870M77971M84640N12152N58952N91865N99421O17427O76826
12093B0338379P53315Q00703Q17408Q43908R00556R66482J026536J101570J210108
12084B8758965J327400J415317J481948J577895J729327J901559K042026K140942
12076D2375379K231146K336589K439503K498176K481552K380806K199310J944445
12068F0886906J630326J283554R43198O48520M12833K03467l6656l26180o06867
12059F5039101p90512q49450q38989q21198p93262p12177n64758l78121j76839
$$ y = [9444195, 9673764, 9894840, 10113377, 10344460, 10595114, 10860205, 11135429, 11429392, 11751691, 12088742, 12410453, 12713891, 13044209, 13450025, 13925017, 14416478, 14888216, 15349255, 15819125, 16297096, 16781736, 17293888, 17852840, 18444705, 19044126, 19661553, 20338379, 21091694, 21892397, 22709805, 23553713, 24454269, 25420751, 26447287, 27548857, 28758965, 30086365, 31501682, 32983630, 34561525, 36290852, 38192411, 40234437, 42375379, 44606525, 46943114, 49382617, 51880793, 54362345, 56743151, 58942461, 60886906, 62517232, 63800786, 64743984, 65392504, 65805337, 66008804, 65972148, 65645968, 65039101, 64248589, 63399139, 62560150, 61738952, 60945690, 60233513, 59668755, 59290634, 59113795]
12050E9113795K6973K07501L41725M62669O42435Q93431J133039J288191J397318
12041F5507077J555811J787427K033063K256289K489894K764541L052830L314315
12033H4761247L551344L786967M020746M238720M438987M614226M732441M771116
12025A18915794M755013M725093M678434M569139M361823M054565L651952L145035
12017A52856848K526236J811137J044942K91539m00900j038634j667662k298598
12009A53124908k866778l297164l590161l804587l968050m048338m009900l854538
12001A23685392l604253l287475k946621k612895k265168j863229j433381j060382
11993A04611988p66820m65627q4245L20036O42421Q93354J190942J594468K031122
$$ y = [59113795, 59140768, 59348269, 59689994, 60152663, 60795098, 61688529, 62821568, 64109759, 65507077, 67062888, 68850315, 70883378, 73139667, 75629561, 78394102, 81446932, 84761247, 88312591, 92099558, 96120304, 100359024, 104798011, 109412237, 114144678, 118915794, 123670807, 128395900, 133074334, 137643473, 142005296, 146059861, 149711813, 152856848, 155383084, 157194221, 158239163, 158530702, 158129802, 157091168, 155423506, 153124908, 150258130, 146960966, 143370805, 139566218, 135598168, 131549830, 127539930, 123685392, 120081139, 116793664, 113847043, 111234148, 108968980, 107105751, 105672370, 104611988, 103845168, 103379541, 103295296, 103615332, 104257753, 105151107, 106342049, 107936517, 109967639]
11984A09967639K413563K758315L137611L557600L942179M225193M411839M540576
11976A38954515M610985M565845M343320L945002L448178K941060K445475J913566
11968A67167946J298096O07893j08269q10261j486709k141173k770314l347875
11960A58409334l828121m180965m427104m616944m767387m845263m827484m748312
11952A22167754m658925m560013m407273m174652l882982l571564l268039k982069
11944I0662237k703374k410572k105939j831533j619215j434965j216590r65393
11936G6374656p48337n95420m48841k45570m152K15630M05760O08611Q38220J055902
11926G7456459J224411J342091J413859J421481J336349J144483Q56198N05837
$$ y = [109967639, 112381202, 115139517, 118277128, 121834728, 125776907, 130002100, 134413939, 138954515, 143565500, 148131345, 152474665, 156419667, 159867845, 162808905, 165254380, 167167946, 168466042, 169073935, 168965666, 168155405, 166668696, 164527523, 161757209, 158409334, 154581213, 150400248, 145973144, 141356200, 136588813, 131743550, 126916066, 122167754, 117508829, 112948816, 108541543, 104366891, 100483909, 96912345, 93644306, 90662237, 87958863, 85548291, 83442352, 81610819, 79991604, 78556639, 77340049, 76374656, 75626319, 75030899, 74582058, 74336488, 74332336, 74547966, 74953726, 75562337, 76400557, 77456459, 78680870, 80022961, 81436820, 82858301, 84194650, 85339133, 86195331, 86701168]
11918H6701168J35456k38637o30723j037445j409614j709103j968620k239515
11910G7602967k494714k652610k699497k712449k738320k723087k600832k390730
11902E6590728k160337j949510j779448j675593j616519j516087j337257j178608
11894D3377369j154067j217683j214584j095940r70260r27153r23750q88649q37396
11885C4147887q17534q13905p83773p36243p07039o89253o51490n98509n58309
11876B7791832n30079m94049m53930m25386m01731l71457l48240l43980l36828
11867B4086152l07275k79626k83005k97805k88266k61006k41091k20265j86405
11858B1721408j72673k07900k44974k19056j59130j51903k00618k17145j66034
$$ y = [86701168, 86836624, 86597987, 85967264, 84929819, 83520205, 81811102, 79842482, 77602967, 75108253, 72455643, 69756146, 67043697, 64305377, 61582290, 58981458, 56590728, 54430391, 52480881, 50701433, 49025840, 47409321, 45893234, 44555977, 43377369, 42223302, 41005619, 39791035, 38695095, 37724835, 36797682, 35873932, 34985283, 34147887, 33330353, 32516448, 31732675, 30996432, 30289393, 29600140, 28948650, 28350141, 27791832, 27261753, 26767704, 26313774, 25888388, 25486657, 25115200, 24766960, 24422980, 24086152, 23778877, 23499251, 23216246, 22918441, 22630175, 22369169, 22128078, 21907813, 21721408, 21548735, 21340835, 21095861, 20876805, 20717675, 20565772, 20365154, 20148009, 19981975]
11849A9981975j17494j26896j54628j51527j41327j61141j88543j87995j72843
11840A8579581j65036j49572j25991j43270k12425k44394j66369n6087n3699j58476
11830A7104262k24513j68184p3494n3448r7496j19430r3896o9150p1679p0582
11820A6062390m1244j0846j6584m8015o1380m2894k6680l9472n5556l6661M15
11809A5683473J957l6204n3902j9137J8084M470l1249k8865L343J1142j842K3699
11797A5574969R0142J17188O3904L953K0458P8248P8185J5026p960O2259J37907
11786A6234279J14840L0828J3687Q9919J46121J06919N1006P9815J53665J65966
11776A7187045J26216J35047J97234K10537J58102J52915K34690K81681K19690
$$ y = [19981975, 19864481, 19737585, 19582957, 19431430, 19290103, 19128962, 18940419, 18752424, 18579581, 18414545, 18264973, 18138982, 17995712, 17783287, 17538893, 17372524, 17316437, 17262738, 17104262, 16879749, 16711565, 16638071, 16584623, 16487127, 16367697, 16273801, 16204651, 16132972, 16062390, 16021146, 16010300, 15993716, 15945701, 15884321, 15841427, 15814747, 15775275, 15719719, 15683058, 15683473, 15685430, 15649226, 15595324, 15576187, 15594271, 15598741, 15567492, 15538627, 15541970, 15553112, 15551270, 15574969, 15665111, 15782299, 15846203, 15850156, 15870614, 15948862, 16027047, 16042073, 16034113, 16096372, 16234279, 16349119, 16379947, 16393634, 16483553, 16629674, 16736593, 16787599, 16867414, 17021079, 17187045, 17313261, 17448308, 17645542, 17856079, 18014181, 18167096, 18401786, 18683467, 18903157]
11767A8903157J67517K39654L37929L11664K20658K36799L51507M01783L59828
11758B1530496L66347M61766N14180M68674M50228N33271O11927O08844O21483
11749B6167216P25460Q09198P66773P02331P60470Q81295R20110R05356R66533
11740C3604742J083454J129115J115688J173253J301329J365495J351509J401109
11732D3525694J554435J670850J676897J693603J817695J954286J992232J997871
11724E7883563K092922K251995K365804K425504K505984K619677K713828K781525
11716G7640802K867668K985140L114422L266857L469653L707227L947591M205788
11708A05205148M514524M854011N179187N502526N888217O372570O939694P565423
$$ y = [18903157, 19070674, 19310328, 19648257, 19959921, 20180579, 20417378, 20768885, 21170668, 21530496, 21896843, 22358609, 22872789, 23341463, 23791691, 24324962, 24936889, 25545733, 26167216, 26892676, 27701874, 28468647, 29170978, 29931448, 30812743, 31732853, 32638209, 33604742, 34688196, 35817311, 36932999, 38106252, 39407581, 40773076, 42124585, 43525694, 45080129, 46750979, 48427876, 50121479, 51939174, 53893460, 55885692, 57883563, 59976485, 62228480, 64594284, 67019788, 69525772, 72145449, 74859277, 77640802, 80508470, 83493610, 86608032, 89874889, 93344542, 97051769, 100999360, 105205148, 109719672, 114573683, 119752870, 125255396, 131143613, 137516183, 144455877, 152021300]
11700A52021300Q244808Q993763R862161J0926319J2235294J3781953J5532936
11693B31598534J7423096J9282014K0837985K1867327K2290285K2040736K0886582
11686C76226559J8505193J4802652J0154002N305169R63208k644408n854712r139955
11678D08317708j2555498j5694909j8190693k0059106k1430684k2152277k1929005
11671B76305536k0790473j9146214j7365148j5533038j3666286j1922257j0470950
11664A67411170r321473q400768p683208p134935o645733o134983n638943n195151
11656A11255976m737900m221059l750769l457774l299586l125729k896437k700070
11648H3066652k578187k471913k344651k232068k147149k043190j904958j786340
$$ y = [152021300, 160266108, 169259871, 179122032, 190048351, 202283645, 216065598, 231598534, 249021630, 268303644, 289141629, 311008956, 333299241, 355339977, 376226559, 394731752, 409534404, 419688406, 424993575, 425956783, 423312375, 417457663, 408317708, 395762210, 380067301, 361876608, 341817502, 320386818, 298234541, 276305536, 255515063, 236368849, 219003701, 203470663, 189804377, 177882120, 167411170, 158089697, 149688929, 142005721, 134870786, 128225053, 122090070, 116451127, 111255976, 106518076, 102297017, 98546248, 95088474, 91788888, 88663159, 85766722, 83066652, 80488465, 78016552, 75671901, 73439833, 71292684, 69249494, 67344536, 65558196]
11640F5558196j718151j655403j560356j472554j442836j443522j401482j300218
11632E3563674j200648j160595j165867j153461j088302r97920r27437q82339
11624D4987105q40444q03569p92600p93193p60588o91355o33869o06874n70957
11615C8493656n12773m86280n19483n50802n25917m92178n14094n56238n52198
11606C3783693n40887o12363p41894q05892p64910p08057o96579o81598o14453
11597B7617060n31709m80712m51768m33895m50820m87713m67825l67697k79665
11588B3665256k86872l40569l38394k71044k12154k03491k26921k60472k92417
11579B1232922l02706k89238k86941l09612l10818k60319k13431k30599k70151
$$ y = [65558196, 63840045, 62184642, 60624286, 59151732, 57708896, 56265374, 54863892, 53563674, 52363026, 51202431, 50036564, 48883103, 47794801, 46796881, 45869444, 44987105, 44146661, 43343092, 42550492, 41757299, 40996711, 40305356, 39671487, 39064613, 38493656, 37980883, 37494603, 36975120, 36424318, 35898401, 35406223, 34892129, 34335891, 33783693, 33242806, 32630443, 31888549, 31082657, 30317747, 29609690, 28913111, 28231513, 27617060, 27085351, 26604639, 26152871, 25718976, 25268156, 24780443, 24312618, 23944921, 23665256, 23378384, 23037815, 22699421, 22428377, 22216223, 22012732, 21785811, 21525339, 21232922, 20930216, 20640978, 20354037, 20044425, 19733607, 19473288, 19259857, 19029258, 18759107]
11570A8759107k49903j84913j64009k03575k29858k10747j98769k18987k16342
11561A6882004j60945j17897j48506k07410k08429j49830j05011j11846j34326
11552A5537804j29971j06367j00393j26100j52982j34933o8705j5874l7323j06841
11542A4558315j33183q0384j6971j7490o2809q2216n7163k8600k2857k5816k3930
11531A4006896k2113j9784q066Q239J8493L0188M9229M6470q608q3718j08189
11520A3909037p1405m1475o5409j05742j09246q6606p6789p5178n5841l5619n0161
11509A3135566q0803p4057l3357k2141o1773r3930p3762l8751m1153o3281n5659
11498A2496899k2604q178j8930k2632j3858j9577l9598m0917k0750j7925m3137
$$ y = [18759107, 18509204, 18324291, 18160282, 17956707, 17726849, 17516102, 17317333, 17098346, 16882004, 16721059, 16603162, 16454656, 16247246, 16038817, 15888987, 15783976, 15672130, 15537804, 15407833, 15301466, 15201073, 15074973, 14921991, 14787058, 14718353, 14702479, 14665156, 14558315, 14425132, 14344748, 14327777, 14310287, 14247478, 14165262, 14108099, 14079499, 14056642, 14030826, 14006896, 13984783, 13964999, 13956933, 13965172, 13983665, 14013853, 14063082, 14109552, 14100944, 14017226, 13909037, 13837632, 13796157, 13730748, 13625006, 13515760, 13429154, 13352365, 13277187, 13221346, 13185727, 13135566, 13054763, 12980706, 12947349, 12925208, 12863435, 12769505, 12695743, 12656992, 12615839, 12552558, 12496899, 12474295, 12466117, 12447187, 12424555, 12410697, 12391120, 12351522, 12310605, 12289855, 12271930, 12228793]
11487A2228793n2713k1852M420k4159q1601r7044n2643o754j8374p7627j19497
11476A1680949r5629k9154N444l1766q9027q0603n4O5950N0096j3313m4288j4996
11464A1403609M1860Q6862R7639P0121L6182M9414J11153J45665J01354M0537
11454A2184396N8663J39145J71116J05858J1345l9435n3246o5481p8980r0026
11444A2343355j13451j43732j45817j20621j23389j76479k21488k07535j71084
11435A0919759j67503j74843j40623q6237p9692j22491j48022j30415j14577j27020
11425I628336j33032j08102q5491r5804j12237r9447p7478q9982j32307j55708
11415H538748j34404r3661p2303q1547j02176j07095q6991o1835o0685q3480r5420
$$ y = [12228793, 12176080, 12154228, 12158648, 12134489, 12052888, 11955844, 11903201, 11896447, 11878073, 11800446, 11680949, 11585320, 11556166, 11561610, 11529844, 11440817, 11360214, 11360160, 11426110, 11476206, 11462893, 11418605, 11403609, 11445469, 11532331, 11629970, 11700091, 11736273, 11785687, 11896840, 12042505, 12143859, 12184396, 12243059, 12382204, 12553320, 12659178, 12670523, 12631088, 12577842, 12512361, 12433381, 12343355, 12229904, 12086172, 11940355, 11819734, 11696345, 11519866, 11298378, 11090843, 10919759, 10752256, 10577413, 10436790, 10350553, 10270861, 10148370, 10000348, 9869933, 9755356, 9628336, 9495304, 9387202, 9301711, 9205907, 9093670, 8994223, 8916745, 8826763, 8694456, 8538748, 8404344, 8310683, 8238380, 8156833, 8054657, 7947562, 7860571, 7798736, 7738051, 7654571, 7559151]
11404G559151p1204l1485j7148l6483o0435o7827o9153p6398p4347m6611j6880
11393F991180k8242p4758r0960l7793K8983K2571n2546r8005n4423J8212K7847
11382F652066k5848o5409m6683M39L3403M4255L8787J4636k2542n1498n8762m9929
11370F462915l4061j8702j8163l8810n8398n1108k9310k3954k9107j3670J2700
11359F160332N186l3107m0863P21K6422o561l6795P415Q4744R8886M9795L0229
11347F346404P5074J10585P7078J8285M933L1936M1995Q935m8415j03081j30478
11336F433251j12122o8184n8126j08058j64267j63089j20434r8879j07928j02691
11326E329473p4575p0327j06122j30169j03006n9443m8831n9263n1167l1832l8423
$$ y = [7559151, 7487947, 7456462, 7439314, 7402831, 7342396, 7274569, 7205416, 7129018, 7054671, 7008060, 6991180, 6962938, 6888180, 6797220, 6759427, 6788410, 6810981, 6758435, 6660430, 6606007, 6624219, 6652066, 6626218, 6560809, 6514126, 6514565, 6547968, 6592223, 6631010, 6645646, 6623104, 6571606, 6512844, 6462915, 6428854, 6410152, 6391989, 6353179, 6294781, 6243673, 6214363, 6190409, 6161302, 6147632, 6160332, 6165518, 6132411, 6091548, 6092269, 6118691, 6112130, 6075335, 6082750, 6167494, 6266380, 6316175, 6346404, 6421478, 6532063, 6609141, 6627426, 6632359, 6664295, 6706290, 6715225, 6666810, 6563729, 6433251, 6321129, 6252945, 6194819, 6086761, 5922494, 5759405, 5638971, 5540092, 5432164, 5329473, 5254898, 5184571, 5078449, 4948280, 4845274, 4785831, 4737000, 4677737, 4626570, 4594738, 4556315]
11315D556315o5586p0462m7003l7644n9290o9154l0536K5105L5840j0263o2426
11304D164896o8611k9346R254O565k8433m6141j7155K5428K7033j1353l3468j1480
11292C987189J4203L406j6840J407L9786L0459m0073r7567p2775P535N3418K0809
11280C930957m1446n6384j0991L3219K0913k5777l7924O199N2172M5649K494k5134
11268C893947k4362k2131k5979j3305J7525L0434L778l2644l5046j462K9334K4949
11256C845038p733l2275j9841K0470N0744M7312K3681K166j7483m0544m9183k5115
11244C797237J2220K7244K0624K0734K7710J1763k8055m9183k4620J9944M2877
11233C878495L0855j424k5435j1232L8456P0055M0942o548N025O4163P6442J3800
$$ y = [4556315, 4490729, 4420267, 4373264, 4335620, 4276330, 4207176, 4176640, 4201745, 4237585, 4227322, 4164896, 4096285, 4066939, 4076193, 4082758, 4054325, 4008184, 3991029, 4016457, 4043490, 4032137, 3998669, 3987189, 4001392, 4004798, 3987958, 3989365, 4029151, 4059610, 4019537, 3921970, 3849195, 3856730, 3910148, 3930957, 3889511, 3833127, 3822136, 3855355, 3876268, 3850491, 3812567, 3818766, 3870938, 3916587, 3919081, 3893947, 3869585, 3847454, 3821475, 3808170, 3825695, 3856129, 3859907, 3827263, 3792217, 3790755, 3820089, 3845038, 3837305, 3805030, 3785189, 3805659, 3856403, 3903715, 3927396, 3929562, 3912079, 3871535, 3822352, 3797237, 3809457, 3836701, 3857325, 3878059, 3905769, 3917532, 3889477, 3840294, 3815674, 3835618, 3878495, 3909350, 3907926, 3882491, 3871259, 3909715, 3979770, 4020712, 4014164, 4019189, 4083352, 4159794, 4173594]
11221D173594l2667N333O5861O1298J5450P021L2084K5922q854k711N5609R0965
11209D488905N6810J070r297K7745O6295P1399M2255O940J552K9927N1316L6109
11197D871026J4228K8795O5348P8097O5459O1203O8602O7407P0299J01786J32752
11186E625002J13240O5356O2450J14573J57668J62031J64028J78548J72101J43408
11176F958405J38263J58478J50144J10670J04065J32237J06317N199n5417K522
11166G810883Q3097O0142l2302p1780l9374j4093k4171k8596j7199j4590o585
11155G705432L1624N8163K1352l2482k1147K8534K3236k7218k3234M2077O5537
11144G871874K1977J2174P1546Q8717K143o5829N405J27191J26675R019n9052
$$ y = [4173594, 4140927, 4146260, 4212121, 4273419, 4288869, 4295890, 4327974, 4353896, 4345042, 4342331, 4397940, 4488905, 4545715, 4546785, 4537488, 4565233, 4631528, 4702927, 4745182, 4752122, 4753674, 4783601, 4834917, 4871026, 4885254, 4914049, 4979397, 5057494, 5122953, 5184156, 5252758, 5320165, 5390464, 5492250, 5625002, 5738242, 5803598, 5866048, 5980621, 6138289, 6300320, 6464348, 6642896, 6814997, 6958405, 7096668, 7255146, 7405290, 7515960, 7620025, 7752262, 7858579, 7863778, 7808361, 7810883, 7893980, 7954122, 7921820, 7850040, 7810666, 7796573, 7772402, 7743806, 7726607, 7712017, 7705432, 7737056, 7795219, 7816571, 7784089, 7762942, 7791476, 7814712, 7787494, 7764260, 7806337, 7871874, 7893851, 7906025, 7977571, 8066288, 8068431, 8002602, 8008007, 8135198, 8261873, 8270892, 8211840]
11133H211840R19R2545J15593R3355Q9613J01828R8490R3814J18359J54232J60803
11122I331391J44528J46195J64939J54096J08001R5909J65717K54728K62436J95613
11112A1023553J60851K03004K40601K05185J58038J90058K71962L03197K67747
11103A3024196K35342K33401K30129K33196K84695L51688L46031K76183K53822
11094A5468683L12387L50900L16191L03521L84627M63664M29810L52060L73993
11085A8755836M80901N29496M81062M50736N15425O07676O39451O28611O49217
11076B3738411P19313P84739P87727P34641P07083P86077R44622J060497J073091
11067C1336201J064271J122987J208153J244024J276333J394658J549345J612057
$$ y = [8211840, 8212759, 8305304, 8420897, 8514252, 8603865, 8705693, 8804183, 8897997, 9016356, 9170588, 9331391, 9475919, 9622114, 9787053, 9941149, 10049150, 10145059, 10310776, 10565504, 10827940, 11023553, 11184404, 11387408, 11628009, 11833194, 11991232, 12181290, 12453252, 12756449, 13024196, 13259538, 13492939, 13723068, 13956264, 14240959, 14592647, 14938678, 15214861, 15468683, 15781070, 16131970, 16448161, 16751682, 17136309, 17599973, 18029783, 18381843, 18755836, 19236737, 19766233, 20247295, 20698031, 21213456, 21821132, 22460583, 23089194, 23738411, 24457724, 25242463, 26030190, 26764831, 27471914, 28257991, 29202613, 30263110, 31336201, 32400472, 33523459, 34731612, 35975636, 37251969, 38646627, 40195972, 41808029]
11059D1808029J603982J684391J889889K068412K133340K205374K401373K642537
11051E8437327K810348K963342L231251L579527L859127M050753M282082M597930
11043H7811687M873234M993896M991340M935271M797662M504452M056181L516375
11035A24480098K913543K224700J448100O40446j25902q14559j427859j975403
11027A27363164k448474k821764l076070l213831l248918l189328l039699k813687
11019A03511393k530436k203725j849340j498475j182394q98323o09900k97024
11011I2441776P258K55114M60475P03035J028188J370114J627339J808350K032947
11002A01734596K369147K746940L085364L426915L856207M344518M794322N210125
$$ y = [41808029, 43412011, 45096402, 46986291, 49054703, 51188043, 53393417, 55794790, 58437327, 61247675, 64211017, 67442268, 71021795, 74880922, 78931675, 83213757, 87811687, 92684921, 97678817, 102670157, 107605428, 112403090, 116907542, 120963723, 124480098, 127393641, 129618341, 131066441, 131706887, 131580985, 130766426, 129338567, 127363164, 124914690, 122092926, 119016856, 115803025, 112554107, 109364779, 106325080, 103511393, 100980957, 98777232, 96927892, 95429417, 94247023, 93348700, 92738800, 92441776, 92449034, 92704148, 93164623, 93867658, 94895846, 96265960, 97893299, 99701649, 101734596, 104103743, 106850683, 109936047, 113362962, 117219169, 121563687, 126358009, 131568134]
10994A31568134N690639O245403O754298P141019P452388P707491P797719P624072
10986A87981163P224316O664814N905596M889321L682563K403183J073362l25505
10978B19498813j712546k969376m101498n182336o158652o877198p309024p580784
10970A77607399p754865p743643p497428p120668o718643o265680n723839n171180
10962A23611453m695400m256817l782538l323204k983942k745198k481750k142933
10954I7199671j801743j527419j306066j094995q74988o36553l77257j20887J09124
10945H9568887L31128N77379Q44035J116295J410369J726881J999397K173605
10937I9747976K308339K493662K679377K703008K504570K194920J870511J479633
$$ y = [131568134, 137258773, 143504176, 150258474, 157399493, 164851881, 172559372, 180357091, 187981163, 195205479, 201870293, 207775889, 212665210, 216347773, 218750956, 219824318, 219498813, 217786267, 214816891, 210715393, 205533057, 199374405, 192497207, 185188183, 177607399, 169852534, 162108891, 154611463, 147490795, 140772152, 134506472, 128782633, 123611453, 118916053, 114659236, 110876698, 107553494, 104569552, 101824354, 99342604, 97199671, 95397928, 93870509, 92564443, 91469448, 90594460, 89957907, 89580650, 89459763, 89568887, 89900015, 90477394, 91321429, 92437724, 93848093, 95574974, 97574371, 99747976, 102056315, 104549977, 107229354, 109932362, 112436932, 114631852, 116502363, 117981996]
10929A17981996R47302L31186k52540p94716j372474j994103k570658l036551
10921A09239442l404652l693659l887829l991521m045091m051002l953520l738942
10913G8473226l494310l304718l141057k925090k671429k471591k344131k203467
10905E5917433k006521j833924j763289j739191j655685j515819j408027j351125
10897D2643852j275153j159567j076436j061045j041841r57176q55529q07444
10889C4409661p90153p43808o83313o58638o47366n92014n19309n10877n58902
10880B8705281n63219m89604m23437m29245m56227m38014l99009l91439l96988
10871B4718099l71846l39402l52880l94564l94208l37862k86950k86354l11760
$$ y = [117981996, 118929298, 119260484, 119007944, 118213228, 116840754, 114846651, 112275993, 109239442, 105834790, 102141131, 98253302, 94261781, 90216690, 86165688, 82212168, 78473226, 74978916, 71674198, 68533141, 65608051, 62936622, 60465031, 58120900, 55917433, 53910912, 52076988, 50313699, 48574508, 46918823, 45403004, 43994977, 42643852, 41368699, 40209132, 39132696, 38071651, 37029810, 36072634, 35217105, 34409661, 33619508, 32875700, 32192387, 31533749, 30886383, 30294369, 29775060, 29264183, 28705281, 28142062, 27652458, 27229021, 26799776, 26343549, 25905535, 25506526, 25115087, 24718099, 24346253, 24006851, 23653971, 23259407, 22865199, 22527337, 22240387, 21954033, 21642273]
10862B1642273l17327k91577k57408k47055k75552l13735l03281k31778j69602
10853A9234958j85296k46684k67262k35340k20548k50711k68965k39996k14752
10844A7105404k38006k63015k28731j69164j62349k00873k03195j47482j05601
10835A5386988j26704j66552j68334j46720j41721j41958j15702q3456r1545j29215
10825A4075081j39973j15019j07811j40157j60442j31504j01923j31775j85916
10816A2860561j75175r4798m5941r6973j85543k03488j39621q2114r3842j42113
10806A1600953j61072j36241j00742p9815p5134q8938j24950j62838j64403j19870
10796A0386950o7441n0669p0468r4184r9026q8018p2938o3601p0176r4330j16331
$$ y = [21642273, 21324946, 21033369, 20775961, 20528906, 20253354, 19939619, 19636338, 19404560, 19234958, 19049662, 18802978, 18535716, 18300376, 18079828, 17829117, 17560152, 17320156, 17105404, 16867398, 16604383, 16375652, 16206488, 16044139, 15843266, 15640071, 15492589, 15386988, 15260284, 15093732, 14925398, 14778678, 14636957, 14494999, 14379297, 14295841, 14204296, 14075081, 13935108, 13820089, 13712278, 13572121, 13411679, 13280175, 13178252, 13046477, 12860561, 12685386, 12590588, 12544647, 12447674, 12262131, 12058643, 11919022, 11836908, 11743066, 11600953, 11439881, 11303640, 11202898, 11123083, 11047949, 10959011, 10834061, 10671223, 10506820, 10386950, 10319509, 10268840, 10198372, 10104188, 10005162, 9917144, 9844206, 9780605, 9710429, 9616099, 9499768]
10785I499768j09938p4626l9072l0361n1774q8078j15943j13215q0294n1128n7931
10774H687408q5551r0920o8945n9855q0674r3713o8595l5904m2707q3637j14756
10763G862151j15257r8596p9229o3694o1461p3440q2926q2420q7613j00336r2348
10752F924831o0264n3172r5355j27249r2041l8576m9341r7936q7094j6845P987
10741F214945m6833q8613n9095k9751o6043j05677o6416Q868J9327m0141r2448
10730E648123j01381q6697n4558p753O574m5189j03692r0765l7546l4668p5894
10719E016554p1571j4792k438o4537j01766m8832J3449j1413q2279r1152k8790
10708D512433J5778p041n4766p2674o0280m8091n0466n6354n0045l4905l4144
$$ y = [9499768, 9389830, 9315204, 9276132, 9245771, 9193997, 9105919, 8989976, 8876761, 8796467, 8745339, 8687408, 8601857, 8510937, 8441992, 8382137, 8301463, 8207750, 8139155, 8103251, 8060544, 7976907, 7862151, 7746894, 7648298, 7569069, 7505375, 7443914, 7370474, 7287548, 7205128, 7117515, 7017179, 6924831, 6864567, 6811395, 6716040, 6588791, 6496750, 6458174, 6408833, 6310897, 6223803, 6206958, 6214945, 6168112, 6079499, 6020404, 5990653, 5924610, 5818933, 5752517, 5761385, 5780712, 5740571, 5648123, 5546742, 5460045, 5405487, 5397734, 5404308, 5359119, 5255427, 5164662, 5127116, 5092448, 5016554, 4944983, 4930191, 4927753, 4863216, 4761450, 4712618, 4726067, 4714654, 4632375, 4541223, 4512433, 4528211, 4521170, 4466404, 4393730, 4333450, 4285359, 4234893, 4178539, 4128494, 4093589, 4059445]
10697D059445n6265o9544m1721J580K747m1937p4070o0242l1951k2419k2025j9774
10685C623824l0253n1655n5800m6923o3489r1546n9099L5089P8749O465q4184
10674C261178p4882q638p517o5301o6708Q590N1000M211n3034m6339q826M847
10662B998581M849J0151l773m1509n2604j9666l710l8595o0052j5306L4384J3464
10650B826214l3566j8009L2477J4764p0522j10450n7175Q856K0842J4896K8730
10639B657057J9369m3235q8998m8707K0087J2330n6901p4964j1362L7923O422
10628B429021m6625m4866j3064j6096m3464l9269r174p437l2102k3615K5589M7052
10616B225950P295l6829l4026j6065k4014k5435J8094N4692J0258p5147q5059
$$ y = [4059445, 4003180, 3933636, 3891915, 3893495, 3896242, 3854305, 3780235, 3719993, 3688042, 3665623, 3643598, 3623824, 3593571, 3541916, 3486116, 3439193, 3375704, 3284158, 3225059, 3260148, 3338897, 3345362, 3261178, 3186296, 3177658, 3170141, 3104840, 3038132, 3046722, 3097722, 3101933, 3048899, 3002560, 2993734, 2998581, 3003430, 3013581, 3009808, 2968299, 2915695, 2896029, 2892319, 2853724, 2793672, 2778366, 2812750, 2826214, 2792648, 2774639, 2807116, 2821880, 2751358, 2640908, 2583733, 2592589, 2613431, 2628327, 2657057, 2676426, 2633191, 2544193, 2495486, 2515573, 2527903, 2471002, 2396038, 2384676, 2422599, 2429021, 2382396, 2337530, 2324466, 2308370, 2264906, 2225637, 2216463, 2209026, 2176924, 2153309, 2178898, 2225950, 2233245, 2196416, 2162390, 2146325, 2122311, 2096876, 2114970, 2169662, 2179920, 2104773, 2019714]
10605B019714j079O5130L8781j9250k9238j6717m2840p8683m7414L8270P8112
10594B004786K6506m7389o2143k4093N891R09j4030j0737O450J1656o676k3616
10582A867514l149M5096N9573P171n5118m9408O550K0282l2028o2246p030O6474
10570A863681N8481j3047m5346p913K7117J4105K79L0157O2845M1569r256k3208
10558A999464M170J8447k77j3225L621K0844R174j4293j9094p107J227J317o90
10545B003578q608k6646m1779l7976j9873m892m13m599j9663m4625o0464m3342
10533A690698L623M4346M2534q24m4600m7290j3463R913n241k7299j1935K5374
10521A665836K8761p022k0060K4574P6435P1706K2079j1599l872K1453L8667L9654
$$ y = [2019714, 2018635, 2083765, 2122546, 2103296, 2074058, 2057341, 2014501, 1935818, 1888404, 1926674, 2004786, 2031292, 1983903, 1921760, 1897667, 1903558, 1904467, 1890437, 1879700, 1886150, 1897806, 1891130, 1867514, 1864365, 1909461, 1969034, 1976205, 1921087, 1871679, 1878229, 1898511, 1866483, 1804237, 1797207, 1863681, 1922162, 1909115, 1863769, 1855856, 1882973, 1897078, 1897357, 1927514, 1990359, 2031928, 2022672, 1999464, 2003634, 2022081, 2021804, 2008579, 2012200, 2033044, 2042218, 2027925, 2008831, 2001724, 2002951, 2004268, 2003578, 1994970, 1968324, 1926545, 1888569, 1868696, 1863804, 1863391, 1858792, 1839129, 1794504, 1734040, 1690698, 1694321, 1738667, 1781201, 1780377, 1735777, 1688487, 1675024, 1684937, 1679696, 1652397, 1640462, 1665836, 1694597, 1687575, 1667515, 1692089, 1768524, 1840230, 1862309, 1850710, 1846838, 1868291, 1906958, 1946612]
10509A946612K4985J1472K6112N9545N8714O080l5226r715L9949M0920Q317O469
10497B184234K2057j6123r7232j23094o1544K426K425k3216k4725k3434m3975
10486A797799n1603k3338n926l4539o3140m5326j7483k7403m5024k5345P36j3268
10474A446140l3600o690L2328J4846l4914l7761J507N835l3872m3405K722L9190
10462A352326K1229j2324j4983L003J2984J1169M649J225J4705L6620K3566l1662
10450A422507n5275J806N9451J8350o5842n7727K9360M4907m6290r9561k9667
10439A222019N4968M0514k2272l9441l0334m6434n2338j2623P429m2051p6703
10428A002734j5293N5929J4863p7146o6153L3232N8728k9780r0366l5286M3130
$$ y = [1946612, 1971597, 1983069, 2009181, 2068726, 2127440, 2133520, 2098294, 2088579, 2128528, 2169448, 2177765, 2184234, 2206291, 2190168, 2092936, 1969842, 1908298, 1910724, 1913149, 1889933, 1865208, 1841774, 1797799, 1746196, 1722858, 1716932, 1682393, 1619253, 1573927, 1556444, 1529041, 1484017, 1458672, 1459408, 1446140, 1412540, 1405850, 1438178, 1453024, 1418110, 1380349, 1381856, 1387691, 1353819, 1310414, 1313136, 1352326, 1373555, 1361231, 1346248, 1349251, 1362235, 1373404, 1378053, 1379278, 1393983, 1430603, 1454169, 1422507, 1367232, 1369038, 1428489, 1446839, 1380997, 1323270, 1352630, 1397537, 1351247, 1251686, 1222019, 1276987, 1317501, 1295229, 1255788, 1225454, 1179020, 1126682, 1114059, 1121488, 1079437, 1002734, 987441, 1043370, 1058233, 981087, 914934, 948166, 1006894, 977114, 886748, 851462, 894592]
10417H94592L8321j7793l6898m918L3137M2384Q817n2346p8388k3891M9083L7961
10405H90061l7519n3804J5648N0996j3312p3877k8821N4358N1207k6296o6643
10394G61998l1766J9034M0763L5374j266o7730j07105o0341L3740P3330L1039
10383G27070j8115j2822K2138L6304K2844P59k2930m2976m1413j1268K4134L3670
10371G17395R359k9967n2455l3093K0229O1817N1353K393l4047l3946k1075j8345
10359F39618j1958J3576L1526M901m3344m1239K8397P9150K7049q0308j12673
10348E34695l5659M3458L8463L703K4931P0230N1212j8296m3473p592J1295j5763
10336F57204k7926K132J9917j481j3512L475l294m5734m8091J9313O6175K3487
$$ y = [894592, 932913, 915120, 878222, 873304, 906441, 948825, 957642, 905296, 826908, 803017, 852100, 890061, 852542, 798738, 814386, 865382, 852070, 778193, 749372, 803730, 854937, 828641, 761998, 730232, 749266, 790029, 825403, 824137, 756407, 649302, 588961, 622701, 696031, 727070, 708955, 696133, 718271, 754575, 777419, 778178, 755248, 712272, 670859, 659591, 683725, 717395, 726754, 696787, 644332, 611239, 631468, 693285, 744638, 747031, 712984, 679038, 657963, 639618, 627660, 641236, 672762, 677663, 634319, 593080, 621477, 700627, 727676, 647368, 534695, 499036, 542494, 580957, 584660, 609591, 679821, 731033, 712737, 669264, 661672, 672967, 657204, 629278, 631410, 651327, 649846, 636334, 639809, 636515, 590781, 542690, 562003, 628178, 651665]
10324F51665m0392l7229J7l317k7351j4050J2838J719j7347L411J8774k8589p6971
10311D43178l6433M2344M4664o648J797N4448K7448p0049q0475L4255J08365L4654
10299E97548o8476n9641J0819J8665k3737j8096L8829O1735K1769k5693l4982
10288E18740j2026J6368K1405r362l9311j6530L7712M5736L90j9824P214P965
10276E58477l4798k7112N9532R8918J0483q5088n1196M3539N2011o520j1704K7962
10264F34504R270n2629m7987J5754K3681l3748n1204j2860j0283m5113j7780N9682
10252D71287N2441m7041p6457J4893O5163j4269p5025J719Q4804K4395p8077m8611
10240C75222N4649N2611m1454o4960J225K6537j3711j4232L2788J9077n0368l8915
$$ y = [651665, 611273, 574044, 574061, 570744, 543393, 529343, 542181, 543900, 526553, 529964, 548738, 520149, 443178, 406745, 449089, 493753, 487105, 488902, 543350, 570798, 500749, 420274, 454529, 562894, 597548, 529072, 469431, 480250, 498915, 475178, 457082, 495911, 557646, 579415, 553722, 518740, 506714, 523082, 544487, 535125, 495814, 479284, 516996, 562732, 563122, 543298, 550512, 558477, 523679, 496567, 556099, 655017, 665500, 580412, 529216, 572755, 624766, 618246, 606542, 634504, 643774, 591145, 543158, 558912, 582593, 548845, 497641, 484781, 474498, 429385, 411605, 471287, 523728, 476687, 400230, 415123, 480286, 466017, 390992, 392711, 477515, 501910, 423833, 375222, 429871, 482482, 441028, 376068, 377293, 403830, 390119, 375887, 408675, 427752, 377384, 338469]
10228C38469O3612R0765j4876q5418j0250P0886J0927q7090m8963O7759O9934
10217D65755m7363r8823j3672O9018M2303j6677r028K2397n341n7618m4914J8061
10205C24098L4240j5540m3001K428N1412K4899l9544m3451K0698N6952J3555l8639
10193C48107k0411L1452K9993j7178k7629R377J9639j1091l351N8510O3893l9830
10181D41481j19660m6965P7996O3080o8280j08613l533O3042j4739p9460J9780
10170B24129J51197R4994r6993j66727l8462Q7084N5265l6068l7708J8367J7775
10159B72853k7836k2996K8557L2844k4476n1814o053M0676K2879k0318j9347J8426
10147B43395L3413Q606j5006n138K0133J9892k0117o8373p4870k4724L7539N3924
$$ y = [338469, 402081, 492846, 477970, 392552, 382302, 453188, 464115, 377025, 328062, 395821, 465755, 418392, 319569, 305897, 374915, 417218, 400541, 391513, 413910, 408569, 350951, 306037, 324098, 358338, 342798, 299797, 302225, 353637, 378536, 338992, 295541, 316239, 373191, 386746, 348107, 327696, 359148, 389141, 371963, 344334, 353711, 373350, 362259, 358908, 417418, 481311, 441481, 321821, 274856, 352852, 415932, 347652, 239039, 235506, 298548, 283809, 204349, 224129, 375326, 470320, 373327, 206600, 168138, 255222, 310487, 274419, 236711, 255078, 272853, 245017, 222021, 250578, 283422, 258946, 207132, 201079, 241755, 264634, 244316, 224969, 243395, 276808, 285414, 270408, 265270, 285403, 305295, 285178, 216805, 141935, 117211, 154750, 208674]
10135B08674K2269m519P403L0211K2791o876j9082p492q331l8315n6978j8450
10123A31305N3462P9472K5480m4460m8397L016K6841o673l4252o646L2594K5462
10111B37204j843Q029L3975J1290m4048m8267Q131L6465l139l4496J479M2459
10099B47239J2359m5182l9161J7197L5094R46j2459J8777L0868j0941n1337l8729
10087A64671l655L295q345k004J6951J7137j772j3125p822J40M08p040j9146k4633
10073A15060p726K6070M6303L5266R590q730j7921j9220n221J4795J1627j5312
10061A84581k1062J8275N5106L1792l2118o5023m0621Q71J9856J3956q467l7147
10049A19999m0363O770O5110O2025k310m0967l591M9241M2383k419j8726j1149
$$ y = [208674, 230943, 226424, 233827, 264038, 286829, 279953, 260871, 253379, 245048, 206733, 149755, 131305, 184767, 264239, 289719, 245259, 196862, 199878, 226719, 220046, 185794, 179148, 211742, 237204, 235361, 243390, 277365, 288655, 244607, 196340, 204471, 240936, 237797, 203301, 204780, 247239, 259598, 214416, 175255, 192452, 227546, 228492, 216033, 234810, 265678, 254737, 203400, 164671, 161016, 164311, 155966, 153962, 170913, 188050, 186278, 173153, 165331, 165471, 165879, 158839, 139693, 115060, 107334, 133404, 179707, 214973, 224563, 215833, 197912, 178692, 173471, 188266, 199893, 184581, 163519, 181794, 236900, 268692, 236574, 171551, 130930, 131801, 151657, 165613, 157146, 119999, 79636, 86406, 151516, 213541, 211231, 170264, 166673, 215914, 258297, 255878, 237152, 226003]
10037B26003l1317o3888l8135M0830P3188J1833n9779n2272K543K1159L621R514
10025A43300L8029L2641p051j8500J0302J6604k2078m0809R17M4103K7933r430
10013B15961k284K8168J7093k5405l1588N874K3041p871m0883l6890j2132Q197
10001A41281K2093K2223n048l7301l1066O214J9312m638j4887J3504L9406L3744
9989B04837K4760K7005K408n4543o9680k27P3165N3248k5749n3306r654K6908
9977A99172K1226J9310L9841L4393j5029n0205l0385L484L603j1176o594J139
9965B08779j1475j4987K3416O3643L8151l9548q0907m2098K1814M0332J4823q063
9953B13880j1949j6609k6655k1803j349M738j2194j4273K2135N1805J8841m7242
$$ y = [226003, 194686, 130798, 92663, 133493, 206681, 218514, 158735, 106463, 109006, 130165, 133786, 143300, 181329, 213970, 206919, 188419, 198721, 215325, 193247, 152438, 153355, 197458, 225391, 215961, 213677, 241845, 258938, 233533, 201945, 207819, 230860, 222989, 182106, 145216, 133084, 141281, 163374, 185597, 180549, 143248, 112182, 118396, 137708, 133070, 118183, 131687, 171093, 204837, 229597, 256602, 259010, 204467, 134787, 134560, 207725, 260973, 235224, 181918, 172264, 199172, 220398, 239708, 279549, 313942, 298913, 248708, 218323, 221807, 225410, 214234, 207640, 208779, 197304, 182317, 205733, 269376, 307527, 267979, 187072, 144974, 166788, 207120, 221943, 213880, 201931, 185322, 158667, 136864, 135515, 140253, 128059, 113786, 135921, 187726, 206567, 159325]
9941A59325o0166n779L2207K981l1838m418M2907K9250k6201l6564N869K1837
9929A29410j4602l4106M247M3833K8719j0696k2439j4743j7527k1113j0095n429
9917E5459j6205k345N2103Q1041K6843n4339o2796j897L4709Q288k3633j3890
9905H3338J2036J8262R855j425k0285l4236j5392K1665K3252j6187l2103Q995
9893E7775M8076K4122k6553k6617K1520M2834N220l9035l3859J1235M7291M3116
9881A75125K461m4641n6211j4449L9647L9579k0062o2928k7353M4232N7764k499
9869A30665n1834k4692L6552M8190J490l9299l5529j1630O173K8243N7173N6773
9857B02275L673o3010q3091m6972M981L5099L1273P2k9405j6304M0506Q1623N6471
$$ y = [159325, 99159, 93380, 125587, 128568, 96730, 92312, 135219, 164469, 138268, 101704, 107573, 129410, 114808, 80702, 84949, 128782, 157501, 146805, 124366, 109623, 92096, 70983, 60888, 55459, 39254, 36909, 89012, 170053, 196896, 142557, 79761, 77864, 112573, 120861, 97228, 83338, 95374, 113636, 123491, 122066, 101781, 67545, 52153, 73818, 97070, 80883, 48780, 57775, 105851, 129973, 103420, 76803, 98323, 141157, 146377, 107342, 73483, 84718, 132009, 175125, 177586, 132945, 76734, 62285, 101932, 141511, 121449, 58521, 31168, 75400, 133164, 130665, 78831, 54139, 90691, 138881, 140371, 101072, 65543, 53913, 60086, 88329, 145502, 202275, 205948, 142938, 59847, 12875, 17856, 52955, 84228, 84300, 54895, 38591, 79097, 160720, 217191]
9844B17191o951m3452l8085k2185p262J3110J4847k6109o3819l0575M1439M5760
9832I3909k9248o5987j797O2570K1880o1590n7746K6588P1283L6040k063K684
9820I6523O304j6537k3134K451Q884k3139l6029j395K1272n596k0405K4709N9228
9807I3136O407o8222m5527M9995P8248K339n7385j6420N0885M1165k2568m3657
9795F8396K217N0559M5738l002m5926l9442J1130M2303M106n5715m5078K4698
9783E9984L9845l1126o8852M512Q1959M0991m6160l2618M6123L0442p7545j01860
9771e4305R740R1370L5765l5916K588O7679K8380n9264n8546J0778K8383n013
9759F1639P218N3464K8563n7659p4090J0450P1933L5083k3852k8346j1782j6407
$$ y = [217191, 210240, 166788, 128703, 106518, 99256, 112366, 127213, 101104, 37285, 6710, 48149, 93909, 64661, -1326, -3123, 59447, 81327, 19737, -38009, -11421, 59862, 95902, 93839, 96523, 102827, 86290, 63156, 65607, 74491, 51352, 15323, 13928, 35200, 29604, 9199, 33908, 93136, 99543, 31321, -14206, 35789, 114037, 116376, 58991, 42571, 93456, 134621, 112053, 68396, 70613, 121172, 166910, 163908, 117982, 78540, 89670, 131973, 136079, 80364, 35286, 59984, 99829, 68703, -149, 4363, 86322, 127313, 81153, 48535, 94658, 125100, 47555, -54305, -44565, 46805, 82570, 46654, 49242, 116921, 145301, 86037, 27491, 38269, 66652, 61639, 68857, 122321, 150884, 93225, 19135, 29585, 101518, 136601, 112749, 84403, 72621, 56214]
9747E6214j3129J2144J1716j9292r315N1562O2994j5916p3524k2936M6832J9874
9735A07224n1062m2431K6376L5825k3797m4684R125N1261K5263j6432j4171J5264
9723G7761K7118Q676k8789o1610n4882m824L3829J9623n470J1712L2697p289o4066
9710a5514l4730O5435J04414L0421n3812n1620J487K3531N358j4493k1755j8759
9698A9963p37J9954J7093K311J4544M1745K5783l5007o9058m2581l034J5079L4613
9685D0668N3527K3321m2863n1147J9591N6851r624q0775m3154M6478N7360j0719
9673E9514n4405m2863k8101j6666K8317P4680M7792l0301n5412m959L2744R785
9661B0125j7708n008J3319R464J3557L2804J5353m9355q0928k5011N1784N5753
$$ y = [56214, 43085, 55229, 66945, 47653, 38338, 89900, 152894, 136978, 63454, 40518, 87350, 107224, 56162, 13731, 40107, 75932, 52135, 7451, 16576, 67837, 93100, 76668, 62497, 77761, 104879, 113555, 84766, 23156, -31726, -36550, -2721, 16902, 11432, 23144, 55841, 48552, -15514, -50244, 15191, 119605, 150026, 96214, 44594, 46081, 69612, 74970, 60477, 38722, 19963, 19226, 39180, 56273, 58584, 73128, 114873, 140656, 105649, 36591, -5990, -9024, 6055, 40668, 94195, 117516, 74653, 23506, 43097, 99948, 90324, 9549, -33605, 12873, 70233, 59514, 5109, -37754, -65855, -82521, -54204, 20476, 68268, 37967, -17445, -22404, 10340, 20125, 2417, -2591, 10728, 20192, 33749, 66553, 81906, 32551, -48377, -73388, -21604, 34149]
9649C4149k51l0220l259L2752L5402J3346p933j9895k6304l0761l0964j6922J4940
9636c5920M3157L8918Q195j0460Q5J1844l900l3484m0231j1818K5398L3779N014
9623C0577k4588j3861K3230K9887n346k1676J5206M5033Q253m4503k9230K5833
9611C8815K3651l2626m1307K1252N7622J5249l1939k1028j34k0442l6892j818
9599b9597L5337J4714k6247k4722p19m93j620K6353L5440j5885n5428n97Q2547
9586C9083O3256m2640r1828l4058L2573L6409J8629J6122m226m5851m1907K3999
9574c0439O6272L2888r676N84J3816k6713o3061j6730O1468N7082k7400p6317
9562a8226l6682J8608J7450j5262k0965L876K4262K6184K1026J6400J0613J820
$$ y = [34149, 33898, 3678, 419, 33171, 68573, 81919, 73986, 54091, 27787, -2974, -33938, -50860, -35920, 7237, 46155, 54350, 43890, 43975, 55819, 51919, 18435, -21796, -33614, -8216, 25563, 30577, 5989, -7872, 15358, 45245, 39899, 18223, 33429, 78462, 86715, 42212, 12982, 38815, 62466, 29840, -11467, 9785, 67407, 82656, 50717, 29689, 29555, 9113, -27779, -29597, 5740, 20454, -5793, -30515, -31234, -31727, -33347, -6994, 28446, 12561, -42867, -43464, 39083, 102339, 59699, -32129, -66187, -33614, 2795, 21424, 37546, 33320, -12531, -54438, -30439, 35833, 68721, 59045, 59629, 73445, 46732, -16329, -33059, 28409, 85491, 58091, -18226, -54908, -36300, -18850, -34112, -55077, -51201, -26939, -755, 20271, 36671, 47284, 49104]
9550D9104j2018k9382l6582k0391P414J8281M666r860m515J2689K0527J1072p245
9537C760k1163k0769o212Q887J0124J503J068J3509J9914L844k1817k6395K055
9524c1692M0329N1259J8587l5806o6172m2271J5560M7789J8925l4677m4893k337
9512f5399K8394L562k9194p12O5635P5399l44p6634o7742O216O1459N5750J1842
9499F8232k8730l4800J713M4355L4135k9752o8305k7306L7410L8733j4155m0279
9487a8749j3579J6688K1101K1016K1493l520m3456m5454n16L3117J9265o641n215
9474d450R768J2443Q402P439K091l175P578J5626j6788o7104o2182N216M9902
9461c5234K3933j0797O139L3327J1144k7770j8357K2732L2492Q858m261m990k0889
$$ y = [49104, 37086, 7704, -28878, -49269, -41855, -23574, -18908, -28768, -33283, -20594, -67, 11005, 3760, -17403, -38172, -44384, -35497, -25373, -23870, -22802, -9293, 10621, 14465, -7352, -33747, -31692, 8637, 59896, 78483, 42677, -23495, -65766, -50206, -2417, 16508, -18169, -63062, -65399, -37005, -33443, -62637, -63349, 2286, 77685, 77341, 707, -67035, -60819, 640, 56390, 68232, 39502, 4702, 6415, 50770, 84905, 55153, -13152, -40458, -3048, 35685, 21530, -18749, -32328, -15640, 5461, 26477, 47970, 44450, 994, -44460, -44976, -11859, 7406, 765, -4450, 5318, 17761, 26163, 33602, 35693, 32518, 40096, 55722, 38934, -28170, -90352, -85136, -35234, -11301, -22098, -15959, 17368, 28512, 742, -17615, 5117, 37609, 46467, 42206, 37216, 16327]
9448A6327l5906j4288K2937K5262j244j1329m324j1748k0535O098M3510L0104
9436D4864k5501m8535j4162K3240K5654J5410R597j0142m0061l8279N975M6440
9424e500M6922K2488j777k0986k7743j2543L566j0848l9455l5002M567L5350M0580
9411c81L9907L0369p878m8500m1731j713J2135k29J2507M1581K6233j8196p869
9398C6235M8378L6592o2952j10527k2773Q3802P1879j5138n3454l5232k7619k3107
9386g3916K0679N7163J8303m0588j4721O3431O4512k4410p8938l6420K6251L5698
9374A7044J4026k348j9692k9392J670N1158M9624m120l3897j4704l470j6209M786
9361A4476N9253N2411m2667j07220n0692M3296M9780q241k2594J5870K6410o132
$$ y = [16327, -19579, -33867, -10930, 14332, 13088, 1759, -2565, -14313, -34848, -28750, 14760, 44864, 19363, -29172, -43334, -20094, 5560, 20970, 30567, 20425, -19636, -57915, -51940, -5500, 41422, 63910, 62133, 41147, 13404, 861, 4427, -6421, -45876, -80878, -76311, -40961, -381, 39526, 69895, 62017, 13517, -28214, -29927, -17792, -18021, -5514, 36067, 62300, 44104, 36235, 84613, 121205, 58253, -52274, -75047, 8755, 80634, 65496, 12042, -23190, -50809, -73916, -53237, 3926, 22229, -18359, -33080, 30351, 94863, 70453, -8485, -44905, -18654, 17044, 31070, 28722, 9030, -20362, -18692, 32466, 82090, 77970, 44073, 29369, 25899, 9690, 14476, 73729, 126140, 83473, -23747, -74439, -31143, 18637, 10396, -12198, 3672, 30082, 23950]
9349B3950j4752J8759L2560j984l3048j9834P360R501j501R84R659L723j3728
9336B1649k4330j9301j405J8446K0637m067l0847k2525J8825M8399L5630n44k4038
9323C6529k4183j1144P367K2902J7560j4005m2141l0603J2262L9493K9571J2552
9311E6160J4328J0358k6604o0527l2568L9638O9593K2447l6782m2645j2689Q085
9299H794K1081L7371K8884j4175l3550P805M0679p255p2510m3136M7390N9468
9287H0846k3018o1440P201O8442K7962l5883j8570L3862J8328m5218n8685j2594
9275a8767J7979R575Q567L1253M3351K9056K846l0478n9789m3732K3783O3985
9263G7629J4270n9868n0441K8648O9626L9740O357K017j3963m7317m0165J7099
$$ y = [23950, 9198, 27957, 60517, 58533, 25485, 5651, 13011, 22512, 21011, 21995, 31654, 35377, 21649, -2681, -21982, -23387, -4941, 15696, 11629, -19218, -41743, -22918, 25481, 61111, 60567, 36529, 12346, 1202, 8569, 31471, 49031, 35026, -7115, -37718, -25456, 14037, 43608, 56160, 70488, 80846, 54242, -6285, -38853, 785, 70378, 92825, 56043, 13398, 709, 8794, 29875, 67246, 96130, 81955, 48405, 56210, 96889, 89634, 17124, -26012, 21378, 80846, 57828, -3612, 3589, 72031, 99993, 64110, 45540, 79402, 97730, 52512, -6173, -18767, -788, 8787, 17354, 48607, 91958, 121014, 123860, 93382, 33593, -10139, 13644, 77629, 91899, 32031, -18410, 10238, 79864, 119604, 125961, 127978, 114015, 66698, 26533, 43632]
9251D3632M7765O181n0206n0073j801L9914M3535R176l8691m9733M096O8684O0046
9238A32525j4986o1433l0141K7153N0079L6222r30n3956p9644k7525N9396O8771
9226A05531j5858p3227k1706O0292O2270K23l7637k9648j3673J939K9256M3361
9214A11123J6908j8748j7564O404J0507m602j3752j9228k5546o770L8629N0399
9202A27760m018n2948j8000N5198N9143j2018o0849l6083J2180K8912J9503N784
9190A24564j1327k7316k6104r208O319J7237K5907J7768j3177l6859k6783l125
9178C7896L165l465j0734k5301l0522J6481Q9941Q1901l4135j17869n4717N5714
9166H355N0793l3133l3315N3550O9599k3952q2034k8897L0538J7957L818L4330
$$ y = [43632, 91397, 97578, 47372, -2701, -4502, 35412, 78947, 88123, 49432, -301, 3795, 72479, 132525, 117539, 56106, 25965, 53118, 103197, 139419, 138489, 84533, 4889, -22636, 36760, 105531, 89673, 16446, -5260, 55032, 117302, 117525, 79888, 50240, 36567, 38506, 67762, 111123, 128031, 109283, 91719, 98123, 108630, 104028, 90276, 71048, 45502, 38732, 77361, 127760, 123742, 70794, 52794, 107992, 167135, 155117, 94268, 58185, 70365, 99277, 118780, 124564, 113237, 85921, 59817, 50609, 56928, 74165, 100072, 117840, 104663, 67804, 41021, 37896, 41061, 37596, 26862, 1561, -28961, -12480, 77461, 159362, 125227, 7358, -47359, 8355, 59148, 26015, -7300, 46250, 115849, 91897, 9863, -19034, 11504, 29461, 33279, 67609]
9154F7609K5295n6916q5285J6168J08070M6513p4658p3981K9253P1332J8123j6340
9142G5183Q948J4131k8828m7557j3973J0297M63P651M0270L1545l3080o9838k8986
9129c3774K5224K2822p963n839K2114K7201J603k0896j8837Q83K0724K2756J88
9116E6206k8988l8095k2726L399L1404M9574L3932j5293n0258l3273N816J8470
9104A0168J2945K1138K4503j0325m9244l1839K1995L8440J1347J07J3151Q97l1843
9091C1440k2288K4335K4674l5067o1551j0505L8868K5882O815L3628M7513p784
9079I5960o4065l4261L6801M6624J181j5178O683K619l1176k8700K0816M6863
9067H4167J2876l1675l5701j1229O506O072q119k4790k1822O999K9000J7507J7
$$ y = [67609, 92904, 35988, -49297, -33129, 74941, 121454, 46796, -27185, 2068, 73400, 91523, 75183, 84131, 98262, 69434, 21877, 7904, 18201, 18664, 26315, 66585, 98130, 65050, -4788, -33774, -8550, 14272, 6309, 470, 22584, 49785, 51388, 30492, 11655, 12538, 33262, 56018, 56206, 27218, -10877, -33603, -30204, 1200, 50774, 84706, 69413, 19155, -14118, -8302, 10168, 23113, 44251, 68754, 58429, 9185, -22654, -659, 37781, 49128, 49235, 62386, 63283, 31440, 9152, 33487, 58161, 23094, -38457, -48962, -10094, 15788, 22603, 56231, 103744, 95960, 31895, -2366, 34435, 81059, 82240, 67062, 73745, 76364, 45188, 16488, 37304, 84167, 97043, 65368, 29667, 18438, 24944, 31016, 22897, -1893, -23715, -16716, 12284, 29791, 29808]
9054B9808J1600K6701J462m0030l8230j439O962k0287k4039J2336L2549Q462j1797
9041e942P976K9268R008k6583k6898P142L5482L5577J2584j9379l8712k5068J1004
9028E459L1001J7263n496q899N032J7165J3431r043l2632k3734K0781M8317J8560
9015I7205k3710r473L6692K5981m6073q0470l0862K2703Q207k3983K744N5950
9003C4911M8787j6106n3146k6209J0419O041j9318j8624J4766M3192L1891p345
8991D9259k2477J4338N7598M1084k4280o0125l4985k028k898r259M310P066j7736
8978a33k4338J3363M3003K4007K824K1770L0753j6439n4995j3053M5125J4459
8966H6346o3987o1793K0891N7934R652k9854j4199j1259m7719m2774L7941R9734
$$ y = [29808, 41408, 68109, 69571, 29541, -8689, -10128, -3166, -23453, -47492, -35156, -2607, 5855, -5942, 2034, 31302, 40310, 13727, -13171, -6029, 29453, 65030, 77614, 58235, 19523, -5545, 5459, 36460, 53723, 48227, 39328, 44360, 61525, 74956, 65913, 33281, 9547, 30328, 78645, 97205, 73495, 64022, 100714, 126695, 80622, 152, -30710, -8007, 200, -23783, -21039, 34911, 83698, 67592, 14446, -11763, -1344, 4697, -14621, -33245, -18479, 24713, 56604, 49259, 26782, 41120, 98718, 139802, 115522, 55397, 20412, 18384, 15486, 6227, 10537, 17603, -133, -24471, -11108, 31895, 55902, 58726, 80496, 111249, 94810, 39815, 26762, 71887, 86346, 22359, -39434, -18543, 39391, 49043, 19189, 4990, -6269, -53988, -96762, -58821, 40913]
8954D0913O7429j593k9383l1034l7888j7507M0630O1690L261n6180m1938k996
8942d596o286r609L9843P3663J1966p0755m8501M0388M8890l4732p2136o580N8135
8929A9690M0358q548k3374k2289k7427n545M7302O2846R571m2152k9229Q361O663
8916C6227j8812j8094L414Q554k500n723j1N056J3053J9327P960o566R715L6596
8902H8196J1505n4454o3309J4408O8450J2826o9251n0321M2304P6781K2490k5074
8890G4551j1190J2376J502j0225J2176M2624M2783J2802k8123n8298m3700K5972
8878G3250Q5650N2332m9732r7452l2177N8032O3272m234m9206l2083k120o900
8866E8632k7288j6236K8048N2290J5591m7054n7237K810N7954M2620o170j1486
$$ y = [40913, 108342, 106749, 77366, 46332, 8444, -9063, 31567, 93257, 96518, 40338, -1600, -4596, -10882, -20491, 19352, 93015, 104981, 34226, -14275, 26113, 75003, 40271, -31865, -38445, 19690, 60048, 51500, 28126, 5837, -21590, -27135, 20167, 83013, 92584, 50432, 21203, 29564, 36227, 17415, -679, 2735, 11289, 8789, 3066, 3055, 8111, 21164, 40491, 48451, 41885, 51600, 88196, 99701, 45247, -18062, -3654, 64796, 77622, 8371, -41950, 354, 77135, 99625, 74551, 63361, 75737, 77239, 67014, 79190, 121814, 164597, 177399, 149276, 90978, 47278, 73250, 158900, 211232, 161500, 64048, 31871, 89903, 153175, 148941, 99735, 67652, 65532, 58632, 31344, 15108, 43156, 95446, 111037, 63983, 6746, 9556, 67510, 110130, 103960, 92474]
8854I2474K2820K8231r712l3111j3724J0529J5208K3646L8248J9339l2510n1626
8842A09812r811K9142J0494k3900j1490K6770K9012n124k5174j2057J2598L3211
8830A63483M2565K5431j0606k0597J2361L6293Q908k7804j6555J6847J2786j2892
8818B30220J03M1375M3167k87k3437l576Q828j0665j8712J1784M2822L8000J3284
8805C72906o633k2205k5039P087N3856N3932l632m8069k4577K9490M6378J9815
8793D53309o646o554J2696L3707M1853L5621L5009N1706N5716J8773j8453O912
8781G13649O6864O6884L16k6830L1546P5062J8072o3624n2131K3476M0904j8315
8769H75873n4305j9197J7446r572o8477q9927n3503J0012N6400N4805J2889k3763
$$ y = [92474, 115294, 143525, 133813, 100702, 86978, 97507, 112715, 136361, 174609, 193948, 161438, 109812, 100001, 129143, 139637, 115737, 104247, 131017, 160029, 154905, 129731, 117674, 130272, 163483, 206048, 231479, 220873, 200276, 212637, 248930, 257838, 230034, 213479, 230326, 243112, 230220, 230323, 271698, 314865, 314578, 291141, 287565, 296393, 285728, 267016, 278800, 321622, 359622, 372906, 366273, 344068, 319029, 326116, 379972, 433904, 430272, 382203, 357626, 387116, 433494, 453309, 446663, 440109, 452805, 486512, 528365, 563986, 598995, 650701, 706417, 725190, 706737, 713649, 780513, 847397, 847713, 820883, 852429, 927491, 945563, 881939, 829808, 853284, 894188, 875873, 821568, 802371, 819817, 810245, 741768, 651841, 598338, 608350, 664750, 719555, 732444, 708681]
8757G08681k5537j4209j3483k390L3112M8337R607k7795J809N4804M0012k5622
8745G87326m0557J0993L9879J4272P020M6292N4655L98j8356O6166J53982J16829
8733A238899J217l4212N2670J41847J29627N0308j716K951J7433l615m4961m9738
8721A500710K422N0826K3448n5149q7777m8949k5474p2894j16911p2264J0632
8710A108620J7766n1534q7764m0127K0240K1057j2845j6577J8128M3532K5112
8699A045608j8304l8577j6357J0978J76k5470l485O0827Q6022M2336L811J9775
8687A167340K7965k0825m7094K8047J19070R2698q193k9092L9919O3705J4946
8676A448486J6819R4063J00186j7540q9476M174J17830P2064n2469n9840L4911
$$ y = [708681, 683144, 668935, 655452, 653062, 686174, 734511, 744118, 716323, 718132, 772936, 812948, 787326, 746769, 757762, 797641, 811913, 818933, 865225, 919880, 920278, 901922, 968088, 1122070, 1238899, 1240116, 1205904, 1258574, 1400421, 1530048, 1580356, 1578640, 1581591, 1599024, 1595409, 1550448, 1500710, 1503132, 1553958, 1577406, 1522257, 1434480, 1385531, 1360057, 1287163, 1170252, 1097988, 1108620, 1126386, 1074852, 987088, 946961, 967201, 988258, 975413, 958836, 976964, 1020496, 1045608, 1027304, 988727, 972370, 983348, 983524, 958054, 954569, 1015396, 1101418, 1143754, 1147565, 1167340, 1195305, 1174480, 1127386, 1155433, 1274503, 1367201, 1359008, 1329916, 1369835, 1433540, 1448486, 1465305, 1559368, 1659554, 1642014, 1552538, 1556712, 1674542, 1746606, 1694137, 1634297, 1669208]
8665A669208N5291k3829n3533Q862L0788m3794q4715M53J07491J05777L1067l759
8653A799307J5647L1482L4643M9684N8519L8687K9220O5926R6289N4224j7271
8642B256357j8568N3576J04587Q5642M3498K3368J3477L048J2043L6331L5805
8631B649164O787Q2L5833O5929N7676M8924P3892R8545Q8671Q2618J22772J64432
8619C495325J41215Q6357Q7064J31617J13158J813r5159q9258l3687k7972p5327
8608C735146j10264j12051j09814j11729j06052j06477j25945j30417q9488m5802
8598B687107n4878q1933n1482J7787L4170j3343l8230q461P337j8799j4364N0532
8586B515443Q4721K8435k9217N379O9340N7977J5913N7758J53491J65741Q4406
$$ y = [1669208, 1724499, 1700670, 1647137, 1655999, 1686787, 1642993, 1558278, 1558731, 1666222, 1771999, 1803066, 1799307, 1814954, 1846436, 1881079, 1930763, 1989282, 2027969, 2057189, 2123115, 2219404, 2273628, 2256357, 2237789, 2291365, 2395952, 2481594, 2525092, 2548460, 2561937, 2564985, 2577028, 2613359, 2649164, 2655951, 2656033, 2691866, 2757795, 2815471, 2864395, 2938287, 3036832, 3125503, 3208121, 3330893, 3495325, 3636540, 3722897, 3809961, 3941578, 4054736, 4056549, 3961390, 3872132, 3838445, 3810473, 3735146, 3624882, 3512831, 3403017, 3291288, 3185236, 3078759, 2952814, 2822397, 2732909, 2687107, 2632229, 2550296, 2498814, 2516601, 2550771, 2537428, 2499198, 2490737, 2498074, 2479275, 2464911, 2515443, 2600164, 2628599, 2599382, 2604761, 2674101, 2732078, 2747991, 2805749, 2959240, 3124981, 3209387]
8575C209387N1520J33407K27695K41992K22491K41501K80110K96207L04581L13597
8565E522488K74547J70975P4971L8435R760o2268j26283j24122j10624j67076
8555E500803k56620k85354k62224k71725l14317l05052k28141j67450j66047j68992
8545C074881j34636r9076r1172p8208m4686m0334r1188j33854j03325l1732N665
8534B232335N82J066J8658J3811k9609o7547m7423K5859Q6215P1536P3l4281K6329
8521B297604J15624J24363O1366M8975J35857K10694J65640O2328L7855R8275
8511C358581J20855M6796m3445o7633n4779p4131j24815j55398j48667j31688
8501B725676j26315j33152j47556j57753j43296j04017p1954o7367o6726m7719
$$ y = [3209387, 3260907, 3394314, 3622009, 3864001, 4086492, 4327993, 4608103, 4904310, 5208891, 5522488, 5797035, 5968010, 6042981, 6081416, 6091176, 6028908, 5902625, 5778503, 5667879, 5500803, 5244183, 4958829, 4696605, 4424880, 4110563, 3805511, 3577370, 3409920, 3243873, 3074881, 2940245, 2841169, 2749997, 2671789, 2627103, 2586769, 2495581, 2361727, 2258402, 2226670, 2232335, 2232917, 2233983, 2252641, 2266452, 2236843, 2169296, 2121873, 2147732, 2233947, 2305483, 2305556, 2271275, 2297604, 2413228, 2537591, 2598957, 2647932, 2783789, 2994483, 3160123, 3222451, 3260306, 3358581, 3479436, 3526232, 3482787, 3415154, 3360375, 3286244, 3161429, 3006031, 2857364, 2725676, 2599361, 2466209, 2318653, 2160900, 2017604, 1913587, 1841633, 1774266, 1707540, 1659821]
$$ [...]
##END NTUPLES=NMR SPECTRUM
##END=
