##TITLE=1H ikalashn
CA-9301-1
19.11.2024
##JCAMPDX= 6.0         $$ Bruker NMR JCAMP-DX V2.0
##DATA TYPE= NMR SPECTRUM
##DATA CLASS= NTUPLES
##ORIGIN= UXNMR, Bruker Analytische Messtechnik GmbH
##OWNER= root
$$ TOPSPIN		Version 1.3
$$ 2024-11-19 15:48:08.281 +0400  Irina@DPX200
$$ Compression mode = diff/dup
##.OBSERVE FREQUENCY= 200.131300845
##.OBSERVE NUCLEUS= ^1H
##.ACQUISITION MODE= SIMULTANEOUS
##.ACQUISITION SCHEME= undefined
##.AVERAGES= 8
##.DIGITISER RES= 18
##SPECTROMETER/DATA SYSTEM= spect
##.PULSE SEQUENCE= zg
##.SOLVENT NAME= CDCl3
##.SHIFT REFERENCE= INTERNAL, CDCl3, 1, 17.49637
##AUDIT TRAIL= $$ (NUMBER, WHEN, WHO, WHERE, WHAT)
$$ ##TITLE= Audit trail, TOPSPIN		Version 1.3
$$ ##JCAMPDX= 5.01
$$ ##ORIGIN= Bruker BioSpin GmbH
$$ ##OWNER= Irina
$$ $$ F:/spectra/data/iren/nmr/1H/4/pdata/1/auditp.txt
$$ ##AUDIT TRAIL=  $$ (NUMBER, WHEN, WHO, WHERE, VERSION, WHAT)
(   1,<2024-11-19 15:47:45.625 +0400>,<Irina>,<DPX200>,<TOPSPIN 1.3>,
      <created by zg
	started at 2024-11-19 15:47:08.421 +0400,
	POWCHK disabled, PULCHK disabled
       terminated by command 'halt'
       configuration hash MD5:
       BE 6D 3F 07 2A EA 11 49 91 17 2B D3 AF B3 58 0D
       data hash MD5: 16K
       65 CE 56 E7 0D A7 66 4F E7 A9 21 28 60 C9 F7 22>)
(   2,<2024-11-19 15:47:48.437 +0400>,<Irina>,<DPX200>,<TOPSPIN 1.3>,
      <Start of raw data processing
       fp BC_mod = 2 FT_mod = 6 PKNL = 1 PHC0 = 320.6451 PHC1 = 5.217594 SI = 32K 
       data hash MD5: 32K
       DE EF A3 70 41 2D 30 E1 62 1C B0 13 6F A9 F5 2C>)
$$ ##END=
$$ 
$$ $$ hash MD5
$$ $$ D0 E3 D3 81 E3 14 3A A6 38 B6 CB 34 4E CF 99 D0
##$RELAX= 
##$RELAX= 
##$RELAX= 
##$RELAX= 
##$RELAX= 
##$RELAX= 
##$RELAX= 
##$RELAX= 
##$RELAX= 
$$ Bruker specific parameters
$$ --------------------------
##$DU= <F:/spectra>
##$EXPNO= 4
##$NAME= <1H>
##$PROCNO= 1
##$TYPE= <nmr>
##$USER= <iren>
##$AMP= (0..31)
100 100 100 100 100 100 100 100 100 100 100 100 100 100 100 100 100 100 
100 100 100 100 100 100 100 100 100 100 100 100 100 100 
##$ANAVPT= -1
##$AQSEQ= 0
##$AQ_mod= 1
##$AUNM= <au_zg>
##$AUTOPOS= <>
##$BF1= 200.13
##$BF2= 200.13
##$BF3= 200.13
##$BF4= 200.13
##$BF5= 200.13
##$BF6= 200.13
##$BF7= 200.13
##$BF8= 200.13
##$BYTORDA= 1
##$CFDGTYP= 0
##$CFRGTYP= 5
##$CHEMSTR= <none>
##$CNST= (0..63)
1 1 145 1 1 1 1 1 1 1 1 1 1 1 1 1 1 1 1 1 1 1 1 1 1 1 1 1 1 1 1 1 1 1 
1 1 1 1 1 1 1 1 1 1 1 1 1 1 1 1 1 1 1 1 1 1 1 1 1 1 1 1 1 1 
##$CPDPRG= <>
##$CPDPRG1= <>
##$CPDPRG2= <>
##$CPDPRG3= <>
##$CPDPRG4= <mlev>
##$CPDPRG5= <mlev>
##$CPDPRG6= <mlev>
##$CPDPRG7= <mlev>
##$CPDPRG8= <mlev>
##$CPDPRGB= <>
##$CPDPRGT= <>
##$D= (0..63)
0 2 0 0 0 0 0 0 0 0.06 0 0.03 0 0 0 0 0.0002 0 0 0 0 0 0 0 0 0 0 0 0 0 
0 0 0 0 0 0 0 0 0 0 0 0 0 0 0 0 0 0 0 0 0 0 0 0 0 0 0 0 0 0 0 0 0 0 
##$DATE= 1732016862
##$DBL= (0..7)
120 120 120 120 120 120 120 120 
##$DBP= (0..7)
150 150 150 150 150 150 150 150 
##$DBP07= 0
##$DBPNAM0= <>
##$DBPNAM1= <>
##$DBPNAM2= <>
##$DBPNAM3= <>
##$DBPNAM4= <>
##$DBPNAM5= <>
##$DBPNAM6= <>
##$DBPNAM7= <>
$$ [...]
##$SW_h= 4401.40845070422
##$TD= 16384
##$TD0= 1
##$TE= 300
##$TE2= 300
##$TE3= 300
##$TEG= 300
##$TL= (0..7)
0 120 120 120 120 120 120 120 
##$TP= (0..7)
150 150 150 150 150 150 150 150 
##$TP07= 0
##$TPNAME0= <>
##$TPNAME1= <>
##$TPNAME2= <>
##$TPNAME3= <>
##$TPNAME4= <>
##$TPNAME5= <>
##$TPNAME6= <>
##$TPNAME7= <>
##$TPOAL= (0..7)
0.5 0.5 0.5 0.5 0.5 0.5 0.5 0.5 
##$TPOFFS= (0..7)
0 0 0 0 0 0 0 0 
##$TUNHIN= 0
##$TUNHOUT= 0
##$TUNXOUT= 0
##$USERA1= <user>
##$USERA2= <user>
##$USERA3= <user>
##$USERA4= <user>
##$USERA5= <user>
##$V9= 5
##$VALIST= <valist>
##$VCLIST= <CCCCCCCCCCCCCCC>
##$VD= 0
##$VDLIST= <DDDDDDDDDDDDDDD>
##$VPLIST= <PPPPPPPPPPPPPPP>
##$VTLIST= <TTTTTTTTTTTTTTT>
##$WBST= 1024
##$WBSW= 25
##$XGAIN= (0..3)
0 0 0 0 
##$XL= 0
##$YL= 0
##$YMAX_a= 329832
##$YMIN_a= -495803
##$ZGOPTNS= <>
##$ZL1= 120
##$ZL2= 120
##$ZL3= 120
##$ZL4= 120
##$ABSF1= 0
##$ABSF2= 0
##$ABSG= 0
##$ABSL= 0
##$ALPHA= 0
##$AQORDER= 0
##$ASSFAC= 0
##$ASSFACI= 0
##$ASSFACX= 0
##$ASSWID= 0
##$AUNMP= <proc_1d>
##$AXLEFT= 0
##$AXRIGHT= 0
##$AXTYPE= 0
##$AXUNIT= <>
##$AZFE= 0.1
##$AZFW= 0.1
##$BCFW= 0
##$BC_mod= 2
##$BYTORDP= 0
##$COROFFS= 0
##$CY= 7568.61572265625
##$DATMOD= 1
##$DC= 0
##$DFILT= <>
##$DTYPP= 0
##$F1P= 17.9538593292236
##$F2P= -4.03888763876832
##$FCOR= 0.5
##$FTSIZE= 32768
##$FT_mod= 6
##$GAMMA= 0
##$GB= 0
##$INTBC= 0
##$INTSCL= 1.367314e-010
##$ISEN= 128
##$LB= 0
##$LEV0= 0
##$LPBIN= 0
##$MAXI= 945.577
##$MC2= 0
##$MEAN= 0
##$ME_mod= 0
##$MI= -402.1523
##$NCOEF= 0
##$NC_proc= -7
##$NLEV= 6
##$NOISF1= 8.587773
##$NOISF2= 6.764455
##$NSP= 0
##$NTH_PI= 0
##$NZP= 0
##$OFFSET= 17.49637
##$PC= 1
##$PHC0= 320.6451
##$PHC1= 5.217594
##$PH_mod= 1
##$PKNL= yes
##$PPARMOD= 0
##$PPDIAG= 0
##$PPIPTYP= 0
##$PPMPNUM= 100
##$PPRESOL= 1
##$PSCAL= 0
##$PSIGN= 0
##$REVERSE= no
##$SF= 200.13
##$SI= 32768
##$SIGF1= 16.12182
##$SIGF2= -4.496377
##$SINO= 3.521527
##$SIOLD= 32768
##$SREGLST= <1H.CDCl3>
##$SSB= 0
##$STSI= 32768
##$STSR= 0
##$SW_p= 4401.40845070422
##$SYMM= 0
##$S_DEV= 0
##$TDeff= 16384
##$TDoff= 0
##$TI= <>
##$TILT= no
##$TM1= 0
##$TM2= 0
##$TOPLEV= 0
##$USERP1= <user>
##$USERP2= <user>
##$USERP3= <user>
##$USERP4= <user>
##$USERP5= <user>
##$WDW= 0
##$XDIM= 32768
##$YMAX_p= 314200088
##$YMIN_p= -1781869
$$ End of Bruker specific parameters
$$ ---------------------------------
##NTUPLES= NMR SPECTRUM
##VAR_NAME=  FREQUENCY,     SPECTRUM/REAL,   SPECTRUM/IMAG
##SYMBOL=    X,             R,               I
##VAR_TYPE=  INDEPENDENT,   DEPENDENT,       DEPENDENT
##VAR_FORM=  AFFN,          ASDF,            ASDF
##VAR_DIM=   32768,         32768,           32768
##UNITS=     HZ,            ARBITRARY UNITS, ARBITRARY UNITS
##FACTOR=    0.134324425510551, 1,           1
##FIRST=     4401.40845070422, -1288809,     -1318429
##LAST=      0,             -1228657,        -1517027
##MIN=       0,             -1781869,        0
##MAX=       4401.40845070422, 314200088,    0
$$ Real data points
##PAGE= N=1
##DATA TABLE= (X++(R..R)), XYDATA
$$ [...]
20433h88818R7620K1201k398N8336Q939j62712j83788L8288K13080J31954q100
20422f76398J9287R4874K9143p5819l9699N7839M3762m5416q7357r7858r7908
20411h75550O293J74232J44483j27671k61662j9417K45480J25042j65374j50583
20401i04727J11520J67061n9558k04606j05222L8543J00827J27863N7443j55624
20391h26480k25376R5906M36704K42703k74858l74160K4104K18494n9661k18716
20381i61340Q7368L20940L7933k98832j31886K31709J95491j20506j92294l150
20371h34567P9259J4243J177k6521j78431j84474J49070L87546Q9566l37924k10266
20360a051322K79987L70097J995j74312L346K5396k17732k09318J48962K69376
$$ y = [-888818, -791198, -769997, -772395, -714059, -705120, -867832, -1051620, -1013332, -800252, -668298, -676398, -657111, -562237, -533094, -608913, -648612, -590773, -547011, -592427, -679784, -777642, -875550, -869257, -695025, -550542, -678213, -939875, -959292, -713812, -588770, -754144, -904727, -793207, -626146, -685704, -890310, -995532, -956989, -856162, -728299, -670856, -826480, -1051856, -955950, -519246, -276543, -551401, -925561, -901457, -682963, -742624, -961340, -873972, -553032, -515099, -813931, -945817, -714108, -518617, -639123, -831417, -834567, -755308, -741065, -739888, -766409, -944840, -1129314, -980244, -592698, -503132, -841056, -1051322, -771335, -401238, -399243, -573555, -570209, -544813, -762545, -971863, -822901, -553525]
20350e53525l2756j56995J58798K91064j38852m92102j77250L04362K05455k19220
20340h11021k21731J52957K35762q8297k76013q9672J35355J68162J37560R6799
20330e60139n7311k08372j15469R9722P9255j51800k07577k550J24207N059j20172
20319a115147n4377R7952K00181K27227J09823j69543l29817q5258L11310L16554
20309d91095o7385k47401M3078L32779J58183k64768m31108k40351K0531J27432
20299a060105Q2480M415K7218J61812K16646N7972j07740l1266R4351q7311l91344
20288a032872k74641K22520M15331N6139k49624n9711J93707K2658k44926q2788
20278a034207K67127K15612j38670j93426J23523K75321L5229k06154j32098O9272
$$ y = [-553525, -586281, -743276, -584478, -293414, -432266, -924368, -1101618, -797256, -591801, -811021, -1032752, -879795, -644033, -732330, -1008343, -1098015, -962660, -794498, -656938, -560139, -617450, -825822, -941291, -841569, -762314, -914114, -1121691, -1124241, -1000034, -994975, -1115147, -1169524, -1071572, -871391, -644164, -534341, -703884, -1033701, -1118959, -807649, -491095, -558480, -805881, -762803, -430024, -271841, -536609, -967717, -1208068, -1187537, -1060105, -977625, -973210, -945992, -784180, -567534, -509562, -617302, -648568, -554217, -641528, -1032872, -1307513, -1084993, -669662, -613523, -863147, -922858, -729151, -706493, -951419, -1034207, -767080, -551468, -690138, -883564, -760041, -484720, -449491, -655645, -787743, -718471]
20268g18471J02409l0185j44716j09974P5108K32725J26507j70946k55110N154
20258h87499J71067p5791l33878j12538L01088K90018n8000j45551Q3626J32995
20248f34463q0687j27504M4013R701k26757j49663K50029L12155j27110l53862
20238a084148Q216L31879R3883k39268j14458J36395J5426j79382J5604K71409
20228g44444P7183k34943p5860K48901N1708m19978l33988K48968M36148J8689
20218g27616k50997k9001J21008j14925k30535P9036L02764N9239k01843m2355
20208a035225J79870K2416k09965n4545K34954J46008j74983j99202P9896K10871
20198g99905O3284p8964p4737l5867Q730Q9509P2026j08637j71995R2184L44805
$$ y = [-718471, -616062, -646247, -790963, -900937, -825829, -593104, -466597, -637543, -892653, -887499, -716432, -792223, -1126101, -1238639, -937551, -647533, -705533, -851084, -767458, -634463, -715150, -842654, -798641, -788940, -1015697, -1165360, -915331, -603176, -730286, -1084148, -1075932, -744053, -650170, -889438, -1003896, -867501, -852075, -1031457, -1015853, -744444, -667261, -902204, -978064, -729163, -677455, -1097433, -1431421, -1182453, -746305, -727616, -978613, -1007614, -886606, -1001531, -1232066, -1153030, -850266, -791027, -992870, -1035225, -855355, -832939, -1042904, -1097449, -862495, -716487, -891470, -1090672, -1010776, -799905, -736621, -815585, -890322, -926189, -917459, -827950, -755924, -864561, -1036556, -944372, -599567]
20187e99567J56680k46177k89953K3098J46919p8982k03526K5103K50857J42034
20177f73514r1008j06611M0053Q8104M015n7504l8168m948j1139n0960o5237J7756
20165i49161J34244P6663j67294k40710Q2091M05405K12739k64905l11686J38359
20155h84255L60587J5606l05279j00145K10677O5110k44303j14103K70550K43205
20145d82350j69500k76462R6743L18784J7833l32736k22009J29682K24517L9701
20135f55797j08025j09322o4901L474P9971J4437k06244k71893L604K71545J18946
20124i24205k20983j49820L47369N94585K01447l56440m21853m3656J99255M0971
20114g33330k11059k05342J5382J79639J55902L4542m3026l9225l2491r7269j68910
$$ y = [-599567, -442887, -689064, -979017, -955919, -809000, -887982, -1091508, -1066405, -815548, -673514, -764522, -871133, -831080, -742976, -738961, -796465, -834633, -839581, -850720, -901680, -966917, -949161, -814917, -738254, -905548, -1146258, -1064167, -658762, -446023, -710928, -1022614, -884255, -523668, -508062, -813341, -913486, -702809, -637699, -882002, -996105, -725555, -482350, -651850, -928312, -831569, -512785, -494952, -827688, -1049697, -920015, -695498, -655797, -763822, -873144, -938045, -934571, -854600, -840163, -1046407, -1318300, -1314696, -1043151, -924205, -1145188, -1295008, -947639, -353054, -151607, -508047, -929900, -973556, -774301, -733330, -944389, -1149731, -1134349, -954710, -798808, -764266, -807292, -846517, -879008, -976277, -1145187]
20103a145187r5628J19986K40743R4220j37987j36676Q6886J93825K8949j47117
20093h97986p7813Q9355O1411j19621j58057Q855J24097L7125p5970k8137Q3937
20082i52804P1701k7010k4880J00625J63996M5213j31447j43710N5186K53239
20072e89891J99012p8886k45413o4045K34735K04620j80129m21364j79190K18231
20062i02320K33802j04317k75911n4225K09931J80377J2388P351J00945K5815
20052e66164j89416k42126l8326J62774J35900l1639j36611j25946m8458Q4124
20042i95888K32392K49853M9688k05261k51927o3464J11981Q0361n8619p4245
20032i25129P6575J94941R7534j41103k51206p9633J99595K60744K9255j97159
$$ y = [-1145187, -1240815, -1120829, -880086, -785866, -923853, -1060529, -973643, -779818, -750869, -897986, -975799, -886444, -825033, -944654, -1102711, -1093856, -969759, -932634, -1008604, -1036741, -952804, -881103, -908113, -932993, -832368, -668372, -623159, -754606, -898316, -843130, -589891, -390879, -469765, -715178, -779223, -544488, -339868, -519997, -941361, -1120551, -902320, -668518, -772835, -1048746, -1102971, -893040, -712663, -700275, -692924, -591979, -566164, -755580, -997706, -1036032, -873258, -737358, -768997, -905608, -1031554, -1080012, -995888, -763496, -513643, -463955, -669216, -921143, -984607, -872626, -792265, -850884, -925129, -848554, -653613, -556079, -697182, -948388, -1028021, -828426, -567682, -538427, -735586]
20022g35586j26239J24958J83715m9420k55907j55809J11901K25020J19877j8778
20012e76268r1447j49790j75975o8956J17194J68327K3921j14019q0368L9876
20002i07505J03248J13028R9675J145j59483j74590L8632K03863M9355k25838
19992h58470j96920J33030L11629J10744j66961j94287p0943l7070m2371Q3769
19982i27850K45208K12538K2956r5496j25735k29431l38055j77835K16421M10803
19972g86476J86089j07072p6142J30795J23117q2040j43143j1486J4446j34572
19962h86484j47711J00045K72804J12335j24325r2792P6448L5712j75306k17325
19952a046599l2684R3604K7977n7425m5694j7130J0985J19840K09188O6322k00860
$$ y = [-735586, -861825, -736867, -553152, -602572, -858479, -1014288, -902387, -677367, -557490, -576268, -667715, -817505, -993480, -1062436, -945242, -776915, -752994, -867013, -947381, -907505, -804257, -691229, -591554, -590409, -749892, -924482, -885850, -681987, -632632, -858470, -1055390, -922360, -610731, -499987, -666948, -861235, -932178, -969248, -1011619, -927850, -682642, -470104, -447148, -542644, -668379, -897810, -1235865, -1413700, -1197279, -786476, -600387, -707459, -783601, -652806, -529689, -611729, -754872, -766358, -751912, -886484, -1034195, -934150, -661346, -549011, -673336, -766128, -689680, -653968, -829274, -1046599, -1079283, -985679, -957702, -1015127, -1060821, -1077951, -1066966, -947126, -737938, -671616, -872476]
19941h72476k09644Q6241K61017Q4330j21003n5255P4173M363p4760P9496K26413
19930e17105M5321k20709j26657J79415J73481j45911k57330j0985J58464J8311
19920g03705j15634j7284O6231n8590j52317l996J81318J64625L7351o8225k12583
19909h82809l28659j39238K88438M05167o412l77374j89250K15815K32440l8560
19899h20442q7562Q7608R8075m7834k7579Q7336l0714k29183p3996K65549J84507
19888e94235k60558l32592J27066L63713j0463l26716o763M30985K49021k86750
19878f47292m11096j16937p427j67495r7614K91255M66781J75202j58386j38715
19868h11724O2853J19522K9251o5363j55389k20199j18036J47867L11896J99628
$$ y = [-872476, -1082120, -995879, -734862, -650532, -771535, -826790, -752617, -748254, -823014, -743518, -517105, -471784, -692493, -819150, -639735, -466254, -612165, -869495, -880480, -722016, -703705, -819339, -836623, -770392, -828982, -981299, -985295, -803977, -639352, -602001, -670226, -882809, -1211468, -1350706, -1062268, -657101, -663513, -1040887, -1230137, -1014322, -781882, -820442, -908004, -820396, -722321, -770155, -797734, -710398, -741112, -970295, -1044291, -778742, -594235, -854793, -1187385, -1060319, -696606, -707069, -1033785, -1040548, -609563, -360542, -647292, -1058388, -1175325, -1182752, -1350247, -1447861, -1156606, -689825, -514623, -673009, -811724, -748871, -629349, -600098, -665461, -820850, -1041049, -1159085, -1011218, -699322, -499694]
19858d99694k3071j26384j19074j03348n2754O1688J15781K2717p0917J505J38895
19847f54656J23819k6600r9136l5892p256j06987j93024j25704L549K2012m8700
19836a148575l1323J23951K55461K16443M8946j18990k11856j69806N2316L04187
19826f79246K50672j79254n09092k48757L55569N58238J49729k57306j73468P9088
19816f53827J3589j80590l7992K78133J97089k50544l99048j3971L13560J07171
19806f26430k67355k24872J46789L07947R9151j38744j51651m6743J0182K9319
19796h62407O5192Q0777K8997m7154n0886O0787J92480J54818j06056l49058k89614
19785a122124j2902J12250j6913q3229J15287L10172J94699p8970j65573o8445
$$ y = [-499694, -522765, -649149, -768223, -871571, -924325, -862637, -746856, -724139, -795056, -793551, -654656, -530837, -557437, -656573, -692465, -699721, -806708, -999732, -1125436, -1121887, -1099875, -1148575, -1179898, -1055947, -800486, -584043, -535097, -654087, -865943, -1035749, -983433, -679246, -428574, -607828, -1116920, -1365677, -1010108, -451870, -302141, -559447, -732915, -653827, -640238, -820828, -858820, -580687, -383598, -634142, -1033190, -1047161, -733601, -626430, -893785, -1118657, -971868, -663921, -564770, -703514, -855165, -901908, -891726, -862407, -797215, -716438, -687441, -734595, -785481, -724694, -532214, -377396, -483452, -832510, -1122124, -1135026, -1022776, -1039689, -1122918, -1007631, -697459, -502760, -581730, -747303, -815748]
19775h15748m3182j12792p6719P0781J21333M0120J2970Q4541Q9146j2640n7879
19764g00069q746l0098j45589j44473L3253J42886M9625j8356J19014K17877j5802
19753e00478l79622m00705l1847K74209K21839L7938L9122J44338P4004j53795
19743f74997k40159p9164Q2574M2752n0288K6519J66487Q3169j90523k71885J2082
19732a093433L16207K34219j28633l04182r0903K30919L04337Q8405j87010k79436
19722i09510j12843J53800K29324J0906k24210j45066J42176K03923q2032l18183
19712a051715j67472J56275K28045J9924j37974q0676K7772K8275k0896j4442
19702a012884L2883O1605O0939L6596K534J7940J04563J37378j1102k12056j84995
$$ y = [-815748, -858930, -971722, -1048441, -977660, -856327, -816207, -803237, -718696, -629550, -642190, -700069, -708815, -738913, -884502, -1028975, -995722, -852836, -803211, -821567, -702553, -484676, -500478, -880100, -1280805, -1312652, -1038443, -816604, -778666, -739544, -595206, -521202, -674997, -915156, -994320, -911746, -868994, -919282, -892763, -726276, -643107, -833630, -1105515, -1093433, -777226, -543007, -671640, -975822, -1066725, -835806, -531469, -443064, -630074, -909510, -1022353, -868553, -639229, -628323, -852533, -997599, -855423, -651500, -733532, -1051715, -1219187, -1062912, -834867, -814943, -952917, -1033593, -1005821, -977546, -998442, -1012884, -980001, -918396, -857457, -820861, -818327, -800387, -695824, -558446, -569548, -781604, -966599]
19691i66599P5488K19570L4580k13780j69844O7868J22589l4338m3954J99864
19681g08556L05431R330l29426k42811J04956J79115n8629j21948J30061K22141
19671e10336r7499l47287q9921K79403J44537k77406k51513K43862M32051r467
19661d83576m19299k13987K18519K06006j59870k89357o4179J17106R1078R1176
19651i06383J88223J47713p5373j92532p0220N0379j8788j23966q5213J4022M4440
19640a027698O4579J36313J44349R522j17341q3579J3055N799n7874l1582M8234
19629h96223K3293j04117j55613l4859J49664K26911J33888m8200j71884j63193
19619a040333r7589p0625k2663J47026L03393J76137j78835l24691n1809K52194
$$ y = [-966599, -891111, -671541, -636961, -850741, -1020585, -952717, -830128, -864466, -908420, -708556, -403125, -393795, -723221, -966032, -861076, -681961, -740590, -862538, -732477, -510336, -607835, -955122, -1045043, -765640, -621103, -898509, -1150022, -906160, -474109, -483576, -902875, -1116862, -898343, -692337, -852207, -1141564, -1205743, -1088637, -997559, -906383, -718160, -570447, -645820, -838352, -908572, -858193, -876981, -1000947, -1086160, -1072138, -1027698, -963119, -826806, -682457, -672935, -790276, -873855, -860800, -855001, -912875, -944457, -896223, -872930, -977047, -1132660, -1167519, -1017855, -790944, -657056, -705256, -877140, -1040333, -1137922, -1208547, -1231210, -1084184, -780791, -604654, -783489, -1108180, -1159989, -907795]
19609i07795J48539j84098k38119K5517J62489J381j11558N0499K09266R3559
19599g50320q2671j5356J39363M0355k24461k66287l9412J13772N9578M5475J78469
19588h01495J88030p4259k94501j63862J21479J84147N4670L6000J36852Q6284
19578e26655j34187k17847m3500J42879J57910J15295R7632k1190k29281k34069
19568h93013N7277K63562P8755k15942j97084J7326K1110j45444r0251J83686
19558i20018K42594j3550j58047K0946J64722O556j48684M005J84985P876l11277
19547i19892k78705O4024K23640N4494q2092K8224J54464Q8257l0805l2716m845
19536g35952o4069j20718o4729L2841P2165Q3731R3948L3945p4780n9905J04438
$$ y = [-907795, -759256, -943354, -1181473, -1155956, -993467, -992086, -1103644, -1053145, -843879, -750320, -832991, -848347, -708984, -668629, -893090, -1159377, -1198789, -1085017, -1025439, -979964, -801495, -613465, -687724, -982225, -1146087, -1024608, -840461, -785791, -749791, -612939, -526655, -660842, -878689, -922189, -779310, -621400, -506105, -408473, -429663, -658944, -893013, -835736, -572174, -493419, -709361, -906445, -889119, -868009, -1013453, -1103704, -920018, -677424, -690974, -849021, -828075, -663353, -656797, -805481, -801476, -616491, -608615, -919892, -1198597, -1134573, -910933, -856439, -938531, -910307, -755843, -667586, -698391, -731107, -735952, -800021, -920739, -985468, -952627, -880462, -796731, -702783, -668838, -743618, -803523, -699085]
19525f99085J59530n3865k68786j38834K14114L29406O0257k29648k01008J4909
19515h13010Q1460l3806o8507Q3881J99980P9672j31651j53315M923O2313q5231
19504g73291j89722m4233J68899J45985o5557j46279m994J06225K0299r4625m2013
19493i19306Q9585J03763Q246n1772m4492l1440Q676J18456J78288J8914k68988
19482g90070l59404j10623K10357K54428L1395j38355p3407N6403L4638n4117
19472i38755K5751K32618K41618n2595k97645j67594J28489J53007p0900j01640
19462h47646J79148L39101R1098k18558j52144J22924J17238j95346l56950j48306
19452a069441J23568J45552K3062J2493J12805J38602L3307q1524q9925O474J07946
$$ y = [-699085, -539555, -593420, -862206, -1001040, -786926, -457520, -397263, -626911, -827919, -813010, -731550, -765356, -833863, -749982, -550002, -470330, -601981, -755296, -750373, -688060, -773291, -963013, -1007246, -838347, -692362, -757919, -904198, -909192, -802967, -782668, -877293, -919306, -829721, -725958, -717712, -769484, -813976, -845416, -836740, -718284, -539996, -521082, -790070, -1149474, -1260097, -1049740, -795312, -763917, -902272, -975679, -919276, -884638, -938755, -913004, -680386, -438768, -491363, -789008, -956602, -828113, -675106, -746006, -847646, -668498, -329397, -238299, -456857, -609001, -486077, -368839, -564185, -921135, -1069441, -945873, -800321, -777259, -764766, -651961, -513359, -480052, -561576, -651501, -645027, -537081]
19441e37081R3128n6832j93838j57912M071J01182P3637L8539M8606R858r7829
19430f74471j27865q014J08836P3597l6314p1454m2604l3259j2714P1472J20795
19419f31995K0304j23771j07445M0508Q4857m5762j48719p3910N7962Q2368M5895
19408g99708O3270O8075o5133k23774j50827J33414K69064N6335k08364j38345
19398i95993J54073K12191n1474j95937N2564L30757J84069k00803k61913O0479
19388g11987K26738n3979l67918k33377J83096L38728Q3904k05045j83602P5767
19378h47675K62810J83886q4179k72651j79781P0333J35189p8977k37786n4610
19368a103441K48243K50045l2468j89425n8542P6019m077j16751l1941J42310
$$ y = [-537081, -443953, -500785, -694623, -852535, -848464, -747282, -673645, -635106, -586500, -576642, -674471, -802336, -810350, -701514, -627917, -664231, -735685, -778289, -811548, -824262, -752790, -631995, -611691, -735462, -842907, -802399, -717542, -763304, -912023, -985933, -927971, -845603, -799708, -736438, -668363, -733496, -957270, -1108097, -974683, -705619, -649284, -857648, -995993, -841920, -629729, -681203, -877140, -824576, -493819, -309750, -510553, -772466, -711987, -485249, -539228, -907146, -1140523, -957427, -618699, -534795, -739840, -923442, -847675, -584865, -400979, -485158, -757809, -937590, -867257, -732068, -811045, -1048831, -1103441, -855198, -605153, -637621, -827046, -885588, -809569, -813646, -930397, -962338, -820028]
19358h20028J59869J9819q4857p4904l2610j9303k0309k8758m9064m4302K4226
19347i70221J29604K05216J97338P6725j16609k30267j30860Q7325J71862M3734
19337e36153r8762p8769K6233M9847k5747j10732j40034o6964J12726K42844J21938
19326e03573j53710k21218J2519J67466k7141k66106j51775J37420J45810q1968
19316i42276r1092J75140K61200j8223k56646j28244J21299J44969K8211J4645
19306f91017N1482k0779r9799j7766J03455N3311p9356o4737O2113R1818K0505
19295e90770P029M5291N015p5665n3818K8529K4092k3915J8926O6473n0771k08194
19283h07778j35700R4834J47395j3988p9107M9923J18259K9402J4577J36313J14457
$$ y = [-820028, -660159, -640340, -725197, -800101, -832711, -852014, -872323, -901081, -950145, -994447, -970221, -840617, -635401, -438063, -361338, -477947, -708214, -839074, -751749, -579887, -536153, -634915, -713684, -687451, -637604, -663351, -774083, -914117, -981081, -868355, -625511, -503573, -657283, -878501, -865982, -698516, -725657, -991763, -1143538, -1006118, -860308, -942276, -1033368, -858228, -597028, -615251, -871897, -1000141, -878842, -733873, -705662, -691017, -639535, -660314, -760113, -777879, -674424, -621113, -700469, -765206, -703093, -611275, -590770, -583741, -538450, -533435, -609100, -662918, -634389, -610297, -634212, -615286, -548813, -599584, -807778, -943478, -848644, -701249, -715237, -794344, -744421, -626162, -596760, -582183, -445870, -331413]
19272c31413j26224k24651j757J65720k5049k46700r2878K05117J80382n5261
19262e52714m1415J78010J27685k22751l58005q9219J37321K3916r2918J18220
19252g71870L72820K45162j20287k62319j29390n5456j27280p3524J83944L10903
19242d27297O5904k87451l16053K027K75963K25582j7764j73223j78185j51541
19232i82038j14830K0228J90571J60487j19084l35038j89029J87848M08371L16467
19222d56047Q1330j09301k01597j74489m6500L6316l3697j01512L9357K48780
19212g17360J86976j28271k85398r1792J44019J03999r2318j38443K1169K03953
19202g93466K39815P3108j84011k39913N8276L66890J98615l04494m59815o4599
$$ y = [-331413, -457637, -682288, -684045, -518325, -543374, -790074, -882952, -677835, -497453, -552714, -594129, -416119, -288434, -511185, -869190, -958409, -821088, -797172, -890090, -771870, -399050, -153888, -274175, -536494, -665884, -721340, -848620, -922144, -738200, -427297, -361393, -648844, -964897, -962870, -686907, -461325, -479089, -652312, -830497, -982038, -1096868, -1076640, -886069, -725582, -844666, -1179704, -1368733, -1180885, -772514, -456047, -374717, -484018, -685615, -860104, -906604, -870288, -903985, -1005497, -966140, -717360, -530384, -658655, -944053, -1035845, -891826, -787827, -880145, -1018588, -997419, -793466, -553651, -480543, -664554, -904467, -846191, -479301, -280686, -585180, -1044995, -1109594]
19192a109594K70847J12967j18218N0551K90943R7552k47788j57603J82565J25504
19182e02274k59817k83048J38071L13287k5163k85047m7982K88405K72587P7782
19172c13199O193m1751j73270j63702N5256J18731j26702k53340J2754K51594
19162f27436O9480j94720q8446J47533P4696j05065L1981K64981J12265k15279
19152e30010j34542K22678J80567k71410l97028M3029L83196J58876k02527j79430
19142g26601N6587J01619k984k3001j0510q6102j07953L9619J46363K8919j16123
19131g00167n4560Q2171P5519J5580O3498Q7386q0485k48395j31199J46287K03744
19120e40621k7896k41558k08321o978J71331K15694J20040j4335m9975O206P754
$$ y = [-1109594, -838747, -725780, -843998, -793447, -502504, -404952, -652740, -810343, -627778, -502274, -762091, -1045139, -907068, -593781, -618944, -903991, -951973, -663568, -390981, -313199, -307006, -348757, -522027, -685729, -630473, -511742, -638444, -891784, -879030, -627436, -557956, -752676, -841122, -693589, -618893, -723958, -691977, -426996, -314731, -530010, -664552, -441874, -261307, -532717, -929745, -886716, -503520, -344644, -547171, -726601, -670014, -568395, -571379, -594380, -604890, -690992, -798945, -759326, -612963, -584044, -700167, -754727, -672556, -597037, -581457, -517959, -430573, -511058, -759453, -890652, -744365, -540621, -568517, -810075, -1018396, -1025374, -854043, -638349, -518309, -532644, -582619, -576413, -568659]
19109e68659o7620o0568N9052R1480k4955n4517J05257J70658m5076k32833p1870
19098f99651J84954R7024k13743k45870O2461K57806J08520j10160j40629p8658
19088g77946o2288l8557J5028o830p8422j8887J48305J47494r0240k47767q7435
19077a097545J91116K62258J04958p5084j50893j15831R442J43009J50505J4640
19067e63425j25906j73905j54267o6349J22028K80981J88318j00160k21997l355
19057h18037K66930K40056l6275k57350k66698j28267M4904J52565J29093M2354
19047f30725L8698J05534P6791n5351r4678p655j7172j69302j67653J08970K90462
19036e22081O8363k62270k46466J2455P9086n9815l2772J94432K22444p7960l01487
$$ y = [-568659, -636279, -696847, -637795, -546315, -571270, -625787, -520530, -349872, -394948, -627781, -699651, -514697, -417673, -631416, -877286, -814825, -557019, -448499, -558659, -699288, -777946, -840234, -878791, -863763, -870593, -949015, -967902, -819597, -672103, -762343, -1010110, -1097545, -906429, -644171, -539213, -614297, -765190, -881021, -871579, -728570, -578065, -563425, -689331, -863236, -1017503, -1083852, -961824, -680843, -492525, -592685, -814682, -818037, -551107, -311051, -347326, -604676, -871374, -999641, -954737, -802172, -673079, -630725, -592027, -486493, -409702, -465053, -559731, -567386, -584558, -753860, -921513, -812543, -522081, -453718, -715988, -962454, -949999, -870913, -930728, -963500, -769068, -546624, -624584, -926071]
19025i26071j41821J48139J86127J2579p7030j5652K2353k7735l1162Q6374J77592
19014e86307N6486k13946l19842o5466L08331L59462K9065k55239j78739M8482
19004h17713J03563O4090J51202K28302L1458k72449k88154o5348j2262j61024
18994a038335j20856J71755K85111M5885j50061l4800J06536K6354l3801J26709
18984f15503K17865j411k18923j10326O6572k8688j57712L0558K64282R4334k42812
18973g01764j93932J11073P9621k48653k35444K10625M38567J63424j10686l8622
18963e25791M1823j08717j43317J17207K13228j14317l32508j5391L31795J10705
18953d25283k97175j84045K26517J81261k38607k42594K53226M33974k6936m12678
$$ y = [-926071, -1067892, -919753, -733626, -721047, -798077, -813729, -791376, -819111, -850273, -763899, -586307, -529821, -743767, -1063609, -1129075, -820744, -461282, -432217, -687456, -866195, -817713, -714150, -650060, -498858, -270556, -239098, -511547, -799701, -865049, -877311, -1038335, -1159191, -987436, -702325, -656440, -806501, -841301, -734765, -708411, -742212, -615503, -397638, -399049, -617972, -728298, -661726, -690414, -848126, -817568, -553286, -458952, -701764, -895696, -784623, -705002, -953655, -1189099, -978474, -539907, -376483, -487169, -525791, -483968, -592685, -736002, -618795, -405567, -519884, -852392, -867783, -535988, -425283, -722458, -906503, -679986, -498725, -737332, -979926, -726700, -292726, -319662, -732340]
18943g32340j63822K52542J94993j42159j83419P3565J83681J6982j56485j57034
18933h13496l8709J09890J82787N2383j83744j93761P9092K09680o2910l25921
18923i84709r8016L47459L48361j16413l94011j51022K05228K31658M4798k8297
18913e94964K2513J2353o5117p5501k610M8360K0731n1142r5522m0000J12270
18902g08629K27357J79685L1784o6769j08150j63100j62209l139J75454J42199
18892d55517k6288m7937O2479J5071j79253j52200J39150K04896j93615n49258
18882a182472l36477J76931L65009J73930M0035R6732Q6356l1582q875J35898
18872d84515P8704j92064k67955K13K22701R9926j27948j37840j6945K1726M7643
$$ y = [-732340, -896162, -643620, -448627, -590786, -774205, -700640, -516959, -499977, -656462, -813496, -852205, -742315, -559528, -507145, -690889, -884650, -805558, -595878, -658788, -984709, -1082725, -735266, -386905, -503318, -897329, -1048351, -843123, -611465, -566667, -594964, -572451, -560098, -625215, -700716, -703326, -654966, -634235, -685377, -780899, -820899, -708629, -481272, -301587, -269803, -336572, -444722, -607822, -770031, -773170, -597716, -455517, -481805, -529742, -467263, -452192, -631445, -783645, -644495, -439599, -633214, -1182472, -1518949, -1342018, -977009, -803079, -763044, -666312, -579956, -611538, -620413, -484515, -405811, -597875, -865830, -865617, -642916, -542990, -670938, -808778, -825723, -803997, -756354]
18861g56354J65781J74650j05612l92481k79019J21346L11217J33334p1660m5489
18851g44287O6229P3424M8846R4768J01451l1337j50459p9020O1262K7829j26559
18840f57853j10722J21854K45475M6585k14575j64167J18387K06401k9437k23987
18830f62039q0895J76247J60720q8261j97655l8139J36225J28083N0167N1666
18820c63881P0214J634r2596j05402o2208m2272l9664j2253L3161P9053J12134
18809d22080O7336q9845k06584q7294J57190J77361r1267k73156j01223J80681
18799f88881K16265O0503j1904J5313j4594m8244O3641J81071L6517k57859k98797
18788g46969j9662J88132Q0481r8422m5847J51324K06961M4325j76391k77126
$$ y = [-756354, -590573, -415923, -521535, -914016, -1193035, -1071689, -760472, -627138, -698798, -744287, -678058, -604634, -555788, -461020, -359569, -390906, -541365, -620385, -559123, -531294, -657853, -768575, -646721, -401246, -354661, -569236, -733403, -615016, -408615, -438052, -662039, -742934, -566687, -405967, -494228, -691883, -730022, -593797, -465714, -415547, -363881, -293667, -292033, -384629, -490031, -552239, -594511, -634175, -646428, -613267, -534214, -422080, -354744, -444589, -651173, -738467, -581277, -403916, -495183, -768339, -869562, -688881, -472616, -412113, -424017, -408704, -423298, -471542, -407901, -226830, -190313, -448172, -746969, -766631, -578499, -498018, -596440, -642287, -490963, -284002, -239677, -416068, -693194]
18778f93194j74662P5395K54457J64323r2629k00465o0739Q3445M4938l0071O1933
18767e67269K34239K35687M291k62270l19661q6616K60845L81450J09563k79835
18757b89576l50500p0962J56558Q4116p7753o4875N6375J02244P3014J8117j17824
18746d81066k69208j64840K27741M58193J69760l14838m09511r1722J50082Q9655
18736f35754j3202M0960J02584L1646n7437n0026j0155J4790Q0551J43232O4539
18725b88272r0859p9305R5173J26149o9992j49993Q9916L04054J10898k62477
18715b14708k91725L8727K14805k2699l16692k57412M4521J88359O5688o5646
18705f16782q002J29997J47012K8714p8559p8058q792L9018J4357p2372j51268
$$ y = [-693194, -867856, -792461, -538004, -373681, -466310, -666775, -727514, -644069, -599131, -629202, -567269, -333030, -97343, -93052, -355322, -674983, -761599, -500754, -119304, -9741, -289576, -640076, -711038, -554480, -470364, -548117, -612992, -556617, -454373, -381359, -363242, -481066, -750274, -915114, -687373, -229180, -59420, -374258, -783769, -875491, -725409, -635754, -648956, -607996, -505412, -473766, -531203, -581229, -591384, -576594, -496043, -352811, -288272, -379131, -458436, -363263, -237114, -307106, -457099, -367183, -63129, 47769, -214708, -506433, -467706, -252901, -275600, -592292, -849704, -805183, -616824, -551136, -616782, -624784, -494787, -347775, -319061, -397620, -475678, -484470, -445452, -431095, -503467, -654735]
18694f54735j29736P359J48494J77855J24461R6838R8649M3631n9256j08259j09750
18683c64449j69020k34129j03188J99187L31076J17231j42290j18661L6571j6653
18673d64325k02107j54112J38897K82697R6278j42598j64907m8591L6187Q3045
18663e39536J03291K2711j20941j41214n041P9912O351o6196j6944L7199m63j9862
18651f60733N2921Q2348k3130j18941o5937N1661J07458J16124J05666M1480k0046
18640c31129K4299N6317j31310l62867k14992K30264L43914o1926l36278j8801
18630h02509L68934J84115k54923k38096J21955J55785j49693j76064J70859K96487
18620c23150p177k26519o5981J08045L4045o073J54275J88755n7058j88576K5737
$$ y = [-654735, -784471, -777112, -628618, -450763, -326302, -229464, -130815, -87184, -146440, -254699, -364449, -533469, -767598, -870786, -671599, -340523, -223292, -365582, -484243, -447672, -464325, -666432, -820544, -681647, -398950, -302672, -445270, -610177, -658768, -622581, -539536, -436245, -413534, -534475, -675689, -680730, -600818, -594467, -660663, -677607, -640408, -640871, -660733, -607812, -525464, -548594, -667535, -733472, -681811, -574353, -458229, -352563, -311083, -331129, -306830, -250513, -381823, -744690, -959682, -729418, -385504, -447430, -783708, -802509, -433575, -249460, -504383, -742479, -620524, -464739, -614432, -790496, -619637, -323150, -330327, -556846, -622827, -514782, -480737, -486810, -332535, -143780, -200838, -389414, -363677]
18609c63677J83902m4744l16377k14750O1481J31434P1306Q7923K0746k49161
18599f31917l33232P2594N05123L43034j91122l61964m6956K06714J31852J0738
18589b95136J3035l9105j77801j77252k5853L2788j0870O3762J86384O0034k06507
18578e76521j65075J67373K45709p1318k28108P8580L46874J14489k59094k18015
18568e65106Q0735J17457r6472j39487L4496Q4068n2662q5110N1259R0376m1983
18557e22429q9816N2838J52548N4886p9669r6559p0644o2432L5033K27811K80169
18546a18264N7056k11223k28612l4503J05210Q0925N592j6225J0042N5355R2460
18535b02187O1062n6396j49966j02087K8813P5720O341l8941K6178J02658O1244
$$ y = [-363677, -179775, -224519, -540896, -755646, -694165, -562731, -491425, -403502, -382756, -631917, -965149, -892555, -387432, -44398, -235520, -597484, -644440, -437726, -305874, -295136, -282101, -321206, -499007, -676259, -702112, -669324, -680194, -616432, -430048, -370014, -576521, -741596, -574223, -328514, -399832, -627940, -549360, -202486, -87997, -347091, -565106, -484371, -366914, -463386, -602873, -568377, -484309, -536971, -622081, -570822, -480446, -522429, -612245, -559407, -406859, -351973, -431642, -528201, -598845, -661277, -626244, -398433, -118264, -61208, -272431, -501043, -535546, -430336, -349411, -343819, -360044, -350002, -294647, -202187, -141125, -197521, -347487, -449574, -420761, -345041, -338700, -377641, -351463, -248805, -187561]
18524a87561p3733j71728j57198n2603Q0395J68000J43012J9562q6005q6469l4985
18513d39313k0973j7280M0030Q0999L550q0051M3322K78963K38640j65892m51740
18502d89745j96475K97118L88166K2692k28326p5251Q9465q8013l00176r2893
18492f73438L33158L68139p5877m07948k09539K03407K86872J3781j93382j02242
18482d57069Q8881J30399N0793P552J7826L637j8376J3522K8125q8672k28597
18471d51979j37720J61260K90156M2716k50447j67448J73099K86602M1788j95344
18461b07317j51357J9059Q6350O6139L2275n3814j43283m8822J99611K69144L5877
18450A03862j51773k4825J32596l5306l02124j98566J86924L13673L2451k35909
$$ y = [-187561, -261294, -433022, -590220, -642823, -562428, -394428, -251416, -231854, -317859, -404328, -439313, -460286, -477566, -437536, -356537, -352987, -433038, -389716, -110753, 127887, -38005, -489745, -686220, -389102, -936, 21756, -206570, -281821, -192356, -280369, -580545, -673438, -340280, 27859, -48018, -455966, -665505, -462098, -175226, -161445, -354827, -457069, -368188, -237789, -186996, -179444, -161618, -157981, -176357, -162835, -134710, -223382, -451979, -589699, -428439, -138283, -95567, -346014, -513462, -340363, -53761, -11973, -207317, -358674, -339615, -253265, -187126, -154851, -208665, -351948, -400770, -201159, 67985, 103862, -47911, -72736, 59860, 24554, -277570, -476136, -289212, 24461, 56912, -178997]
18440a78997k05294p4486m7622l399J45906K00856N0635o0667N5421J62957j4668
18429C0642k81855k30803J11284K86892O6041k32639j94969J35514L38442J74792
18419B03341j15004j41565J09946K63936Q1696k07878k50789n5417R6990R1593
18409G6849L9764r731r1475j05469O2892K24775R1837j85378j48913K05968L24951
18398D86070l8656l84682k42377J00656J13952j28443j70261L5688J48817R2613
18388A3377J00410J75446O9088j83103k26366K8280K44701J94129K9931p8562
18378C67331j76745k53923j40804J44062L01201J91498M4788M6151M6372j02208
18368D67723k40238j81186k0572Q0968J59459K41197J51085j69498l99283k38197
$$ y = [-178997, -384291, -458777, -506399, -509798, -363892, -163036, -112401, -173068, -117647, 45310, 30642, -251213, -482016, -370732, -83840, -17799, -250438, -445407, -309893, 28549, 203341, 88337, -53228, 56718, 320654, 402350, 194472, -56317, -111734, -14744, 76849, 116613, 106882, 15407, -90062, -27170, 197605, 289442, 104064, -44849, 161119, 486070, 447414, 62732, -179645, -78989, 34963, -93480, -263741, -228053, -79236, 13377, 113787, 289233, 358321, 175218, -51148, -22868, 221833, 415962, 445893, 367331, 190586, -63337, -204141, -60079, 241122, 432620, 477408, 523559, 569931, 467723, 227485, 46299, 25727, 106695, 266154, 507351, 658436, 488938, 89655, -148542]
18358a48542J15704K43188J06057M885M7400N4516l8172o9036J8672O3718j9288
18347C79102j06923j07303r1961j06770p2045L9657J20681J10780R0203J13216
18337C68637J12009M0339l9338p3746p4763k0806J18606K24349J17527j23415
18327F49399j91624j6910Q1874r1048k34779j1263L46432L13813j22920m03411
18317C19563j89713J99028L14280J64803J7115p8205k09427k61311n9240K24367
18307D41260K20085n4745j59089J00298L35400J56315k19546k80386L5506K88665
18297H63763J86331p7275j87367j11013k990N7983P3208K3401p1554r7727M540
18286F61300J18421J04536M446l7583N025L4424M118l3062m1005m2351m0219r549
$$ y = [-148542, -32838, 210350, 316407, 321292, 368692, 423208, 385036, 316000, 334672, 398390, 379102, 272179, 164876, 72915, -33855, -105900, -66243, 54438, 165218, 255421, 368637, 480646, 520985, 481647, 407901, 333138, 312332, 430938, 655287, 772814, 649399, 457775, 440865, 522739, 431691, 196912, 185649, 532081, 845894, 722974, 319563, 129850, 328878, 643158, 807961, 825076, 746871, 537444, 276133, 216893, 441260, 661345, 606600, 447511, 547809, 883209, 1039524, 819978, 539592, 575098, 863763, 1050094, 972819, 785452, 674439, 671449, 729432, 802640, 826041, 754487, 656760, 661300, 779721, 884257, 888703, 851120, 856145, 890569, 894687, 861625, 820620, 778269, 738050, 728501]
18274G28501J5416m6826j78677k18081m1366K44763L80144K41728k418r2310j044
18263A029830N0076o2080j46429J9360K92029L01465m370k36105j11798J31497
18253A263475J08901j26555j92535J3638J78382R3826k6877O4593K15280J02954
18243A695082k22973l50736q7275K40017K17611q9891k42419m5048J95659J33441
18233A443468j22633j98438j5939J32345O9596j9105M7995J19079j8786k30923
18223A206659k01473P0845K47621J38858n2810o6048N5557Q0879n6512j87402
18213A236174j58227k6982L8578L133Q421J31270K02609L6540k04691j45116K28201
18202A349910M31207J42312k85902l12172R686J68390P222j05777M4715J79498
$$ y = [728501, 743917, 697091, 518414, 300333, 258967, 503730, 883874, 1125602, 1123184, 1030874, 1029830, 1079906, 1017826, 871397, 890757, 1182786, 1484251, 1479881, 1243776, 1131978, 1263475, 1372376, 1245821, 1053286, 1066924, 1245306, 1339132, 1312255, 1376848, 1592128, 1695082, 1472109, 1121373, 1034098, 1274115, 1491726, 1401835, 1159416, 1114368, 1310027, 1443468, 1320835, 1122397, 1106458, 1238803, 1308399, 1289294, 1337289, 1456368, 1437582, 1206659, 1005186, 1076031, 1323652, 1462510, 1409700, 1343652, 1399209, 1480088, 1423576, 1236174, 1077947, 1050965, 1089543, 1092676, 1101097, 1232367, 1434976, 1471516, 1266825, 1121709, 1349910, 1781117, 1923429, 1637527, 1325355, 1335041, 1503431, 1510653, 1404876, 1449591, 1629089]
18192A629089M5305j49962r8835J22517K24189J31290j8978j26669j47210l4433
18182A576303J26445J15790q3813j63131N9458K90069J74852j40186k36544o6984
18172A652259M1400l4916o4180P8308J93262J22185K553j251L3241l8124j65923
18161A818814j87906n6067J31437K39142J77081k0840j62609o6363J90989L17001
18151B380679J50926j40067k67526j38751P9310J54994K8128j22572q1620J15627
18141B159128K06962P0897r7987j00089j5039J3306N2324J68876J66131r9893
18131B524616l30219j61618J98805K39781k6957j03212J17558J78411q5263k13941
18121B337961M8402K56803L2324k62903j53046J49825J70750j6634m2388L9671
$$ y = [1629089, 1674394, 1524432, 1425597, 1548114, 1772303, 1903593, 1884615, 1757946, 1610736, 1576303, 1702748, 1818538, 1734725, 1571594, 1631052, 1921121, 2095973, 1955787, 1719243, 1652259, 1693659, 1658743, 1594563, 1672871, 1866133, 1988318, 1990871, 1989620, 2022861, 1984737, 1818814, 1630908, 1574841, 1706278, 1945420, 2122501, 2101661, 1939052, 1872689, 2063678, 2380679, 2531605, 2391538, 2124012, 1985261, 2064571, 2219565, 2247693, 2125121, 2043501, 2159128, 2366090, 2436987, 2339000, 2238911, 2223872, 2237178, 2289502, 2458378, 2624509, 2524616, 2194397, 2032779, 2231584, 2471365, 2444408, 2341196, 2458754, 2637165, 2551902, 2337961, 2386363, 2643166, 2675490, 2412587, 2259541, 2409366, 2580116, 2563482, 2521094, 2560765]
18111B560765m4362j46772L3819K66154J14172k10982j24412K89668L59342k6905
18101C070487k41689l6320P1917j74865k61282J26434M38738J82903k10234j42565
18091B823524J37686O8481j76099m9604K91444K11082k56065l99461n208L18743
18081B964523J56573j33463j22979M3315N1194m4164m2551J5982P650k3102j0668
18070B862310r985k4837L0521Q8408k0757j84270q9909J88122J87052j58724k94807
18059B573124N7099L60911J15063k92979k24833J42430J58727j59084j81928K05859
18049B754389L91778P6102k52574j60829Q0212O3141r0531o8015N8544M1978o5458
18038B828737o1537K4222O0966J00080J89418J47163j17676l02799j36271J22716
$$ y = [2560765, 2516403, 2369631, 2403450, 2669604, 2783776, 2572794, 2448382, 2738050, 3097392, 3070487, 2828798, 2792478, 2864395, 2689530, 2428248, 2554682, 2993420, 3176323, 2966089, 2823524, 2961210, 3029691, 2853592, 2803988, 3095432, 3306514, 3050449, 2650988, 2645780, 2964523, 3121096, 2987633, 2864654, 2907969, 2959163, 2914999, 2872448, 2888430, 2896080, 2872978, 2862310, 2852325, 2827488, 2858009, 2946417, 2925660, 2741390, 2651481, 2839603, 3026655, 2867931, 2573124, 2630223, 2991134, 3106197, 2813218, 2588385, 2730815, 2889542, 2730458, 2548530, 2754389, 3146167, 3222269, 2969695, 2808866, 2889078, 2952219, 2861688, 2793673, 2852217, 2894195, 2828737, 2767200, 2791422, 2852388, 2952468, 3141886, 3289049, 3171373, 2868574, 2732303, 2855019]
18028B855019O8234j56759q7750K40497L00210o0506l43794j78483J45890J99648
18018B982206M4197n48R3117J12200J2966n6939m1264j2250K106K0737J4912k2542
18006C148898q385Q6923J51246J23488J04634J19620n488k95262m01185p2422
17996B952067L46566L26221m6881j76045J29611L72259J55943k26984k92838o8283
17986C471636P2888J5611m1311P681O8971Q7796R6377O2984n2822j37215n9307
17975C593289P4632N9898n4559l7663J11348J38454k5615j20221K6738K18124
17965C984425K00454K9547p0254l3332M9855J14150J23403L2923q8442n5202J41031
17954D428558K18458R395k13344j11373J76848K35404K0111j07413Q924J08801
$$ y = [2855019, 2923253, 2766494, 2678744, 2919241, 3219451, 3158945, 2815151, 2636668, 2782558, 2982206, 3026403, 3025855, 3118972, 3231172, 3244138, 3187199, 3145935, 3133685, 3135791, 3156528, 3171440, 3148898, 3140513, 3227436, 3378682, 3502170, 3606804, 3726424, 3720936, 3425674, 3024489, 2952067, 3298633, 3624854, 3577973, 3401928, 3531539, 3903798, 4059741, 3832757, 3539919, 3471636, 3544524, 3560135, 3518824, 3526505, 3595476, 3683272, 3779649, 3842633, 3789811, 3652596, 3593289, 3667921, 3727819, 3673260, 3635597, 3746945, 3885399, 3859784, 3739563, 3766301, 3984425, 4184879, 4214426, 4144172, 4110840, 4160695, 4274845, 4398248, 4431171, 4342729, 4287527, 4428558, 4647016, 4656411, 4443067, 4331694, 4508542, 4743946, 4764057, 4656644, 4665568, 4774369]
17944D774369J1232r2398k1051Q3573N7854J4825Q2904J26982J8667o5045O7452
17933E059364K47179K03844K1639k7319M3707J7713q4166n4422P6078Q5583m553
17922E584647K3794J25784N1909j19869l6114K64516L05441k6834k26895o125
17912E940254K05683J4251k34529o0475K94448K75946l6260j02052J43052K42067
17902F682385M4814j06921n2562k2013q0430J4170K50685K61477j7368j54502
17892F819735N6876K42050J13954l9614P9442K27089R2092j02868L435K48586
17882G740777K28346l650p1249N3325O4066p3250n8683J87672L69269K74280K4685
17871H735588j83412k66951j65130J19815L68046L27098P1153r3320n7719L9513
$$ y = [4774369, 4785601, 4693203, 4672152, 4755725, 4813579, 4828404, 4911308, 5038290, 5056957, 4991912, 5059364, 5306543, 5510387, 5532026, 5504707, 5548414, 5566127, 5481961, 5427539, 5503617, 5589200, 5584647, 5608441, 5734225, 5786134, 5666265, 5630151, 5894667, 6200108, 6173274, 5946379, 5940254, 6145937, 6160188, 5925659, 5865184, 6159632, 6435578, 6399318, 6297266, 6440318, 6682385, 6727199, 6620278, 6567716, 6545703, 6465273, 6479443, 6730128, 6991605, 6974237, 6819735, 6876611, 7118661, 7232615, 7193001, 7272443, 7499532, 7591624, 7488756, 7492191, 7740777, 7969123, 7965473, 7894224, 7947549, 8011615, 7938365, 7879682, 8067354, 8436623, 8710903, 8735588, 8552176, 8285225, 8120095, 8239910, 8607956, 8935054, 9006207, 8912887, 8855168, 8894681]
17861H894681J38015K82046L52683J65650j32866j58222J45245L89674K95137
17852A0372043K0376j55084j52613m579K26264L43302J70554j00905q5402J93544
17842A0827500K95893Q2114n5181J10410K36205M8693j15080J22028M70185L96495
17832A2419262j2986j90193O0505L76676M37461K73016J2589k36428k74449J3492
17822A2878945L68773M23726K31260J47744K35218K26121P7229O3747K41294L04430
17812A5198487J36268L7074J92784L45174K57038J17746J71991K81190K08229
17803A6945981O6021J04974K58658K82730J99613K23519L34467L07378J36767
17794A8860108O8833J80675K64940K14370K08264L71609N16223M30812K40116
$$ y = [8894681, 9032696, 9314742, 9667425, 9833075, 9700209, 9541987, 9687232, 10076906, 10372043, 10392419, 10237335, 10084722, 10080143, 10306407, 10649709, 10820263, 10719358, 10633956, 10827500, 11123393, 11205507, 11150326, 11260736, 11496941, 11545634, 11430554, 11552582, 12022767, 12419262, 12406276, 12216083, 12276588, 12653264, 13090725, 13363741, 13376330, 13139902, 12865453, 12878945, 13247718, 13671444, 13902704, 14050448, 14285666, 14511787, 14589016, 14652763, 14894057, 15198487, 15334755, 15371829, 15564613, 15909787, 16166825, 16284571, 16456562, 16737752, 16945981, 17012002, 17116976, 17375634, 17658364, 17857977, 18081496, 18415963, 18723341, 18860108, 18928941, 19109616, 19374556, 19588926, 19797190, 20168799, 20685022, 21115834, 21355950]
17785B1355950K27927L99580M79491L44027K11847L01461M90875N05225L39864
17776B4656247K62935M00910N61323N50014M43477L99915M02849L97235M91098
17767B8566003P40490Q84998O60174K97419K88974O34814P91670N18579K91679
17758C3674800N62953J016355J029896O30141M46206P62509J131887J067365P21083
17749D1043195O16041R21958J278535J295464J018309Q18547R10858J117311J161876
17740E0182094J069407J081229J220788J230597J031298R34665J165216J428064
17732E9343358J305175R26822Q23209J125851J360860J175191Q75273R54988J344468
17723F9235195J501826J184573P76048P44922J039151J227848J112642R25631
$$ y = [21355950, 21583877, 21983457, 22462948, 22806975, 23018822, 23320283, 23811158, 24316383, 24656247, 24919182, 25320092, 25881415, 26431429, 26874906, 27274821, 27677670, 28074905, 28566003, 29306493, 30191491, 30851665, 31149084, 31438058, 32072872, 32864542, 33383121, 33674800, 34237753, 35254108, 36284004, 36914145, 37360351, 38122860, 39254747, 40322112, 41043195, 41659236, 42581194, 43859729, 45155193, 46173502, 46992049, 47902907, 49020218, 50182094, 51251501, 52332730, 53553518, 54784115, 55815413, 56750078, 57915294, 59343358, 60648533, 61575355, 62398564, 63524415, 64885275, 66060466, 66935739, 67890727, 69235195, 70737021, 71921594, 72697642, 73442564, 74481715, 75709563, 76822205, 77747836]
17715G7747836R08911R78730R62054R29642J021786J105632R66968P68476Q84406
17706H6274441J247484J344864J022761P90396J025755J366833J331576J113048
17698I5517158J188925J470106J504858J326758J376603J654323J696951J455039
17690A07190721J441991J828566K106882J952756J759792J925264K199201K209281
17682A22614454K118840K244742K447574K440396K351152K439941K561699K448492
17674A41667290K252242K259805K325627K163277J960044K070114K295349K164373
17666A59158121J796928J741039J986263J933185J435640J073544J160798J241793
17658A71527311R23925N21375M26119M42426K62549R0074K17610L99741K56148
$$ y = [77747836, 78656747, 79635477, 80597531, 81527173, 82548959, 83654591, 84621559, 85390035, 86274441, 87521925, 88866789, 89889550, 90679946, 91705701, 93072534, 94404110, 95517158, 96706083, 98176189, 99681047, 101007805, 102384408, 104038731, 105735682, 107190721, 108632712, 110461278, 112568160, 114520916, 116280708, 118205972, 120405173, 122614454, 124733294, 126978036, 129425610, 131866006, 134217158, 136657099, 139218798, 141667290, 143919532, 146179337, 148504964, 150668241, 152628285, 154698399, 156993748, 159158121, 160955049, 162696088, 164682351, 166615536, 168051176, 169124720, 170285518, 171527311, 172451236, 172972611, 173398730, 173841156, 174103705, 174193779, 174411389, 174811130, 175067278]
17649A75067278j1239P4648M53592O39116N26981M98926P42057J014895J147168
17640A80153422J285714J533378J755259J874460K017353K245974K450768K609877
17632A95926205K856002L179015L357550L318843L294025L461426L673866L702813
17624B22769745L546127L327505L070057K743639K403396K123179J878042J595115
17616B43456805J235548P74537K25419k72243n44374o17069o94657q54049r56030
17607B41753887r23294q76169q86896q36736o60277m99237m43698l51838j22423
17598B36153319R2882J83811L39800P15242J069851J120942J075913J369715J963128
17589B44084603K377486K431156K464813K739806L066814L212988L278094L427679
$$ y = [175067278, 175056039, 175130687, 175584279, 176223395, 176750376, 177249302, 177991359, 179006254, 180153422, 181439136, 182972514, 184727773, 186602233, 188619586, 190865560, 193316328, 195926205, 198782207, 201961222, 205318772, 208637615, 211931640, 215393066, 219066932, 222769745, 226315872, 229643377, 232713434, 235457073, 237860469, 239983648, 241861690, 243456805, 244692353, 245466890, 245692309, 245420066, 244875692, 244258623, 243563966, 242709917, 241753887, 240830593, 239954424, 239067528, 238230792, 237570515, 237071278, 236627580, 236275742, 236153319, 236246201, 236430012, 236769812, 237485054, 238554905, 239675847, 240751760, 242121475, 244084603, 246462089, 248893245, 251358058, 254097864, 257164678, 260377666, 263655760, 267083439]
17581B67083439L580348L607369L560187L468609L209070K832920K710255L006029
17573B93058226L289720L071178K508111K136819K069388J962047J688807J484682
17565C11268978J382820J071291M76999j3485j70424l17657p95435j405129j767473
17556C09730485j929938k190630k536913k720332k770327k966042l315500l504213
17548B87796590l424437l348220l440607l474386l248307k980658k984175l145194
17540B61750606l070381k690570k383747k424860k592938k521101k261637k207111
17532B41598261k459718k605783k304391j846220j784089k123168k311145k081493
17524B24082254j842323j998588k305879k281033j949783j720562j705135j667974
$$ y = [267083439, 270663787, 274271156, 277831343, 281299952, 284509022, 287341942, 290052197, 293058226, 296347946, 299419124, 301927235, 304064054, 306133442, 308095489, 309784296, 311268978, 312651798, 313723089, 314200088, 314186603, 314016179, 313698522, 312903087, 311497958, 309730485, 307800547, 305609917, 303073004, 300352672, 297582345, 294616303, 291300803, 287796590, 284372153, 281023933, 277583326, 274108940, 270860633, 267879975, 264895800, 261750606, 258680225, 255989655, 253605908, 251181048, 248588110, 246067009, 243805372, 241598261, 239138543, 236532760, 234228369, 232382149, 230598060, 228474892, 226163747, 224082254, 222239931, 220241343, 217935464, 215654431, 213704648, 211984086, 210278951, 208610977]
17516B08610977j561538j590314j733910j719892j557734j598517j905376k054765
17508A94888931j809907j548279j702113k139413k437091k460872k344924k185008
17500A78261324k087678k242292k592610k722574k451039k236150k527956l007686
17492A58393339l034606k636548k414600k565895k685225k562953k493859k631394
17484A37368259k663865k395368k114996k092898k173622k164328k179924k285116
17476A19298142k236838j954179j823303k099417k384572k201631j772412j663885
17468A03161905j890141j975734j794583j712754j871878j927605j663554j375461
17460H8950195j407687j668885j843907j813888j654777j441783j256120j219012
$$ y = [208610977, 207049439, 205459125, 203725215, 202005323, 200447589, 198849072, 196943696, 194888931, 193079024, 191530745, 189828632, 187689219, 185252128, 182791256, 180446332, 178261324, 176173646, 173931354, 171338744, 168616170, 166165131, 163928981, 161401025, 158393339, 155358733, 152722185, 150307585, 147741690, 145056465, 142493512, 139999653, 137368259, 134704394, 132309026, 130194030, 128101132, 125927510, 123763182, 121583258, 119298142, 117061304, 115107125, 113283822, 111184405, 108799833, 106598202, 104825790, 103161905, 101271764, 99296030, 97501447, 95788693, 93916815, 91989210, 90325656, 88950195, 87542508, 85873623, 84029716, 82215828, 80561051, 79119268, 77863148, 76644136]
17452G6644136j345248j477844j480571j382539j264542j144366j043418j020743
17444F6484865j068103j097619j076297j042271r84987q83629q53913j019546
17436E8458500j220205j136313p82732n69448p25635r67304r47291p53458o84936
17427E0671178p65970q04934p75134q01204q60000q12255o82379o21625o33695
17418D3913982o07078n68217o14014o47883n16752l76909n27998q52587q68642
17409C8333902m78221k05781m26400p74579p05876l19933j55030l68596o19977
17400C4279509o72741o19704n23013l20290j49253k82555o09153o57127l27724
17391C0117949j18442l28472n43719l46811q0309k95772p64397p66422k43756
$$ y = [76644136, 75298888, 73821044, 72340473, 70957934, 69693392, 68549026, 67505608, 66484865, 65416762, 64319143, 63242846, 62200575, 61215588, 60331959, 59478046, 58458500, 57238295, 56101982, 55319250, 54749802, 54024167, 53056863, 52109572, 51356114, 50671178, 49905208, 49100274, 48325140, 47523936, 46663936, 45851681, 45169302, 44547677, 43913982, 43306904, 42738687, 42124673, 41476790, 40960038, 40583129, 40055131, 39202544, 38333902, 37855681, 37649900, 37223500, 36448921, 35743045, 35423112, 35268082, 34899486, 34279509, 33606768, 32987064, 32464051, 32143761, 31994508, 31711953, 31102800, 30445673, 30117949, 29999507, 29671035, 29127316, 28780505, 28700196, 28404424, 27640027, 26873605, 26629849]
17382B6629849R4214j23810m48698m43122l15304l71439m32231k59664q4198j86444
17372B4059153l40130k24904o8303k62454n86651m96945p0921N5795k81050n21262
17362B1262328l22411q6064k30251n01795m37535j03380P5210m0408k26863l01596
17352A9087235k67272j73126r2393j28054k50805k80151j80658j58553k88789
17343A7267434l25200j27477J9102j58288m27217l92841j24586r26q0443j04600
17333A5544958m6242j47740l91972m27706j42428J16015N9607j56903k59849k46724
17323A3901016k37621j99119n7634Q5326O4818j19851l22368m02622k98117p3782
17313A2340046N7794o4841k93103l11419q8386N8961n8015k24390j79298n744
$$ y = [26629849, 26724063, 26600253, 26151555, 25708433, 25393129, 25021690, 24589459, 24329795, 24245597, 24059153, 23719023, 23494119, 23425816, 23163362, 22576711, 22079766, 22008845, 22064640, 21783590, 21262328, 20939917, 20853853, 20623602, 20121807, 19684272, 19580892, 19656102, 19615694, 19388831, 19087235, 18819963, 18646837, 18554444, 18426390, 18175585, 17895434, 17714776, 17556223, 17267434, 16942234, 16814757, 16833859, 16675571, 16248354, 15855513, 15730927, 15730001, 15649558, 15544958, 15498716, 15350976, 14959004, 14531298, 14388870, 14504885, 14564492, 14407589, 14147740, 13901016, 13663395, 13464276, 13406642, 13491968, 13556786, 13436935, 13114567, 12711945, 12413828, 12340046, 12397840, 12332999, 12039896, 11728477, 11640091, 11699052, 11641037, 11416647, 11237349, 11231605]
17303A1231605M6768n4578j42189j24537n1829L364k1167j63762l25395k94098
17293A0104182l1114J94641J28383j25220k61766j91107q9818q6789j03289l6535
17283I501568M9893P520j69371k79275j45422J02273J30441j21559k74013m7677
17273H754378K33997Q1603l48257m19659j9615K29260l3752l30414j59587J83442
17263H171396J60714r6289j00789Q3217q110l41552l96653o6088J65070M3277
17253G614193j03189j8234P5613k4512j24036m9618L741j37450k66808j49959
17243F819741P6731J52678O7695o0268k06246l02041j74280J26954K34306k1797
17233F713473k89918j96476R9508J90259K9783j02964q5460m0948m6644n6361
$$ y = [11231605, 11278373, 11223795, 11081606, 10957069, 10905240, 10908604, 10887437, 10723675, 10398280, 10104182, 10073068, 10267709, 10396092, 10270872, 10009106, 9817999, 9728181, 9641392, 9538103, 9501568, 9551461, 9558981, 9389610, 9110335, 8964913, 9067186, 9197627, 9076068, 8802055, 8754378, 8988375, 9069978, 8721721, 8302062, 8282447, 8511707, 8477955, 8147541, 7987954, 8171396, 8332110, 8235821, 8135032, 8218249, 8210139, 7868587, 7471934, 7405846, 7570916, 7614193, 7511004, 7492770, 7568383, 7543871, 7419835, 7370217, 7373958, 7236508, 6969700, 6819741, 6896472, 7049150, 7116845, 7056577, 6850331, 6548290, 6374010, 6500964, 6735270, 6713473, 6423555, 6227079, 6326587, 6516846, 6546629, 6443665, 6358205, 6317257, 6270613, 6214252]
17223F214252n0963m2403j0249J2085o1368j56457o8722J47404J45682j42090
17213E987171k88883l4320K43891J34385j29440j14987M1913o3514l12404k60029
17203E203783M5390J50904Q975j7750Q9746J463k04958q3217K87352K79329k04493
17192E556524m71359j72758J38248J3610j51123M5382K10774q0428l92538j34526
17182D561806L55283L29356j32376l22921j01132M0129l1655M1172K44464J19625
17172E103751l12775m22259j1352L00677P5406k75437k35802K2270P8914j1480
17162D311913L2957J34056L7866j70595k05508n7173N9053P8726P8705M1731o5370
17151D276361j22237l3060P9470R1287Q6457J14279M066k74552l61861k6618L26527
$$ y = [6214252, 6163289, 6120886, 6110637, 6122722, 6061354, 5904897, 5836175, 5983579, 6129261, 5987171, 5698288, 5663968, 5907859, 6042244, 5912804, 5797817, 5839730, 5776216, 5463812, 5203783, 5249173, 5400077, 5409052, 5391302, 5481048, 5482511, 5277553, 5194336, 5481688, 5761017, 5556524, 5085165, 4912407, 5050655, 5064265, 4913142, 4958524, 5169298, 5088870, 4696332, 4561806, 4917089, 5246445, 5114069, 4791148, 4690016, 4730145, 4698490, 4739662, 4984126, 5103751, 4790976, 4368717, 4357365, 4658042, 4733448, 4458011, 4222209, 4244479, 4323393, 4311913, 4344870, 4478926, 4516792, 4346197, 4140689, 4083516, 4142569, 4221295, 4300000, 4341731, 4276361, 4154124, 4121064, 4200534, 4291821, 4378278, 4492557, 4496623, 4222071, 3860210, 3833592, 4160119]
17140D160119J74335k78094l48837P7354L76290J57473j84656j58778Q0987Q2269
17130D138462j45744j86347R1501L17685J59263k13392l52252r7845K37397K62334
17120D211062k2848k56057j86742M1035J48173R1612J3910l8967j17904j65167
17110C718107o7821R6967J19105k2446j29474j01756m0034L193J00297K02684
17100C878822J18777j25082k00109M1376K67070J21656k29553l32518q7026J70863
17090C624276J72568j361j40351j39193M764J97430K35973J8218k29000j86554
17080C556770O9330J23025j46712l31231j01176K59642K63806m7078j94361j2049
17070C439966J40829k962k01717j27400J08995J67519K2448n1930L6972P6928
$$ y = [4160119, 4334454, 4056360, 3707523, 3784877, 4161167, 4318640, 4133984, 3975206, 4056193, 4138462, 3992718, 3806371, 3897872, 4215557, 4374820, 4161428, 3809176, 3711331, 3948728, 4211062, 4188214, 3932157, 3745415, 3786450, 3934623, 4026235, 4040145, 4001178, 3883274, 3718107, 3650286, 3747253, 3866358, 3843912, 3714438, 3612682, 3572648, 3575841, 3676138, 3878822, 3997599, 3872517, 3672408, 3713784, 3980854, 4102510, 3872957, 3540439, 3453413, 3624276, 3796844, 3795483, 3655132, 3515939, 3520703, 3718133, 3954106, 3972324, 3743324, 3556770, 3626100, 3749125, 3602413, 3271182, 3170006, 3429648, 3693454, 3646376, 3452015, 3439966, 3580795, 3577833, 3376116, 3248716, 3357711, 3525230, 3547678, 3495748, 3532720, 3609648]
17060C609648n6138j80196r9504R9516J87328R0975o4566j26270m8914O7562O0369
17049C539810q2940j42577K5344J76404j6514l69760l38344J32824M13225J18340
17039C455812k73598j82877J56323J51995j32905j65110P4481J07956j04127r7689
17029B990261J65385J90877m5836O1099N58095N72895k62652r68734o26045J73553
17019B808898K99951j31441j43419L37712M20585j25359m70602j53367K41045
17010C084003J92491K5082J04679J53115p8744k22715J7038K42256M8427k41096
17000C324536j64059P1144L0854j31688r231K63122K48820n784r8412R891L3209
16989C572402m4472k0202K7480j12894k68275j15175J81426J77436r0997j85779
$$ y = [3609648, 3553510, 3373314, 3273810, 3373326, 3560654, 3651629, 3587063, 3460793, 3411879, 3479441, 3539810, 3456870, 3314293, 3339637, 3516041, 3499527, 3129767, 2791423, 2924247, 3337472, 3455812, 3182214, 2999337, 3155660, 3307655, 3174750, 3009640, 3084121, 3192077, 3087950, 2990261, 3155646, 3346523, 3300687, 3361786, 3919881, 4492776, 4230124, 3261390, 2635345, 2808898, 3108849, 2977408, 2833989, 3171701, 3592286, 3466927, 2996325, 2842958, 3084003, 3276494, 3301576, 3406255, 3559370, 3480626, 3257911, 3274949, 3517205, 3565632, 3324536, 3160477, 3231621, 3262475, 3130787, 3121556, 3384678, 3633498, 3627714, 3529302, 3539193, 3572402, 3527930, 3507728, 3535208, 3422314, 3154039, 3038864, 3220290, 3397726, 3306729, 3120950]
16979C120950l9830L649r7634j6603K55046L25626J11182k5902L4068l036j82062
16968C485454j51316J15399J51283j67093l13718n021K79775J12886j83443j64203
16958C160003k594l5280r8672N9773J80728l0674k42442j9286L41743K53885j51737
16947C415447k50951K0088J45035k0433q7778N2414N0628j51100j46990J44199
16937C170559K28926j19718m05264j78724K55698L32611K8526k41033k41931p5048
16927B754602Q6191J25201Q835j26316q6842P2466R3668o2238j51908q8826o3250
16916B561583j07319J1140K70886K63408j29636m06862j86456J66085J23563j72103
16906B394289k14707K3709J51978P4201M2577R0836J854j77568j52232N0352O7050
$$ y = [3120950, 3081120, 3084769, 2987135, 2970532, 3225578, 3551204, 3662386, 3636484, 3670552, 3667516, 3485454, 3334138, 3449537, 3600820, 3433727, 3120009, 3114988, 3394763, 3507649, 3324206, 3160003, 3157409, 3122129, 3023457, 3083230, 3263958, 3233284, 2990842, 2971556, 3313299, 3567184, 3415447, 3164496, 3184584, 3329619, 3309186, 3221408, 3273822, 3324450, 3173350, 3026360, 3170559, 3399485, 3279767, 2874503, 2695779, 2951477, 3284088, 3312614, 3071581, 2829650, 2754602, 2840793, 2965994, 2974829, 2848513, 2761671, 2834137, 2927805, 2865567, 2713659, 2624833, 2561583, 2454264, 2465404, 2736290, 2999698, 2870062, 2463200, 2276744, 2442829, 2566392, 2394289, 2179582, 2203291, 2355269, 2429470, 2472047, 2562883, 2564737, 2387169, 2234937, 2285289, 2352339]
16895B352339j46250j84064J02429K79092O480l72648l11583J36051L92887J42397
16885B397130k96549m06588p4745L19876L48387K009l17939k85999k1836J28482
16875A792228O1199l3998k2916K1462K1622J4798K3533P919q227M7612J18884
16864B044116N2133j50145k98137k73588j33558N4586K55436L28401J24689k13239
16854A790694l30341j37435O5341N8237o751M8996J02550p617j47392j06473L3602
16843A363411M2887p5818j24685m2293M7072N5591O384n0512m7714O5672J69911
16832A409906L7074k81388l70844k2482L55452K59941j61663l26510p0219J92912
16822A022179J56731q886o5022l9261l470R7338K14596J41053j22918k71361j56562
$$ y = [2352339, 2206089, 2022025, 2124454, 2403546, 2410026, 2037378, 1725795, 1861846, 2254733, 2397130, 2100581, 1693993, 1619248, 1939124, 2287511, 2289520, 1971581, 1685582, 1663746, 1792228, 1853427, 1819429, 1796513, 1817975, 1839597, 1854395, 1877928, 1885847, 1877620, 1925232, 2044116, 2096249, 1946104, 1647967, 1374379, 1240821, 1295407, 1550843, 1879244, 2003933, 1790694, 1460353, 1322918, 1388259, 1446496, 1439745, 1488741, 1591291, 1583674, 1436282, 1329809, 1363411, 1406298, 1330480, 1205795, 1163502, 1210574, 1266165, 1272549, 1222037, 1174323, 1239995, 1409906, 1446980, 1165592, 794748, 772266, 1127718, 1387659, 1225996, 899486, 829267, 1022179, 1178910, 1170024, 1105002, 1065741, 1062271, 1159609, 1374205, 1515258, 1392340, 1120979, 964417]
16811I64417k3553o4517q9865P1009J87157K0914j86352p3130K06762K04651q2283
16800A135210k13565l6012J12135K0295p0913L9112J42373K9081j04607k823J72534
16789A222820R5062j72164k63492o7198J59569K03119J01323n3580k09252k33237
16779G82970j6837K45794K07568j02028k35084J9614K83539J58910j54990j92811
16769I96645M3553J35907m8948j83862o0384R8679O7746k0680J8668P1424k6423
16758A092325j26483M42K22763K02765o6901k37569j35254J7323K255p1698j9626
16747H80342Q1517L4425j31318j84985k9417J74893K30654J15331n2005j52705
16737I66732j41954n4428K1434J8647k7906j1933J02696K04815J52441l8931j83112
$$ y = [964417, 940864, 876347, 786482, 857491, 1044648, 1065562, 879210, 806080, 1012842, 1217493, 1135210, 921645, 885633, 997768, 1018063, 947150, 986262, 1128635, 1157716, 1053109, 1050286, 1222820, 1317882, 1145718, 882226, 815028, 974597, 1177716, 1279039, 1225459, 1016207, 782970, 766133, 1011927, 1219495, 1117467, 882383, 901997, 1185536, 1344446, 1189456, 996645, 1040198, 1176105, 1127157, 943295, 882911, 981590, 1049336, 1028656, 1047324, 1118748, 1092325, 965842, 966284, 1189047, 1391812, 1324911, 1087342, 952088, 969411, 971666, 899968, 880342, 961859, 996284, 864966, 679981, 650564, 825457, 1056111, 1171442, 1119437, 966732, 824778, 770350, 791784, 810431, 782525, 770592, 873288, 1078103, 1230544, 1191613, 1008501]
16726A008501j31054M9104J55633R6085k6845p6456m2058M384L3186O1912Q0420
16715A212812N3403j3699p0322p6344k9067L7212M9521m8198j85307j81965L2681
16704G80727K75009K94256P8483j44360k00923j39160p8826k7814O9427J77259
16694A084078J72196J1234j69637j87132m0059P0530R177r3225m2089R0212O4098
16683I69383j07834j43190K4280Q8619r7354j95364P7135M01134L12596l9252
16673A290153j46906j42l2116k45845j41191L28267M88240K835m84268l03701
16663G55326K07328K82725q1988k59626o4800P7464k7197p1675R0173J62419j5241
16652A054908j58316n6664O0788l2825j46198k1007J97498J84462n7827k32035
$$ y = [1008501, 877447, 926551, 1082184, 1178269, 1151424, 1074968, 1032910, 1037294, 1070480, 1132392, 1212812, 1266215, 1252516, 1182194, 1105850, 1076783, 1113995, 1163516, 1115318, 930011, 748046, 780727, 1055736, 1349992, 1428475, 1284115, 1083192, 944032, 865206, 837392, 906819, 1084078, 1256274, 1267508, 1097871, 910739, 870680, 941210, 950387, 857162, 815073, 905285, 969383, 861549, 718359, 742639, 831258, 733904, 538540, 615675, 1016809, 1329405, 1290153, 1143247, 1143105, 1110989, 865144, 723953, 1052220, 1540460, 1543295, 1059027, 755326, 962654, 1245379, 1163391, 903765, 838965, 916429, 889232, 817557, 907730, 1070149, 1054908, 896592, 839928, 900716, 867891, 721693, 700686, 898184, 1082646, 1024819, 792784]
16642G92784j84585m9597J1387J1646N4323J49867J71203J3433k04160k10339
16632E55962N0819K69628J66480j06004k02082q4863K3698O6489J34207J22552
16622I96886j19181l36590j22031L33384L62162j35141m33554r8430L04943J24046
16612H76494l37812l57098N6628K94520J78408P9996J12834k2327l28367l64722
16602A88554j323K92800J79446n2320l4746Q4450j4176k19381j72263J18420K59330
16591F28791N5981k07300j63561J49929L47654J95169r3240j54462K0557J06130
16581H85648l2697j43181m5918N1764l4626r0996P3379J58887j37860m40386j75325
16570F8689M02982M62184r8581m29878n5560M09093K91148j24687k03189J1657
$$ y = [792784, 608199, 558602, 569989, 581635, 635958, 785825, 957028, 970461, 766301, 555962, 606781, 876409, 1042889, 936885, 734803, 649940, 673638, 740127, 874334, 996886, 877705, 541115, 419084, 752468, 1114630, 979489, 545935, 447505, 752448, 876494, 538682, 181584, 238212, 532732, 711140, 791136, 903970, 881643, 553276, 188554, 187231, 480031, 659477, 607157, 572411, 656861, 642685, 423304, 251041, 369461, 628791, 684772, 477472, 313911, 463840, 811494, 1006663, 913423, 758961, 779518, 885648, 852951, 709770, 663852, 715616, 680990, 589994, 663373, 822260, 684400, 244014, 68689, 471671, 933855, 835274, 405396, 349836, 758929, 1050077, 925390, 722201, 733858]
16560G33858N7972q1410q5463J9665l8982j79940j00307J18042J31258l7984p2351
16549D64358K9644N413q2216O1104L02569J94639j96213k78777Q3166K92922Q879
16538H85488k77004p8431K69995J94504j76292k77847l4314J09447l9993j86474
16528C89079q8440J15317K03944J63266Q7198K5772m603j5974o1304j38228j46331
16517E29696n7948o140n4555m8592J06169K12064R1309o2947J4459J75953Q6954
16506I86422j71336k00656L3036J32493l3635j03143J01106J92794j11686l98381
16496D27014j40911M10901N21720N1363l49363k05613J56440J95898n8586j83358
16486H25505n6949M6104k1964p2070L5792J25549M348j92578j86916K9059J98178
$$ y = [733858, 791830, 710420, 624957, 644622, 605640, 425700, 325393, 443435, 574693, 536709, 464358, 494002, 499415, 417199, 478303, 780872, 975511, 779298, 500521, 583687, 876609, 885488, 608484, 530053, 800048, 994552, 818260, 540413, 506099, 615546, 575553, 389079, 300639, 415956, 619900, 783166, 870364, 896136, 891533, 875559, 814255, 676027, 529696, 471748, 465608, 411053, 362461, 468630, 680694, 772003, 709056, 723515, 899468, 986422, 815086, 614430, 647466, 779959, 746324, 643181, 744287, 937081, 825395, 427014, 286103, 697004, 1218724, 1270087, 920724, 715111, 871551, 1067449, 1008863, 825505, 768556, 814660, 792696, 720626, 756418, 881967, 886315, 693737, 506821, 535880, 734058]
16475G34058J77657Q6023N1318L2048k6781n2060O543L7615m9656j21728l524
16464H71513K05353K27732J6764j60379j00620P4448J32849M1827o1282q6251
16454A161954m7685J2187M2204j3145j27644j71440o8029Q7171J53056J16399
16444A145028M4109m8574j50074j54915Q286J89870J56715o9106j98798o2134
16434H60407J66417K23435R8004j3156k266M1694K87j08716j56594n4992J28674
16423A183194K18507J27443k0988n0563J6216O089j00255j07278O9171K18318
16413A559854J38777m3339p3043M3721R1842L947r0683j19642j09644k7769J30745
16402A504766J57910r9344l29771r3983L92359M10497j32649m20193N671M17507
$$ y = [734058, 911715, 997738, 1049056, 1081104, 1054323, 1002263, 1008806, 1046421, 996765, 875037, 871513, 1076866, 1304598, 1321362, 1160983, 1060363, 1134811, 1267660, 1309487, 1248205, 1161954, 1114269, 1126456, 1168660, 1155515, 1027871, 856431, 788402, 875573, 1028629, 1145028, 1189137, 1140563, 990489, 835574, 843860, 1033730, 1190445, 1121339, 922541, 860407, 1026824, 1250259, 1348263, 1335107, 1332841, 1374535, 1374822, 1266106, 1109512, 1054520, 1183194, 1401701, 1529144, 1508156, 1457593, 1473809, 1479898, 1379643, 1272365, 1341536, 1559854, 1698631, 1655292, 1582249, 1625970, 1717812, 1721759, 1631076, 1511434, 1401790, 1374021, 1504766, 1662676, 1563332, 1233561, 1139578, 1531937, 1942434, 1809785, 1389592, 1395263, 1812770]
16392A812770P4141m39372j33899N36255J89499j049802j241675N17390K342825
16383B608132J950648j43157j392637p56302K55965J86487m08360l30597K57555
16374B227734L52715j43175m06815j16336J77310P9845j23557j10857N061M5448
16364A987373O2881P8497j7132j37518k3523K39470K01896k17205m55698j14212
16354A604829L81447L72239q6078l69451j99618J00705K05408J49223N1388q8893
16344B121199k00046j09066J32175K01011k9391k49197j55558R8055J58640J690
16334A969512j00700m3961r07o1340o4840R4641K30496J17003j47942k44793p1892
16323A675277J13755O2197j19406j35750N4281J76436N9536j02037n7835R7025
$$ y = [1812770, 1886911, 1447539, 1313640, 1849895, 2039394, 989592, -252083, 265307, 2608132, 4558780, 4415623, 3022986, 2266684, 2522649, 2709136, 2300776, 1970179, 2227734, 2580449, 2437274, 2030459, 1914123, 2091433, 2171278, 2047721, 1936864, 1941925, 1987373, 2050254, 2128751, 2111619, 1974101, 1950578, 2190048, 2391944, 2174739, 1719041, 1604829, 1986276, 2358515, 2272437, 1902986, 1703368, 1804073, 2009481, 2158704, 2210092, 2121199, 1921153, 1812087, 1944262, 2145273, 2115882, 1866685, 1711127, 1809182, 1967822, 1969512, 1868812, 1824851, 1823944, 1762604, 1697764, 1792405, 2022901, 2139904, 1991962, 1747169, 1675277, 1789032, 1851229, 1731823, 1596073, 1650354, 1826790, 1886326, 1784289, 1726454, 1823479]
16313A823479P7704j16967j90468k9069J17166N2613n8505q464Q8276K5486r5260
16302A685991l6039J25538R6358j08807j39459J21750L32933J99084j04398k28622
16292A944329j28293o302K8560K201q3796k05191k11922j1805K13824K06917m332
16281A744190j56028j20024m319Q6766J53911J59771K6974j69591k24854r4155
16271A402641K6936k976p6812m6667L5755K8169o2060r3678P7J30160J66964P7196
16259A585705m7392q4132j9790L2463P70l1887J8088N6808l6138j47022o1497
16248A265976J54124J92445j3699j54263k8718J25656K3513j95072j84143O7582
16238A253401K37716J50200m0011j37866j27390p0291k245K3362l4216r1046j9264
$$ y = [1823479, 1901183, 1784216, 1593748, 1564679, 1681845, 1734458, 1675953, 1667489, 1755765, 1781251, 1685991, 1649952, 1775490, 1871848, 1763041, 1623582, 1745332, 2078265, 2277349, 2172951, 1944329, 1816036, 1809734, 1838294, 1840495, 1756699, 1551508, 1339586, 1327781, 1541605, 1748522, 1744190, 1588162, 1468138, 1463819, 1550585, 1704496, 1864267, 1891241, 1721650, 1496796, 1402641, 1429577, 1426601, 1349789, 1303122, 1338877, 1367046, 1304986, 1211308, 1211385, 1341545, 1508509, 1585705, 1538313, 1454181, 1434391, 1466854, 1467624, 1435737, 1453825, 1510633, 1474495, 1327473, 1265976, 1420100, 1612545, 1598846, 1444583, 1415865, 1541521, 1565034, 1369962, 1185819, 1253401, 1491117, 1641317, 1601306, 1463440, 1336050, 1265759, 1263514, 1286876, 1252660, 1161614, 1142350]
16227A142350J30975J60950K1043r3262k4967J13217J06552n9861j90247j34271
16217A172479M1281J46846Q9102l3163n7486M1096J26902Q6163l4689j02564m7013
16206A428954R0482J89501J27249p7936k07702q4836J28252J03056j44279k26398
16196A326343M204J83163K5359j86433r2955J00228k33k11471m1865L85085M04527
16185A895952j12010m72322k04396K65877L39393Q4119r0888j26937j77691j53459
16175A247638O5331K33306P7185j82738j47860J01527J73016M2139K9598J74393
16165A813535J73596m0843j71966p5724M0505L1332J9175Q0864R5697J4110m6553
16154A933728n0232p3081n7953J10035K71722J51458j21698j23101J58041K45971
$$ y = [1142350, 1273325, 1434275, 1455318, 1362056, 1337089, 1450306, 1556858, 1496997, 1306750, 1172479, 1213760, 1360606, 1449708, 1416545, 1359059, 1400155, 1527057, 1613220, 1578531, 1475967, 1428954, 1519436, 1708937, 1836186, 1758250, 1550548, 1465712, 1593964, 1697020, 1552741, 1326343, 1330547, 1513710, 1539069, 1352636, 1259681, 1359909, 1359676, 1148205, 1106340, 1491425, 1895952, 1783942, 1311620, 1107224, 1373101, 1712494, 1796613, 1705725, 1578788, 1401097, 1247638, 1312969, 1546275, 1623460, 1440722, 1292862, 1394389, 1567405, 1609544, 1639142, 1813535, 1987131, 1946288, 1774322, 1698598, 1739103, 1770435, 1789610, 1870474, 1966171, 1980281, 1933728, 1883496, 1810415, 1752462, 1862497, 2134219, 2285677, 2163979, 2040878, 2198919, 2444890]
16144B444890k7016k17910l2364J74214M0159j70261o6309J65693J18391j03017
16134B326470r9477R4011J03913q9612j46918q15P0458L015L5101J84661J69866
16123B650673m1439j10329Q5632K20118P8302r6028o0386L4548L485p046J45554
16112B903084K35880M1282j92247r5798J93951K13540j05619l45027k33941L3833
16102B648938J88085K20811K14643J49290L8872K458L6477l7706k21400j99890
16092C040578J76872N06266L04505k48466m73767j33237K44659J63862j31679
16083C449593j09266J97185K86529L5403j11280J04002L18563J50777j73718j95136
16073C952652N6138J67554L0718o3791Q361L0006p5906n0236K08499L55059J10626
$$ y = [2444890, 2417874, 2199964, 2167600, 2341814, 2381973, 2211712, 2145403, 2311096, 2429487, 2326470, 2226993, 2321004, 2424917, 2335305, 2188387, 2187572, 2258030, 2261045, 2296146, 2480807, 2650673, 2609234, 2498905, 2584537, 2804655, 2882957, 2786929, 2726543, 2761091, 2764576, 2757530, 2903084, 3138964, 3180246, 2987999, 2892201, 3086152, 3299692, 3194073, 2849046, 2615105, 2648938, 2837023, 3057834, 3272477, 3421767, 3460639, 3463097, 3499574, 3461868, 3240468, 3040578, 3217450, 3723716, 4028221, 3779755, 3305988, 3172751, 3417410, 3581272, 3449593, 3340327, 3537512, 3824041, 3859444, 3748164, 3852166, 4170729, 4321506, 4147788, 3952652, 4008790, 4176344, 4207062, 4143271, 4151632, 4181638, 4105732, 4055496, 4263995, 4619054, 4729680]
16062D729680k40797k37969P8020K65163J54251J1182K9155O1071k8304r0710
16052D730742J9882J50751R4783m6683l0620J02010Q5866r3655j24196J21679
16042E010559L12727J35461j94508k32478K0699J48356O345p0107J15586K46218
16032E498858L7568k16471q6751K56769K79249o2815k61063q0218J12058L431
16022E480615j82674j36501L5310Q9582P9304J43334J56738j8915j76839o6283
16012E403671J42406J19043o1081o7835Q6307R1581p0181r7254N3035Q0934p1869
16001E608757q6014J20524J75306q3063k36341L2432L43213K01790j71043j83393
15991E722168J57336K60152q3177l70271j89564J75035K36717J6875j08067l4361
$$ y = [4729680, 4488883, 4250914, 4328934, 4594097, 4748348, 4759530, 4788685, 4849756, 4821452, 4730742, 4750624, 4901375, 4996158, 4949475, 4918855, 5020865, 5106731, 5013076, 4888880, 5010559, 5323286, 5458747, 5264239, 5031761, 5052460, 5200816, 5207161, 5137054, 5252640, 5498858, 5536426, 5319955, 5233204, 5489973, 5769222, 5706407, 5445344, 5365126, 5477184, 5480615, 5297941, 5161440, 5196750, 5286332, 5365636, 5508970, 5665708, 5646793, 5469954, 5403671, 5546077, 5665120, 5604039, 5536204, 5622511, 5714092, 5643911, 5546657, 5599692, 5680626, 5608757, 5522743, 5643267, 5818573, 5735510, 5499169, 5531601, 5874814, 6076604, 5905561, 5722168, 5879504, 6139656, 6056479, 5686208, 5496644, 5671679, 5908396, 5925271, 5817204, 5782843]
15981E782843k60r9915j08974J13778L31530K35629r1676k52368o5242J90231
15971F035576J67286p5957j94200o3315Q2723N0232l6448J2250J28624J18008
15961F224779j8356j03925o3663J3560N4291O7811N1220j7621r8600j26705j08356
15950E874435p2595R365J25874J42466k457j17916o789J91330J82644j2360j01663
15939F212334j6306J8557m8628J0908K07539J90480j35351l02634J3135L79379
15929F529413K21611k43281l21539O1097K79763N2984j54052J1012J94141P338
15919F638487k52378j01755K86101L45654K2680j94740q9154K7761n9929j25167
15909F497560L3082K14993J77397L1027J16M6176J7971l0042L4469J26125O8164
$$ y = [5782843, 5782583, 5682668, 5573694, 5687472, 6019002, 6254631, 6162955, 5910587, 5845345, 6035576, 6202862, 6126905, 5932705, 5869390, 5952113, 6002345, 5965897, 5978147, 6106771, 6224779, 6206423, 6102498, 6038835, 6052395, 6106686, 6174497, 6225717, 6208096, 6109496, 5982791, 5874435, 5801840, 5811205, 5937079, 6079545, 6077088, 5959172, 5952383, 6143713, 6326357, 6313997, 6212334, 6196028, 6214585, 6165957, 6176865, 6384404, 6574884, 6439533, 6136899, 6150034, 6529413, 6751024, 6507743, 6186204, 6247301, 6527064, 6580048, 6425996, 6437008, 6631149, 6638487, 6386109, 6284354, 6570455, 6916109, 6938789, 6744049, 6654895, 6682656, 6622727, 6497560, 6530642, 6745635, 6923032, 6954059, 6954175, 7000351, 7018322, 6988280, 7022749, 7148874, 7217038]
15898G217038q5031j28489m0099L0214M8957J06253J68828J10800p266J7914J70456
15887G609575J94432J6570j12118l3221O0213j2286p4202R3825L04402J95994
15877H243184j72238l36098p3689K89667L46510J23249m8086p766R2264P4228
15867H531225k0357k0089J24145K53292J87546l4888j81288j08652O7022J54721
15857H952677J43336J46402J68697J07069l1669r9136k8378P2148J03937J10229
15847I645312J47769J63742J04168M2268Q4871K07754K74632J92151J881j46059
15837A0718489j06020J06149K79778K42277J08720J34158L10558L36612P0579
15828A2201300k21503k23858K3006K55567L41328K91764J05902j37522j85854
$$ y = [7217038, 7132007, 7003518, 6963419, 6993633, 7042590, 7148843, 7317671, 7428471, 7421205, 7439119, 7609575, 7804007, 7820577, 7708459, 7675238, 7735451, 7723165, 7648963, 7742788, 8047190, 8243184, 8070946, 7734848, 7661159, 7950826, 8297336, 8420585, 8372499, 8364733, 8456997, 8531225, 8510868, 8490779, 8614924, 8868216, 9055762, 9020874, 8839586, 8730934, 8797956, 8952677, 9096013, 9242415, 9411112, 9518181, 9486512, 9387376, 9358998, 9431146, 9535083, 9645312, 9793081, 9956823, 10060991, 10103259, 10188130, 10395884, 10670516, 10862667, 10864548, 10718489, 10612469, 10718618, 10998396, 11240673, 11349393, 11483551, 11794109, 12130721, 12201300, 11979797, 11755939, 11778945, 12034512, 12375840, 12667604, 12773506, 12635984, 12450130]
15819A2450130Q4844L83801L49656R5977M1507K37303K98568O8855j02895O0783
15809A3968529L13987K97454Q9189J5672J31627K23379J92661J30145R7562J02803
15799A5563008K05313L96533M73373K95670P1317R0255K62741K66118J02123J06424
15789A7832875L57569M89888K58904n9414p2959J86427L89034L86137K97560K37189
15779B0303210K01709J88857K29579L06617L61773L64489L06589J99303J34868
15770B2596994K35903M58435N74618M60163K73475K35214L59457N15776O06536
15761B6316571N61443L42119J05772J49793M91981P38494O23408M19873M75692
15752C0225146O18852N03606L11624M68038P63330N32465j69529l81100L94220
$$ y = [12450130, 12534974, 12918775, 13268431, 13364408, 13405915, 13643218, 13941786, 14010641, 13907746, 13968529, 14282516, 14579970, 14669159, 14684831, 14816458, 15039837, 15232498, 15362643, 15460205, 15563008, 15768321, 16164854, 16638227, 16933897, 17005214, 17095469, 17358210, 17624328, 17726451, 17832875, 18190444, 18680332, 18939236, 18879822, 18806863, 18993290, 19382324, 19768461, 20066021, 20303210, 20504919, 20693776, 20923355, 21229972, 21591745, 21956234, 22262823, 22462126, 22596994, 22832897, 23291332, 23865950, 24326113, 24599588, 24834802, 25194259, 25710035, 26316571, 26878014, 27220133, 27325905, 27475698, 27967679, 28706173, 29329581, 29749454, 30225146, 30843998, 31347604, 31659228, 32127266, 32890596, 33423061, 33253532, 32872432, 33266652]
15743C3266652J338819J421040P95455M05872N71500P65598O48499N16047O30142
15734D0359624P79338P34768O37414O80106P86815Q29104Q42877Q50280P71258
15725D7271584O69247P61634J014726J070663P97002N72832P46869J105642J208943
15716E5219142J022453Q67680R06396J019071J096904J145500J156343J129778
15708F3563267J164660J308947J412075J335933J194221J164509J212545J247363
15700G3603520J363130J616975J759532J575121J326058J404318J671364J677789
15692H5997807J465827J521248J881245J991648J667345J487441J837220K209334
15684A00059115K030254J643323J748755K233639K375096K046006J877455K171499
$$ y = [33266652, 34605471, 36026511, 36821966, 37227838, 37799338, 38564936, 39213435, 39729482, 40359624, 41138962, 41873730, 42511144, 43191250, 43978065, 44807169, 45650046, 46500326, 47271584, 47940831, 48702465, 49717191, 50787854, 51584856, 52157688, 52904557, 54010199, 55219142, 56241595, 57109275, 58015671, 59034742, 60131646, 61277146, 62433489, 63563267, 64727927, 66036874, 67448949, 68784882, 69979103, 71143612, 72356157, 73603520, 74966650, 76583625, 78343157, 79918278, 81244336, 82648654, 84320018, 85997807, 87463634, 88984882, 90866127, 92857775, 94525120, 96012561, 97849781, 100059115, 102089369, 103732692, 105481447, 107715086, 110090182, 112136188, 114013643, 116185142]
15676A16185142K449884K325358K124100K247958K476143K402352K174703K244222
15668A34629862K584464K706192K415936K097415K144441K450738K617347K465450
15660A54111845K194022K107162K261664K377019K139322J630741J321020J493556
15652A69636351J824460J775331J315227R30953R11421R85410Q13300M96191L15652
15643A79004296K19109n5341m54961o28554m98954m31787o84478j025886j151798
15634A74291646j198665j484601j901884k005842j723435j550748j864737k363266
15626A60198468k475538k141982j868132k049153k514030k793846k660042k310032
15618A41385713k109288k216140k447025k515447k388112k299790k381425k449042
$$ y = [116185142, 118635026, 120960384, 123084484, 125332442, 127808585, 130210937, 132385640, 134629862, 137214326, 139920518, 142336454, 144433869, 146578310, 149029048, 151646395, 154111845, 156305867, 158413029, 160674693, 163051712, 165191034, 166821775, 168142795, 169636351, 171460811, 173236142, 174551369, 175482322, 176393743, 177379153, 178192453, 178688644, 179004296, 179223405, 179168064, 178713103, 178084549, 177585595, 177153808, 176469330, 175443444, 174291646, 173092981, 171608380, 169706496, 167700654, 165977219, 164426471, 162561734, 160198468, 157722930, 155580948, 153712816, 151663663, 149149633, 146355787, 143695745, 141385713, 139276425, 137060285, 134613260, 132097813, 129709701, 127409911, 125028486, 122579444]
15610A22579444k304427k080207k049793k196448k253541k137966k042050k067306
15602A05447706k072422j973524j903558j935608j919168j768647j664864j755201
15594I0454714j873944j800959j604860j474290j394499j279908j251349j436242
15586G8338663j626709j524807j250466j189834j363405j395774j164149j003142
15578F7820377j114575j231362j109865r40743r58487j014339r14629q57929j081184
15569E8597264j321279j150877p08135n40096p54219q91181p22218o06902q28873
15560E1073484j077131r52521o22745n43763p51418q65795p09119n18927n24990
15551D4507075o36656o46359n29366m33245m80067o36313p25538n95139l36230
$$ y = [122579444, 120275017, 118194810, 116145017, 113948569, 111695028, 109557062, 107515012, 105447706, 103375284, 101401760, 99498202, 97562594, 95643426, 93874779, 92209915, 90454714, 88580770, 86779811, 85174951, 83700661, 82306162, 81026254, 79774905, 78338663, 76711954, 75187147, 73936681, 72746847, 71383442, 69987668, 68823519, 67820377, 66705802, 65474440, 64364575, 63423832, 62465345, 61451006, 60536377, 59678448, 58597264, 57275985, 56125108, 55416973, 54876877, 54122658, 53231477, 52509259, 51902357, 51073484, 49996353, 49043832, 48421087, 47877324, 47125906, 46260111, 45550992, 45032065, 44507075, 43870419, 43224060, 42694694, 42261449, 41781382, 41145069, 40419531, 39824392, 39488162]
15542C9488162k52568m89361p89805p99051n34986l34531l66584m55144m21620
15533C5044512l48066l85791m96894n32886m51115l32566k65826k92143l86283
15524C1552942m45795l95763l24003l73535m84426m41924k38678j43582k78893
15515B8426343l88557k49813p9782k13084n30905n94497l09242p1788j83345m50522
15505B5354808n18482l42277j44865q8271j62351k77481l26436k52593j53768
15496B3088284j97522l51689l69903j69259k5438j85128m47366m11663o7364J67658
15486B1030610J7239l18289m85013m01293k23426p0710K9498L1676r3029k40193
15476A9277070k58307j64348j32672k34014l20349k45613q5546j8187o5074j06546
$$ y = [39488162, 39235594, 38746233, 37956428, 37157377, 36622391, 36287860, 35921276, 35466132, 35044512, 34696446, 34310655, 33813761, 33280875, 32829760, 32497194, 32231368, 31939225, 31552942, 31107147, 30711384, 30387381, 30013846, 29529420, 29087496, 28848818, 28705236, 28426343, 28037786, 27787973, 27708191, 27495107, 26964202, 26369705, 26060463, 25988675, 25805330, 25354808, 24836326, 24494049, 24349184, 24260913, 24098562, 23821081, 23494645, 23242052, 23088284, 22890762, 22539073, 22169170, 21999911, 21974473, 21789345, 21341979, 20930316, 20862952, 21030610, 21047849, 20729560, 20244547, 19843254, 19619828, 19549118, 19578616, 19610292, 19517263, 19277070, 19018763, 18854415, 18721743, 18487729, 18167380, 17921767, 17836221, 17818034, 17752960, 17646414]
15466A7646414j18961k05863l57769l79325j72578O6790R6601m9543j67281k01271
15456A6157214k39426k68120j98911j09429j66820k93285k19995N4336J85862
15447A4901426J32k38179k55673j52480j18133q5252K8676M1240j55271k57838
15437A3708648j3632K33383J6349m12225l80950J02703K97149r7932m62175k71126
15427A2720192J03181R7874j23716q8286R5102j9074l34873l33330J4144J72524
15417A2303738n4610k21163k9623J72758Q359k95784k91502j1573J29165l0401
15407A1679364k29091k00126J9499K01951J77190l2176k25624k12079m3786K8580
15397A1163702r9110k21860j23710R7315J69594K5980j36529j40490j6263R1029
$$ y = [17646414, 17527453, 17321590, 16963821, 16584496, 16411918, 16478708, 16575309, 16525766, 16358485, 16157214, 15917788, 15649668, 15450757, 15341328, 15174508, 14881223, 14661228, 14715564, 14901426, 14901558, 14663379, 14407706, 14255226, 14137093, 14051841, 14080517, 14121757, 13966486, 13708648, 13695016, 13928399, 13944748, 13532523, 13151573, 13254276, 13551425, 13453493, 12991318, 12720192, 12823373, 12921247, 12797531, 12709245, 12804347, 12785273, 12450400, 12117070, 12131214, 12303738, 12249128, 12027965, 11998342, 12171100, 12179459, 11883675, 11592173, 11580600, 11709765, 11679364, 11450273, 11250147, 11269646, 11471597, 11648787, 11616611, 11390987, 11178908, 11135122, 11163702, 11064592, 10842732, 10719022, 10816337, 10985931, 11011911, 10875382, 10734892, 10718629, 10809658]
15387A0809658Q2312l6389j68031j92397q2268N5387R9497M7781j5964m1792l7465
15376A0520329j2682K4411L3561k4482j17192j48359n2097J27864K50654J90967
15366A0792974k3287k04703j92699l0590J04033J14912M7081l2566r3232r6698
15356A0385225l2515R823m9431j09680q903J87448K36478Q8273m2243l9547m1396
15345A0583532j09758o0734J69534K89293P5499k12161j87611P8502K09333J19619
15335A0955048N3162R1697N3615j00460j59634l5285J01015J30604J23337J00589
15325A1313688m161q8240M4392K64394J95558j42434k38147J13239L95572J45924
15315A1999785k84659k68386J13595K41927l3121k03814M0849L65871L73331J55814
$$ y = [10809658, 10891970, 10855581, 10687550, 10495153, 10412885, 10468272, 10567769, 10615550, 10599586, 10557794, 10520329, 10507647, 10532058, 10565619, 10541137, 10423945, 10275586, 10223489, 10351353, 10602007, 10792974, 10769687, 10564984, 10372285, 10341695, 10445728, 10560640, 10607721, 10575155, 10481923, 10385225, 10352710, 10362533, 10313102, 10203422, 10194519, 10381967, 10618445, 10706718, 10664475, 10624928, 10583532, 10473774, 10413040, 10582574, 10871867, 10947366, 10735205, 10547594, 10626096, 10835429, 10955048, 11008210, 11099907, 11153522, 11053062, 10893428, 10858143, 10959158, 11089762, 11213099, 11313688, 11309527, 11221287, 11265679, 11530073, 11725631, 11583197, 11345050, 11458289, 11853861, 11999785, 11715126, 11446740, 11560335, 11802262, 11769141, 11565327, 11606176, 11972047, 12345378, 12501192]
15305A2501192J7371P254O408J2538P2704J16972Q3312N8460J08917J25291K0940
15294A3131359o4348L3929K18304K57780J23704j005O247J04553K11996K66826
15284A4289345K11422P3321J2201J23870K57093K11267N6338K9437J49752K05395
15274A5619441J35148J21982K28575K57953J36175J16639L46974N17735L04129
15265A7784751n1453m6088K95659M46563K19323M6088K25897M13190K24775o6178
15255A9492527M9130M66748O15373L46527J03739J72533L18866L25114L60931
15246B2251488N47073O05413L22081J3872J00446M45970N73140L87691K38406
15237B5485580L15609M35302M51584M70822N47830N26968L49828K33370L51291
$$ y = [12501192, 12518563, 12525817, 12532225, 12544763, 12617467, 12734439, 12817751, 12876211, 12985128, 13110419, 13131359, 13067011, 13100940, 13319244, 13577024, 13700728, 13699723, 13705970, 13810523, 14022519, 14289345, 14500767, 14574088, 14586289, 14710159, 14967252, 15178519, 15234857, 15264294, 15414046, 15619441, 15754589, 15876571, 16105146, 16363099, 16499274, 16615913, 16962887, 17480622, 17784751, 17733298, 17687210, 17982869, 18429432, 18648755, 18694843, 18920740, 19333930, 19558705, 19492527, 19541657, 20008405, 20623778, 20970305, 21074044, 21246577, 21565443, 21890557, 22251488, 22798561, 23403974, 23726055, 23739927, 23840373, 24286343, 24859483, 25247174, 25485580, 25801189, 26236491, 26688075, 27158897, 27706727, 28233695, 28583523, 28816893, 29168184]
15228B9168184N56361O08975N15004M54080M93776N46507N41348N05410N05470
15219C3895115N76125O70741O78138N65925M79290N60567P03787O90978N62871
15210C9383537N83169P76797Q19916N54730L14007M63281Q43198R94362Q06445
15201D5539442O01040O12113P18583P38225O93524O67005O17436N03757M46979
15192E1138104N83557Q11829Q59158O36352L94062M21481O61340P87171O64369
15183E6957423N17936N36097N56006L93440K61553M57711P60785O66472K42787
15174F1350210J50720O12119R70470O75159J51218J22200M97239O23780L80031
15165F5533146K60965M64295O27587N33559M13537M17589L82933K88581L63512
$$ y = [29168184, 29724545, 30333520, 30848524, 31302604, 31796380, 32342887, 32884235, 33389645, 33895115, 34471240, 35141981, 35820119, 36386044, 36865334, 37425901, 38129688, 38820666, 39383537, 39966706, 40743503, 41563419, 42118149, 42432156, 42895437, 43738635, 44732997, 45539442, 46140482, 46752595, 47471178, 48209403, 48902927, 49569932, 50187368, 50691125, 51138104, 51721661, 52533490, 53392648, 54029000, 54423062, 54844543, 55505883, 56293054, 56957423, 57475359, 58011456, 58567462, 58960902, 59222455, 59680166, 60440951, 61107423, 61350210, 61500930, 62113049, 63083519, 63758678, 63909896, 64032096, 64529335, 65153115, 65533146, 65794111, 66258406, 66885993, 67419552, 67833089, 68250678, 68633611, 68922192, 69285704]
15156F9285704N56937M81275J15768k0671K97292N70818L59944m3305j70516j02856
15146G1330390j30619j44953M6298J79195n5866l67578k87336j367o3852m37730
15136G0066582n53197k75016q4579k38330m31601m39825m55099n81198n78670
15127F6429067l65383k51341m05262n57598n01898m35602n18741n47322l92198
15118F2453722l28143n47857p42946n92707l30507l63506o01096o44803m54019
15109E7848138l41840m20659n03977n15191n88531p51488q37558p48807n67199
15100E2572888m15679l97120n85498q70689r40881o68751l79071m46749p60505
15091D7107945r10825q00110o97912p43354p73454o71109n53801n52325o48570
$$ y = [69285704, 69842641, 70323916, 70439684, 70419013, 70716305, 71287123, 71647067, 71603762, 71433246, 71330390, 71199771, 71054818, 71101116, 71280311, 71224445, 70856867, 70569531, 70568164, 70504312, 70066582, 69513385, 69238369, 69153790, 68915460, 68483859, 68044034, 67588935, 67007737, 66429067, 66063684, 65812343, 65407081, 64849483, 64347585, 63911983, 63393242, 62845920, 62453722, 62125579, 61577722, 60834776, 60242069, 59911562, 59548056, 58946960, 58302157, 57848138, 57506298, 57085639, 56581662, 56066471, 55477940, 54726452, 53888894, 53140087, 52572888, 52157209, 51760089, 51174591, 50303902, 49363021, 48694270, 48315199, 47868450, 47107945, 46197120, 45397010, 44699098, 43955744, 43182290, 42511181, 41957380, 41405055, 40756485]
15082D0756485p63684q10885p02398n05874m82815p21567q92848o99880l92122
15073C4784412m02754o36037o50948m54790m75016p23851o97613k85438p3546
15064C0384419m07860p92843o83191l31826l03435n69394o79549n34716m00861
15055B5680744l54749k67806k02337l07473m29763l24826j61508l03373o47542
15046B2681367p14438m03476j34866j71152l00701l14967l18059l84994l54976
15037A9583738j88492j39972l26709m71068l37095j16615r7811k19601k58266
15028A7428109k28414k72705l24657k19118m1391m9442k77686m80132m67136k88063
15018A4779365q1726O2057P9344n6888k60387l81483l62302k68377j76548j12773
$$ y = [40756485, 39992801, 39181916, 38479518, 37973644, 37490829, 36769262, 35876414, 35176534, 34784412, 34381658, 33745621, 33094673, 32639883, 32164867, 31441016, 30743403, 30457965, 30384419, 29976559, 29183716, 28500525, 28168699, 27865264, 27295870, 26616321, 26081605, 25680744, 25325995, 25058189, 24855852, 24548379, 24118616, 23793790, 23632282, 23328909, 22681367, 21966929, 21563453, 21428587, 21257435, 20956734, 20641767, 20323708, 19938714, 19583738, 19395246, 19255274, 18928565, 18457497, 18120402, 18003787, 17905976, 17686375, 17428109, 17199695, 16926990, 16602333, 16383215, 16341824, 16292382, 16014696, 15534564, 15067428, 14779365, 14697639, 14759696, 14839040, 14782152, 14521765, 14140282, 13777980, 13509603, 13333055, 13220282]
15008A3220282q6450j03890j48301j98185k47458k71032k17977r1919P843j3728
14998A1849185j32689k30365k10281q3853K3404k6900k11262l14941j89091J5907
14988A0489114L9872j09987j97583j56187j56920k35632j93291m578L1629k12092
14978I294345l80885j55724J97632K07437p9749k17449q9184k3544j83219l23974
14968H245686k57698j20777l5637R1286K43193J53810k36564n16656l26799R5537
14958G335381K39817K2249j93655j75274n7569j2022j0067P605j8629j30556k33991
14947F773289k24829j24414j5307O4829J01659O0594n7851j63169j44847l79J34952
14936F404527J08910p9292k50231k36856r5039k9842j00816j37240j7205J16125
$$ y = [13220282, 13133832, 13029942, 12881641, 12683456, 12435998, 12164966, 11946989, 11855070, 11862913, 11849185, 11716496, 11486131, 11275850, 11191997, 11215401, 11188501, 10977239, 10662298, 10473207, 10489114, 10528986, 10418999, 10221416, 10065229, 9908309, 9672677, 9479386, 9474808, 9506437, 9294345, 8913460, 8757736, 8955368, 9162805, 9083056, 8865607, 8776423, 8752879, 8569660, 8245686, 7987988, 7867211, 7831574, 7922860, 8166053, 8319863, 8083299, 7566643, 7239844, 7335381, 7575198, 7597447, 7403792, 7228518, 7170949, 7158927, 7148860, 7156465, 7137836, 7007280, 6773289, 6548460, 6424046, 6408739, 6473568, 6575227, 6635821, 6577970, 6414801, 6269954, 6269575, 6404527, 6513437, 6434145, 6183914, 5947058, 5852019, 5822177, 5721361, 5584121, 5566916, 5683041]
14926E683041N8536j42660k54627j75150r149J21579J58193L9518k12755l55128
14916D911398j46222K33388K92108r0485m01022j83266K69632L14252r2670l37191
14906D769922q5789K26744J00016k57674k83131N3757K26595j3880k79547j75820
14896D281193J11069J48220q7344k37843j30559L5488P0052M5223O6369M0280
14886D342148j39606l20992k33242J12590L55684K07911j62739l14391q5297J94782
14876C956848J41664j68083l17107j32653J09035J27431J5583q045N619j23760
14866C606532l05325k55178L7108K36105J29225r0715j26994L8597J93605J77644
14856C640604L493j93916k49859j12039O5277Q2220l9622j01971m1012J2563O657
$$ y = [5683041, 5741577, 5598917, 5344290, 5169140, 5159991, 5281570, 5439763, 5479281, 5266526, 4911398, 4765176, 4998564, 5290672, 5200187, 4799165, 4615899, 4885531, 5199783, 5107113, 4769922, 4684133, 4910877, 5010893, 4753219, 4470088, 4523845, 4750440, 4736560, 4457013, 4281193, 4392262, 4540482, 4453138, 4215295, 4084736, 4120224, 4190276, 4235499, 4301868, 4342148, 4202542, 3881550, 3648308, 3760898, 4116582, 4324493, 4161754, 3847363, 3762066, 3956848, 4098512, 3930429, 3613322, 3480669, 3589704, 3717135, 3732718, 3724673, 3730292, 3606532, 3301207, 3046029, 3083137, 3319242, 3448467, 3357752, 3230758, 3269355, 3462960, 3640604, 3644097, 3450181, 3200322, 3088283, 3153560, 3235780, 3196158, 3094187, 3053175, 3065738, 3072395]
14845C072395M8519J41158J10610p9681k07846j42819m8564n8225l3144J12952
14835B915355J47238r5979l19035j54974K18777K98133q356k91751k68302p8016
14825B363090O5756J35176J32398K4652q9606n9552K9080l4783j71332r0948J62171
14814B466102J95730p5462k32175k8119J97778J00422j03468n0825J33237Q8705
14804B691925j37181j96492m4616M2472j6599l3993K2667k8075j74242j62715
14794A963151M3449J44874p066j48196l0076J77353J63269m6669j59538n4264
$$ y = [3072395, 3120914, 3262072, 3372682, 3293001, 3085155, 2942336, 2893772, 2835547, 2802403, 2915355, 3062593, 2966614, 2647579, 2492605, 2711382, 3009515, 3001159, 2709408, 2441106, 2363090, 2428846, 2564022, 2696420, 2721072, 2631466, 2571914, 2600994, 2566211, 2394879, 2303931, 2466102, 2661832, 2586370, 2354195, 2326076, 2523854, 2624276, 2520808, 2469983, 2603220, 2691925, 2554744, 2358252, 2313636, 2356108, 2339509, 2305516, 2328183, 2300108, 2125866, 1963151, 2006600, 2151474, 2144408, 1996212, 1966136, 2143489, 2306758, 2260089, 2100551, 2046287]
$$ [...]
##END NTUPLES=NMR SPECTRUM
##END=
