##TITLE=1H ikalashn
CA-9300-2
19.11.2024
##JCAMPDX= 6.0         $$ Bruker NMR JCAMP-DX V2.0
##DATA TYPE= NMR SPECTRUM
##DATA CLASS= NTUPLES
##ORIGIN= UXNMR, Bruker Analytische Messtechnik GmbH
##OWNER= root
$$ TOPSPIN		Version 1.3
$$ 2024-11-19 10:19:08.000 +0400  Irina@DPX200
$$ Compression mode = diff/dup
##.OBSERVE FREQUENCY= 200.131300845
##.OBSERVE NUCLEUS= ^1H
##.ACQUISITION MODE= SIMULTANEOUS
##.ACQUISITION SCHEME= undefined
##.AVERAGES= 16
##.DIGITISER RES= 18
##SPECTROMETER/DATA SYSTEM= spect
##.PULSE SEQUENCE= zg
##.SOLVENT NAME= CDCl3
##.SHIFT REFERENCE= INTERNAL, CDCl3, 1, 17.49637
##AUDIT TRAIL= $$ (NUMBER, WHEN, WHO, WHERE, WHAT)
$$ ##TITLE= Audit trail, TOPSPIN		Version 1.3
$$ ##JCAMPDX= 5.01
$$ ##ORIGIN= Bruker BioSpin GmbH
$$ ##OWNER= Irina
$$ $$ F:/spectra/data/iren/nmr/1H/4/pdata/1/auditp.txt
$$ ##AUDIT TRAIL=  $$ (NUMBER, WHEN, WHO, WHERE, VERSION, WHAT)
(   1,<2024-11-19 10:17:42.984 +0400>,<Irina>,<DPX200>,<TOPSPIN 1.3>,
      <acquisition in progress>)
(   2,<2024-11-19 10:18:49.953 +0400>,<Irina>,<DPX200>,<TOPSPIN 1.3>,
      <Start of raw data processing
       fp BC_mod = 2 FT_mod = 6 PKNL = 1 PHC0 = 324.0722 PHC1 = -4.9524 SI = 32K 
       data hash MD5: 32K
       5B 13 E2 6D E9 74 5B AE 97 1E FF 5B 71 4A 6E 67>)
(   3,<2024-11-19 10:18:53.640 +0400>,<Irina>,<DPX200>,<TOPSPIN 1.3>,
      <apk 
       data hash MD5: 32K
       A8 17 13 22 6F CE 31 85 8E 4E 35 7C 0F 33 7B D2>)
(   4,<2024-11-19 10:18:59.234 +0400>,<Irina>,<DPX200>,<TOPSPIN 1.3>,
      <abs n ABSG = 5 
       data hash MD5: 32K
       F8 C9 AA 68 6D 31 8B 5E B1 E1 60 8B 22 7D 93 16>)
$$ ##END=
$$ 
$$ $$ hash MD5
$$ $$ 2C 46 F4 6E 29 5D 0F 73 1D A6 87 77 A6 11 E7 01
##$RELAX= 
##$RELAX= 
##$RELAX= 
##$RELAX= 
##$RELAX= 
##$RELAX= 
##$RELAX= 
##$RELAX= 
##$RELAX= 
$$ Bruker specific parameters
$$ --------------------------
##$DU= <F:/spectra>
##$EXPNO= 4
##$NAME= <1H>
##$PROCNO= 1
##$TYPE= <nmr>
##$USER= <iren>
##$AMP= (0..31)
100 100 100 100 100 100 100 100 100 100 100 100 100 100 100 100 100 100 
100 100 100 100 100 100 100 100 100 100 100 100 100 100 
##$ANAVPT= -1
##$AQSEQ= 0
##$AQ_mod= 1
##$AUNM= <au_zg>
##$AUTOPOS= <>
##$BF1= 200.13
##$BF2= 200.13
##$BF3= 200.13
##$BF4= 200.13
##$BF5= 200.13
##$BF6= 200.13
##$BF7= 200.13
##$BF8= 200.13
##$BYTORDA= 1
##$CFDGTYP= 0
##$CFRGTYP= 5
##$CHEMSTR= <none>
##$CNST= (0..63)
1 1 145 1 1 1 1 1 1 1 1 1 1 1 1 1 1 1 1 1 1 1 1 1 1 1 1 1 1 1 1 1 1 1 
1 1 1 1 1 1 1 1 1 1 1 1 1 1 1 1 1 1 1 1 1 1 1 1 1 1 1 1 1 1 
##$CPDPRG= <>
##$CPDPRG1= <>
##$CPDPRG2= <>
##$CPDPRG3= <>
##$CPDPRG4= <mlev>
##$CPDPRG5= <mlev>
##$CPDPRG6= <mlev>
##$CPDPRG7= <mlev>
##$CPDPRG8= <mlev>
##$CPDPRGB= <>
##$CPDPRGT= <>
##$D= (0..63)
0 2 0 0 0 0 0 0 0 0.06 0 0.03 0 0 0 0 0.0002 0 0 0 0 0 0 0 0 0 0 0 0 0 
0 0 0 0 0 0 0 0 0 0 0 0 0 0 0 0 0 0 0 0 0 0 0 0 0 0 0 0 0 0 0 0 0 0 
##$DATE= 1731997127
##$DBL= (0..7)
120 120 120 120 120 120 120 120 
##$DBP= (0..7)
150 150 150 150 150 150 150 150 
##$DBP07= 0
##$DBPNAM0= <>
##$DBPNAM1= <>
##$DBPNAM2= <>
$$ [...]
##$SW_h= 4401.40845070422
##$TD= 16384
##$TD0= 1
##$TE= 300
##$TE2= 300
##$TE3= 300
##$TEG= 300
##$TL= (0..7)
0 120 120 120 120 120 120 120 
##$TP= (0..7)
150 150 150 150 150 150 150 150 
##$TP07= 0
##$TPNAME0= <>
##$TPNAME1= <>
##$TPNAME2= <>
##$TPNAME3= <>
##$TPNAME4= <>
##$TPNAME5= <>
##$TPNAME6= <>
##$TPNAME7= <>
##$TPOAL= (0..7)
0.5 0.5 0.5 0.5 0.5 0.5 0.5 0.5 
##$TPOFFS= (0..7)
0 0 0 0 0 0 0 0 
##$TUNHIN= 0
##$TUNHOUT= 0
##$TUNXOUT= 0
##$USERA1= <user>
##$USERA2= <user>
##$USERA3= <user>
##$USERA4= <user>
##$USERA5= <user>
##$V9= 5
##$VALIST= <valist>
##$VCLIST= <CCCCCCCCCCCCCCC>
##$VD= 0
##$VDLIST= <DDDDDDDDDDDDDDD>
##$VPLIST= <PPPPPPPPPPPPPPP>
##$VTLIST= <TTTTTTTTTTTTTTT>
##$WBST= 1024
##$WBSW= 25
##$XGAIN= (0..3)
0 0 0 0 
##$XL= 0
##$YL= 0
##$YMAX_a= 729034
##$YMIN_a= -719400
##$ZGOPTNS= <>
##$ZL1= 120
##$ZL2= 120
##$ZL3= 120
##$ZL4= 120
##$ABSF1= 17.49637
##$ABSF2= -4.496376
##$ABSG= 5
##$ABSL= 3
##$ALPHA= 0
##$AQORDER= 0
##$ASSFAC= 0
##$ASSFACI= 0
##$ASSFACX= 0
##$ASSWID= 0
##$AUNMP= <proc_1d>
##$AXLEFT= 0
##$AXRIGHT= 0
##$AXTYPE= 0
##$AXUNIT= <>
##$AZFE= 0.1
##$AZFW= 0.1
##$BCFW= 0
##$BC_mod= 2
##$BYTORDP= 0
##$COROFFS= 0
##$CY= 7568.61572265625
##$DATMOD= 1
##$DC= 0
##$DFILT= <>
##$DTYPP= 0
##$F1P= 17.9538593292236
##$F2P= -4.03888763876832
##$FCOR= 0.5
##$FTSIZE= 32768
##$FT_mod= 6
##$GAMMA= 0
##$GB= 0
##$INTBC= 0
##$INTSCL= 1.367314e-010
##$ISEN= 128
##$LB= 0
##$LEV0= 0
##$LPBIN= 0
##$MAXI= 945.577
##$MC2= 0
##$MEAN= 0
##$ME_mod= 0
##$MI= -402.1523
##$NCOEF= 0
##$NC_proc= -5
##$NLEV= 6
##$NOISF1= 8.587773
##$NOISF2= 6.764455
##$NSP= 0
##$NTH_PI= 0
##$NZP= 0
##$OFFSET= 17.49637
##$PC= 1
##$PHC0= 322.7296
##$PHC1= 2.325537
##$PH_mod= 1
##$PKNL= yes
##$PPARMOD= 0
##$PPDIAG= 0
##$PPIPTYP= 0
##$PPMPNUM= 100
##$PPRESOL= 1
##$PSCAL= 0
##$PSIGN= 0
##$REVERSE= no
##$SF= 200.13
##$SI= 32768
##$SIGF1= 16.12182
##$SIGF2= -4.496377
##$SINO= 3.521527
##$SIOLD= 32768
##$SREGLST= <1H.CDCl3>
##$SSB= 0
##$STSI= 32768
##$STSR= 0
##$SW_p= 4401.40845070422
##$SYMM= 0
##$S_DEV= 0
##$TDeff= 16384
##$TDoff= 0
##$TI= <>
##$TILT= no
##$TM1= 0
##$TM2= 0
##$TOPLEV= 0
##$USERP1= <user>
##$USERP2= <user>
##$USERP3= <user>
##$USERP4= <user>
##$USERP5= <user>
##$WDW= 0
##$XDIM= 32768
##$YMAX_p= 356613223
##$YMIN_p= -113907
$$ End of Bruker specific parameters
$$ ---------------------------------
##NTUPLES= NMR SPECTRUM
##VAR_NAME=  FREQUENCY,     SPECTRUM/REAL,   SPECTRUM/IMAG
##SYMBOL=    X,             R,               I
##VAR_TYPE=  INDEPENDENT,   DEPENDENT,       DEPENDENT
##VAR_FORM=  AFFN,          ASDF,            ASDF
##VAR_DIM=   32768,         32768,           32768
##UNITS=     HZ,            ARBITRARY UNITS, ARBITRARY UNITS
##FACTOR=    0.134324425510551, 1,           1
##FIRST=     4401.40845070422, 34498,        -584837
##LAST=      0,             -13537,          -666529
##MIN=       0,             -113907,         0
##MAX=       4401.40845070422, 356613223,    0
$$ Real data points
##PAGE= N=1
##DATA TABLE= (X++(R..R)), XYDATA
$$ [...]
14104 -36708 -56943 -64994 -46937 -33165 -47302 -67515 -63435 -42906 -35979 -51124 -70101 -75386
14092 -75386 -66246 -53902 -49613 -52534 -48451 -28542 -5278 2382 -7358 -25251 -48557 -69808 -62796
14079 -62796 -15229 32149 22618 -36362 -74415 -53035 -15681 -19559 -56480 -76239 -61390 -39398
14067 -39398 -33374 -36757 -36048 -31669 -29943 -29441 -23003 -11014 -9266 -34445 -74142 -86146 -49055 -677
14053 -677 5855 -25060 -43930 -36652 -38532 -59567 -57631 -13700 24071 12375 -21111 -30562 -24692
14040 -24692 -32146 -37153 -14573 5692 -18378 -59895 -62252 -39103 -48661 -78967 -58194 11230
14028 11230 34201 -26245 -79766 -49181 7525 -4352 -63898 -77484 -34552 -17875 -64817 -110877
14016 -110877 -91794 -31982 1293 -13972 -44511 -53262 -35439 -15255 -18941 -45195 -64846 -58523
14004 -58523 -41504 -35153 -33566 -25230 -26040 -51696 -74569 -57470 -21762 -24808 -66590 -80711 -36929
13991 -36929 8026 -3400 -44937 -54822 -29242 -13361 -23937 -36353 -37399 -38888 -40304 -24873
13979 -24873 2267 13348 3048 -3925 385 -8039 -38416 -61037 -52875 -34800 -35694 -47120 -45339
13966 -45339 -35684 -39035 -50292 -48564 -38164 -38757 -39921 -11302 36815 50713 9557 -37804 -40358
13953 -40358 -13375 -4064 -18329 -25559 -18274 -19232 -34187 -42369 -37370 -37072 -45358 -42283 -23840 -14400
13939 -14400 -23985 -29069 -15635 -6131 -18721 -33839 -32189 -33622 -58973 -80331 -56862 -4242 20584
13926 20584 -2152 -37361 -53220 -51490 -38179 -11140 13543 6823 -27379 -50367 -45664 -37268
13914 -37268 -37621 -24784 5949 17063 -10233 -35212 -20820 2449 -12591 -48105 -50168 -17839
13902 -17839 48 -12788 -23778 -16502 -10715 -11492 1218 19775 6132 -37895 -57899 -33001
13890 -33001 -14360 -37605 -56185 -19760 30196 17807 -42723 -62167 -11911 34234 12586 -42759
13878 -42759 -60262 -30762 -3177 -7531 -25100 -28007 -16826 -13065 -28210 -46869 -43204 -17006
13866 -17006 -2273 -23558 -54971 -51561 -16660 492 -19100 -33385 -5908 35962 43212 15760
13854 15760 -9164 -18465 -28476 -39168 -29397 -375 17522 11839 7075 22001 38069 29496 1424
13841 1424 -22967 -35681 -42179 -38692 -15655 18040 34045 15130 -21299 -37561 -15088 22975
13829 22975 35563 13064 -8315 7123 45492 61478 39586 10098 927 1975 -9585 -31644
13817 -31644 -43333 -34887 -15449 -247 155 -11767 -17311 -1992 17009 7380 -26396 -38439 -7270
13804 -7270 25988 15465 -20776 -29501 -1354 23239 19114 2337 -10130 -24367 -43313 -51915
13792 -51915 -41440 -22129 -3644 11286 10768 -16297 -48354 -46150 -11443 6992 -16276 -45193
13780 -45193 -39321 -12751 -2564 -8481 -3653 14495 24307 18962 8989 -5631 -30274 -47994 -33362
13767 -33362 4722 26501 13041 -12895 -23561 -18084 -8713 1869 15198 22751 12015 -14708
13755 -14708 -34379 -22591 14331 34122 6832 -33917 -23990 35587 62834 7835 -65087 -64370
13743 -64370 -4446 22978 -6922 -25471 3710 24243 -9783 -50254 -34887 8669 9636 -32638
13731 -32638 -55101 -31843 165 11461 13919 18082 11154 -7670 -14422 -1705 2298 -23701 -59308
13718 -59308 -69378 -47013 -14929 1366 -8392 -33992 -49902 -38492 -12580 -1552 -13643 -28426
13706 -28426 -28140 -17330 -7559 -2248 -2893 -11944 -22108 -19785 -6712 -2117 -15478 -32201 -34577 -23865
13692 -23865 -14440 -16977 -30780 -41613 -29603 3732 21806 -6728 -55595 -64543 -22784 11939
13680 11939 -2797 -32872 -24873 9982 17155 -15173 -43553 -39571 -24026 -22138 -27038 -25555 -26747
13667 -26747 -41556 -57263 -55274 -39244 -26071 -20665 -17056 -14614 -16438 -19567 -22190 -32761 -55235
13654 -55235 -72301 -63404 -36845 -22336 -29242 -34982 -24213 -16927 -37772 -72957 -84824 -64803
13642 -64803 -43317 -42090 -45378 -34011 -21551 -28999 -41615 -27872 3523 6278 -34081 -71790
13630 -71790 -64538 -33637 -26783 -42941 -38185 -814 25357 6265 -30621 -35623 -5373 18151
13618 18151 8101 -16948 -26637 -19269 -15166 -22402 -26777 -15765 1423 5676 -6933 -22087 -27550
13605 -27550 -25659 -23010 -18922 -11643 -7379 -12465 -21273 -22564 -15431 -8707 -6091 -2988 752 -4351
13591 -4351 -25048 -53404 -70759 -62210 -29951 3078 7970 -21618 -57303 -63032 -34640 -2253
13579 -2253 7092 -3223 -12962 -12481 -6839 -738 7654 17442 19219 5895 -12095 -11445 16042 45460
13565 45460 43781 13948 -5039 9515 32875 31199 10315 -482 2562 -1086 -14407 -19710 -15756
13552 -15756 -19247 -26638 -16364 3361 -3985 -38325 -50862 -24424 -12339 -53387 -97695 -78863
13540 -78863 -22547 -8317 -43217 -55786 -16510 19083 9249 -8316 10733 41360 36858 6509
13528 6509 -8991 -7086 -13705 -26237 -20618 -3705 -6675 -28412 -32691 -6883 17949 16266 2555
13515 2555 1828 12392 14810 1444 -16479 -23495 -16783 -12404 -28068 -52661 -50172 -11220 21023
13502 21023 6098 -32321 -41013 -18674 -11662 -33111 -44986 -29437 -17342 -24577 -20377 7118
13490 7118 12285 -33095 -77433 -61837 -14968 -7318 -39348 -50366 -24134 -6455 -16728 -20200
13478 -20200 -3330 -2541 -30460 -41919 -11883 13198 -10754 -51351 -53373 -25585 -15614 -28861
13466 -28861 -33569 -26669 -32672 -46193 -35162 -1492 15551 1544 -17419 -27956 -47246 -74447
13454 -74447 -75215 -38501 -4771 -7648 -23915 -15383 9417 13993 -5261 -16933 -6332 5531 -2574
13441 -2574 -23638 -37042 -35648 -29670 -30227 -35449 -34898 -27161 -24684 -33257 -37714 -25500 -14192 -28451
13427 -28451 -55196 -56785 -30623 -14778 -23013 -19194 19168 54442 42739 686 -23732 -21176
13415 -21176 -16789 -16153 -4383 11813 9267 -8332 -16057 -13701 -21946 -34376 -21770 10672 19724
13402 19724 -8820 -35172 -26489 -1904 5251 -6279 -20540 -32854 -40380 -34357 -22917 -29963 -50248
13389 -50248 -42608 4058 37013 10444 -43656 -61578 -38359 -19861 -21918 -15662 8308 17141
13377 17141 -8992 -42003 -46020 -23012 -1854 -3699 -29008 -58768 -61984 -24695 21630 25431
13365 25431 -21201 -68221 -69666 -35983 -7425 1387 4031 4092 -12745 -45805 -65301 -46887 -8009
13352 -8009 8642 -12325 -39586 -36911 -10630 2585 -12011 -32000 -36421 -32322 -32002 -30144 -21435
13339 -21435 -17423 -23651 -21471 1478 22634 15957 -6101 -15126 -13925 -22975 -35018 -28165 -14444
13326 -14444 -25227 -51465 -51957 -25009 -15399 -37625 -50030 -27478 -3663 -9802 -23548 -17993 -13906
13313 -13906 -36869 -62809 -56871 -32681 -20539 -8196 27091 53325 20148 -49549 -74535 -27461
13301 -27461 30125 38605 10235 -11660 -13506 -4669 10223 23289 17609 -4921 -14482 5809 32153
13288 32153 33865 15139 3416 11836 29094 33442 7889 -41551 -78092 -68497 -30380 -14843
13276 -14843 -34005 -44618 -20788 1839 -12828 -37507 -26515 5329 5833 -27747 -45300 -26929
13264 -26929 -9892 -18725 -24296 -1294 20344 3491 -28869 -23996 17230 37900 9038 -29754
13252 -29754 -31639 -7704 -585 -16506 -22127 -2827 14317 5562 -12528 -10725 9352 22539 17378
13239 17378 2469 -15090 -32590 -38938 -26175 -12009 -21333 -42317 -33592 13830 54733 50013
13227 50013 19538 6889 15872 18655 11677 19558 43033 45360 6704 -39432 -47413 -17485 11607
13214 11607 16781 12151 18030 31199 34608 22906 6968 -1389 -502 2599 -1487 -16249 -30982
13201 -30982 -26435 606 23888 15669 -13504 -25509 -9368 2475 -13659 -34698 -31114 -16869
13189 -16869 -20578 -29029 -9714 21677 15254 -27957 -46682 -13820 19516 6299 -25587 -29390
13177 -29390 -17980 -29142 -48141 -30862 13913 31250 6440 -14861 -1089 21629 16439 -12346
13165 -12346 -32302 -22864 8363 32275 22835 -8132 -15108 17575 40556 7929 -44697 -48461
13153 -48461 -9986 225 -34748 -53289 -24159 819 -21295 -52577 -42967 -10427 2456 1069
13141 1069 9593 12342 -13647 -41164 -30592 912 8678 -3589 1020 20028 18947 303 324
13128 324 20370 24767 9065 8934 33017 45467 28724 9690 7263 4416 -9171 -14658 -4638
13115 -4638 -1373 -13060 -14956 2937 11422 -8775 -32497 -32208 -18446 -10868 -4349 6938 6122 -14086
13101 -14086 -27936 -17947 -7897 -19471 -27761 -1691 37404 43270 13380 -13362 -15550 -5979 1416
13088 1416 5150 4226 2596 13035 29170 16763 -31015 -58563 -19220 43326 50019 7727 -1742
13075 -1742 44560 72944 34564 -16310 -13293 20089 22857 1840 11114 52813 71973 45110
13063 45110 10331 1917 7433 3583 -7907 -16820 -23064 -23468 -8464 14590 21567 7746 -2211
13050 -2211 6883 19150 19514 18020 22671 17145 -8132 -28754 -21314 -3031 -1507 -6509 5120 14621
13036 14621 -13502 -57441 -52576 8254 52509 33983 706 12613 45683 41310 12036 19966
13024 19966 65333 78432 31334 -16897 -12540 18677 27114 17035 22569 42414 46935 28915
13012 28915 5664 -13675 -27063 -21702 6791 30919 22517 -4091 -14741 -8684 -10815 -21131
13000 -21131 -15647 5200 13314 1428 -7333 -4848 -9911 -23220 -15159 20375 41256 16484 -23100
12987 -23100 -29251 -6580 1553 -16890 -28732 -11643 12990 15701 1641 -1524 13989 26361
12975 26361 18007 2835 6452 26063 30901 8603 -10887 3975 39194 55510 44686 33438
12963 33438 34977 32193 14135 -4648 -12144 -15941 -20094 -14507 -1082 488 -10196 -3570 31385
12950 31385 59509 48020 14401 -5216 -8964 -14811 -17098 1 21039 15940 -8424 -15108 6021
12937 6021 27377 31606 32676 42286 49349 43689 32337 22164 10235 -715 -311 8824 10697 2603
12923 2603 302 10680 21260 22944 21024 17368 4661 -13687 -19971 -7654 8967 17435 19851
12910 19851 18050 8409 -2376 372 13945 18308 8252 924 4916 9458 11855 24316 42713
12897 42713 42781 22691 13404 27075 33757 15887 4995 26753 47819 26972 -10466 -7902 29834
12884 29834 42084 8362 -23187 -14609 11228 21120 23567 38432 52798 44748 25855 22283 28908
12871 28908 18867 -7524 -17863 4464 35320 43589 30499 20868 26519 35031 33044 25850 26801
12858 26801 35919 40621 35939 32004 37849 48231 53252 52676 52702 55137 57729 59088 55857 42298 21456
12843 21456 9013 15446 30875 38305 35702 33974 39325 48790 57591 61093 56408 49956 52088 56138
12829 56138 41442 11103 2364 34296 69279 63137 34447 36741 71774 86361 60034 37093
12817 37093 50630 69412 55811 31225 37371 64046 66910 40281 22100 31571 47799 53816
12805 53816 60166 72804 72859 48454 22717 27256 59028 82387 71549 39030 19587 30589 53147
12792 53147 56690 39002 28670 43585 64748 66009 53849 53351 63720 58750 34134 22717 46787
12779 46787 79204 76826 40842 16721 33464 67026 75608 53979 32673 30195 31335 20283
12767 20283 11836 28416 59299 70172 51125 27801 19864 15830 1571 -11696 -8003 4427
12755 4427 8416 8247 19873 39167 45119 32141 17519 16659 28556 44941 57165 55149 35722
12742 35722 11775 -551 -1170 414 4200 15615 29232 35747 38770 44248 42329 25834 16911
12729 16911 39522 69599 56948 4435 -22225 14113 64934 65377 24696 1448 11797 17104
12717 17104 -1577 -10682 18810 62744 78047 59502 35608 24827 23732 29963 47304 65500
12705 65500 62024 36442 22111 43747 77410 78597 44648 18782 27345 45238 40671 24874
12693 24874 28946 52395 69038 71056 70310 63306 36076 4450 6119 42200 67500 55362 33088
12680 33088 30765 33957 18976 1199 7490 24517 19251 -2020 350 36945 72493 76105 55697
12667 55697 35034 23869 20180 20790 21136 19705 25772 46932 68430 63907 30527 -3202 -9519
12654 -9519 11141 36644 45792 34488 19131 20901 38894 48845 38937 29446 37992 45844 28928
12641 28928 4949 9689 36037 42312 20890 10108 28528 45861 38958 31894 50946 76277
12629 76277 73180 45307 23070 18474 22272 29921 40836 44398 33350 20841 21790 29544 32109
12616 32109 36257 51889 67667 67752 58660 54051 48695 36181 35411 64142 98624 98446 65124 37657
12602 37657 33794 35832 34343 43084 63258 73522 67657 65457 73039 68734 44464 25458 29439
12589 29439 40423 44038 52911 70494 66755 26410 -9991 3216 47776 69491 58951 54128
12577 54128 69979 78681 65160 52770 58836 66727 60918 52686 50251 39249 18157 18375 55823
12564 55823 92062 83487 47216 33606 48306 52329 35502 34417 64786 87849 71993 46166
12552 46166 54232 85319 92609 65941 43063 52044 79515 99434 101998 87853 61677 40566
12540 40566 44438 67463 79554 66157 47383 48151 68384 92476 108721 109240 91917 74919 86757
12527 86757 125811 152216 139612 112854 110227 128635 135589 119831 98718 86590 86791 105211
12515 105211 139166 161261 149286 125740 129997 156287 163118 144607 142422 175707 209926 216945
12503 216945 217502 233059 240986 219661 200208 221994 262883 270328 248168 253171 303713 347972
12491 347972 339651 300127 280348 293700 314383 321398 317968 317569 329384 351483 367723 360060 332632
12478 332632 313295 322089 347598 362684 354398 331732 314489 320734 352460 386064 391693 371555
12466 371555 361833 382634 405579 394002 358576 340305 346475 343641 319358 307969 332473 357446
12454 357446 337542 289431 269679 289884 303307 281893 256564 258818 266956 247066 213637 203603
12442 203603 212176 205576 186673 192791 226009 240864 215985 186565 181963 179728 155728 136709
12430 136709 157739 198836 213103 196941 182974 177898 159477 130239 122389 144166 166536 171739
12418 171739 173112 176319 163483 133076 116608 132719 156477 157712 141936 129892 123043 115684
12406 115684 117970 137119 152339 138090 102520 77614 78326 93287 109294 123607 134737 138452
12394 138452 133539 123144 114239 118009 137490 151644 133655 94617 82421 118475 161256 159308
12382 159308 118908 87593 87296 99754 108554 117605 127620 127271 113968 99613 92400 92299 101879
12369 101879 119377 125713 105341 77792 79242 111158 136403 130451 107974 92615 89019 93577
12357 93577 105580 116636 113339 100554 98428 108302 108912 96281 96344 122183 149446 155197 152273 159669
12343 159669 165700 151961 132909 136648 159147 170681 160189 143278 132409 128289 135877 158243
12331 158243 175334 159423 116804 88090 99511 134831 161529 165089 151604 135659 132855 148038
12319 148038 165500 166037 155531 157145 172746 176981 158319 139813 142954 154252 150138 137041 139777
12306 139777 160356 175974 174668 167255 162895 158140 156292 172497 205135 222405 199165 156559
12294 156559 141085 165301 191807 183440 150340 131600 141614 155876 149940 131905 125160 132867
12282 132867 138039 135309 141986 168781 195079 191424 161688 142277 154189 175417 175896 164197 173992
12269 173992 209075 232668 220645 197188 197096 214386 216906 199421 189285 201226 218211 223358
12257 223358 222830 226121 228350 226752 233946 257681 283229 292267 286753 280830 282292 293653 314980
12244 314980 332606 324902 296435 284729 310639 344734 352903 353192 385570 438246 454458 416492
12232 416492 375931 383657 427277 459975 462280 450721 445583 452927 466109 469379 451480 424828
12220 424828 414523 420652 415037 387915 370087 387061 416913 423557 412678 419839 453432 484706
12208 484706 492112 483716 473917 467731 473159 499959 535851 550200 535835 524230 540884 566334
12196 566334 566987 550602 557516 596245 622210 598619 553526 545646 583180 612404 593112 550092
12184 550092 528012 525791 513160 494335 506447 552982 586371 573764 540043 521308 512276 493099
12172 493099 477510 490905 518566 521315 496658 482286 498163 523697 537224 541161 538837 522242
12160 522242 498332 495252 520333 536446 505449 440512 392671 392583 422299 440782 426362 395624
12148 395624 382904 397211 406529 380254 338803 332256 369410 403269 398209 375094 368054 371315
12136 371315 362207 349904 359475 381912 382796 357482 339035 347629 365611 370205 361574 348883 335002
12123 335002 326755 336879 361991 377808 369733 351503 341154 335536 322961 305437 291780 281392
12111 281392 271926 272110 288654 308539 313092 303974 296737 293757 284947 273492 276014 291613 295043
12098 295043 274135 253850 263272 291922 302035 278853 245744 228971 229832 237845 250585 267691
12086 267691 280815 284274 284663 286551 280632 261818 246245 249121 256568 246370 229244 235774 262414
12073 262414 269736 245552 229219 249398 275227 265786 238263 239861 269451 280594 259406 244737
12061 244737 259578 274399 264236 257082 286555 328046 328526 284893 246757 243031 248671 235324
12049 235324 218667 231451 270530 298137 291143 267936 261526 278773 296477 294990 284701 291171
12037 291171 318592 341710 338729 319834 311660 321406 330824 322947 300558 277886 267649 278795
12025 278795 312741 354163 376071 364790 336335 320788 331583 353603 360412 343137 324421 339000
12013 339000 391729 440169 436234 386503 349774 365603 408430 431119 431026 440394 464324 470829 447108
12000 447108 425131 433164 454886 461955 460313 472689 494738 504412 503676 513945 534726 544076 541041
11987 541041 549664 574179 588591 583716 586411 612489 638045 644814 658175 702752 749866 755531
11975 755531 731969 731198 765828 797791 807973 825129 870166 917009 934536 933963 946690 979112
11963 979112 1015983 1051141 1090143 1133699 1178045 1223237 1268131 1308771 1352411 1417655 1508820
11952 1508820 1607640 1703342 1810813 1942859 2087329 2234701 2406877 2627461 2876195 3104351
11942 3104351 3288618 3440148 3564023 3641119 3655526 3615796 3540642 3439181 3311104 3156747
11932 3156747 2985779 2819972 2676612 2540367 2370507 2155949 1945232 1794009 1697096 1605626
11922 1605626 1500716 1410025 1352969 1311086 1261306 1203600 1145156 1088847 1047064 1034393 1034465 1007287
11910 1007287 945041 888626 870762 874318 867883 850619 835221 815591 783383 753938 743055 735664
11898 735664 708937 671017 646097 635812 627218 624709 638220 649971 631376 589612 560973 557991
11886 557991 558234 547762 539400 539709 532408 509470 490631 494942 514047 528432 531969 528001 519595
11873 519595 516037 529807 552475 552619 516943 477913 477075 509534 529751 511798 479941 470974 485298
11860 485298 493127 480662 467780 474663 490480 491770 479376 473548 476502 467300 438847 413225 409295
11847 409295 419387 429935 438523 436781 409672 373317 375887 427726 468427 448112 405479 406912
11835 406912 438854 434565 390310 369801 392327 405319 386570 385266 425725 453924 430569 402446
11823 402446 419467 447111 432754 401848 407704 431358 418350 382097 380739 412462 424173 411468
11811 411468 417655 437735 420280 373462 370705 426743 463168 434734 399793 414811 443050 433283
11799 433283 416160 443258 485333 476979 428228 408376 436447 463409 456367 433227 414551 400690
11787 400690 399053 420497 445567 443595 426266 431979 456789 457693 431699 429828 471579 504788 485760
11774 485760 449432 453561 489069 498715 466319 435115 439012 460787 469505 464149 459739 453667 432878
11761 432878 406402 403500 432687 463380 464159 445003 438477 447106 441298 413509 398741 421969 455289
11748 455289 456137 426810 404446 407122 422242 437200 448673 449145 436117 428670 444489 468192 473950
11735 473950 468753 476236 488861 480862 461036 461879 478478 473816 448430 444424 468920 477863 457257
11722 457257 454406 495303 534295 529032 507340 509623 518968 505793 492309 507772 522957 500481
11710 500481 473844 498531 552355 567242 542032 537474 567666 586095 582568 602310 651115 670237
11698 670237 637406 612791 643853 695619 721524 738313 776928 815767 824002 828285 873511 946116
11686 946116 994534 1006875 1016700 1043440 1070920 1078935 1064512 1039289 1025500 1037534 1052926 1030783
11674 1030783 975513 942134 954794 967708 940994 903677 895478 897323 877095 856970 868525 884019
11662 884019 866951 850804 881723 917975 886874 819393 815997 883406 924188 902589 896938 950095
11650 950095 990405 965138 941829 990758 1058158 1058159 1022911 1051517 1152208 1242862 1286319 1324281
11638 1324281 1383067 1438475 1481630 1539753 1616789 1679587 1716070 1747284 1771436 1757147 1707516
11627 1707516 1672198 1674409 1677337 1645044 1589130 1532299 1471223 1401878 1341887 1301459 1266316 1230002
11615 1230002 1205748 1186134 1134943 1048561 982735 979745 1004583 996185 952042 914665 897671 879235
11603 879235 858544 864108 900002 928519 920834 893034 877287 881968 894683 905926 915324 926176
11591 926176 944088 972765 1005417 1028941 1041162 1055702 1085544 1128454 1171688 1204866 1225551
11580 1225551 1237641 1247324 1257261 1262718 1254726 1227463 1183021 1131385 1084991 1048620 1015117 976862
11568 976862 938767 909496 882329 841847 792688 761325 758686 760274 740109 708173 692302 694522
11556 694522 691550 674719 662000 665181 668506 652624 624536 608389 612720 620490 612993 594742 587326
11543 587326 599680 613947 608992 590974 584553 594543 597711 580648 562725 563369 566588 545829 512238
11530 512238 504813 533284 563932 570599 568594 579861 590722 573455 537138 524549 555256 597455
11518 597455 608861 588443 569908 572592 580309 571605 551693 541887 549103 561254 567000 564623 554847
11505 554847 541606 539404 562687 605499 646497 673721 686934 679532 646955 615964 629523 686765
11493 686765 731969 726804 701589 703860 726074 725785 696312 670282 663717 663644 667726 689232 718816
11480 718816 726088 709171 702079 719839 734189 719849 690237 669250 659033 654118 657607 664286
11468 664286 656073 633635 624969 643685 667575 678111 688681 709108 717157 699526 689957 723335
11456 723335 773444 783578 748840 721811 736266 767045 775945 765071 767352 800787 845821 864746
11444 864746 841887 804142 792117 810272 825246 818925 814634 835419 867049 886454 897181 906990
11432 906990 900664 872869 859534 890572 934459 941193 921459 924901 951966 953043 916011 888313
11420 888313 899067 920563 927519 937696 966329 989939 986409 970233 961414 958731 966190 1000290
11408 1000290 1044601 1047525 1001283 973927 1017609 1089254 1114696 1093156 1079224 1091742 1105637
11397 1105637 1115583 1141867 1178392 1193634 1184234 1177530 1182027 1183782 1188415 1213923 1242408 1235677 1203690
11384 1203690 1197920 1225422 1233110 1200511 1183686 1227248 1287990 1298506 1266809 1255128 1284364 1317128
11372 1317128 1325545 1323300 1329019 1341231 1356225 1375433 1388001 1378248 1360094 1373885 1433489 1500528
11360 1500528 1529889 1523812 1521638 1547633 1589922 1626878 1653837 1678490 1704257 1729036 1754345 1784384
11348 1784384 1815773 1838109 1849631 1864941 1898734 1944913 1980505 1990462 1982735 1979820 2001185 2050618
11336 2050618 2111183 2153902 2162503 2151024 2147664 2162094 2181812 2200572 2230580 2277185 2319744 2335616
11324 2335616 2333674 2344955 2382832 2429799 2465246 2489838 2515047 2541597 2562097 2580821 2615433
11313 2615433 2672505 2730920 2762868 2770917 2790429 2847459 2924848 2983507 3012215 3039527 3094272
11302 3094272 3170722 3242896 3302048 3363853 3439008 3511890 3559783 3588847 3635562 3723596 3829864
11291 3829864 3911078 3961251 4019848 4115391 4225194 4310348 4371950 4444984 4545092 4650930 4740464
11280 4740464 4819277 4905359 5003151 5099507 5175435 5222990 5260763 5323148 5416666 5499802 5533964
11269 5533964 5544267 5593012 5695626 5804651 5882637 5947189 6029569 6131481 6244805 6374776
11259 6374776 6516859 6646877 6763822 6907935 7102983 7313910 7499111 7672353 7870117
11250 7870117 8089033 8306999 8539840 8816678 9115126 9385366 9634232 9921413 10266896
11241 10266896 10624039 10958062 11292034 11652406 12022449 12379961 12737502 13114100 13503285
11232 13503285 13897209 14307748 14736464 15159239 15570046 16003965 16484165 16983560 17478949
11223 17478949 18005664 18605402 19247844 19867499 20467314 21120401 21862538 22644108 23412820
11214 23412820 24195499 25060592 26027985 27055491 28106217 29197167 30374897 31661823
11206 31661823 33040367 34487798 36015213 37662310 39458388 41406635 43512126 45804131
11198 45804131 48314158 51049627 54013285 57234714 60746856 64524991 68470356 72456763
11190 72456763 76373788 80129290 83649985 86904823 89909074 92680068 95192529 97388510
11182 97388510 99217474 100643881 101618984 102072654 101952021 101267192 100096645 98558552 96788801
11173 96788801 94936974 93147678 91508964 90012101 88584047 87180189 85846781 84691275
11165 84691275 83804613 83223761 82955330 83005184 83373120 84036587 84963009 86141977 87592188
11156 87592188 89328875 91336250 93591430 96115278 98977407 102240924 105924607 110038203
11148 110038203 114630727 119768469 125476659 131738918 138539725 145850025 153563667 161508209
11140 161508209 169545629 177611286 185623748 193419192 200835857 207817159 214348254 220295707
11132 220295707 225366334 229213727 231537344 232122584 230906113 228040375 223813103 218453869
11124 218453869 212076738 204851320 197147939 189408339 181870428 174477875 167067390 159613047
11116 159613047 152303290 145438894 139275938 133924309 129345223 125423324 122044120 119127204
11108 119127204 116625212 114515644 112787327 111425164 110415321 109764668 109494095 109606405
11100 109606405 110084642 110931992 112186773 113883627 116028525 118632413 121741372 125406384
11092 125406384 129643640 134441535 139764458 145500587 151425837 157271876 162832927 167977446
11084 167977446 172570230 176427073 179343093 181130027 181643767 180842915 178836539 175812057
11076 175812057 171871721 166976497 161104204 154454137 147445157 140484821 133745975 127169411
11068 127169411 120658810 114244532 108066488 102252662 96863753 91934136 87491123 83503335
11060 83503335 79863310 76471146 73310583 70405961 67737124 65246719 62905464 60712345
11052 60712345 58647885 56689569 54862422 53205183 51686434 50224977 48801162 47473411
11044 47473411 46266361 45121427 43991938 42909829 41907793 40946271 39984100 39063436
11036 39063436 38245711 37503035 36755786 35994118 35278322 34626908 33988114 33334330 32711102
11027 32711102 32164163 31672221 31184354 30686932 30204703 29760108 29352991 28964883 28573093
11018 28573093 28174658 27795786 27458888 27147559 26830788 26511768 26215803 25935861 25634986
11009 25634986 25305914 24982470 24681965 24381964 24069672 23768212 23489987 23206647 22896923
11000 22896923 22589150 22321430 22087151 21854930 21620076 21400846 21199759 21002210 20803548
10991 20803548 20609948 20421263 20235352 20058547 19892364 19724474 19551499 19390769 19247556
10982 19247556 19095246 18917300 18743244 18604731 18478610 18321323 18144798 18003176 17906921
10973 17906921 17806577 17671441 17531323 17420564 17327943 17229594 17132260 17051364 16976018 16888349
10963 16888349 16795545 16714364 16644242 16581272 16535304 16504240 16456817 16377774 16307424 16290945 16303697
10952 16303697 16279478 16208399 16149451 16136602 16130971 16093282 16052594 16060401 16111627 16159104 16185358
10941 16185358 16212053 16249397 16284850 16322130 16385434 16474712 16556135 16612448 16669146 16752546 16852763
10930 16852763 16950068 17050473 17169234 17301375 17435085 17574661 17723647 17866845 18001511
10921 18001511 18165120 18390397 18647914 18882946 19102987 19371661 19708201 20053557 20362540
10912 20362540 20674704 21050847 21481007 21909213 22324694 22771143 23272094 23799875 24326537
10903 24326537 24864281 25440811 26064168 26726174 27419231 28138635 28885171 29672911 30519418
10894 30519418 31424023 32369992 33348467 34364626 35424003 36533757 37713512 38978084
10886 38978084 40310518 41683027 43107639 44631971 46277215 48017895 49838412 51771035
10878 51771035 53853372 56083932 58452725 60987052 63730720 66702819 69918728 73433947
10870 73433947 77322606 81622907 86346969 91534390 97241368 103466174 110124964 117107002
10862 117107002 124309674 131606906 138828706 145795585 152338311 158266745 163367949 167477003
10854 167477003 170522954 172472882 173267290 172863459 171323802 168805185 165463147 161415956
10846 161415956 156804054 151826008 146685518 141533922 136484855 131650914 127133055 122993151
10838 122993151 119267892 115999706 113227591 110953281 109141974 107759366 106792826 106237000
10830 106237000 106074799 106276829 106812017 107661801 108835570 110372000 112315657 114693693
10822 114693693 117525111 120849977 124736531 129258278 134472294 140412259 147076885 154409562
10814 154409562 162295116 170580350 179086177 187594687 195844180 203562706 210514735 216517370
10806 216517370 221429928 225151209 227624925 228825494 228732244 227335230 224673438 220846973
10798 220846973 215977858 210179307 203586396 196397444 188843374 181110657 173324352 165608444
10790 165608444 158115348 150964996 144187424 137767793 131731213 126139588 121015310 116323049
10782 116323049 112038547 108186338 104782838 101780982 99107753 96732248 94661191 92887466
10774 92887466 91386603 90158888 89233659 88624491 88311935 88282657 88560528 89181651 90149851
10765 90149851 91425780 92949155 94662863 96519627 98468129 100433842 102325868 104073021
10757 104073021 105639782 106991418 108061950 108784711 109139408 109129301 108716637 107826877 106427264
10748 106427264 104561285 102291959 99653058 96679702 93448357 90052631 86563953 83041690
10740 83041690 79551630 76140026 72813521 69579834 66486014 63579381 60853357 58277031
10732 58277031 55861992 53649357 51636982 49770558 48011030 46366359 44849867 43449216
10724 43449216 42146568 40930667 39778293 38662305 37591620 36606293 35716588 34880672
10716 34880672 34058707 33255734 32495069 31784329 31125711 30522175 29950251 29364531 28758133
10707 28758133 28183190 27678734 27213352 26737939 26260436 25818378 25403666 24973581 24526024
10698 24526024 24106224 23736819 23392675 23053321 22732055 22436104 22140134 21825020 21513353
10689 21513353 21239589 21002972 20772621 20527858 20275472 20033852 19813916 19612829 19417945
10680 19417945 19217289 19008935 18800877 18605123 18431472 18276632 18117107 17930041 17729308
10671 17729308 17559121 17436245 17322605 17179047 17021906 16892685 16791443 16681035 16544653
10662 16544653 16395700 16238284 16063971 15885649 15727618 15579489 15406078 15207294 15020045
10653 15020045 14854743 14682099 14492978 14314546 14150460 13965340 13753526 13561657 13410480
10644 13410480 13257357 13077500 12915796 12802573 12683639 12507696 12327221 12224070 12175510
10635 12175510 12091046 11956571 11839365 11760556 11669801 11554744 11470013 11432065 11383974 11301302
10625 11301302 11238362 11221478 11187825 11092973 10994342 10950301 10911743 10806960 10673594 10598791 10567738
10614 10567738 10487290 10344834 10226765 10169318 10101698 9969996 9820398 9710113 9616213 9492479
10604 9492479 9353343 9237236 9134752 9017471 8900303 8809560 8717313 8576347 8405496 8272633
10594 8272633 8195076 8119696 8009079 7888913 7792364 7708214 7610248 7500044 7394427 7299193
10584 7299193 7216743 7153094 7098205 7026393 6935513 6857227 6807266 6756629 6679152 6596317 6540056
10573 6540056 6499228 6444611 6383050 6337972 6293793 6216316 6121095 6060046 6035045 5988048 5895516
10562 5895516 5810149 5774674 5749710 5675804 5565428 5477122 5424047 5365179 5276339 5179007 5099907
10551 5099907 5042627 4998711 4953097 4883706 4788866 4705406 4662009 4627706 4553644 4454958 4392302
10540 4392302 4373606 4341987 4274484 4220596 4210799 4195922 4128064 4043516 4001135 3982840 3930001
10529 3930001 3850817 3809929 3818048 3812193 3758766 3704036 3692697 3696025 3662522 3597047 3543395 3515051
10517 3515051 3488372 3451065 3415936 3387986 3351831 3298804 3243113 3201472 3171224 3137266 3092081
10506 3092081 3042043 2998365 2966592 2943177 2918966 2885785 2842462 2798023 2767998 2760625 2763907 2754394
10494 2754394 2724461 2691709 2673007 2660820 2639519 2613561 2597793 2586962 2561998 2526220 2505427
10483 2505427 2504641 2494810 2458235 2420050 2410917 2419191 2408823 2372639 2338118 2324585 2322980 2320245 2318198
10470 2318198 2319567 2314888 2294989 2264313 2232584 2202825 2175242 2153779 2140409 2129877 2117421 2105162
10458 2105162 2093865 2076253 2048625 2022824 2012961 2012105 1997103 1960082 1921141 1901394 1895507 1884230
10446 1884230 1865398 1853561 1850051 1835057 1799109 1765913 1766769 1798883 1825606 1818611 1787907 1766661
10434 1766661 1774084 1797789 1810073 1798562 1778103 1769602 1772261 1769214 1759876 1766155 1795697 1819234
10422 1819234 1805827 1767141 1740895 1738555 1739016 1731633 1730969 1740372 1734654 1699514 1662820 1659551 1680779
10409 1680779 1686570 1664481 1646661 1662472 1696552 1709991 1692855 1676486 1691053 1727075 1752170
10398 1752170 1755723 1755604 1763186 1770205 1778782 1811611 1869650 1911114 1908459 1900689 1942171 2016813 2058966
10385 2058966 2052375 2045207 2061898 2068894 2048967 2040965 2068028 2086712 2055031 1999246 1961470 1930080
10373 1930080 1881201 1842539 1844807 1847923 1796547 1722586 1704436 1737802 1740525 1688128 1649121 1664935
10361 1664935 1685292 1660600 1620050 1610386 1621992 1625975 1629346 1642998 1644549 1624353 1622769 1667806
10349 1667806 1717576 1722123 1705431 1724549 1778253 1822048 1851147 1899742 1969386 2024795 2058727
10338 2058727 2099701 2152434 2188883 2206453 2239943 2300933 2353092 2364298 2342264 2304437 2253522
10327 2253522 2198603 2160184 2134217 2087258 2008839 1935334 1897893 1876003 1829224 1752371 1673813
10316 1673813 1616284 1581646 1560820 1540204 1509730 1477713 1463805 1466561 1457070 1419836 1381042 1375796
10304 1375796 1400239 1417055 1401898 1366913 1341129 1341335 1363170 1392334 1419486 1441874 1453626 1448810
10292 1448810 1441014 1459549 1506821 1540458 1529554 1510834 1544166 1620758 1669962 1662554 1648649 1672123
10280 1672123 1704690 1702698 1682034 1686713 1713269 1717474 1682001 1635585 1612765 1625456 1663022 1693735
10268 1693735 1682690 1636165 1608439 1634371 1678424 1686415 1663000 1653120 1667997 1682711 1694597 1727225
10256 1727225 1778857 1821055 1851375 1896466 1959239 2015687 2070166 2157057 2275514 2383026 2475063
10245 2475063 2609105 2815595 3042986 3236607 3420783 3645420 3888966 4078611 4186535
10236 4186535 4245546 4278431 4268727 4203243 4095029 3956982 3792290 3617440 3457431 3308515
10226 3308515 3137732 2929907 2708371 2502249 2321015 2168857 2054019 1969929 1891668 1806157
10216 1806157 1726362 1664066 1609570 1551645 1497095 1454374 1415218 1369815 1325532 1293038 1266225
10205 1266225 1233663 1199406 1173820 1151830 1120047 1081278 1052630 1039569 1029405 1013211 998080
10194 998080 990673 980914 952804 907178 865311 848774 858387 874134 875699 861701 846432 839274
10182 839274 834122 821103 800656 780102 763654 754664 760661 781929 797564 781071 736161 701473
10170 701473 706647 733831 739270 708811 673207 665401 680822 690945 682706 668270 661814 663378 665591
10157 665591 662216 648327 625300 608211 613483 633772 640601 620675 593418 579945 572875 557905
10145 557905 548465 566115 592968 583683 533987 498635 518237 560385 567399 539127 524521 540892
10133 540892 551176 529317 501136 496456 499258 481295 458376 469066 508546 528655 506741 474829
10121 474829 468631 481935 489714 487680 485731 483917 479522 481422 493132 495985 474583 446557 439732
10108 439732 450429 454686 452168 462963 482743 480484 448691 419328 415443 419573 408868 392668
10096 392668 392614 408041 422656 426653 415095 386611 360896 370052 410091 431091 404982 371831
10084 371831 380140 411060 412158 383757 371479 384208 385667 369725 375233 408675 418560 378707
10072 378707 338135 345703 375622 378652 365090 376206 402107 395508 356721 339191 364733 391467
10060 391467 383729 364593 370907 392602 391146 358740 327029 322622 338089 349968 350302 351484 363194
10047 363194 374043 365347 340437 324343 328831 336169 329864 321446 326431 332959 322933 309320 316987
10034 316987 334976 328079 295504 275736 284882 292393 275098 255989 263618 285720 293870 288703 287712
10021 287712 287221 271055 245719 234608 242657 254134 260699 265784 265607 253145 239924 246823 269783
10008 269783 279046 259441 231243 222829 238621 261930 276243 275975 265809 255738 251705 250496 248511
9995 248511 250168 259096 268769 273450 278071 281794 266092 224541 192045 208098 253874 267529 230392
9982 230392 194841 206450 239403 242316 215456 199786 209351 220613 221567 226619 239108 239059 219946
9969 219946 204666 209465 219213 216146 209826 217607 233042 236481 226444 219336 223605 231824 234966 229929
9955 229929 216602 201181 197867 211871 224108 210937 179958 167076 191001 227085 238176 219954
9943 219954 200440 199760 207063 201398 183090 172672 180876 191891 184448 162843 152681 164307 177590
9930 177590 174163 168222 182646 204189 195346 155419 134027 162607 202744 198195 159662 151679 195959
9917 195959 236442 219759 170090 150086 173875 199848 198151 182741 174118 169225 162540 166073 186910
9904 186910 205939 201697 182007 170789 173736 178390 180919 189707 204138 211538 207477 200479 193461
9891 193461 178943 158006 146119 151984 165567 174693 178578 178063 170665 164812 177573 203295 207777
9878 207777 176242 144472 150463 174552 170295 143499 146504 188943 213028 183431 147927 163946
9866 163946 205450 201253 144597 102044 115798 155811 179700 186252 186601 169381 129620 99203
9854 99203 110009 146799 171588 179000 191091 207337 200335 165016 136941 146673 178485 191821
9842 191821 172475 147753 153077 191539 229241 231180 198870 164702 150362 147287 144440 153271 184878
9829 184878 218448 220556 190814 162186 156230 162313 164116 163280 169078 182337 197079 205678 200746
9816 200746 185436 179377 196296 219118 220124 203389 198976 213707 220268 202930 180719 171916 168524
9803 168524 163595 171071 195089 210146 199607 186480 195375 209607 200653 177204 166513 166465 158012
9790 158012 149556 163043 185652 183865 163065 164268 196739 220910 210015 186463 180833 190605 196273
9777 196273 188998 170482 153297 165144 216979 264731 249936 187684 159075 195917 232551 207285
9765 207285 153135 136635 156360 165942 161295 173954 198616 198595 176254 171918 192173 200675 185219
9752 185219 174438 178535 172277 151921 150992 177434 190321 167482 144585 152753 165861 151434 131009
9739 131009 140517 164017 160422 133718 122811 134649 140184 132436 137738 163724 180509 166325 136946
9726 136946 116185 106051 100007 101240 112959 128695 143498 158807 168686 159862 135310 119780
9714 119780 128859 146967 149819 137152 128188 131953 137449 132179 118654 109209 110628 118519 125651 130847
9700 130847 135511 134882 122207 102619 91667 95572 104515 111308 121959 137765 143610 129917 111198
9687 111198 103449 97779 80566 66090 77868 105147 112879 94818 81618 90510 101278 93821 78400
9674 78400 72973 77415 86411 102707 120331 118966 94503 73227 75714 87569 86989 80556 87677 106757
9660 106757 120695 121276 107831 80170 54625 63701 110364 145180 125868 81051 71748 102270
9648 102270 119142 96396 69690 74159 95366 103814 101147 105319 115646 118092 109051 95247 82957
9635 82957 79285 89429 104363 108280 103766 107621 116321 104515 69240 44238 51571 68503 65981
9622 65981 52629 52348 62547 67211 71813 89660 107491 101544 79836 72699 85290 94335 90982
9609 90982 91294 99984 98725 81671 72157 87621 111027 114806 97121 78596 74455 83303 95700
9596 95700 103083 102106 96213 91157 89614 93477 105111 118688 119885 106478 97472 104204 106272 82541
9582 82541 54119 60187 94672 109145 86520 69180 93908 136214 148048 123159 94050 83489
9570 83489 88747 100060 107899 102527 88539 87399 104988 114038 94830 75097 94774 142278 164597
9557 164597 139358 100581 87868 102340 122132 133472 133700 124725 115078 113101 112856 103268 91868
9544 91868 96678 112013 110289 86437 71555 86730 109747 109155 90026 80616 88289 94995 89490
9531 89490 81358 85159 106510 139771 166410 163483 129327 93128 82092 87455 83017 68980 69768
9518 69768 89145 98773 82572 65395 76613 103242 106302 77954 54930 67818 98409 105127
9506 105127 80582 61335 76946 109458 119320 100123 84447 94497 110881 104253 80829 73715
9494 73715 93645 111583 98058 64190 49730 75092 117150 134771 111738 70529 47349 58548
9482 58548 90319 114943 114756 95511 80341 86670 106292 114816 104279 94653 103459 117896 115415
9469 115415 100658 96189 102759 100751 91601 100092 124446 124295 82463 42600 50654 87876 103601
9456 103601 92447 90256 105803 110466 96040 89446 98540 93412 62341 41103 57744 86369 89781
9443 89781 76279 75604 83849 76493 61461 72630 111360 135339 114942 70622 43302 49966 78375
9430 78375 106851 118267 107696 86306 71370 69125 73065 76524 77607 75262 71346 72375 77852
9417 77852 74124 54932 39584 50330 78001 93936 91764 89329 90498 79334 59311 61540 95648
9404 95648 125464 119823 99575 101201 116396 109314 81682 73420 95557 109241 89408 68401 83933
9391 83933 113458 105021 62339 49646 100369 163396 169960 125543 94381 104560 116630 95833
9379 95833 69888 83804 127348 148697 127617 94223 76876 71855 72883 91490 127409 149542
9367 149542 133854 100355 85631 93465 100137 97922 102761 120093 131021 120116 98591 90740 106523
9354 106523 132108 143056 128643 106828 107140 132916 154039 147753 128778 120419 115497 95936 76573
9341 76573 89457 127125 143793 122150 99725 111217 139210 147026 133053 123164 127453 133447 132243
9328 132243 127508 124646 127908 139817 150227 140008 110894 93948 108217 129237 124001 100514
9316 100514 92197 105762 118111 117091 111437 105540 99238 108664 148667 194468 202195 172358 149781
9303 149781 151796 145225 112960 92116 113455 148113 156036 148570 154216 155669 120599 74142 74901
9290 74901 123310 157040 143691 117814 111451 108057 92333 90361 120470 148552 138524 113138
9278 113138 114886 132857 124487 95138 95673 139424 178495 177253 159360 157415 159191 139283 112790
9265 112790 114762 140911 150240 126111 100073 106102 136840 159119 156556 142157 137087 149220 169811
9252 169811 182972 178774 161722 146975 147083 162788 184694 199629 196946 176653 154111 148987 163584
9239 163584 178209 176198 168550 180877 215160 239541 226115 188659 167172 178098 197729 199268
9227 199268 187990 185954 195529 199780 195025 198906 219554 237575 232962 215570 211314 226685 245400
9214 245400 255534 259933 259902 249833 234309 230991 244732 254551 241458 217679 211340 230258 258706
9201 258706 283987 304928 314972 300736 266196 239994 245399 273610 297679 303798 298423 293037
9189 293037 294024 302388 312625 315115 307366 297780 291615 282617 269364 269187 298125 342276 368344 362773
9175 362773 343730 333618 336735 346388 356484 360778 356202 351944 359897 372424 368858 350662 347488
9162 347488 374845 406880 410478 389688 374346 377067 384787 384831 376729 363245 350323 351183 370195
9149 370195 387950 383884 367722 363111 364913 344632 301491 274820 292464 333864 360820 362914
9137 362914 354713 346868 340590 338429 341362 341642 332064 317015 306139 304176 311252 321948 322220 304412
9123 304412 287571 298665 327399 330204 293300 258173 260822 279452 276222 259875 261874 273764
9111 273764 262419 236311 238058 269334 281850 257299 240112 264088 296148 291167 263677 259039
9099 259039 278680 283264 260530 244295 261788 296923 316678 310466 292555 281074 284351 299026
9087 299026 314146 319398 310885 290570 267106 257585 274979 307414 324154 312231 293163 291167
9075 291167 300114 299176 287589 282146 288746 298778 309157 324453 340811 347326 343187 336189 325910
9062 325910 306638 285883 280203 290914 302261 305645 307154 308759 302527 289295 283201 288780 291913
9049 291913 284656 281701 296727 315749 313217 288798 269459 273481 287852 289390 278568 278202 297844
9036 297844 315132 305949 283263 283013 311006 331299 318857 296252 295998 310775 312355 302216 305653
9023 305653 324714 336711 337258 345021 361008 363263 348998 341164 342757 328501 299219 297787 341891
9010 341891 382969 370634 324993 302967 318554 340465 349411 352600 353466 349805 353966 375314 390611
8997 390611 372048 337046 327129 343151 349472 341153 352508 388347 401678 364616 315582 304122
8985 304122 324741 339213 335499 328671 324735 319633 321271 339691 362364 367324 356533 351282 356299
8972 356299 351804 325398 295281 293473 329816 375132 384723 347156 304499 306379 347106 375102
8960 375102 366799 354867 368142 382814 364466 327567 312805 325192 336693 337808 342947 350099
8948 350099 339587 316046 310125 329281 344468 338554 332964 349212 375552 392773 405532 423699
8936 423699 434951 422984 397868 382532 379080 371884 357363 349067 356406 375746 399283 417891
8924 417891 420806 409122 403924 421503 444208 439093 407587 391320 417026 457247 465961 440198
8912 440198 420857 433990 457153 455275 430294 414461 423287 439283 444101 443233 447900 452336 447557
8899 447557 444184 458813 484035 495366 486996 477671 478351 477933 469555 468012 485476 507271 510413 495185
8885 495185 480696 477350 481509 491474 508890 524681 522586 502393 485291 487744 500311 502515 491912
8872 491912 485063 489997 492569 479592 464591 472302 499576 514405 502452 491379 509389 539308
8860 539308 543216 520482 505116 508585 505848 486440 478602 502235 531987 534096 513904 499336 499743
8847 499743 508933 527158 549109 550116 519193 489382 498014 530409 542788 529996 526114 543497
8835 543497 558743 560532 563519 567623 551968 522918 520403 555750 587279 582552 562985 558041 556969
8822 556969 542689 535639 558602 586084 577422 542594 528174 547803 569903 569684 554809 541427
8810 541427 537648 547507 562492 557713 526222 502693 517051 542385 535820 514862 532202 579919
8798 579919 590560 546797 516542 545793 583672 565492 517587 515439 569599 619017 624323 607335
8786 607335 597549 591749 579386 570634 582546 617046 659425 685799 677895 647805 637383 670237
8774 670237 716372 732045 721440 723172 745220 756989 746675 740779 754770 766238 757506 749792
8762 749792 769098 804057 823920 820258 807978 799425 797768 804523 816667 825990 832773 847296 868684
8749 868684 879980 875285 871364 878898 885322 883544 892290 923361 951900 949761 930318 927110 942425
8736 942425 952751 954742 967030 990566 1005921 1010825 1022423 1038003 1033018 1008852 1003747 1037298
8724 1037298 1077473 1086567 1073009 1071454 1092232 1117314 1132043 1136208 1133477 1130657 1138962 1158379 1170275
8711 1170275 1162234 1149210 1151437 1161963 1157645 1135946 1119950 1129401 1163135 1206358 1240452 1251355
8699 1251355 1243693 1240317 1253119 1264310 1255018 1240548 1251641 1288345 1321325 1335700 1342735 1347513
8687 1347513 1339719 1325730 1336087 1382313 1432749 1453686 1454831 1470470 1509611 1549043 1568846 1573183
8675 1573183 1576781 1586714 1599996 1611162 1620928 1637852 1666714 1698374 1723022 1749071 1788133 1823418
8663 1823418 1824665 1801766 1805543 1854738 1901469 1903750 1895703 1934707 2004730 2037491 2023337 2030474
8651 2030474 2097836 2174211 2199273 2192775 2215492 2277793 2340281 2384830 2430615 2483736 2520199 2529654
8639 2529654 2539913 2581412 2648932 2711600 2747463 2760054 2768991 2786520 2799923 2786780 2754648 2743974
8627 2743974 2770725 2790885 2759754 2707611 2702939 2744710 2755068 2696728 2634569 2640983 2691817 2711357
8615 2711357 2685077 2664048 2674462 2687904 2683094 2679657 2696768 2723405 2744874 2760661 2763922 2743464
8603 2743464 2720085 2736285 2787739 2811230 2774764 2736719 2767769 2845977 2886549 2859639 2819402
8592 2819402 2816881 2840390 2855830 2858549 2861831 2868538 2878750 2900822 2933659 2958315 2964765 2967164 2976843
8579 2976843 2983484 2982582 2996233 3037965 3077288 3075594 3047197 3045915 3090691 3142964 3168535 3184907
8567 3184907 3222291 3266158 3278011 3264121 3279300 3347575 3415829 3421551 3387506 3400951 3494044 3595151
8555 3595151 3628133 3617229 3641889 3714033 3769962 3784573 3817718 3915118 4028061 4086408 4105696
8544 4105696 4154628 4242439 4312672 4343974 4383624 4465461 4559619 4633505 4707650 4810065 4917709
8533 4917709 4991660 5042335 5110490 5200662 5283155 5354738 5446877 5567537 5680297 5759360 5830162
8522 5830162 5930873 6057268 6171729 6253988 6320411 6399447 6505297 6631390 6756063 6859539
8512 6859539 6947631 7051251 7187026 7326876 7429910 7501839 7593375 7731369 7882269 8005276
8502 8005276 8115157 8257153 8433789 8598929 8725589 8838255 8966169 9104571 9244626 9404377
8492 9404377 9595339 9786676 9944036 10084921 10251533 10442603 10622168 10789914 10985828 11217223
8482 11217223 11438791 11626954 11820511 12054495 12301883 12525108 12744968 13002744 13280826
8473 13280826 13524259 13732974 13970967 14274894 14606169 14913160 15198320 15497058 15821447
8464 15821447 16155769 16489944 16828947 17176333 17531019 17900061 18298872 18734588 19196183
8455 19196183 19664473 20130440 20602794 21097747 21624457 22184294 22778789 23405822 24050821
8446 24050821 24701692 25375483 26105540 26893183 27701188 28511469 29355770 30262429 31208554
8437 31208554 32165963 33161688 34236708 35367587 36497357 37635976 38855012 40174125
8429 40174125 41530093 42884560 44288056 45793371 47371433 48972171 50616550 52358074
8421 52358074 54187805 56052660 57952221 59944640 62055661 64247561 66492639 68822088
8413 68822088 71277148 73852342 76515900 79261022 82110618 85084165 88180180 91388773
8405 91388773 94711266 98164310 101762736 105502551 109375705 113402316 117622398 122045266
8397 122045266 126640199 131401228 136386913 141657491 147201385 152974447 158993970 165335989
8389 165335989 172043217 179093039 186465057 194188240 202303947 210824362 219744138 229054379
8381 229054379 238726184 248711754 258973290 269473560 280121298 290759193 301218294
8374 301218294 311344651 320955114 329811554 337672684 344348014 349686878 353557943 355874442
8366 355874442 356613223 355783698 353408686 349560859 344380184 338017771 330589852 322218809
8358 322218809 313083644 303383453 293274115 282884068 272368631 261896405 251589622
8351 251589622 241518018 231739941 222308591 213248539 204568348 196290105 188430250 180964783
8343 180964783 173857501 167113619 160760547 154783526 149128727 143765922 138697925 133909514
8335 133909514 129361935 125044478 120976753 117146271 113496605 109996912 106672630 103541722
8327 103541722 100567778 97709344 94975510 92394159 89954228 87617129 85365407 83206895
8319 83206895 81145140 79174622 77295515 75510059 73810410 72184119 70623330 69120938
8311 69120938 67670462 66274056 64935006 63643515 62392129 61198819 60079852 59003918
8303 59003918 57920143 56835176 55806733 54847448 53898685 52926874 51977819 51090042 50219542
8294 50219542 49314092 48406563 47555697 46735300 45872645 44975925 44129347 43360920 42604038
8285 42604038 41808407 41010189 40261220 39554317 38857019 38168075 37500574 36847145 36198184
8276 36198184 35566424 34964435 34381761 33805791 33239966 32683939 32124562 31564660 31030215
8267 31030215 30529420 30036020 29535194 29053461 28615546 28200379 27771345 27328350 26899671
8258 26899671 26499163 26118954 25751053 25392843 25042543 24705414 24389544 24084306 23766517
8249 23766517 23441072 23144961 22891849 22646712 22381359 22118945 21888330 21669363 21429532
8240 21429532 21187250 20985057 20815894 20630890 20415133 20204311 20024164 19860050 19693575
8231 19693575 19528598 19371633 19220221 19076821 18943595 18803501 18641348 18481314 18361053
8222 18361053 18266797 18143058 17977048 17821539 17711730 17608841 17460864 17280007 17118213 16991590
8212 16991590 16869972 16726999 16565827 16403611 16257379 16136727 16028047 15897097 15729255
8203 15729255 15554868 15411227 15292152 15162311 15011379 14862767 14731438 14604566 14470442
8194 14470442 14339886 14224480 14110421 13972433 13810076 13655054 13534476 13433661 13311321
8185 13311321 13156607 13011124 12914149 12842345 12737299 12586506 12435497 12314668 12200595 12068946
8175 12068946 11939412 11833592 11725915 11580813 11414376 11274149 11172225 11078639 10969287 10842571
8165 10842571 10700684 10552649 10423560 10321507 10209981 10057784 9899718 9791634 9716065 9600055
8155 9600055 9429492 9273061 9173705 9087695 8965659 8828771 8717000 8617067 8499067 8381693
8145 8381693 8297851 8224921 8114496 7975345 7863758 7796225 7730357 7636143 7531927 7437738 7341667
8134 7341667 7233406 7132588 7058072 6994944 6916069 6819849 6726607 6647677 6574360 6494272 6408976
8123 6408976 6333330 6276280 6223890 6152711 6064181 5988206 5940558 5897236 5831425 5755502 5697752
8112 5697752 5654248 5598811 5529639 5468090 5417372 5362251 5307765 5275907 5259684 5222473 5152454
8101 5152454 5078161 5019414 4964163 4908487 4875296 4869196 4852586 4797361 4728702 4686736 4671921 4658238
8089 4658238 4634363 4600350 4547729 4477257 4417313 4391404 4383008 4362489 4330900 4304592 4274508 4219694
8077 4219694 4151577 4106716 4096360 4092178 4061612 3997270 3918322 3859744 3844792 3849862 3820624 3746785
8065 3746785 3687985 3688725 3703335 3659667 3569467 3508293 3499922 3493841 3457831 3419145 3399614 3378895
8053 3378895 3345801 3323898 3318223 3295064 3246381 3217610 3233824 3251289 3224654 3172832 3132195 3093060
8041 3093060 3037104 2994011 2996916 3013770 2989970 2937224 2912521 2922205 2915550 2871638 2827087 2808731
8029 2808731 2796391 2767525 2730017 2694074 2653703 2612688 2591421 2590993 2582760 2548675 2503957 2468869
8017 2468869 2445658 2431146 2422621 2404868 2363746 2319147 2308155 2326211 2325263 2285668 2247969 2248915
8005 2248915 2265091 2253457 2216925 2191082 2185828 2178930 2158506 2138247 2131415 2134605 2138474 2136737 2123805
7992 2123805 2097112 2063940 2039263 2035588 2052669 2071001 2061696 2018269 1974163 1967316 1988929 1993093
7980 1993093 1958829 1913014 1885566 1873671 1862470 1850776 1840304 1826080 1812036 1809550 1809109 1785835
7968 1785835 1746594 1732827 1756329 1773651 1752219 1720008 1714012 1720551 1711519 1702520 1720845 1743942
7956 1743942 1728916 1685669 1662469 1668933 1669679 1649676 1631620 1628183 1627246 1626482 1635532 1642135 1622308
7943 1622308 1585875 1566623 1566958 1558892 1538259 1526993 1522850 1502916 1477644 1479606 1495044 1476301
7931 1476301 1432049 1426507 1467055 1477559 1422511 1372447 1387823 1416999 1386812 1329187 1325163 1367599
7919 1367599 1378530 1340263 1311278 1315438 1308379 1268856 1241616 1259431 1286405 1274433 1229730 1190319
7907 1190319 1172019 1165996 1164667 1165705 1166372 1168097 1173035 1171434 1149794 1113498 1083365 1070638 1072336
7894 1072336 1083490 1093094 1080724 1044598 1018991 1031345 1057233 1055659 1031928 1019105 1013999 989998
7882 989998 963369 978072 1022396 1033248 997035 972133 986715 990792 949777 912741 930991 969180
7870 969180 963507 922511 900994 907410 906558 892106 889613 899655 897840 883839 877411 874450 858116
7857 858116 843302 855933 876146 858842 807986 774321 778703 793069 799176 807976 814908 796843
7845 796843 765626 763593 788690 786945 743696 717096 744342 777017 759752 719764 717264 746279
7833 746279 750925 716784 682164 670196 669058 675985 704697 742809 750520 715122 670162 649052
7821 649052 650550 658508 665434 666460 656599 643394 639460 638256 623682 606848 619515 659832 679830
7808 679830 649216 603267 598241 637056 669198 656422 612131 576425 572920 594067 615887 622002
7796 622002 617101 615489 616451 603314 574976 563012 596515 654888 679712 641534 577432 547540
7784 547540 563996 582495 565469 532756 532776 573937 610375 601287 560910 532755 531797 537390 534742
7771 534742 533785 543790 555113 555559 545646 529134 506645 486635 482894 491440 491103 478398 477082 496301
7757 496301 507102 486978 462100 469019 493885 493858 468438 459235 477689 486296 466817 455140 477945
7744 477945 499384 474798 426688 415565 449062 471893 448116 407552 396659 419140 445260 454376
7732 454376 446301 427495 407368 398873 404765 408312 392477 365693 355407 374470 403181 409491 384543
7719 384543 354302 352187 379768 402559 392035 362867 352311 367078 374701 354375 331531 342174
7707 342174 379416 402011 390520 367847 359996 361983 356845 349327 358291 382951 399496 393948 379719
7694 379719 374544 375565 369943 358132 350005 345584 338825 336564 351409 374661 380626 364729 352583
7681 352583 359791 369070 364734 361850 374232 379628 354039 321220 323235 352624 363613 348612 348783
7668 348783 378368 394316 365900 325212 314053 321761 316390 304765 315635 343818 355481 339119
7656 339119 315792 306043 313650 331139 339308 319659 288397 289484 327253 344848 309197 272512
7644 272512 290475 322497 294817 233477 234708 308593 358509 334029 298485 305300 310370 271612
7632 271612 244480 291021 361000 361714 303787 278177 309882 332207 305622 272340 274692 293595
7620 293595 296698 290725 294181 299291 290516 273212 262263 262427 272019 286786 294106 283443 265208
7607 265208 259367 266612 271298 266960 255662 232435 199338 183226 204289 237141 242521 228189 232919
7594 232919 257014 262007 240560 229357 241256 241665 213697 193907 213316 247093 255853 241134
7582 241134 227773 221483 214816 210888 214405 218737 220325 224605 226514 213187 194820 197486 216020
7569 216020 216596 197612 197217 223050 233073 213362 211211 250538 278240 248774 203481 201914 227157
7556 227157 231541 228076 252717 274619 238325 172278 158368 202320 229603 210682 194371 205451
7544 205451 205918 183528 186332 229621 251707 211968 161738 163219 197946 212025 200884 191819 185260
7531 185260 170256 163860 182123 201237 195210 182386 188590 196865 184116 174779 199996 230850 216891
7518 216891 173234 161599 191712 209835 190176 171503 184234 199679 183203 154075 154435 184223
7506 184223 202035 180685 136983 108806 116965 148769 171893 164803 135093 107584 99240 109795
7494 109795 129654 149253 165004 180122 193881 192852 168709 142986 148398 181016 201722 194644
7482 194644 187080 194477 190093 160366 144943 174175 205474 182354 129770 121966 168876 206399
7470 206399 199044 179581 175083 165663 142735 141877 178496 206004 184830 148893 151405 177744 169975
7457 169975 121475 90283 116012 168317 190974 168075 131579 119162 136763 157812 154782 130728
7445 130728 114425 123037 140261 138823 116499 100364 116437 158192 186688 169356 122123 97624
7433 97624 119183 147003 134911 99841 94609 124079 140230 122592 107639 120571 131162 108887
7421 108887 77800 76837 98393 107865 100487 98062 105835 110904 112769 121258 131101 127809 113152 100852
7407 100852 94403 90000 90698 96904 95424 79363 65577 71259 87774 98158 102731 105427 96220 73726
7393 73726 63228 81485 104736 104811 94914 101519 113011 102183 82627 90350 117257 117000 79500
7380 79500 49640 61734 97196 119266 115292 94777 74948 74130 93504 106586 93035 73303
7368 73303 76594 89103 78324 55837 61686 92580 104904 89137 79094 83288 74833 59443 78495
7355 78495 123377 125802 69202 32379 72188 133889 140136 106415 95256 106559 94739 60872
7343 60872 46481 55203 55809 51016 71682 108277 116659 93141 80397 93061 96536 70544 41421
7330 41421 37444 55150 80036 102342 107540 89364 73207 86813 110273 100025 60113 39258
7318 39258 55464 76407 80136 80754 84638 76850 63767 72888 95929 92240 66182 73259 121645
7305 121645 141089 93941 45497 62102 102512 89153 39481 34496 81259 102846 65979 29535
7293 29535 43393 73813 67840 36916 30455 59235 88383 91412 77239 67080 67101 66862 55696
7280 55696 38214 31306 41647 53998 52792 45404 46119 47327 32976 15278 24999 60953 82752
7267 82752 67408 42717 43381 59728 58732 38944 30609 45442 59026 50657 34070 32224 39446
7254 39446 30732 2535 -17568 -6153 26798 52041 53425 37495 20782 18469 36944 63908
7242 63908 72553 50920 21748 16167 33038 45680 45151 49133 64586 71903 58389 40796 37793
7229 37793 42782 42002 38420 38386 35232 27264 30965 51778 62776 42373 14867 17947 43028 47880
7215 47880 23627 7969 26809 59581 74314 67634 56116 51443 58085 76832 96906 97786 70771
7202 70771 32265 10919 25489 70218 112946 117124 80293 41080 32681 45036 54126 65441
7190 65441 90926 102084 59687 -12619 -41385 -2103 47851 55165 38271 39008 53619 54193 44293
7177 44293 46394 55341 48891 32084 30702 47002 58006 55316 54325 62408 65665 52363 29250 10248
7163 10248 3440 10582 27461 43993 51294 47023 32879 16706 16694 44364 79506 86273 62300
7150 62300 43740 49400 53392 33191 8658 3787 4611 -6855 -9328 19638 48767 32454 -10605
7137 -10605 -18163 20374 49564 35562 10779 13063 30392 32564 19349 8741 5311 5729 14203
7124 14203 30202 37674 25940 10072 15603 48304 84714 89776 51020 3035 119 46790 80355
7111 80355 53631 6760 8258 48523 58578 25185 9147 38088 60310 35849 2251 6553
7099 6553 31942 40707 38669 45521 46190 25430 11631 31693 57085 49724 28671 33247 49654
7086 49654 36715 1553 -13837 -4396 1313 1833 18794 44017 51395 49975 62955 67573 26848
7073 26848 -27978 -26396 28549 59578 39114 27758 62885 93698 70755 26935 16028 29716
7061 29716 30676 20159 18948 20914 14958 16497 31393 27398 -10245 -34741 -4152 44289 47545
7048 47545 15297 8601 39021 57912 40776 17644 13675 14959 5634 -5229 -6729 -2522 3578
7035 3578 10996 11287 659 -2319 18852 45880 50476 39658 37903 37781 15483 -13831 -10219 22430
7021 22430 37452 21358 12825 31633 42999 16491 -25374 -44070 -33736 -10564 12245 20654
7009 20654 6328 -7171 16008 62788 75351 36921 2287 13244 36273 24981 -5128 -15167
6997 -15167 -13251 -27717 -43570 -28941 -1092 -1060 -18350 -7533 27780 36442 8380 -6385 16964
6984 16964 36609 15154 -20496 -24868 250 20998 23280 17043 10908 10967 26632 52438 60311
6971 60311 33532 -5963 -26025 -25501 -23983 -23757 -9980 15758 28986 14824 -10810 -20626 -7306
6958 -7306 11679 17277 10967 10074 22531 35305 33854 23032 15854 9792 -7321 -31287 -41595
6945 -41595 -28374 -1982 23425 37608 29439 -687 -24689 -12367 23406 38300 19485 1572
6933 1572 8105 17202 7463 -1411 13210 31774 25878 10585 18392 39610 37615 13877 7098 27110
6919 27110 38754 21378 -573 -3267 479 -5378 -5002 19718 48274 46022 19528 13431 48500
6906 48500 89208 87114 42472 3741 6617 33052 43653 34409 33277 46079 45552 25833 24314
6893 24314 58961 83826 54236 5818 7994 55597 76355 45576 19601 37787 62989 53853
6881 53853 33102 37892 54668 55451 55162 76485 94170 75087 45287 53463 88577 99854 84860
6868 84860 88231 117209 129086 109075 93223 100212 104714 96958 104670 130944 134854 107726 104566
6855 104566 153407 193261 163261 105350 105507 162962 195217 163168 117822 114652 144017 166757
6843 166757 171248 169890 170893 176096 187227 200037 205966 205153 205196 209401 220578 246575 281747 297460
6829 297460 280095 264007 289646 340755 367424 363336 367606 390858 400228 390255 405830 467031
6817 467031 527948 547498 551430 580903 623850 647321 661457 697082 746953 782609 807319 839908
6805 839908 867685 872299 884219 948833 1048597 1122895 1160412 1205134 1271033 1324595 1363106 1432481
6793 1432481 1540515 1626984 1660094 1694241 1780715 1883310 1946862 1998145 2101677 2248130 2368534
6782 2368534 2447372 2543812 2695556 2870049 3029206 3187755 3383028 3626881 3911440 4235775
6772 4235775 4610254 5051737 5574256 6156953 6723044 7185824 7520477 7759584 7920069 7976219
6762 7976219 7907150 7722266 7430582 7041029 6614952 6255224 5992932 5726820 5333631 4818211
6752 4818211 4304260 3892787 3582854 3325704 3099040 2909626 2760934 2643131 2539241 2429880
6742 2429880 2304934 2176218 2066650 1984580 1918900 1856233 1789450 1713618 1630182 1553511 1497935
6731 1497935 1458947 1419244 1369398 1311146 1248613 1190859 1152699 1134422 1111144 1063972 1011221
6720 1011221 982911 973895 953387 915208 883108 865829 844363 811798 790010 792095 798847 789689
6708 789689 770833 755534 740472 719770 700926 689253 676212 658832 649412 650019 641106 614903
6696 614903 595561 602185 614812 605330 582000 571314 571945 562149 542361 533138 534224 522013 491150
6683 491150 465960 462008 463894 452619 432444 417393 408470 398752 390360 392558 405407 413888 402392
6670 402392 375530 358220 364943 374796 358142 326292 321355 347347 353861 314836 279185 297074
6658 297074 334251 323826 278202 271194 314089 334678 296933 258484 270866 297041 283074 250091
6646 250091 247315 260035 240528 201817 201292 241380 262601 240204 218356 231476 252197 243691
6634 243691 215439 197958 199439 213165 234652 247755 227492 183084 165159 198898 240148 235005
6622 235005 197907 187042 218172 250044 251097 234588 220874 206866 189725 186836 208451 233562
6610 233562 237363 227102 226914 237389 235022 209331 178686 165289 170234 179143 181384 177740 175982
6597 175982 182382 192161 188746 161844 127054 114855 134597 161070 165450 149299 136508 139927 150998
6584 150998 158972 164483 170884 173514 164151 142969 123619 124588 148795 170956 158913 115590 84042
6571 84042 96124 132148 152202 150253 146648 141509 118452 91025 95838 129127 139799 107520 79978
6558 79978 99219 134398 132424 100665 86197 96381 98212 85744 89198 114200 125484 103912
6546 103912 75787 69103 76418 77713 70659 62952 57956 58369 64335 65452 56520 56047 79246 101021
6532 101021 86505 52649 48758 74833 78587 45468 26785 51896 76641 60058 34621 47695
6520 47695 80066 81328 51264 27877 22345 22399 35320 68922 90263 64019 17963 10304 42090
6507 42090 62191 52673 46697 60874 70948 63125 55346 57585 58935 59944 70805 76608 56079
6494 56079 33426 51494 91983 90931 42731 14379 36822 59252 42007 17670 17600 12700 -18468
6481 -18468 -31946 5876 44808 26332 -16796 -14479 25861 40051 16703 4450 22619 39892
6469 39892 37939 30829 23382 8058 -1894 10059 23971 14624 3869 21630 39115 14562 -17989
6456 -17989 4984 57111 53228 -1261 -8532 54064 86946 34879 -18118 8356 60037 51473
6444 51473 10941 14596 44552 30010 -15506 -17913 20745 26761 -10121 -19111 22781 49617 21777
6431 21777 -10672 1062 28427 25670 2628 -8416 -7724 -7638 -261 16782 21543 7894 4877 24143
6417 24143 30709 1938 -27376 -20469 1632 3207 -996 20796 48828 39000 1421 -10950 13644
6404 13644 32684 22979 10784 16372 19684 2253 -17469 -15419 1311 11469 10179 3582 -6876
6391 -6876 -17816 -19236 -11657 -11885 -28017 -43793 -40816 -22648 -5160 3639 3657 -3336 -9311 -3588
6377 -3588 8936 8446 -9695 -22268 -10471 10830 14957 2682 -1555 12682 27659 21925 -3925
6364 -3925 -28050 -28019 -2497 24975 29882 15207 4694 7145 6418 -6908 -17117 -10181 3605 12400
6350 12400 25582 49543 62110 42642 11544 4680 19741 25341 15355 12783 22003 21392 7997
6337 7997 5156 15480 11103 -13232 -22615 -318 20604 14038 6104 25083 45608 31821 4939
6324 4939 11115 41992 48031 22518 9813 25938 32482 7994 -9565 16945 62076 72690 39177
6311 39177 -1219 -16412 -7141 8026 13729 7961 2674 8416 15683 6170 -15292 -22237 -6420
6298 -6420 9202 8149 3744 9099 12028 2087 -3767 9187 20181 2130 -31416 -42924 -25404
6285 -25404 -7042 -5933 -12537 -17200 -24324 -33878 -34524 -22573 -8269 717 3844 -4124 -26596 -44805
6271 -44805 -30744 10560 36601 19732 -16869 -33550 -27068 -25466 -39632 -47709 -32237 -10095
6259 -10095 -9974 -31835 -48194 -43597 -32028 -28330 -23969 -8842 1418 -12170 -33938 -32772 -14740
6246 -14740 -15638 -37554 -39887 -8706 14774 2407 -13732 -1958 9039 -15098 -40857 -16589
6234 -16589 31504 30163 -24915 -61856 -44228 -13914 -8711 -10732 -2243 -5677 -33340 -53460 -41845
6221 -41845 -19352 -7726 2401 11196 -6740 -44693 -49660 -8004 16177 -19603 -59893 -39220
6209 -39220 10379 17556 -9959 -13628 3783 -9607 -48741 -54969 -22533 -8350 -28161 -32963 -5399
6196 -5399 7665 -15160 -30015 -11616 488 -19180 -29443 964 28171 2010 -51780 -76128
6184 -76128 -66109 -50997 -31986 1930 26399 10782 -25521 -40378 -34575 -38092 -48062 -35738
6172 -35738 -5067 10094 4041 4229 17225 16708 -8175 -32732 -33584 -13601 13973 36313 35419 3801
6158 3801 -32198 -35691 -8373 12295 5074 -16345 -35914 -51970 -57336 -37443 1332 29552 30457
6145 30457 14682 -4265 -23081 -35188 -33740 -31299 -45023 -59236 -39916 5819 26462 -1146
6133 -1146 -36882 -39508 -24677 -27490 -41195 -36353 -18614 -19422 -37527 -36150 -2679 29008 29239 13172
6119 13172 10781 19882 15044 -8480 -27115 -26192 -21180 -30305 -42989 -35141 -8759 6729 -4962
6106 -4962 -27248 -40066 -46821 -56553 -60494 -49710 -39554 -48025 -61180 -51963 -27046 -19680 -35648
6093 -35648 -43165 -24983 -6110 -13947 -38861 -52621 -44803 -24829 -5859 5 -12268 -28711 -28018
6080 -28018 -12940 -9263 -26605 -45082 -49293 -46982 -43330 -29717 -13258 -20943 -51952 -63402 -33525
6067 -33525 -2159 -10353 -34449 -28324 -2824 -5274 -35503 -44004 -13213 16613 12146 -12152 -31412
6054 -31412 -43166 -45744 -26404 6392 16068 -10434 -35820 -25920 -2557 -9213 -42949 -58123 -32698
6041 -32698 2102 4701 -26358 -55945 -56032 -34909 -22143 -30682 -43318 -40265 -27669 -24359 -29152
6028 -29152 -23516 -6259 -1444 -23368 -53158 -63143 -51533 -39779 -42790 -52424 -48519 -21833 12924
6015 12924 29072 16766 -6338 -19792 -24906 -32200 -37750 -32948 -27357 -35692 -48415 -44446 -29840
6002 -29840 -31468 -51139 -60621 -48518 -37134 -41845 -48130 -43496 -38256 -36343 -19808 13229 26752
5989 26752 -6203 -58044 -78616 -55721 -17500 8768 14327 743 -20393 -30790 -27228 -25205
5977 -25205 -27362 -14396 13089 17231 -20890 -59551 -52085 -17846 -9990 -32975 -45472 -33406 -24112
5964 -24112 -30250 -33997 -31590 -42053 -62213 -61705 -35677 -16585 -18750 -17165 -22 3896 -23854
5951 -23854 -54271 -54829 -35887 -23494 -18116 -11344 -12944 -27057 -28972 -2825 21451 9108 -20531
5938 -20531 -20228 11074 26034 778 -32945 -37291 -16875 -2933 -11951 -34996 -53497 -53312 -32125
5925 -32125 -2327 17429 17903 4536 -12311 -27797 -42293 -52873 -48663 -21992 13014 26256
5913 26256 8734 -10685 -6727 925 -17755 -41904 -25519 17182 17779 -36165 -67042 -24514 29892
5900 29892 18404 -29140 -29540 13868 21876 -23852 -54048 -31586 -4209 -10390 -18577 -2150 2164
5887 2164 -34191 -66426 -47289 -12285 -23554 -65403 -70377 -28624 2282 -9256 -33163 -39853
5875 -39853 -37678 -35993 -24362 -6742 -9828 -34811 -41304 -6660 31765 25349 -17454 -44159 -28589
5862 -28589 657 1520 -31949 -67182 -71924 -49470 -32052 -39154 -53668 -50472 -36376 -38808 -59637
5849 -59637 -68482 -47290 -15932 -2310 -7913 -15794 -15866 -9886 -4903 -10194 -26360 -33812 -13843 13669
5835 13669 4184 -45552 -79756 -58680 -19612 -23076 -61434 -72126 -34536 1050 -7645 -35531
5823 -35531 -35773 -9339 5160 -8596 -28931 -34391 -29753 -30339 -38467 -42478 -31359 -6867 16082
5810 16082 21990 9576 -8819 -22452 -30245 -33548 -31397 -26744 -26826 -31563 -31736 -25342 -24815 -38597 -55282
5795 -55282 -57520 -44404 -28472 -16751 -7764 -3461 -9908 -24716 -34541 -29652 -16430 -12197 -27003
5782 -27003 -49550 -54767 -32399 -4765 -3413 -28761 -49764 -46125 -29848 -17652 -6874 5979
5770 5979 7218 -10869 -29290 -29873 -24101 -26780 -23013 1682 18598 -8424 -55128 -59563 -13600
5757 -13600 24197 17115 -5488 -11954 -18309 -41615 -55695 -37041 -12999 -17256 -32655 -27415 -15988
5744 -15988 -29131 -50089 -41086 -14631 -14284 -35074 -30695 843 8652 -22342 -41702 -16557 15767
5731 15767 10896 -17340 -31081 -25574 -15305 -93 17084 11291 -26140 -58472 -51474 -25329 -19917
5718 -19917 -33041 -36208 -30482 -38465 -54319 -51270 -32988 -29340 -41221 -37096 -10918 2508 -15747
5705 -15747 -37936 -36362 -25931 -33398 -50484 -48354 -24404 -5855 -10703 -28071 -40123 -46376 -56628
5692 -56628 -67609 -61005 -31207 -4865 -14673 -53081 -74028 -51181 -13076 -2742 -22383 -42370
5680 -42370 -47723 -44836 -34317 -12763 3593 -6327 -29594 -31349 -9756 -1126 -20551 -36015 -20040
5667 -20040 7420 12708 -2399 -13200 -13522 -16102 -24073 -27982 -24921 -20896 -18752 -17996 -20153 -23052
5653 -23052 -18756 -7904 -5148 -18818 -36446 -42430 -38897 -36996 -38309 -36912 -30371 -19328 -6434
5640 -6434 -1807 -14935 -35381 -40461 -29150 -25102 -36534 -41699 -29512 -22446 -35230 -42555 -20418
5627 -20418 8198 7742 -12095 -15634 -1565 1379 -11808 -19933 -21281 -34091 -51721 -45334 -16456
5614 -16456 76 -5551 -4014 15516 21889 -2053 -24643 -15609 6112 6528 -11477 -21415 -13862
5601 -13862 3288 21554 25156 -4474 -51878 -66829 -31545 4533 -5024 -33017 -27468 -534
5589 -534 -5236 -40125 -48162 -12358 16604 4575 -17362 -15640 -8996 -22888 -36424 -20843 3579
5576 3579 -2123 -31259 -44841 -34287 -25136 -27529 -28559 -30194 -48114 -68832 -54868 -6637 24178
5563 24178 5999 -25096 -19248 15634 32670 16525 -4883 -11022 -11920 -17604 -18382 -7890 -1200
5550 -1200 -14084 -38457 -51415 -41174 -17274 -1031 -6830 -25156 -28424 -6470 11654 -6218
5538 -6218 -43201 -50061 -17676 5970 -12513 -42218 -39244 -13852 -6044 -18905 -23769 -17529 -23296
5525 -23296 -37490 -29414 -1335 2964 -31234 -57608 -36267 5733 16369 -9249 -36774 -49708
5513 -49708 -57728 -61997 -53153 -39030 -37117 -39511 -21042 12830 21592 -12489 -51413 -48537 -9942
5500 -9942 16214 3454 -24962 -34714 -25084 -19523 -24717 -24967 -19392 -34105 -75802 -99035 -59866
5487 -59866 8586 24786 -28886 -74903 -48095 14087 32586 163 -24033 -13287 -2946 -20307
5475 -20307 -42482 -40418 -20973 -5170 1853 1362 -9341 -21751 -17738 -1080 -169 -24099 -44289
5462 -44289 -37830 -21149 -18979 -26105 -25017 -18524 -17188 -13703 1245 13380 4518 -14901 -22465 -21645
5448 -21645 -31218 -45133 -38727 -14576 -6033 -26096 -44196 -30411 644 10731 -10814 -37056
5436 -37056 -40205 -21904 -3646 2846 6236 15699 20046 487 -35694 -53300 -33786 -6070 -10971
5423 -10971 -42822 -53987 -21233 19188 18791 -18868 -44424 -28031 5262 13427 -6755 -20359
5411 -20359 -5915 15242 10099 -21527 -50196 -56000 -45128 -29980 -13716 1557 9625 10330 10145
5398 10145 7358 -6953 -27459 -33515 -19329 -6123 -11675 -25870 -31017 -28510 -28368 -28516 -22512 -13475
5384 -13475 -4251 9598 21289 10014 -22195 -37359 -15820 2908 -24859 -72377 -75445 -30660
5372 -30660 -2483 -26402 -61754 -60705 -34304 -19986 -22655 -23342 -18893 -18445 -18854 -13938 -13609 -26066
5358 -26066 -33459 -13775 20328 31939 8636 -21453 -26310 -6992 8654 1498 -16722 -19253 -580
5345 -580 14226 5352 -10388 -4937 14438 14314 -11921 -35296 -39679 -40884 -46010 -34689 -2516 15572
5331 15572 -4131 -32722 -32276 -12420 -5606 -11308 -8147 -2173 -15054 -34823 -27349 4660 20222
5318 20222 2333 -20501 -23784 -18605 -20002 -19440 -8383 -1426 -14191 -36779 -47814 -42412 -32476
5305 -32476 -28377 -29337 -25532 -7603 18504 30530 15852 -8704 -19157 -16539 -15237 -11162 7615
5292 7615 26294 16976 -13262 -26960 -14385 -7306 -24333 -43169 -44267 -42522 -52090 -55795 -37867
5279 -37867 -16212 -11953 -14162 -5597 2453 -5882 -16600 -11283 -4854 -18254 -33446 -21291 -24
5266 -24 -14030 -57927 -75655 -43937 -6321 -5283 -25441 -32429 -30482 -43384 -62283 -54870 -19145
5253 -19145 8931 5231 -13831 -21367 -15692 -11435 -11571 -7838 -1766 -4408 -13745 -12049 5595 17453
5239 17453 4831 -18375 -26317 -21042 -24984 -37927 -33845 -6921 11798 -276 -22733 -24230 -6987
5226 -6987 4281 230 -10331 -20935 -27276 -19615 1782 16059 7849 -10788 -24958 -41074 -58800
5213 -58800 -47198 7525 53403 29597 -37293 -58189 -9153 32240 2085 -59229 -72357 -28561
5201 -28561 15312 22115 5749 -8130 -10702 -4292 1288 -8458 -31229 -39678 -16534 16036 26457
5188 26457 18260 17213 27684 32010 22850 6121 -17958 -45417 -51635 -21166 13487 5328 -36341
5175 -36341 -53638 -24083 10276 11816 -2931 -8245 -18439 -52190 -82054 -69272 -30913 -21260
5163 -21260 -49905 -67074 -40305 -3086 -4615 -41838 -71137 -70498 -58342 -53690 -47288 -24609 501
5150 501 -3657 -42726 -79441 -72053 -23804 18939 19689 -9003 -26291 -12865 12640 23152 14550
5137 14550 3602 4067 11914 12155 -2510 -20106 -20074 558 18030 9221 -16264 -27327 -14887 -4035
5123 -4035 -14906 -32958 -35461 -29141 -35208 -47907 -40157 -10192 9813 398 -18941 -24212 -20684
5110 -20684 -22629 -23280 -10714 4223 3954 -4181 -323 13119 17032 8288 -1750 -13654 -32516 -40621
5096 -40621 -16181 20995 24637 -10194 -37316 -30000 -16328 -22982 -29406 -11075 10864 4548 -17497
5083 -17497 -21182 -6237 3370 4726 8298 2930 -24399 -48054 -33896 -1100 -67 -31824 -45926
5070 -45926 -22410 2415 3100 -987 2147 -9970 -40485 -48644 -17203 6762 -15553 -46809 -32434
5057 -32434 9954 21578 -3184 -18805 -10708 -8812 -20407 -13619 20394 44312 32722 7868
5045 7868 -2236 -1134 406 7455 16789 5399 -30626 -57180 -50017 -32521 -34830 -42507 -24027
5032 -24027 10063 18283 -8553 -35262 -35781 -24568 -25588 -36839 -39449 -26001 -8353 -4613 -21290
5019 -21290 -42116 -39403 -7662 21903 17212 -12209 -30836 -28511 -26305 -31834 -25911 -5289 -780
5006 -780 -27489 -48606 -24815 20864 29284 -11802 -52184 -49360 -16665 8479 10434 -6270 -34612
4993 -34612 -59352 -56296 -21208 15527 23224 6195 -12420 -23985 -29724 -22220 -872 9417 -10540
4980 -10540 -34865 -23150 14631 27455 1070 -20370 -6214 12522 -4005 -39815 -48906 -23052
4968 -23052 3349 3880 -15515 -33708 -30504 2711 43422 44785 -7152 -58487 -48128 7296 34692
4955 34692 8231 -20342 -7462 18821 12550 -14211 -14124 18251 38706 19838 -14264 -29064 -25676
4942 -25676 -28589 -44764 -55772 -46699 -25637 -9175 -308 7889 12858 3908 -14956 -22603 -11411
4929 -11411 -2285 -12157 -23713 -12429 9434 8392 -16147 -29716 -17908 -6299 -13917 -23246 -16134
4916 -16134 -6717 -12106 -17626 -2707 19161 20185 4290 -493 12012 20350 12663 -514 -11002
4903 -11002 -22585 -33599 -36065 -35401 -44938 -56376 -44471 -10980 5651 -16556 -44921 -33674 11258
4890 11258 38930 20952 -15764 -29540 -13662 7870 17201 15667 8224 -3140 -9470 1082 22105
4877 22105 30397 18778 7284 6551 -5031 -39509 -58757 -21516 40047 47576 -12769 -65734 -55779
4864 -55779 -21566 -21816 -41206 -29844 2857 6099 -20179 -25770 -263 10035 -13276 -27944 -7471
4851 -7471 11571 -5449 -31175 -25721 -5590 -12671 -40785 -44967 -12951 18675 19894 1761 -11136
4838 -11136 -14667 -19808 -29627 -34063 -24978 -11086 -12120 -32946 -51385 -45483 -24958 -14508 -13687 -3402
4824 -3402 12445 10947 -2581 2346 21646 13059 -26856 -40308 1007 40292 22955 -13027 -2518
4811 -2518 33249 22883 -28550 -42635 1229 29217 -7891 -58851 -56792 -17922 -4739 -31920
4799 -31920 -58677 -52717 -22781 1055 -4389 -35546 -58899 -45301 -11356 1291 -10312 -8052
4787 -8052 18248 30009 8297 -9900 3616 17938 759 -19553 -3365 25803 17758 -18439
4775 -18439 -28884 -1899 21274 18563 10839 10197 -746 -27371 -47347 -48288 -41919 -33490 -16681
4762 -16681 -3652 -15737 -36542 -22690 24432 47105 13552 -34952 -47988 -34029 -29702 -38450
4750 -38450 -40680 -37241 -41331 -46347 -39412 -31137 -37123 -44759 -33139 -12476 -8340 -18018 -18240 -6403
4736 -6403 2625 11339 30366 40933 13484 -33828 -44534 -5141 29655 16104 -16695 -17419 9070
4723 9070 16917 -6528 -27208 -21416 -5892 -2938 -7784 -6218 -1556 -3956 -6224 7945 34331 45805
4709 45805 25632 -9188 -27473 -19739 -3241 5009 5393 3500 -3160 -16420 -28107 -32748 -39069
4696 -39069 -52181 -53833 -23895 21363 39347 15724 -15585 -18672 464 13319 12705 13566 21683
4683 21683 27238 25936 23234 17023 -1683 -26189 -33849 -18980 -7757 -23886 -51880 -55738 -30730
4670 -30730 -13564 -32685 -66614 -70231 -35059 -972 -3357 -29162 -40147 -24880 -5269 2261
4658 2261 5686 13139 14534 923 -15736 -19066 -12256 -8705 -8276 -1687 6673 111 -24498 -47132
4644 -47132 -45852 -20479 6335 8450 -18603 -47982 -46632 -15850 7919 2965 -7793 2601 16567
4631 16567 -1022 -39995 -52615 -24830 4393 5935 -465 8732 16872 852 -21486 -16757 9409
4618 9409 21659 9220 -4819 -5208 -2802 -8780 -17710 -21353 -18688 -9202 5848 14971 7202 -8705
4604 -8705 -13389 -4145 4599 5884 5722 5151 -3000 -18591 -33019 -42229 -44231 -30639 -2635 13857
4590 13857 -1416 -24684 -16935 11902 11976 -27165 -55246 -38185 -8971 -10837 -30686 -29241 -6670
4577 -6670 6037 861 -4780 -5883 -10350 -11799 -166 8665 -7449 -33107 -31337 -2416 13761
4564 13761 -1395 -21023 -19487 -7100 -3119 -4755 -1096 5406 7695 6231 1260 -9309 -17548 -12017
4550 -12017 -2134 -10177 -31440 -32986 -6021 12786 -5439 -35992 -36914 -8878 12928 11073 -2183
4537 -2183 -14586 -23290 -20145 713 21076 14222 -14394 -30017 -18408 -4488 -9121 -14839 3028
4524 3028 31094 33608 6215 -16802 -13400 -2650 -6772 -9794 15188 50733 48132 1682 -31244
4511 -31244 -7789 36776 39432 -786 -29297 -20850 -6405 -11552 -18722 -8648 3595 -518 -10290
4498 -10290 -10760 -10743 -18645 -18328 708 15101 3380 -12917 -1822 23197 21159 -12385 -39318 -34170
4484 -34170 -10219 9243 14237 1794 -25427 -52045 -63415 -63951 -63426 -56323 -38605 -29342 -43880
4471 -43880 -59861 -46446 -14099 4688 9561 19726 21803 -10182 -48955 -36753 19159 44816
4459 44816 11973 -19333 -951 30904 26669 3165 -936 5554 -141 -396 21244 28112 -11318
4446 -11318 -51890 -34121 13739 19285 -11542 -8238 36456 51700 13592 -11916 17131 49653
4434 49653 32983 -1906 -3894 11224 1582 -20037 -14666 5353 -4974 -44009 -64545 -47852
4422 -47852 -23186 -14428 -14459 -15505 -23171 -33709 -31682 -16294 -1712 10119 28485 47030 49425
4409 49425 41648 44451 51779 34787 -4926 -26170 -8615 14969 10298 -8144 -8928 1350 -7736
4396 -7736 -37088 -56856 -53194 -41922 -34208 -19384 9737 38084 46335 33076 11999 -983 4778
4383 4778 25349 38088 23672 -4504 -12370 7843 25395 16704 -1302 -2605 5594 -179 -15734
4370 -15734 -15391 3122 12740 -1154 -21727 -29738 -25770 -15796 100 14309 11727 -4015 -7957
4357 -7957 8246 20218 10394 -1374 9620 32055 37764 23420 3987 -17915 -42991 -51395 -27365
4344 -27365 1803 -5527 -40509 -53176 -30889 -18637 -44420 -70745 -50868 1262 33383 25094
4332 25094 401 -16808 -25753 -30288 -26309 -13812 -4096 -6892 -16655 -16175 4650 32337 39046 17158
4318 17158 -5182 -173 18930 20505 9762 22433 61264 83310 64684 34600 23042 17870
4306 17870 3803 886 22978 35518 4852 -38702 -41355 -8673 9056 440 874 20756 27746
4293 27746 8651 -7865 -5194 -4265 -16903 -21821 -9744 -7656 -30643 -49275 -36087 -10807 -6291
4280 -6291 -17232 -16674 -2461 5049 -3201 -20161 -38035 -46344 -30555 5217 30338 24581 6409
4267 6409 2326 6845 -273 -13890 -12456 2386 6250 -10101 -27929 -25599 625 36450 55504
4254 55504 35466 -13651 -47949 -36857 -2269 10564 -9006 -32254 -36021 -25722 -15888 -11818
4242 -11818 -11918 -11031 -3184 5794 -1929 -27038 -38419 -12394 26844 37009 17848 5383 11168
4229 11168 9022 -12473 -26223 -12080 8412 5460 -16211 -31220 -31292 -26253 -20383 -9649 3627
4216 3627 10420 7466 238 -4203 -2607 1511 -1258 -14295 -23444 -9532 24317 49803 43065 8457
4202 8457 -29293 -47080 -37235 -11439 7198 5858 -4467 -6385 -1450 -3805 -14568 -21161 -18304
4189 -18304 -10728 93 11489 10121 -7051 -12020 19704 60956 62135 27124 9605 26405 32059
4176 32059 824 -25580 -9827 15338 4270 -22610 -17483 9231 8828 -17975 -21827 10482 36864
4163 36864 32367 21441 23585 21548 5738 1946 25502 45860 28626 -14111 -43444 -43065 -26606
4150 -26606 -14220 -20282 -45795 -67755 -56880 -19663 2389 -8957 -21285 -4516 21189 23021
4138 23021 12292 21101 41554 36731 5637 -11221 4401 23851 23036 17461 25325 31810 19262
4125 19262 5188 14603 31596 17839 -24520 -46785 -20003 23282 31897 100 -33097 -36962
4113 -36962 -17996 1467 11363 13266 7000 -9072 -28649 -38306 -30340 -12224 -510 -2896 -7757
4100 -7757 1444 19833 21303 -6076 -38134 -45071 -32639 -28010 -31492 -16307 19702 39865 22827
4087 22827 -3130 -4717 7391 5250 -6723 -6558 556 -5763 -17499 -10440 7878 7909 -8047 -10132
4073 -10132 104 -11724 -45801 -55596 -23326 5871 -3833 -22297 -9387 15610 10370 -16542
4061 -16542 -22252 -1321 11334 1271 -7940 3149 27397 49752 58774 45885 20979 15710 39689
4048 39689 52078 17704 -27755 -21998 26389 47385 17384 -9477 6068 29766 19254 -7440
4036 -7440 -9795 11408 30101 40507 45714 30795 -9747 -41683 -31038 3908 20771 15588 15221
4023 15221 22471 15382 -4944 -10819 6556 26276 33941 33663 24207 335 -20646 -13289 9496
4010 9496 4999 -33427 -59823 -42441 -8767 610 -9779 -7833 14416 36336 40427 25451 2436
3997 2436 -5141 21907 62361 61919 4344 -51787 -44777 4829 26891 3364 -19078 -14843 -14097
3984 -14097 -34420 -38671 751 42214 30262 -17360 -32352 6003 47735 49646 28274 20334
3972 20334 28454 29862 14192 -10426 -32698 -40564 -22624 14343 41368 38867 21299 12281 8093
3959 8093 -9340 -32078 -30359 513 27804 27125 14667 15764 22278 7102 -28880 -51776 -38903
3946 -38903 -7100 11572 8582 2609 11440 30821 41626 32295 10746 -6006 -10997 -10538 -7770
3933 -7770 6819 38417 67925 66247 32080 -280 -1400 17178 22315 6077 -8333 -6885 -5388
3920 -5388 -17511 -24160 620 43499 60659 35166 -387 -9006 4897 11485 586 -10913 -8540
3907 -8540 4417 19194 30613 32215 18116 -5659 -22074 -19075 501 22068 25860 -699 -43861
3894 -43861 -65228 -40916 6846 37024 41090 41161 43774 32152 7851 -309 16149 26384 10307
3881 10307 -8102 -4865 2051 -8778 -14229 15691 55390 53341 13110 -11253 497 11991 568
3868 568 -6444 12303 30623 21461 4473 9864 26079 23237 5872 1670 11677 10876 -7849 -25139
3854 -25139 -28913 -26187 -20545 -6218 11217 13807 -963 -11684 -2334 14914 16694 -937 -18047
3841 -18047 -13720 11731 38034 47832 44086 38648 30447 12498 -2189 10363 41892 49723 18487
3828 18487 -7241 15276 58675 62645 23120 -6747 -1038 7986 -5468 -17163 -178 25444
3816 25444 24847 1729 -15279 -19619 -25453 -32450 -26715 -12171 -9144 -19629 -21677 -5897 5907
3803 5907 -7434 -31529 -32327 -3567 20309 8553 -20592 -20562 16449 41145 15049 -28243 -26124
3790 -26124 21694 51523 28049 -11269 -22203 -16402 -24731 -36949 -22712 11249 30274 24753
3778 24753 12892 754 -19433 -36969 -29860 -4321 9766 3649 -4553 -7320 -13120 -14801 5361
3765 5361 34807 38462 15823 5644 21907 32885 21505 15541 30459 32998 -77 -32306 -22722
3752 -22722 7650 15233 6675 15830 34782 30185 10732 12737 27709 13070 -24391 -27679 14157
3739 14157 39368 10854 -24279 -12399 24214 32200 12284 4537 15977 18295 4340 -3341 3165
3726 3165 6627 201 -1718 7301 14288 10471 4345 6210 15389 23911 21354 1438 -24441 -31130
3712 -31130 -11922 7368 4819 -4677 2872 19129 22106 19326 31074 41136 13049 -42871 -68173
3699 -68173 -35467 14346 33213 25384 21555 27677 29526 24278 19127 15282 15293 28402 49133 51658
3685 51658 27466 6288 13729 30173 23187 1706 530 22568 36339 28055 17765 19060 17841
3672 17841 3002 -10536 -6128 7211 9161 -1577 -6351 7691 30280 38164 21416 -3352 -12628
3659 -12628 -6236 -2714 -4176 8058 31895 31429 -7575 -39819 -19470 25240 28679 -11623 -31438
3646 -31438 -2295 25429 6644 -27070 -21494 14863 28357 1654 -28559 -28423 -4738 14437
3634 14437 11794 -7451 -20829 -10981 8293 4799 -21644 -28852 4122 33718 11891 -34408 -37180
3621 -37180 7891 30862 -6793 -52957 -42195 11402 42221 28218 9738 18943 35328 25482
3609 25482 -3655 -15624 4510 33911 46413 42472 35730 27150 11967 2572 16723 40982 36575
3596 36575 -4177 -36156 -20913 16724 26114 7396 6464 37451 58297 36467 -2107 -13221
3584 -13221 6705 27675 29825 15045 -7168 -21102 -7513 29839 53451 34714 -2578 -10023
3572 -10023 19835 46320 39759 17282 10295 21578 30131 22411 3587 -13061 -17019 -7511 3637
3559 3637 3479 -3765 -842 15242 24455 11965 -9188 -18124 -16065 -16620 -15748 1964 27578 27903 -7113
3544 -7113 -41847 -39294 -9692 8825 4863 -258 4350 3535 -10184 -18807 -10319 -1747 -9106 -15986
3530 -15986 -46 23891 20395 -11191 -31059 -14636 14489 20388 1577 -15126 -13031 573
3518 573 12130 16675 15185 9679 5834 13793 38002 64494 66295 31998 -13606 -32494 -18864
3505 -18864 -2232 1219 12599 46117 70264 49582 5699 -8690 12088 24453 11619 6825
3493 6825 26773 36782 10284 -24764 -34496 -32079 -40767 -42113 -11348 25019 23379 -3622 -5897
3480 -5897 21205 32033 9380 -10471 -3374 5913 -5766 -18883 -9420 7381 2871 -19856 -34719
3467 -34719 -29452 -11480 7809 16382 4569 -17830 -22394 3159 34735 42300 27206 13455 14864
3454 14864 27501 43532 55509 54592 39104 19445 5382 -3133 -6070 1426 14117 14093 -1981
3441 -1981 -9513 9529 31327 15260 -38578 -81078 -69427 -14680 34686 47129 35491 31755
3429 31755 44751 52977 38306 11859 -3908 -6418 -9446 -17268 -22553 -23781 -22723 -11301 12336
3416 12336 21843 -7671 -50355 -53030 -14158 8351 -15448 -42611 -28439 5834 17239 10835
3404 10835 14951 20237 1425 -22248 -10271 25371 30508 -6362 -36870 -29606 -11144 -13170 -24893
3391 -24893 -22060 -7951 -382 -2532 -6434 -7059 -663 13244 22276 13562 -2214 -2847 9860 15105
3377 15105 11865 17322 26095 13628 -12816 -13533 17959 36664 16839 -6881 -1217 9239 -9443
3364 -9443 -35266 -27534 -2107 -9843 -51062 -69790 -37578 6461 14022 -10955 -27679 -11099 27165
3351 27165 55856 51380 17589 -16434 -24236 -6388 17595 32462 32695 17183 -6011 -18926 -13489
3338 -13489 -3513 -2929 -3961 6704 23267 31448 31046 28138 19250 5089 3076 19634 28088 7151
3324 7151 -15879 -1712 33390 35420 -4646 -37693 -33456 -18428 -18946 -17134 5175 20495 -4770
3311 -4770 -51120 -67793 -40694 -3136 14133 12570 7094 3920 1505 -2437 -8215 -10978 -4149 7780
3297 7780 9253 -4588 -16921 -11012 7385 20321 19312 6214 -13244 -23643 -4750 37914 62807
3284 62807 38691 -8603 -25033 21 22784 10152 -16314 -17508 6812 23370 15500 2648
3272 2648 8307 27365 35518 23081 7678 11259 31908 46184 38309 17936 5082 5954 12456
3259 12456 19518 29587 39644 37352 17196 -8090 -20739 -17378 -7002 5158 19162 27281 16680
3246 16680 -7297 -16554 5143 34104 34910 10981 -254 15087 26732 11803 -4619 10390
3234 10390 39583 36620 -2974 -31932 -17042 19782 38356 29728 12689 3524 8092 27462 51519
3221 51519 56788 29094 -14430 -38604 -26184 4281 16252 -8229 -46795 -57532 -28245 6920
3209 6920 14405 8387 22431 46083 32825 -24114 -68584 -54244 -4578 25741 20348 3230 -5170
3196 -5170 -2259 11178 30898 43712 43427 41465 44339 37173 10369 -14889 -12516 10967 28079
3183 28079 26752 14202 -557 -7901 847 12993 -895 -38600 -52397 -16460 23543 12766
3171 12766 -28199 -35626 -1065 23546 12487 -3861 -264 9556 11793 14520 17601 6820 -9819
3158 -9819 -5014 18049 25666 13401 14234 33762 34503 5764 -10453 6702 16453 -10859 -37218
3145 -37218 -22484 4122 -3818 -28560 -24076 -1245 -6212 -31572 -22128 31051 68419 47734 -111
3132 -111 -21104 -5543 15951 18928 8756 7745 25435 40284 22587 -18259 -34582 -6437 23371
3119 23371 10382 -25084 -33467 -12811 -564 -6072 -5936 1742 -5084 -20447 -10950 24095 43978
3106 43978 29623 8590 4652 8350 12421 30265 59361 69653 51402 35191 40818 45330 28650
3093 28650 13238 25420 47983 46378 20552 -151 2134 21167 38835 34220 1671 -28326
3081 -28326 -16350 24866 36546 1673 -21751 9465 50564 38759 -5615 -16007 10082 16016
3069 16016 -8163 -7761 35638 63404 33705 -8794 -4324 30425 38506 17536 15641 44708 59000
3056 59000 29237 -12419 -23733 -11191 -7089 -13063 -3780 22195 32966 11923 -14250 -13108 8827
3043 8827 20230 11117 982 5091 15458 18854 16482 18736 29868 41823 39447 16456 -8556
3030 -8556 -5232 26207 43433 17190 -18867 -10501 34328 51736 15005 -27989 -28065 352 15603
3017 15603 10832 4556 159 -6894 -4454 15401 28160 6986 -31572 -47734 -34805 -20765 -20196
3004 -20196 -18965 -6274 7158 6097 -13233 -42092 -60120 -47725 -12953 9815 5326 -183 15757
2991 15757 31490 18021 -9981 -19261 -11766 -10777 -14163 -8346 -8696 -32582 -49432 -18350 35868
2978 35868 50587 24229 15641 40906 48047 12563 -17960 -6473 14414 5543 -15809 -19015 -14081
2965 -14081 -18556 -17095 1960 12796 -1817 -12519 4973 22105 7181 -18568 -22662 -17372 -22790
2952 -22790 -17662 14192 31383 -2784 -43447 -26083 25862 39129 13392 12979 45438 47291 928
2939 928 -29893 -7584 22723 20469 14869 37029 56159 38256 12514 21351 47688 48812 28171
2926 28171 18146 18991 9319 -3410 3733 18958 9779 -19913 -34110 -23894 -17835 -29402 -35177
2913 -35177 -16625 10012 20999 17590 15378 18450 19699 16987 15249 14983 8126 -10292 -28467 -24077
2899 -24077 7514 37390 31231 -6651 -35478 -27995 992 22486 27841 23989 15876 10291 18654
2886 18654 37578 42922 22231 -2518 -4643 10707 22348 28949 40241 44857 22534 -13459 -21502
2873 -21502 11413 46128 40399 2321 -23406 -12755 11844 13703 -12348 -35891 -31135 -8491
2861 -8491 5003 6575 16094 34479 34015 3780 -23236 -13504 16282 22008 -5026 -28854 -19979
2848 -19979 11317 35586 36821 20338 3702 2208 12872 16258 3574 -9353 -9671 -12476 -33428
2835 -33428 -51291 -32668 11658 33855 16564 -3810 6877 35105 48921 44272 37937 33250
2823 33250 18460 -8615 -33341 -39860 -25235 -2095 10097 4759 -1197 10543 29802 30891 15232
2810 15232 12773 32996 45103 24637 -7041 -13478 7469 30084 39293 36176 19471 -8860 -28439
2797 -28439 -19799 5591 20528 21925 27703 38779 37569 25594 25855 37564 25798 -21746 -59405
2784 -59405 -37702 26050 66401 51219 11593 -8656 -831 18633 36491 44965 37080 18206
2772 18206 7465 11021 8880 -12622 -30708 -15086 23119 42800 30066 10315 780 -10608
2760 -10608 -26645 -21597 13370 40565 27751 2423 10554 40699 41147 6029 -12328 12695 38490
2747 38490 18951 -27651 -49937 -34039 -8524 2795 162 -9163 -17701 -12567 11490 35859 35681
2734 35681 13291 -2985 6432 32448 51230 46860 22293 -2219 -5087 12967 26069 13366
2722 13366 -14405 -29183 -19723 658 14480 14762 3684 -9196 -9151 9515 30327 27954 -832
2709 -832 -27989 -23295 9114 30681 11386 -30591 -46719 -20424 9247 3962 -16377 -6658 28086
2696 28086 38574 11882 -8138 4725 19524 10389 3716 21880 30418 -3074 -39353 -24094
2684 -24094 16514 13843 -25358 -23640 40032 90864 70572 16967 -5853 3091 6962 -1036 -3908
2671 -3908 -2869 -7959 -9310 3623 13703 2370 -13470 -5339 20576 33734 24394 8722 -889
2658 -889 -2735 7234 27986 40664 28671 4172 -7673 -3129 2981 5344 10205 16637 17831 15501
2644 15501 14700 12599 9364 16917 36767 44841 23867 -3955 -6340 9537 10340 -9055 -20646 -10428
2630 -10428 4699 9108 5130 -5423 -24178 -35795 -17660 20735 39271 20524 -6826 -12322
2618 -12322 -4440 -8548 -26693 -40795 -41221 -33224 -24027 -17177 -12864 -6352 5347 12604 2646 -18039
2604 -18039 -28668 -24672 -21488 -22255 -8076 26810 55995 56160 39533 29731 25353 13350 1878
2591 1878 8648 25054 23782 1965 -11739 1158 23764 29372 14364 -3896 -8286 7309 36074
2578 36074 58576 56437 35078 22110 31875 42537 25100 -12068 -30223 -13010 12183 16655
2566 16655 10565 18544 33614 28966 8881 7904 31195 36275 -2037 -42322 -28986 25591 52455
2553 52455 15450 -46007 -67945 -29820 33374 67884 48027 633 -21406 -1685 19746 7876
2541 7876 -12472 -560 26605 20238 -12772 -15259 23167 45228 22762 3675 25019 45264
2529 45264 17156 -26497 -25647 7878 15269 -10108 -21315 -5033 1142 -18096 -30320 -17328 -6603
2516 -6603 -19294 -31884 -14991 22203 48236 46400 21334 -9527 -22269 -6960 12514 3263
2504 3263 -28803 -43304 -21113 13790 32808 32129 18204 -3158 -15434 -2913 17369 10529 -19453
2491 -19453 -27808 985 24460 8260 -20066 -17270 9556 22452 13002 2580 -987 -7313 -12836
2478 -12836 -2382 20235 31261 18034 -7309 -22767 -13201 18040 43042 30952 -10830 -37628
2466 -37628 -25947 -4959 -6353 -12643 8288 41100 41191 3799 -30150 -34938 -25766 -21188 -17786 -9821
2452 -9821 -2556 2215 8556 10831 1136 -7333 6692 34131 40950 17644 -6067 -3680 17581 35747
2438 35747 38458 23318 -460 -7813 16681 47720 46268 18565 7950 22603 20193 -18537 -51576
2425 -51576 -40838 -10095 718 -383 15198 37209 36266 21385 24271 38396 27140 -10591 -34036
2412 -34036 -24426 -8301 -6730 -3890 17239 43328 53824 48382 35403 17734 3364 5920 20781
2399 20781 24180 9104 -2362 3924 11562 5125 -3085 617 5102 1045 7802 39614 66201 48651
2385 48651 2940 -16855 3284 21044 7285 -12393 -5281 17006 24108 16892 17955 28010 25740
2372 25740 5376 -15646 -26137 -31220 -30047 -10416 24267 45668 34596 9116 601 11093
2360 11093 13677 -7025 -32574 -34061 -6608 26838 41139 32189 15719 7479 7787 6491 7
2347 7 -3385 2423 9242 4853 -7051 -7609 12356 35556 34889 6021 -24885 -30501 -13602 -129
2333 -129 -2842 -5448 10061 33141 38129 22362 10505 18154 31044 29705 17245 8522 6082 4665
2319 4665 8945 25653 43210 41086 20224 4550 8217 18639 18791 11715 13296 29347 47802
2306 47802 50009 28065 -4705 -23022 -16007 1123 10512 15869 26175 27562 830 -36909 -43602
2293 -43602 -12052 16905 15242 6306 19317 38687 33287 12460 12472 38307 56938 45732 15975
2280 15975 -10394 -19336 -3156 30074 47972 26630 -7992 -5598 38003 72592 64573 37642
2268 37642 25640 23175 10880 -2122 3437 17583 17359 9404 18714 40472 41151 11864 -13697
2255 -13697 -7660 12549 11393 -15653 -39832 -37566 -14680 5353 5694 -11142 -27056 -24732 -5158
2242 -5158 12743 14543 8564 12900 26084 25289 1262 -18923 -2447 40780 63667 41991 6075
2229 6075 -2673 13672 23054 16650 14871 23035 17841 -10952 -36942 -34731 -17050 -10877 -14757 -6887
2215 -6887 15116 30758 30409 26810 28781 24838 3035 -26352 -40039 -29685 -12635 -12536 -31152 -45139
2201 -45139 -36055 -16484 -11852 -20303 -14610 10868 24314 5276 -17867 -8630 19517 23022 -3506
2188 -3506 -19534 -1292 25427 26648 4107 -17325 -22887 -14222 -766 4388 -3025 -4747 18627
2175 18627 47957 39415 -8361 -37313 -6969 43872 50349 13018 -9739 9766 36160 31565
2163 31565 5455 -11292 -9278 1331 11520 14179 2446 -17366 -26723 -20107 -11890 -8149 4915
$$ [...]
##END NTUPLES=NMR SPECTRUM
##END=
