##TITLE=1H ikalashn
CA-9300-2(30s)
20.11.2024
##JCAMPDX= 6.0         $$ Bruker NMR JCAMP-DX V2.0
##DATA TYPE= NMR SPECTRUM
##DATA CLASS= NTUPLES
##ORIGIN= UXNMR, Bruker Analytische Messtechnik GmbH
##OWNER= root
$$ TOPSPIN		Version 1.3
$$ 2024-11-20 10:51:51.703 +0400  Irina@DPX200
$$ Compression mode = diff/dup
##.OBSERVE FREQUENCY= 200.131300845
##.OBSERVE NUCLEUS= ^1H
##.ACQUISITION MODE= SIMULTANEOUS
##.ACQUISITION SCHEME= undefined
##.AVERAGES= 8
##.DIGITISER RES= 18
##SPECTROMETER/DATA SYSTEM= spect
##.PULSE SEQUENCE= zg
##.SOLVENT NAME= CDCl3
##.SHIFT REFERENCE= INTERNAL, CDCl3, 1, 17.49637
##AUDIT TRAIL= $$ (NUMBER, WHEN, WHO, WHERE, WHAT)
$$ ##TITLE= Audit trail, TOPSPIN		Version 1.3
$$ ##JCAMPDX= 5.01
$$ ##ORIGIN= Bruker BioSpin GmbH
$$ ##OWNER= Irina
$$ $$ F:/spectra/data/iren/nmr/1H/4/pdata/1/auditp.txt
$$ ##AUDIT TRAIL=  $$ (NUMBER, WHEN, WHO, WHERE, VERSION, WHAT)
(   1,<2024-11-20 10:45:32.531 +0400>,<Irina>,<DPX200>,<TOPSPIN 1.3>,
      <acquisition in progress>)
(   2,<2024-11-20 10:49:54.843 +0400>,<Irina>,<DPX200>,<TOPSPIN 1.3>,
      <Start of raw data processing
       efp BC_mod = 2 LB = 0.02 FT_mod = 6 PKNL = 1 PHC0 = 201.0145 PHC1 = 11.39667 SI = 32K 
       data hash MD5: 32K
       CB EF 97 7F 7C C0 FA 5B 1E 09 1A 7F C2 AB E6 C0>)
(   3,<2024-11-20 10:49:57.312 +0400>,<Irina>,<DPX200>,<TOPSPIN 1.3>,
      <apk 
       data hash MD5: 32K
       D3 8C 11 AA 05 60 3E 81 DC C6 A1 A0 A2 04 DF 4B>)
$$ ##END=
$$ 
$$ $$ hash MD5
$$ $$ 86 36 BB F1 5C 84 82 D4 37 29 CA 1B 91 0D 6A D7
##$RELAX= 
##$RELAX= 
##$RELAX= 
##$RELAX= 
##$RELAX= 
##$RELAX= 
##$RELAX= 
##$RELAX= 
##$RELAX= 
$$ Bruker specific parameters
$$ --------------------------
##$DU= <F:/spectra>
##$EXPNO= 4
##$NAME= <1H>
##$PROCNO= 1
##$TYPE= <nmr>
##$USER= <iren>
##$AMP= (0..31)
100 100 100 100 100 100 100 100 100 100 100 100 100 100 100 100 100 100 
100 100 100 100 100 100 100 100 100 100 100 100 100 100 
##$ANAVPT= -1
##$AQSEQ= 0
##$AQ_mod= 1
##$AUNM= <au_zg>
##$AUTOPOS= <>
##$BF1= 200.13
##$BF2= 200.13
##$BF3= 200.13
##$BF4= 200.13
##$BF5= 200.13
##$BF6= 200.13
##$BF7= 200.13
##$BF8= 200.13
##$BYTORDA= 1
##$CFDGTYP= 0
##$CFRGTYP= 5
##$CHEMSTR= <none>
##$CNST= (0..63)
1 1 145 1 1 1 1 1 1 1 1 1 1 1 1 1 1 1 1 1 1 1 1 1 1 1 1 1 1 1 1 1 1 1 
1 1 1 1 1 1 1 1 1 1 1 1 1 1 1 1 1 1 1 1 1 1 1 1 1 1 1 1 1 1 
##$CPDPRG= <>
##$CPDPRG1= <>
##$CPDPRG2= <>
##$CPDPRG3= <>
##$CPDPRG4= <mlev>
##$CPDPRG5= <mlev>
##$CPDPRG6= <mlev>
##$CPDPRG7= <mlev>
##$CPDPRG8= <mlev>
##$CPDPRGB= <>
##$CPDPRGT= <>
##$D= (0..63)
0 30 0 0 0 0 0 0 0 0.06 0 0.03 0 0 0 0 0.0002 0 0 0 0 0 0 0 0 0 0 0 0 
0 0 0 0 0 0 0 0 0 0 0 0 0 0 0 0 0 0 0 0 0 0 0 0 0 0 0 0 0 0 0 0 0 0 0 
##$DATE= 1732085390
##$DBL= (0..7)
120 120 120 120 120 120 120 120 
##$DBP= (0..7)
150 150 150 150 150 150 150 150 
##$DBP07= 0
##$DBPNAM0= <>
##$DBPNAM1= <>
##$DBPNAM2= <>
##$DBPNAM3= <>
##$DBPNAM4= <>
##$DBPNAM5= <>
##$DBPNAM6= <>
##$DBPNAM7= <>
##$DBPOAL= (0..7)
0.5 0.5 0.5 0.5 0.5 0.5 0.5 0.5 
##$DBPOFFS= (0..7)
0 0 0 0 0 0 0 0 
$$ [...]
##$SW_h= 4401.40845070422
##$TD= 16384
##$TD0= 1
##$TE= 300
##$TE2= 300
##$TE3= 300
##$TEG= 300
##$TL= (0..7)
0 120 120 120 120 120 120 120 
##$TP= (0..7)
150 150 150 150 150 150 150 150 
##$TP07= 0
##$TPNAME0= <>
##$TPNAME1= <>
##$TPNAME2= <>
##$TPNAME3= <>
##$TPNAME4= <>
##$TPNAME5= <>
##$TPNAME6= <>
##$TPNAME7= <>
##$TPOAL= (0..7)
0.5 0.5 0.5 0.5 0.5 0.5 0.5 0.5 
##$TPOFFS= (0..7)
0 0 0 0 0 0 0 0 
##$TUNHIN= 0
##$TUNHOUT= 0
##$TUNXOUT= 0
##$USERA1= <user>
##$USERA2= <user>
##$USERA3= <user>
##$USERA4= <user>
##$USERA5= <user>
##$V9= 5
##$VALIST= <valist>
##$VCLIST= <CCCCCCCCCCCCCCC>
##$VD= 0
##$VDLIST= <DDDDDDDDDDDDDDD>
##$VPLIST= <PPPPPPPPPPPPPPP>
##$VTLIST= <TTTTTTTTTTTTTTT>
##$WBST= 1024
##$WBSW= 25
##$XGAIN= (0..3)
0 0 0 0 
##$XL= 0
##$YL= 0
##$YMAX_a= 598230
##$YMIN_a= -629872
##$ZGOPTNS= <>
##$ZL1= 120
##$ZL2= 120
##$ZL3= 120
##$ZL4= 120
##$ABSF1= 0
##$ABSF2= 0
##$ABSG= 0
##$ABSL= 0
##$ALPHA= 0
##$AQORDER= 0
##$ASSFAC= 0
##$ASSFACI= 0
##$ASSFACX= 0
##$ASSWID= 0
##$AUNMP= <proc_1d>
##$AXLEFT= 0
##$AXRIGHT= 0
##$AXTYPE= 0
##$AXUNIT= <>
##$AZFE= 0.1
##$AZFW= 0.1
##$BCFW= 0
##$BC_mod= 2
##$BYTORDP= 0
##$COROFFS= 0
##$CY= 7568.61572265625
##$DATMOD= 1
##$DC= 0
##$DFILT= <>
##$DTYPP= 0
##$F1P= 17.9538593292236
##$F2P= -4.03888763876832
##$FCOR= 0.5
##$FTSIZE= 32768
##$FT_mod= 6
##$GAMMA= 0
##$GB= 0
##$INTBC= 0
##$INTSCL= 5.687517e-011
##$ISEN= 128
##$LB= 0.02
##$LEV0= 0
##$LPBIN= 0
##$MAXI= 945.577
##$MC2= 0
##$MEAN= 0
##$ME_mod= 0
##$MI= -402.1523
##$NCOEF= 0
##$NC_proc= -6
##$NLEV= 6
##$NOISF1= 8.587773
##$NOISF2= 6.764455
##$NSP= 0
##$NTH_PI= 0
##$NZP= 0
##$OFFSET= 17.49637
##$PC= 1
##$PHC0= 208.8465
##$PHC1= 1.368872
##$PH_mod= 1
##$PKNL= yes
##$PPARMOD= 0
##$PPDIAG= 0
##$PPIPTYP= 0
##$PPMPNUM= 100
##$PPRESOL= 1
##$PSCAL= 0
##$PSIGN= 0
##$REVERSE= no
##$SF= 200.13
##$SI= 32768
##$SIGF1= 16.12182
##$SIGF2= -4.496377
##$SINO= 3.521527
##$SIOLD= 32768
##$SREGLST= <1H.CDCl3>
##$SSB= 0
##$STSI= 32768
##$STSR= 0
##$SW_p= 4401.40845070422
##$SYMM= 0
##$S_DEV= 0
##$TDeff= 16384
##$TDoff= 0
##$TI= <>
##$TILT= no
##$TM1= 0
##$TM2= 0
##$TOPLEV= 0
##$USERP1= <user>
##$USERP2= <user>
##$USERP3= <user>
##$USERP4= <user>
##$USERP5= <user>
##$WDW= 1
##$XDIM= 32768
##$YMAX_p= 497535780
##$YMIN_p= -962332
$$ End of Bruker specific parameters
$$ ---------------------------------
##NTUPLES= NMR SPECTRUM
##VAR_NAME=  FREQUENCY,     SPECTRUM/REAL,   SPECTRUM/IMAG
##SYMBOL=    X,             R,               I
##VAR_TYPE=  INDEPENDENT,   DEPENDENT,       DEPENDENT
##VAR_FORM=  AFFN,          ASDF,            ASDF
##VAR_DIM=   32768,         32768,           32768
##UNITS=     HZ,            ARBITRARY UNITS, ARBITRARY UNITS
##FACTOR=    0.134324425510551, 1,           1
##FIRST=     4401.40845070422, -932845,      -832438
##LAST=      0,             -813229,         -951715
##MIN=       0,             -962332,         0
##MAX=       4401.40845070422, 497535780,    0
$$ Real data points
##PAGE= N=1
##DATA TABLE= (X++(R..R)), XYDATA
$$ [...]
20454f00452M370L412q869q155K737j910j8658j2876J8552L1326M972j8714m459
20441f08724J6097J647k2666q989K3687J6985k4313l5490l69K1933j581k3787
20429f45570j603K9792J7729k0448k8217J320K3783J5840j297o401l691j435J580
20416f18618L896N86l514j07N232K236k408M467J4495O443j6618k5804q547J1922
20402f26339J0733m313p917N407J6022Q222q865j4298l503N576j793j4017r360
20389f44445Q381J1752o949j8446j06K4598J7963j3352k5094K01K8576K4573j245
20376e93593j2702J252J7288J3091n838j7637j2092j87K587m469j0324j0296r233
20363f42153o379O234K3310K3029p61k0648j1643R621R170j1054j7464K85J4506
$$ plain form
20454 -600452 -596082 -592670 -601539 -609694 -606957 -608867 -627525 -640401 -621849 -590523 -585551 -604265 -608724
20441 -608724 -592627 -590980 -613646 -622635 -598948 -581963 -606276 -641766 -642135 -620202 -621783 -645570
20429 -645570 -647173 -617381 -599652 -620100 -648317 -646997 -623214 -607374 -608671 -615072 -618763 -620198 -618618
20416 -618618 -614722 -614136 -617650 -617757 -612525 -610289 -612697 -608230 -593735 -587292 -603910 -629714 -638261 -626339
20402 -626339 -615606 -619919 -627836 -622429 -606407 -598185 -607050 -621348 -624851 -619275 -621068 -635085 -644445
20389 -644445 -636064 -624312 -631261 -649707 -649813 -625215 -607252 -620604 -645698 -645497 -616921 -592348 -593593
20376 -593593 -606295 -605043 -587755 -574664 -580502 -598139 -610231 -610418 -607831 -612300 -622624 -632920 -642153
20363 -642153 -648532 -642298 -618988 -595959 -596720 -617368 -629011 -619390 -610220 -621274 -638738 -638453 -623947
20350f23947N738r931j2347n819n04O842J5129Q770j2713k0634O98K1598R137
20337f17983j8127j6587J3439K8573J0516j0307p906K772J35p270k604O597M479
20324f14273k862m09N793o08j3920j2842L747J4492J0307N176O899L535r630j4496
20310f19091j41J2360J47k0418j3647J8957L5243J2864j7460j7346M981J2637
20298e90914k593j3150l144R645P784J769N941Q889p187l0326l0055k482K1846
20285f23977J9941L630m765l985n943j1063j0264l706N83L006R965J6305Q516
20272f01757j0913j9644m815J6892K0041K833j3066j0801M368J5473J3519M406
20260e83464r85j421o132j7544k0331o78K6961L1747Q353j4509j5965q985r336
$$ plain form
20350 -623947 -618209 -628140 -640487 -646306 -646810 -639968 -624839 -616069 -628782 -649416 -648718 -627120 -617983
20337 -617983 -636110 -652697 -639258 -610685 -600169 -610476 -618382 -615610 -615475 -622745 -625349 -618752 -614273
20324 -614273 -617135 -617544 -611751 -612359 -626279 -639121 -635374 -620882 -610575 -605399 -598500 -594965 -604595 -619091
20310 -619091 -619232 -606872 -606725 -627143 -640790 -621833 -586590 -573726 -591186 -608532 -603551 -590914
20298 -590914 -593507 -606657 -609801 -600156 -592372 -590603 -584662 -575773 -582960 -613286 -643341 -645823 -623977
20285 -623977 -604036 -600406 -605171 -609156 -615099 -626162 -636426 -640132 -639549 -636543 -626578 -610273 -601757
20272 -601757 -612670 -632314 -637129 -620237 -600196 -597363 -610429 -621230 -616862 -601389 -587870 -583464
20260 -583464 -584449 -585870 -592002 -609546 -629877 -630555 -603594 -571847 -563494 -578003 -593968 -602953 -612289
20247f12289n632J3072K4166L397k6505k3367N989J3803j0800k4843n109J4949
20235f33169O724n792M608J6437J582j8621j0363R879M895j4685j0745J0790J2489
20222f25971j283P307L0443J8789k5029l5237R008M0454R821l4693k8774P109
20210f28056J4283l849k627J5009Q628j7194j7586R064J6093n872r836K1751L8575
20197e61617L223m4006m3848l030K4130J4539n942j1446m763K195P629J2388J0471
20184f00077l083j9654k0354K204K7325K5049k699j8717k817J5648L857j9282
20172f12600j4232J0148J0484j4419j9519P257K2846N002r770N429J8761k38k2835
20159f13686j2905P844K147j3248j940J8807O708k4731k4938N562J7954L198L175
$$ plain form
20247 -612289 -617921 -604849 -580683 -577286 -603791 -627158 -621169 -607366 -618166 -643009 -648118 -633169
20235 -633169 -626445 -632237 -627629 -611192 -609610 -628231 -638594 -628715 -623820 -638505 -649250 -638460 -625971
20222 -625971 -627254 -619947 -589504 -570715 -595744 -630981 -621973 -581519 -571698 -606391 -635165 -628056
20210 -628056 -613773 -617622 -620249 -605240 -596612 -613806 -631392 -622328 -606235 -612107 -621943 -600192 -561617
20197 -561617 -558394 -602400 -646248 -649278 -625148 -610609 -616551 -627997 -632760 -630565 -622936 -610548 -600077
20184 -600077 -603160 -622814 -643168 -640964 -613639 -588590 -591289 -610006 -612823 -597175 -593318 -612600
20172 -612600 -626832 -616684 -606200 -620619 -640138 -632881 -610035 -605033 -614803 -609374 -590613 -590851 -613686
20159 -613686 -626591 -618747 -616600 -629848 -631788 -612981 -606273 -631004 -655942 -650380 -632426 -629228 -626053
20146f26053K6503K7931q026l3222j5895Q742M653o311M854J7012K744j4407j671
20133f13146J9379R068j7764j6173J0125J6592l791j1542P804K0838O357j2235
20121e84488j1354j096L703Q112J3783O192j3953j9139K415K2381J4812m970j0731
20108e74333p952j4469k0921p318J5302J7721K13q853l55M781m119j0338k993
20095f13634K993m167r613K758K0015J7302n973k6942k9732j8021j921J1277J5187
20082f40471Q126k92J951J2654J7383Q528o435j5610j2828J677K0330K8651J8675
20069e57661K467j167N349J098j7545k5282o529J4581P304j5824j4373J7031L6371
20056e54180J5943j6209j9532n63L587j2869j8256r2J1316p380l0894k1322J3244
$$ plain form
20146 -626053 -599550 -571619 -579645 -612867 -628762 -620020 -615367 -621678 -616824 -599812 -597068 -611475 -613146
20133 -613146 -593767 -584699 -602463 -618636 -608511 -591919 -595710 -607252 -599448 -578610 -572253 -584488
20121 -584488 -595842 -596938 -593235 -585123 -571340 -565148 -579101 -598240 -595825 -573444 -558632 -563602 -574333
20108 -574333 -582285 -596754 -617675 -624993 -609691 -591970 -591757 -600610 -600965 -596184 -600303 -610641 -613634
20095 -613634 -610641 -614808 -624421 -621663 -601648 -584346 -590319 -617261 -646993 -665014 -666935 -655658 -640471
20082 -640471 -632345 -632637 -630686 -618032 -600649 -592121 -598556 -614166 -626994 -625317 -604987 -576336 -557661
20069 -557661 -555194 -556361 -551012 -549914 -567459 -592741 -599270 -584689 -577385 -593209 -607582 -590551 -554180
20056 -554180 -538237 -554446 -573978 -574541 -570954 -583823 -602079 -602171 -590855 -598235 -629129 -650451 -637207
20043f37207K9031R077j6513j6582K894J7354J6926O083j0694k4346j8265Q278
20031f33964K5944R589k1601k6478n80J9693J3763K234M397P140k027n198J1231
20018e95857K1270r29k8357j6464K1628K9811k431k4562r772M975r344j9934N959
20005f24007L3925J5521k5227k5420J3918K9359r02k4762n230K2176J3428j4583
19993e91804k0372m945L101K465J1914K4298J4325j3020k3717o491J2337J1162
19981e80747j431j1047j7557j9216m120K5002L8781J5758k3103l5746j1241J7154
19969f07513J4583j2351k5396m721K4159K3873l262j9198o771O924j105r371Q246
19956f11903K8000Q766l3097l7261P233L9214J6887k1177k1036O574J7020P150
$$ plain form
20043 -637207 -608176 -599099 -615612 -632194 -629300 -611946 -595020 -588937 -599631 -623977 -642242 -633964
20031 -633964 -608020 -598431 -620032 -646510 -647090 -627397 -613634 -611400 -607003 -599863 -601890 -607088 -595857
20018 -595857 -574587 -575516 -603873 -620337 -598709 -568898 -571329 -595891 -605663 -600688 -610032 -629966 -624007
20005 -624007 -590082 -574561 -599788 -625208 -611290 -581931 -582833 -607595 -612825 -590649 -577221 -591804
19993 -591804 -612176 -617121 -614020 -611555 -599641 -575343 -561018 -574038 -597755 -604246 -591909 -580747
19981 -580747 -582178 -593225 -610782 -629998 -634118 -609116 -570335 -554577 -577680 -613426 -624667 -607513
19969 -607513 -592930 -605281 -630677 -635398 -611239 -587366 -590628 -609826 -616597 -609673 -610778 -620149 -611903
19956 -611903 -583903 -575137 -608234 -645495 -638262 -599048 -582161 -603338 -624374 -617800 -600780 -593630
19944e93630O382J5218Q974q128p598P530N199j4155j2813J6387L1000P970j8711
19931e56375j7365q564j9225k8606o655K4955K2149r475k3755p099P367j45q525
19918f31318J239J4926J3551L276l87L147N200J558q257k0166k0463l91K2206
19905f15879J9425m596j5464k32J3195L059j0739j444J9864K3750Q710k789l684
19892e66824p318j7424k0781j0725M198J6275K3934K0879O05k4919l0565r509
19880f22174J5481K0031N763p858r809o110n895p309r24J3583K0517O881j4359
19867e92182j5475O858K2153Q179j5987j8803k571N843P99K447J6148J9887J429
19854e61275j9199j8879k568R911J1991R868O290J04n970q982j0766j1162m842
$$ plain form
19944 -593630 -587248 -572030 -563056 -571184 -578782 -571252 -566053 -580208 -593021 -576634 -545634 -537664 -556375
19931 -556375 -573740 -582304 -601529 -630135 -636790 -611835 -589686 -599161 -622916 -630015 -622648 -622793 -631318
19918 -631318 -630079 -615153 -601602 -598326 -598713 -595566 -590366 -588808 -597065 -617231 -637694 -638085 -615879
19905 -615879 -596454 -601050 -616514 -616746 -603551 -600492 -611231 -612675 -592811 -569061 -560351 -563140 -566824
19892 -566824 -574142 -591566 -612347 -623072 -618874 -602599 -578665 -557786 -557181 -582100 -612665 -622174
19880 -622174 -606693 -586662 -580899 -588757 -598566 -604676 -610571 -617880 -618804 -605221 -584704 -577823 -592182
19867 -592182 -607657 -600799 -578646 -570467 -586454 -605257 -607828 -601985 -601186 -598739 -582591 -562704 -561275
19854 -561275 -580474 -599353 -601921 -592010 -580019 -570151 -563861 -563757 -569727 -578709 -589475 -600637 -605479
19841f05479O969J1949M103l925J504J2729J0829n443j5919o890R182R902o467
19828e76956j7418o543J2123J2469n473j5126m711N331r6k453J5043K8023O165
19815e49622k8293k6046R714K3759k990k2584M3L0628K4895k277j1549m690n276
19802e64288m851J6025L5029J5743k4087l1675k690J3663l238j7365l229J4633
19790e56330J1017k21j901n534j8574j8797N808K5008R411k1244k7640p049J3030
19777e93016J8242J2395k936k1205j9703R905L3899J6247k4324l6541j1045R579
19765f08503q09j5508l153K2243K5325K867j4507p514P819O185j0733j5876N821
19752f06343L3311L3954O855j6106j4449l309l777j0594p060M602Q793R76j1949
$$ plain form
19841 -605479 -598510 -586561 -582458 -586383 -584879 -572150 -561321 -566764 -582683 -589573 -580391 -570489 -576956
19828 -576956 -594374 -600917 -588794 -576325 -581798 -596924 -601635 -596304 -596400 -598853 -583810 -555787 -549622
19815 -549622 -577915 -603961 -594247 -570488 -573478 -596062 -596019 -565391 -540496 -542773 -554322 -559012 -564288
19802 -564288 -569139 -553114 -518085 -502342 -526429 -558104 -560794 -547131 -550369 -567734 -570963 -556330
19790 -556330 -545313 -545534 -547435 -552969 -571543 -590340 -584532 -559524 -550113 -571357 -598997 -606046 -593016
19777 -593016 -574774 -562379 -565315 -586520 -606223 -596318 -562419 -546172 -570496 -607037 -618082 -608503
19765 -608503 -609312 -624820 -627973 -605730 -580405 -577538 -592045 -599559 -591740 -585555 -596288 -612164 -606343
19752 -606343 -573032 -539078 -532223 -548329 -562778 -566087 -569864 -580458 -587518 -582916 -574123 -573147 -585096
19739e85096k3421k2113O580M9782N8888Q109n3674n4267L256M2132J8487k4383
19727e75720k8870k997Q616q04q02J6776K4106N181j7913j8070L62J2337O548
19714e71250m707n996K136P868O120L920O868R083L285o359j1025j0870j0885
19701e81812q933j172O082N080J994O401J1056K789j1087j1732j737j351j1086
19688e95508r045Q943J8579O844q415j1345r772r847j553J3089J1731o894r488
19675f02681J6800L3854J2077j7085j2725N832l736k6767j4844K4304L1455o005
19663e59521k9962m551K8638J9668j5052k5632j683K4950K8313Q967j7367k9502
19651e72734j4716J0919J4721p251k1055n749J4859J1965m314p149L684R243M880
$$ plain form
19739 -585096 -608517 -630630 -624050 -574268 -515380 -507271 -560945 -615212 -611956 -569824 -551337 -575720
19727 -575720 -604590 -607587 -598971 -599775 -600577 -583801 -559695 -554514 -572427 -590497 -590135 -577798 -571250
19714 -571250 -575957 -581953 -579817 -571949 -565829 -561909 -555041 -545958 -542673 -549032 -560057 -570927 -581812
19701 -581812 -590745 -591917 -585835 -580755 -578761 -572360 -561304 -558515 -569602 -581334 -583071 -584422 -595508
19688 -595508 -604553 -595610 -577031 -570187 -578602 -589947 -599719 -609566 -611119 -598030 -586299 -593193 -602681
19675 -602681 -585881 -552027 -539950 -557035 -569760 -563928 -567664 -594431 -609275 -584971 -553516 -559521
19663 -559521 -589483 -594034 -565396 -545728 -560780 -586412 -588095 -563145 -534832 -525865 -543232 -572734
19651 -572734 -587450 -576531 -561810 -569061 -590116 -595865 -581006 -569041 -573355 -580504 -576820 -567577 -562697
19638e62697m38m378p263j688J2517J7951M838j0080r909l314k582Q27J3133J5833
19624e37250k514j7005n095J0320j115j9973r109J6206J0542j9434k1904Q887
19612e87444J9140j0341k6580O070M1277K2965k5561l8809m358L1557L5085J4172
19600e22827j2034l1491l2057j0647J2669J6150O128K299M742J873q66Q913K0220
19587e36928J0917j2926k0541o64K3716K7133P431k0096l5886k6461P23J8427
19575e65155J1747k059l552k361j2447j7573J625K3869J5280j1057j3944M647
19563e70980M179j7712j6296J8852L7902J3023j3873l076J8074Q851j3501j0560
19551e45117O490J610j7222j3730R484J7479O121K831J0286M609j1632r549R069
$$ plain form
19638 -562697 -563135 -567513 -574776 -576464 -563947 -545996 -541158 -551238 -561147 -564461 -567043 -566216 -553083 -537250
19624 -537250 -539764 -556769 -561864 -551544 -552659 -572632 -581741 -565535 -554993 -574427 -596331 -587444
19612 -587444 -568304 -578645 -605225 -599155 -557878 -534913 -560474 -599283 -603641 -572084 -536999 -522827
19600 -522827 -534861 -566352 -598409 -609056 -596387 -580237 -574109 -571810 -567068 -565195 -566061 -557148 -536928
19587 -536928 -526011 -538937 -559478 -560142 -536426 -509293 -501862 -521958 -557844 -584305 -583582 -565155
19575 -565155 -553408 -555467 -559019 -561380 -573827 -591400 -589775 -565906 -550626 -561683 -575627 -570980
19563 -570980 -566801 -584513 -600809 -581957 -544055 -531032 -544905 -547981 -529907 -521056 -534557 -545117
19551 -545117 -538627 -537017 -554239 -567969 -558485 -541006 -534885 -532054 -521768 -517159 -528791 -538340 -529271
19538e29271R202j3666k0865K534J9717M214j7400j4546k787r040k0262p790J8797
19525e81163K3157j403k1661j1024J7804L1179J2966j8336k8695p832J5915J2696
19513e56397n421l021K1127K9693N368k2771k5157r728L324J1421J4161J424j9715
19500e55692j9235Q800K7220J2196p689l034M761j2140k8994r319K4045K1411
19488e37670r387j7149M452J1468p989j5170N151J7673K777j0293p45Q131j709
19475e50460q866J879O924r867k1900o261J4463J3182L438O115P987n888j3596
19462e62850N311K4842J3206j0460r916M292q50j5536o203J6347J1930j3585j4189
19449e57661J3562K1290n588j9557O797L1203J1332k5793k8839n56J5827N736
$$ plain form
19538 -529271 -520069 -533735 -554600 -552066 -532349 -528135 -545535 -560081 -562868 -571908 -592170 -599960 -581163
19525 -581163 -558006 -559409 -581070 -592094 -574290 -543111 -530145 -548481 -577176 -585008 -569093 -556397
19513 -556397 -561818 -564839 -543712 -514019 -508651 -531422 -556579 -566307 -562983 -551562 -537401 -535977 -555692
19500 -555692 -574927 -566127 -538907 -526711 -534400 -537434 -532673 -544813 -573807 -583126 -559081 -537670
19488 -537670 -547057 -564206 -559754 -548286 -556275 -571445 -566294 -548621 -545844 -556137 -556882 -548751 -550460
19475 -550460 -559326 -557447 -550523 -560390 -582290 -588551 -574088 -560906 -557468 -551353 -543366 -549254 -562850
19462 -562850 -557539 -532697 -519491 -529951 -539867 -535575 -536425 -551961 -558164 -541817 -529887 -543472 -557661
19449 -557661 -544099 -522809 -528397 -547954 -541157 -509954 -498622 -524415 -553254 -553810 -537983 -532247
19437e32247o250l572M289P742Q933O746m129j5991j1847P949J9848O468j9467
19424e31528l0203j6618L192R586N526O580J3732J2717J118m394L563Q793K56
19411e17680o678J044O123r230k4992j1942J5578J8358l653j2712J740Q886m728
19398e39886j1829L712J7614R937k354j752l2o040k506J5990K0335m469k4617
19385e25897r318J6523J3268r792j6731n242J831L016R016P490j3559k6136K80
19372e55251L7096L0765j0892k8313m144J6050L833j3685j0977k211j327L968
19360e35088J5663J1533q931j2740P702J3697j2046k7916j853L0693K3906m966
19348e00346j1719l3k753j4752o042J4241R386j5500j7009J0351K1004m919k6526
$$ plain form
19437 -532247 -538497 -542069 -537780 -530038 -521105 -514359 -518488 -534479 -546326 -538377 -518529 -512061 -531528
19424 -531528 -561731 -578349 -575157 -565571 -560045 -553465 -539733 -527016 -525898 -530292 -526729 -517936 -517680
19411 -517680 -524358 -523314 -517191 -526421 -551413 -563355 -547777 -529419 -533072 -545784 -544044 -535158 -539886
19398 -539886 -551715 -548003 -530389 -520452 -522806 -524558 -524590 -530630 -533136 -517146 -496811 -501280 -525897
19385 -525897 -535215 -518692 -505424 -515216 -531947 -537189 -535358 -532342 -523326 -515836 -529395 -555531 -555251
19372 -555251 -518155 -487390 -498282 -526595 -530739 -514689 -510856 -524541 -535518 -537729 -539056 -535088
19360 -535088 -519425 -507892 -516823 -529563 -521861 -508164 -520210 -548126 -549979 -519286 -495380 -500346
19348 -500346 -512065 -512098 -514851 -529603 -535645 -521404 -512018 -527518 -544527 -534176 -513172 -518091 -544617
19335e44617q440K3734K6483K828j2146p920m289j0401j1365J841J4015P882q937
19322e31332j2406M892K1318J3762j0322k2684j3766k557k283n22J1865J6788
19310e27247p58j8684p740J7704J7869q299j9919n5J8538R141p712m245P317J128
19296e22962j3332p442J4598J9383k028j9890j2159N070P060k987n377K973P486
19283e29607K202k036K411P040J914o818n440N502J0569K157q439q824l398k999
19269e35766n446r14Q071Q753P5m417R12M946K07l769K355J1065J1221O153L996
19254d92558O34j0073j7439p351Q931M513k0436l1375p656K4391K7412N309p697
19241e23395j230J055j2122j7857r9J7397P135j3768o937K4836L7739J2576j7647
$$ plain form
19335 -544617 -553057 -529323 -502840 -500012 -512158 -520078 -524367 -534768 -546133 -544292 -530277 -522395 -531332
19322 -531332 -543738 -538846 -517528 -503766 -514088 -536772 -550538 -553095 -555378 -555900 -544035 -527247
19310 -527247 -528005 -546689 -554429 -536725 -518856 -527155 -547074 -547129 -528591 -519450 -527162 -531407 -524090 -522962
19296 -522962 -536294 -543736 -529138 -509755 -511783 -531673 -543832 -538762 -531702 -534689 -540066 -537093 -529607
19283 -529607 -527405 -529441 -527030 -519990 -518076 -524894 -530334 -524832 -514263 -512106 -520545 -529369 -532767 -535766
19269 -535766 -541212 -542126 -534055 -525302 -525227 -529644 -528732 -523786 -523579 -527348 -524993 -513928 -502707 -496554 -492558
19254 -492558 -491924 -501997 -519436 -526787 -517856 -513343 -533779 -565154 -572810 -548419 -521007 -515698 -523395
19241 -523395 -524625 -523570 -535692 -553549 -553648 -536251 -529116 -542884 -549821 -524985 -487246 -474670 -492317
19228d92317j9355l765R88n265n785j561l578n076N918J6241M037j9212j9108
19215e47838P562K5136J3605l796k066Q045M848p735j2600r072n697P93J4169
19202e14646J9054K62k5464k5572J098K0249J0734p213m887J2546J5511n923k6883
19189e31134k0638O065K1330P980j6794k5223j1799O611J5428J4125P645R92J423
19176e23989J1126J7144M382j9357k8228j2399R632J8027J3502N955m15k449L171
19163e03898P979k022j9796k0036O69J3446K889o491O931K2022R819j6402k3457
19150e28347j1505m814m363O760K0505J2988p068o084J5998K2033n47k0572j7259
19137e22275p815n573L024J9121J6042r533j7048J2288L3758P712k9715k0251
$$ plain form
19228 -492317 -511672 -515437 -514449 -519714 -525499 -527060 -530638 -535714 -529796 -513555 -509518 -528730 -547838
19215 -547838 -540276 -515140 -501535 -505331 -507397 -499352 -494504 -502239 -514839 -523911 -529608 -528815 -514646
19202 -514646 -495592 -495330 -520794 -546366 -545268 -525019 -514285 -521498 -526385 -513839 -498328 -504251 -531134
19189 -531134 -551772 -545707 -524377 -516397 -533191 -558414 -570213 -563602 -548174 -534049 -526404 -525412 -523989
19176 -523989 -512863 -495719 -491337 -510694 -538922 -551321 -541689 -523662 -510160 -504205 -504620 -507069 -503898
19163 -503898 -495919 -497941 -517737 -537773 -537104 -523658 -520769 -527260 -520329 -498307 -488488 -504890 -528347
19150 -528347 -539852 -544666 -549029 -542269 -521764 -508776 -515844 -521928 -505930 -483897 -484444 -505016 -522275
19137 -522275 -530090 -535663 -532639 -513518 -497476 -507009 -524057 -511769 -478011 -470299 -500014 -520265
19125e20265K1030K8263j0200l5842j3577J9729J9346m464j5406o533L435M860
19113e09624J073o340j3617q820J1124K7761K2649K898j0164r791n931m894l112
19100e06788R46K752Q10n36P45J019k064m571j015P991J4288R222o059j8346j5049
19085e16655K42J0681O939j582j538M449K050j1988k1786j2187R841K2070J4064
19072d95400j334o795k734k440r341j1008J650J8860K2303O552j5016k3860j3422
19059e31985N121J3852P534n11K295Q154J528j1940r520J1154K2050N919j3973
19046d90322p789J3316J3228j2115k6228o008K4199K6856K00k4451k3779m802
19034e17695J0073Q205l952j0754m907N249P786L330K470Q909J4631J3038P343
$$ plain form
19125 -520265 -499235 -470972 -481172 -517014 -530591 -510862 -491516 -495980 -511386 -517919 -514484 -509624
19113 -509624 -508551 -514891 -528508 -537328 -526204 -498443 -475794 -472896 -483060 -492851 -498782 -503676 -506788
19100 -506788 -505842 -503090 -502280 -502816 -502071 -501052 -503116 -507687 -508702 -500711 -486423 -477201 -483260 -501606 -516655
19085 -516655 -516413 -505732 -498793 -500375 -501913 -497464 -495414 -507402 -529188 -541375 -531534 -509464 -495400
19072 -495400 -496734 -503529 -506263 -508703 -518044 -529052 -527402 -508542 -486239 -479687 -494703 -518563 -531985
19059 -531985 -526864 -513012 -505478 -505989 -503694 -495540 -494012 -505952 -515472 -504318 -482268 -476349 -490322
19046 -490322 -498111 -484795 -471567 -483682 -509910 -515918 -491719 -464863 -464663 -489114 -512893 -517695
19034 -517695 -507622 -499417 -503369 -514123 -519030 -513781 -505995 -502665 -500195 -491286 -476655 -463617 -456274
19021d56274K430l426j3164k2440k1925p345J3789K5576J7817m63q350K68O511
19008d66996n912k3011j9017K845J2394k114j5880o144J3540J6444M160Q56J2562
18995d76273J7292K68k1187k0532J491J8609J4350L19n678n524j1278j8750j1187
18982e18080J0531K3356J5541L486K592K910p026j3194k08J4515M345j9503k2275
18969e03010k507O602m947q566Q956J9909N297r955o62J3955M632j5609j3357
18956d99262Q315J5707l75j3115m081J2055J3235j348j4209q745J4123L0677J5572
18943d31451k1718l8590j3621K0938K4247L458o515j528n529j8556j2921J5262
18931d86524L2526J7903p827j7043j0898m847k597l03J152R61K377M840M452L242
$$ plain form
19021 -456274 -453844 -457270 -470434 -492874 -514799 -522144 -508355 -482779 -464962 -465425 -473775 -473507 -466996
19008 -466996 -472908 -495919 -514936 -512091 -499697 -501811 -517691 -523835 -510295 -493851 -489691 -488835 -476273
18995 -476273 -458981 -458713 -479900 -500432 -498941 -480332 -465982 -465663 -471341 -476865 -488143 -506893 -518080
18982 -518080 -507549 -484193 -468652 -465166 -462574 -459664 -466690 -479884 -480092 -465577 -461232 -480735 -503010
18969 -503010 -505517 -498915 -503862 -512428 -503472 -483563 -478266 -488221 -488883 -474928 -470296 -485905 -499262
18956 -499262 -490947 -475240 -475615 -488730 -492811 -480756 -467521 -468869 -483078 -491823 -477700 -447023 -431451
18943 -431451 -453169 -491759 -505380 -484442 -460195 -456737 -463252 -464780 -470309 -488865 -501786 -486524
18931 -486524 -453998 -436095 -443922 -460965 -471863 -476710 -479307 -479610 -478458 -477497 -475120 -470280 -465828 -462586
18917d62586L690j215j3193j3277J0697L0989J2742k5111k8941O064K5040J298
18905d53803k1318l609K4300J6645j2549j8885j325O697j404n127l324j0230j5597
18892d99529P06K1470J2027j5491j3651J9697L1135j721l0863j4573J7236J5006
18880d58551j2581k0713k539R178K296j272P952J0578k365j0376L24J1174K727
18867d64168j1207o307J0420J0797p857j6723j492J4081O368r861o120J1897J2608
18854d57564r063k1027l791J8992J6812l728j3091j840J2564J3543J493j2097
18842d58797j3348K915K0350J3786j2710k1601M115K7480J0353k2722j8796J7945
18830d51030K9835k093k7279p481K3058J5046j8792k9458q982O175j467q946K529
$$ plain form
18917 -462586 -458896 -460111 -473304 -486581 -475884 -444895 -432153 -457264 -486205 -480141 -455101 -453803
18905 -453803 -475121 -478730 -454430 -437785 -450334 -469219 -470544 -463847 -465251 -470378 -473702 -483932 -499529
18892 -499529 -498823 -477353 -465326 -480817 -494468 -474771 -443636 -445357 -476220 -490793 -473557 -458551
18880 -458551 -471132 -491845 -494384 -485206 -482910 -484182 -476230 -465652 -468017 -478393 -478069 -466895 -464168
18867 -464168 -475375 -481682 -471262 -460465 -468322 -485045 -486537 -472456 -466088 -475949 -482069 -470172 -457564
18854 -457564 -466627 -487654 -491445 -472453 -455641 -459369 -472460 -474300 -461736 -448193 -446700 -458797
18842 -458797 -472145 -469230 -448880 -435094 -447804 -469405 -465290 -437810 -427457 -450179 -468975 -451030
18830 -451030 -421195 -423288 -450567 -458048 -434990 -419944 -438736 -468194 -477176 -471001 -472468 -481414 -478885
18817d78885J8598J8376M172p463p473J876J2108J1636m203k1698j9773J782J7104
18804d53843N818j9302k7077n995K2940L1981J6562m765j4266j0624k240M719
18792d56092P156L163k681J92J2097J4895m918k9793k7705L263K7681J8529p561
18779d41774j4756M108K0775R991j8478l1120j0544K1721K9189O265j4323p347
18767d46293J0731J1771N59r30J641j2496k8957j1071L1511M2206M637k5110o092
18754d27893K0981K768l6442l4924O215L0294J7716M480J0268J1970k239r718
18742d06524Q5N373m352q905J088N988j764j022J3814J5373o226j8819k486J4079
18728c94298M905o891N874K1249P221j7916j6599J715J240j1653j340K4768K0854
$$ plain form
18817 -478885 -460287 -441911 -437739 -445202 -452675 -450799 -438691 -427055 -431258 -452956 -472729 -470947 -453843
18804 -453843 -448025 -467327 -494404 -500399 -477459 -445478 -428916 -433681 -447947 -458571 -460811 -456092
18792 -456092 -448936 -445773 -448454 -448262 -436165 -421270 -426188 -455981 -483686 -480423 -452742 -434213 -441774
18779 -441774 -456530 -452422 -431647 -421656 -440134 -471254 -481798 -460077 -430888 -424623 -438946 -446293
18767 -446293 -435562 -423791 -423232 -424162 -422521 -435017 -463974 -475045 -443534 -401328 -396691 -421801 -427893
18754 -427893 -406912 -404144 -440586 -475510 -469295 -439001 -421285 -416805 -406537 -394567 -396806 -406524
18742 -406524 -406439 -401066 -405418 -414323 -413235 -407247 -409011 -410033 -396219 -380846 -387072 -405891 -408377 -394298
18728 -394298 -389393 -396284 -390410 -369161 -361940 -379856 -396455 -394740 -393500 -405153 -406493 -381725 -360871
18715c60871j6673l5237q506K3047J8338o162j4933r022p678o873N536J6574P930
18702c94530p421m654Q989O230j1428j4758K798J2520k710k0946j6333L522J4557
18689d24164J1916P571N242k91n772k727L766m07j3170j4342M525K4601K3976
18676c79276N049j2838j7557r466P226K3666K4709N229j6203j7600m812k593j4649
18663d09115j6758K796K0281J0620j3648j9331Q36K0308J6177l310j2973j855
18651d05972J5615J7225r9j4807q279P353M879j5235k1505J71K0768J0861j3088
18638d02113j3680J0622K6383J7175K068L9N079M180l004j0583j4562r844L875
18625c84365J2099J070j6841j6687l0P368n30j683J0189J0773q457j6688N840
$$ plain form
18715 -360871 -377544 -412781 -421287 -398240 -379902 -386064 -400997 -410019 -417697 -424570 -419034 -402460 -394530
18702 -394530 -401951 -406605 -397616 -391386 -402814 -417572 -414774 -402254 -404964 -425910 -442243 -438721 -424164
18689 -424164 -412248 -404677 -399435 -399726 -405498 -408225 -404459 -404866 -418036 -432378 -427853 -403252 -379276
18676 -379276 -374227 -387065 -404622 -414088 -406862 -383196 -358487 -353258 -369461 -387061 -391873 -394466 -409115
18663 -409115 -425873 -423077 -402796 -392176 -405824 -425155 -424319 -404011 -387834 -391144 -404117 -405972
18651 -405972 -390357 -373132 -373231 -388038 -396317 -388964 -384085 -399320 -420825 -420654 -399886 -389025 -402113
18638 -402113 -415793 -405171 -378788 -361613 -359545 -359506 -354427 -350247 -353251 -363834 -378396 -388240 -384365
18625 -384365 -372266 -371196 -388037 -404724 -404754 -397386 -397916 -399599 -389410 -378637 -387094 -403782 -397942
18612c97942K7532J2232j9930k2042N374J6996m278k3343j0735J5128K1339P277
18600c72392l414M3O394K768q784j3694r58K0247K5448N505j6441j4512K399N662
18586c61729p100j0776K605J1749O398N183J7128J8874m842k6623j4701J4628
18574c49206J9098o177k3920j0746J5077K6061J8092L849m868k238O691M931j4125
18561c17481k6525o054K8641K9818q607l4571j2148K4239K2312j0520k4438m798
18549c40132J4682J2519O229R739P112j1527k3298r113R981M668j2958p086K2553
18536c16631L5734J0103k6859l6836j8007L239J0514P559N98p806r886J905J7024
18523c29349J2996j1446k6241r174J7646J4487j7421l3731j1269J6329R271j7541
$$ plain form
18612 -397942 -370410 -358178 -378108 -400150 -394776 -377780 -382058 -405401 -416136 -401008 -379669 -372392
18600 -372392 -375806 -375763 -369369 -366601 -375385 -389079 -390037 -369790 -344342 -338837 -355278 -369790 -367391 -361729
18586 -361729 -368829 -379605 -377000 -365251 -358853 -353670 -336542 -317668 -322510 -349133 -363834 -349206
18574 -349206 -330108 -336285 -360205 -370951 -355874 -329813 -311721 -307872 -312740 -314978 -308287 -303356 -317481
18561 -317481 -344006 -350060 -321419 -291601 -300208 -334779 -346927 -322688 -300376 -310896 -335334 -340132
18549 -340132 -325450 -312931 -306702 -296963 -289851 -301378 -324676 -333789 -323808 -319140 -332098 -339184 -316631
18536 -316631 -280897 -270794 -297653 -334489 -352496 -349257 -338743 -331184 -330586 -338392 -348278 -346373 -329349
18523 -329349 -316353 -327799 -354040 -363214 -345568 -331081 -348502 -382233 -393502 -377173 -367902 -385443
18511c85443j9291P048J8988j403j7923R43L0716K8643k268k1912j2717L359M307
18498c66953m830q148q74R885J3466M589o979l609J2244J2742j3408l2404r812
18485c94091L0820L4717l471l1645j9205K921j44j2884l347K0817K6587P595j1065
18472c52395j1347p01L395q019k5621k4161R242M4781L5767j4270m5281k1739
18460d10349J8081K4378P892N737J0519q122l3774k1475K0841L5347N401j9056
18448c64580m172J7945Q930j6378k4015j4284n375M227K0790K8117J0844j3503
18436c51454j7669n108J559j455j026L825K404m649o281p42L498J567n838j5306
18422c96675j5972K320K5402K1683j1121l1979j3105J5822J2221j3781j8931K967
$$ plain form
18511 -385443 -404734 -397686 -378698 -380101 -398024 -397081 -366365 -337722 -339990 -361902 -374619 -371260 -366953
18498 -366953 -371783 -379931 -380805 -370920 -357454 -352865 -359844 -363453 -351209 -338467 -351875 -384279 -394091
18485 -394091 -363271 -328554 -332025 -363670 -382875 -379954 -380098 -392982 -396329 -375512 -348925 -341330 -352395
18472 -352395 -363742 -364443 -361048 -369067 -394688 -418849 -409607 -364826 -329059 -343329 -388610 -410349
18460 -410349 -392268 -367890 -359998 -354261 -343742 -351864 -385638 -407113 -386272 -350925 -345524 -364580
18448 -364580 -368752 -350807 -341877 -358255 -382270 -396554 -401929 -397702 -376912 -348795 -337951 -351454
18436 -351454 -369123 -374231 -372672 -374127 -375153 -371328 -368924 -373573 -379854 -380596 -377098 -375531 -381369 -396675
18422 -396675 -412647 -410327 -384925 -363242 -374363 -406342 -419447 -403625 -391404 -405185 -424116 -421149
18410d21149J5935K882j2407r602P97N146Q676J6176J7464O412o238j0587j0269
18397c96764r392m496L840Q721J0662J5183J4833k889k5733k2890Q528L1100J8015
18384c51282q625j2592L860R691m216j3419L90K1424K1150l809k6035j9555Q393
18371c74625K5369J4383n474q209K850O787K183M706J1397J323k1705k2397J2181
18358c51231M3041K9983j1137l2327j9173p7K681k172j314J208p95L24J1599K1047
18344c08343R961j8358l5311j9357J3828K5282N52k8935k5086O170K4543J2345
18332c42709m876j247J2720J2440k618j3840j2881o236K75M115R67p467q965J535
18318c68787R764L464n427P22J4166J2144o739j9545j2153M968J5838J5988P651
$$ plain form
18410 -421149 -405214 -402332 -414739 -424341 -423544 -418398 -409722 -393546 -376082 -369670 -375908 -386495 -396764
18397 -396764 -406156 -410652 -406812 -398091 -387429 -372246 -357413 -360302 -386035 -408925 -400397 -369297 -351282
18384 -351282 -359907 -372499 -368639 -358948 -363164 -376583 -376193 -354769 -333619 -337428 -363463 -383018 -374625
18371 -374625 -349256 -334873 -340347 -348556 -345706 -338919 -336736 -332030 -320633 -319310 -341015 -363412 -351231
18358 -351231 -308190 -278207 -289344 -321671 -340844 -340921 -338240 -340412 -341726 -340518 -341313 -340989 -329390 -308343
18344 -308343 -298382 -316740 -352051 -371408 -357580 -332298 -331746 -360681 -385767 -379597 -355054 -342709
18332 -342709 -347585 -348832 -336112 -323672 -326290 -340130 -353011 -359247 -358972 -354857 -353890 -361357 -370322 -368787
18318 -368787 -359023 -355559 -360986 -360264 -346098 -333954 -340693 -360238 -372391 -367423 -351585 -335597 -327946
18305c27946o029j7305j6479k895J3599K2455J8496L140j2928j5035j809J0005
18293c32731P293k490o375n186m369K58J0264J2556Q0r930k233P025l506j8670
18279c48014p646K1367K8053K285k0594j4202O060J6104J5122J0251k70j2561
18267c04045j2139J506R274L769J190J0263J6384J0136M045O026L702q860j6438
18254b75187j0576l706l23J2789K9934J9285k1698m3611j2869L3975M3992K2556
18242b05439Q641O094o494j9965p575J8111J8781l978j1448M710J2087j598j0555
18229a98628k445K698l455k944O183J238j6656j4947J1127K2388K513j0425R547
18216a93806K8219R987j9125j4782J3535K3520P999o377r334j0019n097J2206
$$ plain form
18305 -327946 -333975 -351280 -367759 -370654 -357055 -334600 -316104 -312964 -325892 -340927 -342736 -332731
18293 -332731 -325438 -327928 -334303 -339489 -343858 -343600 -333336 -320780 -320700 -330630 -332863 -325838 -329344 -348014
18279 -348014 -355660 -334293 -306240 -303955 -324549 -338751 -332691 -316587 -301465 -291214 -291484 -304045
18267 -304045 -316184 -314678 -305404 -301635 -300445 -290182 -273798 -263662 -259617 -253591 -249889 -258749 -275187
18254 -275187 -285763 -289469 -289792 -277003 -247069 -227784 -249482 -293093 -305962 -271987 -227995 -205439
18242 -205439 -196798 -190704 -197198 -217163 -224738 -206627 -187846 -191824 -203272 -198562 -186475 -188073 -198628
18229 -198628 -201073 -198375 -201830 -204774 -198591 -197353 -214009 -228956 -217829 -195441 -192928 -203353 -193806
18216 -193806 -165587 -155600 -174725 -189507 -175972 -152452 -144453 -150830 -160164 -170183 -175280 -163074
18204a63074K3798R843j1078o778J4340J7447N01o663L047P659K792O050J2942
18191h9174j113k7475k5149J0796L2956J4954q653l827R256Q67j2276j220J7690
18178h2368R894j4504j6118P376K0025Q765j603K172K335q879r341J2966L2400
18165c6880K1553p371k0059n167J7273K4129J1486n684p547J0773K9789K6588
18153E8883O999J90J6232L0251K0779K040j415O746P690N458J9448M2933M4239
18140B60473J7228j510J5942M5434M4521J3929n094R192L2170L3845K0599J7824
18128E04553K7870L0189J8390J1538K1938L3089K4867O285K984J8546L0223K4001
18116G54473J2447J0612J3889J2188R136J0640Q203o024j8042r801P621N791j5814
$$ plain form
18204 -163074 -139276 -129433 -140511 -147289 -132949 -115502 -115001 -121664 -118617 -110958 -108166 -102116 -89174
18191 -89174 -90287 -117762 -142911 -132115 -99159 -84205 -92858 -96685 -87429 -86562 -98838 -100058 -82368
18178 -82368 -72474 -86978 -103096 -95720 -75695 -66930 -68533 -66361 -64026 -72905 -82246 -69280 -36880
18165 -36880 -15327 -22698 -42757 -47924 -30651 -6522 4964 -720 -8267 2506 32295 58883
18153 58883 65882 66072 82304 112555 133334 135374 133959 140705 148395 153853 173301 216234 260473
18140 260473 277701 276191 292133 337567 382088 396017 390923 400115 432285 466130 486729 504553
18128 504553 532423 562612 581002 592540 614478 647567 672434 678719 681703 700249 730472 754473
18116 754473 766920 777532 791421 803609 812745 823385 831588 825564 807522 797721 805342 811133 795319
18103G95319k5087n656J7461J5595l524j3225o916L212J2795K5389L3136K2344
18091H70843k180j8160j2236R262L2799M5438L6079R172o913J1460M7104N9402
18079A082070L9397K0071K5892M1986M6883M6992N6754O6972N9256L8290K5064
18068A549627K6093L0077K8457K1128Q759l693m124R021J6364L865j2314j0639
18056A662621j781j1043l1064k9354m522M737k0191m5409l5605q431p087l6593
18044A436278o0007n1722k5340p176n745j3937k3605k8241k2123o834N764M250
18032A201562r048j9071j3189N712K2532K6246K0488J6714K0855L0048L7525L5537
18020A375911K0066R01r96K0579M1181L4025R312J710J9194L2786K4030J1523
$$ plain form
18103 795319 770232 764576 782037 797632 794108 780883 773967 777179 789974 815363 848499 870843
18091 870843 868663 850503 838267 847529 880328 925766 961845 971017 964104 975564 1022668 1082070
18079 1082070 1121467 1141538 1167430 1209416 1256299 1303291 1360045 1427017 1486273 1524563 1549627
18068 1549627 1575720 1605797 1634254 1655382 1664141 1660448 1656324 1665345 1681709 1685574 1673260 1662621
18056 1662621 1660840 1649797 1618733 1589379 1584857 1589594 1569403 1523994 1488389 1479958 1472871 1436278
18044 1436278 1376271 1324549 1299209 1292033 1286288 1272351 1248746 1220505 1198382 1191548 1197312 1201562
18032 1201562 1192514 1173443 1160254 1165966 1188498 1214744 1235232 1251946 1272801 1302849 1340374 1375911
18020 1375911 1395977 1396878 1395882 1416461 1457642 1491667 1500979 1502689 1521883 1554669 1578699 1590222
18008A590222J3856J6309J015j4236j985K5152K9215O035r068J270J1035k978
17996A665842k2087j6501O946J5569j140k0520k2623j4737j3292j7458j3984k088
17984A543927J570j2423k7665k1140K869J5454L974q876l7J7554J5705l512j1163
17971A516237K504J5501J3241J1413K5767M2947M1200K4047J2809J5587K2616
17960A743869K6531L0452L8186M8626N7950N9907N0195L7599M0277O0588P5927
17949B270107O8852N3466N2527O0355N4522L7616L5782N3287O1198M3822K7075
17938B818609L8858O3445O3581L5965J4327J8684L0232K4951Q701K597Q575J0073
17926C138598J944j226Q598J5185l23k8807m0643k4140j561M91j4404j9892m108
$$ plain form
18008 1590222 1604078 1620387 1621402 1607166 1605181 1630333 1659548 1665583 1656515 1657785 1668820 1665842
17996 1665842 1643755 1627254 1634200 1649769 1648629 1628109 1605486 1590749 1577457 1559999 1546015 1543927
17984 1543927 1545497 1533074 1505409 1484269 1487138 1502592 1506566 1497690 1497653 1515207 1530912 1527400 1516237
17971 1516237 1518741 1534242 1547483 1558896 1584663 1627610 1668810 1692857 1705666 1721253 1743869
17960 1743869 1770400 1800852 1839038 1887664 1945614 2005521 2055716 2093315 2133592 2194180 2270107
17949 2270107 2338959 2392425 2444952 2505307 2559829 2597445 2633227 2686514 2747712 2791534 2818609
17938 2818609 2857467 2920912 2984493 3020458 3034785 3053469 3083701 3108652 3117353 3119950 3128525 3138598
17926 3138598 3140542 3139316 3147914 3163099 3162776 3133969 3093326 3069186 3067625 3068116 3053712 3033820 3029712
17913C029712J4548J2093j0764l0568k9347j3219j033M57L036J6776L1086K6979
17901C049756O961k025J7015M6257N5526M1135K5973K5249L1035L2266L1087L2167
17889C392402L1713K7608K7862L7045M4693M0565L3080L6540M4581L5057M402
17878C755548j9653j0743J9688L2540Q279k7523l4271o565J9227J1780j6620l1243
17866C700444k3232j5013k0592k6747k1535j6799k5952l8441l6721k4789j8613
17855C432010j9650k0390k5786m2472n4008l7823n789M846j3637k6528j0843R697
17843C189627M322j7251k4168j2845n970j2202j5391m119J0227J0230n249j9704
17831C097507j5747M797J7597L199k1991k1476R178L2094K2628N278R913K2418
$$ plain form
17913 3029712 3044260 3056353 3045589 3015021 2985674 2972455 2971422 2971879 2974915 2991691 3022777 3049756
17901 3049756 3056717 3054692 3071707 3117964 3173490 3214625 3240598 3265847 3296882 3329148 3360235 3392402
17889 3392402 3424115 3451723 3479585 3516630 3561323 3601888 3634968 3671508 3716089 3751146 3755548
17878 3755548 3735895 3725152 3744840 3777380 3785659 3758136 3723865 3717300 3736527 3748307 3731687 3700444
17866 3700444 3677212 3662199 3641607 3614860 3593325 3576526 3550574 3512133 3475412 3450623 3432010
17855 3432010 3412360 3391970 3366184 3323712 3269704 3231881 3226092 3230938 3217301 3190773 3179930 3189627
17843 3189627 3193949 3176698 3152530 3139685 3133715 3121513 3106122 3102003 3112230 3122460 3117211 3097507
17831 3097507 3081760 3086557 3104154 3107353 3085362 3063886 3073064 3105158 3127786 3133064 3142977 3165395
17819C165395J5252J823J3572L8876L8113J3827R201L2446M1507J9040L734K0739
17807C413525L7632K7009K0035M7930P5003N1093m61j3755J8369M1113K9684J7396
17795C764573K6015L2681K3779K3127M0056M1508R524j8055l908K7731L0019O478
17783D003528j520J6326K9653K1510R693J0484J5987J5911J4501J6650J8699K0715
17771D192137K8779L8328L4493J7543R819K5081M5909M6681K9063J7971K6073
17760D511877L9063M0028L5121M3188O4322P3563N3345K2373J7184M5694P5042
17749E020800P2588M5682K8212L6320N3593N8426N0067M1927M0414M0730L9724
17738E528483M2213N0977N7638N1788L7473L0755L8302M8570M9705M5259M3335
$$ plain form
17819 3165395 3180647 3182470 3196042 3234918 3273031 3286858 3296059 3328505 3370012 3389052 3392786 3413525
17807 3413525 3451157 3478166 3498201 3546131 3621134 3672227 3671766 3658011 3676380 3717493 3747177 3764573
17795 3764573 3790588 3823269 3847048 3870175 3910231 3951739 3961263 3943208 3939300 3967031 3997050 4003528
17783 4003528 4002008 4018334 4047987 4069497 4079190 4089674 4105661 4121572 4136073 4152723 4171422 4192137
17771 4192137 4220916 4259244 4293737 4311280 4321099 4346180 4392089 4438770 4467833 4485804 4511877
17760 4511877 4550940 4590968 4626089 4669277 4733599 4807162 4860507 4882880 4900064 4945758 5020800
17749 5020800 5093388 5139070 5167282 5203602 5257195 5315621 5365688 5407615 5448029 5488759 5528483
17738 5528483 5570696 5621673 5679311 5731099 5768572 5799327 5837629 5886199 5935904 5981163 6024498
17727F024498M2024L8203L8616M5843M6403L3980K9900N1394P3088N9216K5995
17716F509160K3575N5710P3420N9389N5311P9092Q2471L7721L201L5597Q8034
17705G102681P8312K4333J7688P5513J16353R2998N6302N8752P7384P3920O1594
17694G835830O3826O4353M8768M6112P7977J09606J03617Q2919Q6601J00068Q7859
17683H707536O4410O8236Q8741Q5149O3860O9606J04608J22608J07527R5994J10174
17672I688449J24800J17937J04481J00024R6046R0186R9363J22942J32428J18210
17662A0794866J08245J19243J28477J18431J10056J21555J30931J15369R6624
17653A1843797J07372J36583J49349J42745J40780J46829J42987J30744J32208
$$ plain form
17727 6024498 6066522 6104725 6143341 6189184 6235587 6269567 6299467 6350861 6423949 6483165 6509160
17716 6509160 6532735 6588445 6661865 6721254 6776565 6855657 6938128 6975849 6979050 7014647 7102681
17705 7102681 7180993 7205326 7223014 7298527 7414880 7507878 7564180 7622932 7700316 7774236 7835830
17694 7835830 7899656 7964009 8012777 8058889 8136866 8246472 8350089 8433008 8519609 8619677 8707536
17683 8707536 8771946 8840182 8928923 9014072 9077932 9147538 9252146 9374754 9482281 9578275 9688449
17672 9688449 9813249 9931186 10035667 10135691 10231737 10321923 10421286 10544228 10676656 10794866
17662 10794866 10903111 11022354 11150831 11269262 11379318 11500873 11631804 11747173 11843797
17653 11843797 11951169 12087752 12237101 12379846 12520626 12667455 12810442 12941186 13073394
17644A3073394J50303J63193J61830J60846J66701J66357J57701J62303J91984
17635A4554612K25048K34483K24190K18374K25483K32969K34278K40614K59429
17626A6649480K76356K73038K57661K60563K94574L34628L48334L34859L17343
17617A9346836L07623L02063L06197L32517L69087L81482L59818L38006L49397
17608B2393026L85505M15690M25816M19613M05161M00004M24304M66157M83118
17599B6218394M66297M67350N20702N77496N78430N61059O11123P18855P84529
17590C1504235P84830Q22554R49376J039671R49238P41317O23683O68238P22001
17581C8805143O35578M69329L93634M58987N66990O38688P04763Q13520R39172
$$ plain form
17644 13073394 13223697 13386890 13548720 13709566 13876267 14042624 14200325 14362628 14554612
17635 14554612 14779660 15014143 15238333 15456707 15682190 15915159 16149437 16390051 16649480
17626 16649480 16925836 17198874 17456535 17717098 18011672 18346300 18694634 19029493 19346836
17617 19346836 19654459 19956522 20262719 20595236 20964323 21345805 21705623 22043629 22393026
17608 22393026 22778531 23194221 23620037 24039650 24444811 24844815 25269119 25735276 26218394
17599 26218394 26684691 27152041 27672743 28250239 28828669 29389728 30000851 30719706 31504235
17590 31504235 32289065 33111619 34060995 35100666 36049904 36791221 37414904 38083142 38805143
17581 38805143 39440721 39910050 40303684 40762671 41329661 41968349 42673112 43486632 44425804
17572D4425804J032071J104258J202641J322506J409451J446784J488064J586201
17564E5017780J730592J879832K024008K174656K305829K350796K275441K133000
17556G1891934K021129J982998J965977J893616J779962J752904J940735K337337
17548H7566592K796620L147138L274979L110778K631221J940738J293452R29110
17540A06690628Q78559R95160J165094J389396J644556J787956J691856J400255
17532A17643460J056120P19114L61793K4666j46635n1304K58970O50505J014068
17523A21530757J271403J358250J273706J117672J029562J098951J342306J715695
17515A31738302K121055K455225K702180K940326L222104L497073L699791L849626
$$ plain form
17572 44425804 45457875 46562133 47764774 49087280 50496731 51943515 53431579 55017780
17564 55017780 56748372 58628204 60652212 62826868 65132697 67483493 69758934 71891934
17556 71891934 73913063 75896061 77862038 79755654 81535616 83288520 85229255 87566592
17548 87566592 90363212 93510350 96785329 99896107 102527328 104468066 105761518 106690628
17540 106690628 107569187 108564347 109729441 111118837 112763393 114551349 116243205 117643460
17532 117643460 118699580 119418694 119780487 119805153 119658518 119607214 119866184 120516689 121530757
17523 121530757 122802160 124160410 125434116 126551788 127581350 128680301 130022607 131738302
17515 131738302 133859357 136314582 139016762 141957088 145179192 148676265 152376056 156225682
17507A56225682L989129M080770M067499M004634M016190M119138M198926M180287
17499A88882255M126393M140251M259056M481358M804002N167939N426045N414547
17491B26701846N026210M237493L183867K223641J757024J873871K290289K710848
17483B50005089L082116L342643L140498K140000N79973p98922j476430j571828
17475B58443139j469282j305825j023745p07550n67268o35678p21350o90424o39846
17466B50682171p59899j127743j640188k054451k108228j718101j083350n15164
17458B39675047j59033M9640K04305L47049N80246J094887J972811L014390L858028
17449B50637370M300467M505721M893377N751122O886259P717319P825974P392804
$$ plain form
17507 156225682 160214811 164295581 168363080 172367714 176383904 180503042 184701968 188882255
17499 188882255 193008648 197148899 201407955 205889313 210693315 215861254 221287299 226701846
17491 226701846 231728056 235965549 239149416 241373057 243130081 245003952 247294241 250005089
17483 250005089 253087205 256429848 259570346 261710346 262290319 261491397 260014967 258443139
17475 258443139 256973857 255668032 254644287 253936737 253369469 252733791 252012441 251322017 250682171
17466 250682171 249922272 248794529 247154341 245099890 242991662 241273561 240190211 239675047
17458 239675047 239516014 239565654 239769959 240117008 240697254 241792141 243764952 246779342 250637370
17449 250637370 254937837 259443558 264336935 270088057 276974316 284691635 292517609 299910413
17441B99910413O956533O751577O446628N584268M131833K525335J300546P59758
17433C34366891Q41536J143469J137879N40568m86129j516848k188671k326149
17425C31512546j934228j286176r62326j541259l116643n166935o910116p725943
17417C02868920p336534n884458m023236k757630k847531m184824n804980o622038
17409B63407689o215745m961022l505220k229527j191009l87946J24811L79599
17401B45421630N70713Q73478J261723J587578J779422J878439J946521K049084
17393B57368588K286111K710040L206764L556277L625067L434283L069043K627787
17385B81883960K242960K004460J814273J432100P46559m7223n73746n31786J62900
$$ plain form
17441 299910413 306866946 313618523 320065151 325649419 329781252 332306587 333607133 334366891
17433 334366891 335208427 336351896 337489775 338030343 337544214 336027366 333838695 331512546
17425 331512546 329578318 328292142 327329816 325788557 322671914 317504979 310594863 302868920
17417 302868920 295532386 289647928 285624692 282867062 280019531 275834707 270029727 263407689
17409 263407689 257191944 252230922 248725702 246496175 245305166 244917220 245042031 245421630
17401 245421630 245992343 246865821 248127544 249715122 251494544 253372983 255319504 257368588
17393 257368588 259654699 262364739 265571503 269127780 272752847 276187130 279256173 281883960
17385 281883960 284126920 286131380 287945653 289377753 290124312 290077089 289503343 288971557 289134457
17376B89134457J353129K670282L660902M003362L665141K911037K220051K125640
17368C11744001K938819M510395O319840P859821Q911616R487875R678876R643218
17360C71094461R617124R775283J0088203J0365831J0393750J0008673R166743
17353D40510068Q030850O897612N946959N154090M515175M185592M221531M331586
17345D83793463M135197L595824K932392K140833R38071p33203k455371l779006
17337D90568200m682983n376905n867365o060669o211366o876199q292988j0045623
17329D37154102j1487250j2304342j2509636j2106460j1100307r812032q829087
17322C59004988q471477q480611q383377q006880p462732o797348n962465n094667
$$ plain form
17376 289134457 290487586 293157868 296818770 300822132 304487273 307398310 309618361 311744001
17368 311744001 314682820 319193215 325513055 333372876 342284492 351772367 361451243 371094461
17360 371094461 380711585 390486868 400575071 410940902 421334652 431343325 440510068
17353 440510068 448540918 455438530 461385489 466539579 471054754 475240346 479461877 483793463
17345 483793463 487928660 491524484 494456876 496597709 497535780 496802577 494347206 490568200
17337 490568200 485885217 480508312 474640947 468580278 462368912 455492713 447199725 437154102
17329 437154102 425666852 413362510 400852874 388746414 377646107 367834075 359004988
17322 359004988 350533511 342052900 333669523 325662643 318199911 311402563 305440098 300345431
17314C00345431m504661m290299m186003l903975l429987k879552k284969j687208
17306B73178777j233167r68684o96659k65870J45764K83885K17058J95991K24767
17297B71081862J07341j36750k67410k42423k83411m77399o71300q42271j196519
17288B67071720j766538k285948k642992l077126l696333m198069m383511m557573
17280B40463630n001962n401619n322037m998687n042325n493386n818722n837059
17272A97547833n966472o399571o682394o431720n940195n669784n571069n359448
17264A49527180n133236n197053n454336n482485n157273m766652m505138m255913
17256A09575094l933020l677572l586805l528049l364925l155184k993002k836132
$$ plain form
17314 300345431 295840770 291550471 287364468 283460493 280030506 277150954 274865985 273178777
17306 273178777 271945610 270976926 270280267 270014397 270160161 270444046 270661104 270857095 271081862
17297 271081862 271189203 271052453 270785043 270542620 270259209 269781810 269110510 268268239 267071720
17288 267071720 265305182 263019234 260376242 257299116 253602783 249404714 245021203 240463630
17280 240463630 235461668 230060049 224738012 219739325 214697000 209203614 203384892 197547833
17272 197547833 191581361 185181790 178499396 172067676 166127481 160457697 154886628 149527180
17264 149527180 144393944 139196891 133742555 128260070 123102797 118336145 113831007 109575094
17256 109575094 105642074 101964502 98377697 94849648 91484723 88329539 85336537 82500405
17248H2500405k623756k420655k311488k257677k172977k056549j954336j861946
17240F4841021j753861j649430j575478j514121j445689j389671j352405j293462
17232E2866904j196797j116202j093712j088072j043436r78569r44149r33150
17224D4472817r00156q41719p95549p76158p63464p44775p25723p07781o87562
17215C7529930o69065o52325o25626n90429n72340n83143n94803n78073n45277
17206C2118849n26849n25217n20852n07635m93881m80689m64306m50071m43837
17197B7705512m39516m30782m22842m19674m14602m04545l96081l88730l74492
17188B4014248l61515l68734l86830l80917l48777l35140l61807l86507l68759
$$ plain form
17248 82500405 79876649 77455994 75144506 72886829 70713852 68657303 66702967 64841021
17240 64841021 63087160 61437730 59862252 58348131 56902442 55512771 54160366 52866904
17232 52866904 51670107 50553905 49460193 48372121 47328685 46350116 45405967 44472817
17224 44472817 43572661 42730942 41935393 41159235 40395771 39650996 38925273 38217492 37529930
17215 37529930 36860865 36208540 35582914 34992485 34420145 33837002 33242199 32664126 32118849
17206 32118849 31592000 31066783 30545931 30038296 29544415 29063726 28599420 28149349 27705512
17197 27705512 27265996 26835214 26412372 25992698 25578096 25173551 24777470 24388740 24014248
17188 24014248 23652733 23283999 22897169 22516252 22167475 21832335 21470528 21084021 20715262
17179B0715262l36501l38090l60383l53307l16472k98645l15961l30554l16883
17170A7748466k95713k88708k86652k80455k81180k88280k76642k40438k15210
17161A5295188k27150k50045k45773k22707k15560k24462k17388j88041j68262
17152A3335800j75861j87488j78639j59650j51309j50085j43165j38751j51082
17143A1899770j66877j59323j32090j16949j24961j32297j23198j14551j21983
17134A0707541j31590j27538j21570j28665j36058j26400j12435j15809j27562
17125I579914j25360j15968j21202j32591j24355j05248j08488j29795j28387
17116H488520r8794q6769j13804j38637j23859r3457q7086r8083r9208r5235j03252
$$ plain form
17179 20715262 20378761 20040671 19680288 19326981 19010509 18711864 18395903 18065349 17748466
17170 17748466 17452753 17164045 16877393 16596938 16315758 16027478 15750836 15510398 15295188
17161 15295188 15068038 14817993 14572220 14349513 14133953 13909491 13692103 13504062 13335800
17152 13335800 13159939 12972451 12793812 12634162 12482853 12332768 12189603 12050852 11899770
17143 11899770 11732893 11573570 11441480 11324531 11199570 11067273 10944075 10829524 10707541
17134 10707541 10575951 10448413 10326843 10198178 10062120 9935720 9823285 9707476 9579914
17125 9579914 9454554 9338586 9217384 9084793 8960438 8855190 8746702 8616907 8488520
17116 8488520 8389726 8302957 8189153 8050516 7926657 7833200 7746114 7648031 7548823 7453588 7350336
17105G350336j08187q7474o0090o1342q2737q6762p1929p0834q6072q2844n3812
17094F498253l9080o1767q8199p9695m9430l6850n0272o6138o9051o3152n3293
17083E841326m1354l6545m6319n8971n5707l9117k9480l2444l3159k7150l1131
17072E409949n0028n9406m3759k8779m1755n8879l8821j19n179n7862q3654m2822
17060D898886K701j3016n5840n6695l0809m1228p5400o2579n420J3606l1379p0721
17048D472106o0762m3357n0418m9442k7641l0974o8064p4809l1135q071l6398
17037C991035m6318j2199j9616q8604q9917J8230M5611j22940k40115k0554L45952
17026C760565L77637L810l02848k07796M2337O7276q1789j08275J2015N5489k6777
$$ plain form
17105 7350336 7242149 7154675 7094585 7033243 6950506 6863744 6791815 6720981 6634909 6552065 6498253
17094 6498253 6459173 6397406 6309207 6229512 6180082 6143232 6092960 6026822 5957771 5894619 5841326
17083 5841326 5799972 5763427 5717108 5658137 5602430 5563313 5533833 5501389 5468230 5441080 5409949
17072 5409949 5359921 5300515 5256756 5227977 5186222 5127343 5088522 5088403 5083224 5025362 4941708 4898886
17060 4898886 4901587 4888571 4832731 4776036 4745227 4703999 4628599 4566020 4560600 4574206 4542827 4472106
17048 4472106 4411344 4367987 4317569 4268127 4240486 4209512 4141448 4066639 4035504 4027433 3991035
17037 3991035 3944717 3932518 3912902 3824298 3734381 3752611 3798222 3675282 3435167 3414613 3760565
17026 3760565 4138202 4142012 3839164 3631368 3673705 3740981 3659192 3550917 3562932 3618421 3591644
17015C591644o0809O915L1652l8918p1448n612L4273k7001p9044k9797L2332K073
17003C386260o3356n8489q078p48l1602l6480j9025k7231n0096m2746j8860k3371
16991C006178m3113l2793m302n331k9709l1285j1733j3690l5717l4023p396k463
16979B754623k7189l3767m090J7116l2k1655j2242O900J754j2916j630K8637L8528
16966B734037J7487m475m003Q825J5314J4417J4834J8161K0862K2651K3648K0922
16954B902680J6179J8742L0042L3254J4893q389p015J6306K5888P450o698J2325
16942C055657M2438M4027J9211O05l603j1465k3034j8851q58Q510Q974K0054L4706
16929C176371K4668k145m284K0374K3132j2107l4729j0370K1200J6076K6J6907
$$ plain form
17015 3591644 3530835 3537750 3569402 3530484 3459036 3453424 3487697 3460696 3381652 3351855 3384187 3386260
17003 3386260 3322904 3264415 3256337 3255589 3223987 3187507 3168482 3141251 3091155 3048409 3029549 3006178
16991 3006178 2963065 2930272 2925970 2920639 2890930 2859645 2847912 2834222 2798505 2764482 2757086 2754623
16979 2754623 2727434 2693667 2689577 2706693 2706661 2685006 2672764 2679664 2681418 2668502 2666872 2695509 2734037
16966 2734037 2751524 2747049 2743046 2751871 2767185 2781602 2796436 2814597 2835459 2858110 2881758 2902680
16954 2902680 2918859 2937601 2967643 3000897 3015790 3007401 3000386 3016692 3042580 3050030 3043332 3055657
16942 3055657 3098095 3142122 3161333 3161938 3158335 3146870 3123836 3104985 3104127 3112637 3121611 3141665 3176371
16929 3176371 3201039 3198894 3194610 3214984 3238116 3226009 3191280 3180910 3202110 3218186 3218212 3235119
16917C235119M8615M9337K5933J9681L2476L4620K7436L5054M7916L7483J7296
16906C610966K5826N4855O0437M2953M6505P2080O3898K594n4268n4776j9841
16895C851229L963Q379N795p488l2085m5482l6865l1328m7438o1560m7672k3628
16883C535820k1831l7960m4898l8954l8036m7559n7587o2485o0261m6338k7758
16872C052153k5407m2733n4669m8319m6809o5975p7820n3344j5614p957k8879
16861B584627m2777m0549m3176n3939n3846m1860l5917l4552k0401k306q846l5499
16849B170959m4367k5705j3324k4727l2752j7632j702m380m969J4969K9825J1672
16837B057867j7093j7960Q20L819p216j487J8038J6886l956j289L4665N2810J8544
$$ plain form
16917 3235119 3283734 3333071 3359004 3378685 3411161 3445781 3473217 3508271 3556187 3593670 3610966
16906 3610966 3636792 3691647 3752084 3795037 3841542 3913622 3977520 3980114 3925846 3871070 3851229
16895 3851229 3855192 3863571 3869366 3861878 3829793 3784311 3747446 3716118 3668680 3607120 3559448 3535820
16883 3535820 3513989 3476029 3431131 3392177 3354141 3306582 3248995 3186510 3126249 3079911 3052153
16872 3052153 3026746 2984013 2929344 2881025 2834216 2768241 2690421 2637077 2621463 2613506 2584627
16861 2584627 2541850 2501301 2458125 2404186 2350340 2308480 2272563 2238011 2217610 2215304 2206458 2170959
16849 2170959 2126592 2100887 2087563 2062836 2030084 2012452 2010750 2006370 2001401 2016370 2046195 2057867
16837 2057867 2040774 2022814 2023634 2027453 2020237 2018750 2036788 2053674 2049718 2048429 2083094 2135904 2154448
16824B154448k7533k8054P914K5408O238j6174j6356o683m456o178m254j601k17
16811B082502L382O242K886J701J2825K0820J503l1507l5699n107J5928L256q896
16798B069836Q743K4925K254l1021k2714J4872K4250j129r211J9613M2115K8985
16786B171518R165J1754J9589J2735Q405K1081K7680J2315M471K8429N2896M1429
16774B421467J9498L3013O4966N9146J6028k542K9775O3969N1847J2035p349M458
16762B766311K0920K2696J5769J4568K2540K6376Q118k9646n7495n2674k9614
16751B727869j7267j7711j4600j1416k4965m5151m1919j6361n268k5144m8957
16740B459110n1351m1096l3225k4125j3050j4921l0562l5559k0766j1780k3649
$$ plain form
16824 2154448 2126915 2098861 2106775 2132183 2138421 2122247 2105891 2099208 2094752 2088574 2084320 2082719 2082502
16811 2082502 2085884 2092126 2095012 2096713 2109538 2130358 2131861 2100354 2064655 2059548 2075476 2078732 2069836
16798 2069836 2078579 2103504 2105758 2074737 2052023 2066895 2091145 2090016 2080805 2100418 2142533 2171518
16786 2171518 2180683 2192437 2212026 2224761 2233166 2254247 2281927 2294242 2298713 2327142 2380038 2421467
16774 2421467 2440965 2473978 2538944 2598090 2614118 2611576 2641351 2705320 2757167 2769202 2761853 2766311
16762 2766311 2787231 2809927 2825696 2840264 2862804 2889180 2897298 2867652 2810157 2757483 2727869
16751 2727869 2710602 2692891 2678291 2666875 2641910 2596759 2554840 2538479 2533211 2508067 2459110
16740 2459110 2407759 2366663 2333438 2309313 2296263 2281342 2250780 2215221 2194455 2182675 2159026
16729B159026l0127r347J2616L192j8603j1474J8873K8907P972q956j044J1483
16717B162518J0228P712J6460K2319J0112q727j5531j2410j0583p075N032J4923
16705B194978O337j3882k1757j0311K290J225q183j8485l3896n2233n2461k4150
16693A969472L018r895n2397p0589m1109n778j2629n1262p4935o4588l8860j7484
16681A532964r082k2087n1462o5373m3181j5888k5705n6511n7737l0984k7552
16670A127402n4089n4853j1729J3814j8400n4358l3392J0590Q095l0526l9729
16659H62825j0415O599m827j0389k599j3306l9129l1943J4051L7551M959l3633
16647G79744k4259R860J6199j420j170J9813K4086O55j6897m195J9672K4191Q773
$$ plain form
16729 2159026 2128899 2119552 2132168 2135360 2116757 2105283 2124156 2153063 2161035 2152079 2151035 2162518
16717 2162518 2172746 2180458 2196918 2219237 2229349 2220622 2205091 2192681 2182098 2175023 2180055 2194978
16705 2194978 2201315 2187433 2165676 2155365 2157655 2158880 2150697 2132212 2098316 2046083 1993622 1969472
16693 1969472 1972490 1962595 1910198 1839609 1798500 1792722 1780093 1728831 1653896 1589308 1550448 1532964
16681 1532964 1523882 1501795 1450333 1384960 1341779 1325891 1300186 1243675 1185938 1154954 1127402
16670 1127402 1073313 1018460 1006731 1020545 1002145 947787 914395 924985 933080 902554 862825
16659 862825 852410 859009 854182 843793 841194 827888 788759 756816 770867 808418 813377 779744
16647 779744 755485 765345 781544 780124 778954 798767 822853 823508 806611 802416 822088 846279 855052
16634H55052l347O74J1045J5495J8602L1890N0805N7389M8023M0104M3633M6595
16622A215960L9861L2550K7688J2608n349Q101N1993O4554J1023m4875k6546L2821
16610A420389L9606j0075l1403L59J3886k3718m8693k1589o09l1060n7489k4275
16598A225329K0078Q258k8174k3808j849k6129p6445q1673m6594l6165n3357m2769
16586H36702o789p652n0170o9137m6002l5144n5070n5645k1622q579l7719n0966
16574C92207j7705M967k5255n7934l9150l037k945j7558k510J9980L790l1554
16562B23296l3523p068K534q155p796L98j3118l8958l7425o327J7495J8820J3811
16549A23984O558j2348k9165j8661R910K1749P816j0339j8148j5419j256J3964
$$ plain form
16634 855052 851705 852379 863424 878919 897521 929411 980216 1037605 1085628 1125732 1169365 1215960
16622 1215960 1255821 1288371 1316059 1328667 1323318 1331419 1383412 1447966 1458989 1414114 1387568 1420389
16610 1420389 1459995 1449920 1418517 1418876 1432762 1409044 1360351 1338762 1338153 1307093 1249604 1225329
16598 1225329 1245407 1253665 1225491 1201683 1199834 1173705 1097260 1015587 968993 932828 879471 836702
16586 836702 829913 822261 772091 702954 656952 621808 566738 511093 489471 480892 443173 392207
16574 392207 374502 379469 354214 296280 257130 254093 251148 233590 231080 251060 254850 223296
16562 223296 189773 182705 185239 177084 169288 169686 156568 117610 80185 73858 91353 110173 123984
16549 123984 130542 118194 89029 70368 80278 102027 109843 99504 81356 65937 64681 78645
16537G8645M348k7275l3697L769K8842l836m2655j8009L4278K7507k6457l6473
16525a1013R137K6651r500k4334J4241L4369n019l6059p138K2701l467l3550p463
16512c0444K5829M77l6577r569L7833J2853n4327n3332J5101L9396j0424l8689
16500a01873J912L3702J126l3437r909K3214M669k8558j5650J5645M911k8284
16488a32532k2681J2894J8679r821k2215n937L006m203M95J5827Q551j6883j6587
16475a71407J2455J9242j3430l4197p663K5729J6377j6057k0411L443J2192q127
16463a81854k5500j5604O023J1743k814j8511j5579N404K0777R112j7410k3694
16451b47907k330J0250j1900l7706k0412K8766M9882J7648k5512l2523j0666N476
$$ plain form
16537 78645 82993 55718 22021 25790 54632 50796 8141 -9868 24410 51917 25460 -11013
16525 -11013 -1876 24775 15275 -9059 5182 39551 34532 -1527 -8665 14036 10569 -22981 -30444
16512 -30444 -4615 -4138 -40715 -50284 -12451 402 -53925 -107257 -92156 -52760 -63184 -101873
16500 -101873 -99961 -66259 -65133 -98570 -108479 -85265 -80596 -109154 -124804 -109159 -104248 -132532
16488 -132532 -155213 -142319 -123640 -133461 -155676 -161613 -158607 -162810 -162315 -146488 -137937 -154820 -171407
16475 -171407 -158952 -139710 -153140 -187337 -195000 -169271 -152894 -168951 -189362 -185919 -173727 -181854
16463 -181854 -207354 -222958 -216935 -205192 -208006 -226517 -242096 -236692 -215915 -206803 -224213 -247907
16451 -247907 -250237 -239987 -251887 -289593 -310005 -281239 -231357 -213709 -239221 -271744 -282410 -276934
16439b76934Q542J2275J2266o123k8776k4227L206J3890k324o607K0292L6456
16427b38064O744k8796j3650K6822K0544k8794m1314M668L0396j1236n0435j4954
16415c38069M5593M0166j3614k4988J5431K9576o163k6127R16J9641o132l1319
16403b95089j8128j07n797O31M1848O4260K1399m0420m7418J989N8246Q2933M5187
16390i0466n7697j21562l237K30271K66261n8069m38651m31399n0656K38383J54031
16379c62791o6990q5426O1726J10522N496p5084l8793K1466K7685J4102J2164
16368c75923K02j2950J1477M5176K0037m1575m9205j598J2150k0263j2186M8710
16356c75948N8964j4759n9638o124M8509Q998n3275l0311L3822K8371k7459k6372
$$ plain form
16439 -276934 -268392 -256117 -243851 -249974 -278750 -302977 -299771 -285881 -288205 -294812 -274520 -238064
16427 -238064 -231320 -260116 -273766 -246944 -226400 -255194 -296508 -291840 -261444 -272680 -323115 -338069
16415 -338069 -292476 -252310 -265924 -290912 -275481 -245905 -252068 -278195 -277279 -257638 -263770 -295089
16403 -295089 -313217 -313324 -319121 -318490 -276642 -212382 -190983 -231403 -278821 -276832 -218586 -135653 -90466
16390 -90466 -148163 -269725 -272962 -42691 223570 165501 -273150 -704549 -755205 -516822 -362791
16379 -362791 -429781 -515207 -453481 -342959 -337463 -412547 -451340 -429874 -402189 -388087 -375923
16368 -375923 -375721 -388671 -377194 -332018 -311981 -353556 -402761 -404359 -392209 -412472 -424658 -375948
16356 -375948 -316984 -331743 -391381 -397505 -348996 -339998 -393273 -423584 -389762 -361391 -388850 -415222
16344d15222L4847N6479J0061l0086k8460k9116m2247j6827M3937N6834o275n9430
16332d25505l3285K2622K9190m853k1260r309K545Q366J6097J1296j4689k9697
16320d48482n752K7668K5430k828j4385l687J082m635j6J5198K0861J5254R956
16307c64336l364l3834n0922j9169L2004L5959q724l0256M332L7823J7489k3160
16295d06158k7530o703m040j0623R949L7705J9126l2092m1060P615L6752k190
16283d19249m9625l2674K1902L8240J1403j379J3762J2465j8932l6406j4954J3225
16271d62222J8509J3467R610p517l1160k0538K6251M4418k394n2865l5883J8905
16259d81419L2398J584j1481M966J970k6806k6880J3253L0998k363k6362N371
$$ plain form
16344 -415222 -380375 -323896 -313835 -343921 -372381 -401497 -443744 -460571 -416634 -359800 -366075 -425505
16332 -425505 -458790 -436168 -406978 -411831 -433091 -442400 -439855 -431489 -415392 -404096 -418785 -448482
16320 -448482 -454234 -426566 -401136 -403964 -418349 -422036 -420954 -425589 -425605 -410407 -389546 -374292 -364336
16307 -364336 -367700 -401534 -452456 -471625 -439621 -403662 -412386 -442642 -438310 -400487 -382998 -406158
16295 -406158 -433688 -440391 -444431 -455054 -445105 -407400 -388274 -420366 -461426 -453811 -417059 -419249
16283 -419249 -468874 -501548 -479646 -441406 -430003 -431382 -417620 -405155 -424087 -460493 -475447 -462222
16271 -462222 -443713 -430246 -420636 -428153 -459313 -479851 -453600 -409182 -411576 -464441 -500324 -481419
16259 -481419 -449021 -447437 -458918 -453952 -451982 -478788 -505668 -492415 -461417 -463780 -490142 -484771
16247d84771M0926J5369l8871m4225j211K1842K101j4349n42J2772L55j6047j2358
16234e19009j868m649j2412q933P75M379M834Q862R391j300j2957r648O351J7370
16220e18814J3575K682k722l83J439k363m088N624J8154J3187q881j9037k2K2523
16206d79126J4193j4802k2547Q92J8132K395k1837j7264R942K0454k20k1566j1241
16193e22595K0380L3435J0448k1644k8249j2067k679p663k943K0356L1469O399
16181d75353k6512k2541J2009K7977N398k2671k4393r514j013Q45N030N203p295
16168e32830k1582k0069m059R725J1075L183m832l972P100J5098N258j3679j4856
16155e64440P809K5434J3059j4379k3387p209R709O851r144j5857j122K1341K2410
$$ plain form
16247 -484771 -443845 -428476 -467347 -511572 -512783 -490941 -488840 -503189 -503731 -490959 -490604 -506651 -519009
16234 -519009 -520877 -525526 -537938 -546871 -546096 -541717 -536883 -528021 -518630 -519930 -532887 -542535 -536184 -518814
16220 -518814 -505239 -502557 -505279 -505662 -504223 -506586 -510674 -505050 -486896 -473709 -482590 -501627 -501649 -479126
16206 -479126 -464933 -479735 -502282 -501390 -483258 -480863 -502700 -519964 -510022 -489568 -489788 -511354 -522595
16193 -522595 -502215 -468780 -458332 -479976 -508225 -520292 -522971 -530634 -533577 -513221 -481752 -475353
16181 -475353 -501865 -524406 -512397 -484420 -479022 -501693 -526086 -535600 -536613 -535768 -530738 -525535 -532830
16168 -532830 -554412 -574481 -578540 -568815 -557740 -554557 -559389 -563361 -556261 -541163 -535905 -549584 -564440
16155 -564440 -556631 -531197 -518138 -532517 -555904 -563113 -553404 -546553 -555697 -571554 -572676 -551335 -528925
16142e28925p406l6637k6031J5905L7881J5799j3443q863J3820J1268j8015l3132
16130e77779j3158J6966K6231J3622k971j1227r544l530k578q823j0608P05J3346
16117e69348J1664L204O694J7309J1315j2816k6582j3596O431R688K046K866J1538
16104e39587J0921m199k0080k2900j2127L385J3361J1735J797n106j204Q304J1315
16091e44385L237p567q983R11J0204O190p890j5259p472M093M639m392j0767q993
16077e86434j956P660J5522J2425l182j5853j1705l8R56o027k960J1547J9161
16064e60884J1383l77o633r399p227N296J8739J5431J112J181J5710J1763k1046
16051e24951m1989j6582K5793L1011j421k3062j2116K267l332j0326K157J7545
$$ plain form
16142 -528925 -536331 -572968 -598999 -583094 -545213 -529414 -542857 -551720 -537900 -526632 -544647 -577779
16130 -577779 -590937 -573971 -547740 -534118 -537089 -548316 -557860 -561390 -563968 -572791 -583399 -582694 -569348
16117 -569348 -557684 -554480 -547786 -530477 -519162 -531978 -558560 -572156 -565725 -556037 -553991 -551125 -539587
16104 -539587 -528666 -532865 -552945 -575845 -587972 -584587 -571226 -559491 -557694 -562800 -564004 -555700 -544385
16091 -544385 -541148 -548715 -557698 -556787 -546583 -540393 -548283 -563542 -571014 -566921 -562282 -566674 -577441 -586434
16077 -586434 -588390 -580730 -565208 -552783 -555965 -571818 -583523 -583561 -582605 -588632 -591592 -580045 -560884
16064 -560884 -549501 -549878 -556511 -565910 -573137 -567841 -549102 -533671 -532559 -531378 -515668 -503905 -524951
16051 -524951 -566940 -583522 -557729 -526718 -528139 -551201 -563317 -561050 -564382 -574708 -572551 -555006
16039e55006J0959o190m758J1476R704j7108l3614j3706J8807K4372M656m748
16027e55156Q237J6250J263j3376q18K3125K1080j0293l5800l0371o007J1767
16015e70099J1838j254j4035r614J4303L2479J8918j3547k6517j0536M685R87
16003e62392k789Q818J7601O094q447m480M844l348j7773j1036J1562J8702K618
15990e40026j2898j2661o341k467M640J6210K0922J1992m513j9989k7098j7766
15978e89995M440J6922N177j0658l501J4052N564k7661m0607j0646K7242L0814
15966e78857O384j0181o442L05j444j733J0174K5681K4497J98k5692k3907L688
15953e77329K0033K355k1297j1873J8349K2753m619j8842Q17J5770n159k8727
$$ plain form
16039 -555006 -544047 -550237 -554995 -543519 -533815 -550923 -584537 -598243 -579436 -555064 -550408 -555156
16027 -555156 -546919 -530669 -529406 -542782 -543600 -520475 -499395 -509688 -545488 -575859 -581866 -570099
16015 -570099 -558261 -559515 -573550 -583164 -568861 -536382 -517464 -531011 -557528 -568064 -563379 -562392
16003 -562392 -565181 -556363 -538762 -532668 -541115 -545595 -540751 -544099 -561872 -572908 -561346 -542644 -540026
15990 -540026 -552924 -565585 -571926 -574393 -569753 -553543 -532621 -520629 -525142 -545131 -572229 -589995
15978 -589995 -585555 -568633 -563456 -574114 -577615 -563563 -557999 -585660 -626267 -636913 -609671 -578857
15966 -578857 -572473 -582654 -589096 -588791 -590235 -591968 -581794 -556113 -531616 -531418 -557110 -581017 -577329
15953 -577329 -557296 -554941 -576238 -588111 -569762 -547009 -551628 -570470 -569653 -553883 -559042 -587769
15941e87769r595L1665L4999p036l6051j3044K7176K7811j2496m2602k8668O088
15929f09522J7817p4j4227k563J6077J5725M906Q187J9737J1018j7100k9084j0854
15916e89957O884n43j3146m310J3574J4142L581N401J4987P752j5013k4820j0063
15903e91531R453J4890R431L138j420m072m563p094j3428j4004j224J3261J2316
15890e74847O3m753P16N01j1804k1304j3045Q594K5630K3651M407j3203j1470
15877e86864J784J075j6795k1874L509L1412K6004m105k1223j2189M253J2223
15865e82790J0198j636j5459j0214J6514K8395K80l1702j9025J7249J4679k7943
15853f01454m6057j4138J7254J0391l525Q784K3093R642q839j319J3124L090j5282
$$ plain form
15941 -587769 -597364 -565699 -530700 -537736 -573787 -586831 -559655 -531844 -544340 -586942 -615610 -609522
15929 -609522 -591705 -591779 -606006 -608569 -592492 -576767 -571861 -563674 -543937 -532919 -550019 -579103 -589957
15916 -589957 -583073 -583616 -596762 -601072 -587498 -573356 -569775 -564374 -549387 -541635 -556648 -581468 -591531
15903 -591531 -582078 -567188 -557757 -554619 -556039 -560111 -564674 -571768 -585196 -599200 -600424 -587163 -574847
15890 -574847 -574784 -579537 -578821 -578320 -590124 -611428 -624473 -615879 -590249 -566598 -562191 -575394 -586864
15877 -586864 -585080 -584005 -600800 -622674 -619165 -587753 -561749 -565854 -587077 -599266 -595013 -582790
15865 -582790 -572592 -574228 -589687 -599901 -583387 -554992 -554712 -586414 -605439 -588190 -573511 -601454
15853 -601454 -647511 -661649 -644395 -634004 -637529 -628745 -605652 -596010 -604849 -606168 -593044 -589954 -605236
15840f05236r254R436P760q075p625O906R635J658L176Q164l306j8082o585K0176
15826e91252K2514q42j0446N003J0545j1527k9737j7043M851L186j3278j0233
15814f38259J8179L7887J8277k5397m2299o313M1101L5051k1472n1789j3923L3910
15802f15047K2478k0138j9667J7995K0900j9307l0503J2725M2067J2198k4320
15791f00619j1783J7232J1013p735N320K3334m813n1066m3406J2953L9833J0070
15779e99667j8693o676J2278M499n439R708K3692L970k6512k4701K430J1671o996
15766f20436k0053p132J1162J0586q49m32J2612J7006K351j4452j2929J557O856
15753f14153j836p117j344Q16q396j5257j4665j9760j4114N8865J99136K79232
$$ plain form
15840 -605236 -614490 -605054 -597294 -605369 -612994 -606088 -596453 -594795 -591619 -583455 -586761 -604843 -611428 -591252
15826 -591252 -568738 -569580 -580026 -575023 -564478 -576005 -605742 -622785 -617934 -614748 -628026 -638259
15814 -638259 -620080 -582193 -563916 -589313 -631612 -637925 -596824 -561773 -583245 -635034 -648957 -615047
15802 -615047 -592569 -612707 -632374 -614379 -593479 -612786 -643289 -630564 -588497 -576299 -600619
15791 -600619 -612402 -595170 -584157 -591892 -586572 -563238 -568051 -619117 -662523 -649570 -609737 -599667
15779 -599667 -618360 -625036 -612758 -608259 -613698 -603990 -580298 -576328 -602840 -627541 -625111 -613440 -620436
15766 -620436 -640489 -647621 -636459 -625873 -626722 -627154 -614542 -597536 -595185 -609637 -622566 -621009 -614153
15753 -614153 -615989 -623106 -624450 -623634 -632030 -647287 -661952 -681712 -695826 -636961 -437825 -158593
15741a58593J65128q6927k52079j96788l4180M1762R39l7272j1208J4187j2717
15730e67748l9775r073M0202L5638j4177m0475k1012K037Q50m109N023J2029L567
15717e97023l701M476J1791K81j6535j5294j79P689O033R043J5362P103j6570
15704e87524l0191j6258R660K0601J2296J932O17J898k905j0113r936j888L326
15691f08485j717j0143r981j800K317p44J865J6680K6183R959k1565l4265j3987
15678f45683J4702K1292O112p039m323O297J2100J0554N499j740j1319j8392j4541
15665f26481J041J5454J4495J300o424p58O278L355l093l783l965r044p380R608
15651f09397K2837J0106j3809j5552L423J0581j061m327P546O493j4189j9874
$$ plain form
15741 -158593 6535 -80392 -332471 -529259 -563439 -521677 -520738 -558010 -569218 -555031 -567748
15730 -567748 -607523 -616596 -576394 -540756 -554933 -595408 -616420 -614383 -613533 -617642 -612619 -600590 -597023
15717 -597023 -600724 -596248 -584457 -584176 -600711 -616005 -616184 -608495 -602462 -593419 -578057 -570954 -587524
15704 -587524 -617715 -633973 -624313 -603712 -591416 -589484 -588867 -586969 -589874 -599987 -609923 -611811 -608485
15691 -608485 -610202 -620345 -630326 -632126 -629809 -630553 -628688 -612008 -585825 -575866 -597431 -631696 -645683
15678 -645683 -630981 -609689 -603577 -610616 -614939 -608642 -596542 -585988 -580489 -582229 -593548 -611940 -626481
15665 -626481 -625440 -609986 -595491 -594191 -600615 -601373 -595095 -591740 -594833 -598616 -602581 -611625 -619005 -609397
15651 -609397 -586560 -576454 -590263 -605815 -602392 -591811 -592872 -597199 -589653 -583160 -597349 -617223
15639f17223L197J6128o106k5203l816K5545J4732j4044o312K5858K1739k0303
15627e85808l4246N189M1563K7619q824k1484j2371o346m987j714m761j2681k602
15614f21453K7078L9335J5093j0970o476N049j1250l7824l4270m681J4488J4987
15602f10894J6018J7288K726j6864j3104R957J9229O282m031o05l91r418r155
15589e92962O734J6617O402p580o243M239O161m369j6326j7012k796J3882J2643
15576e80610p608k0239o906J3019J3492M709J0785K0373M365k4892k3857R092
15564e88277K3938k672k9539j6269J6630K4726L572j7349k0347r537O178J5488
15552e93458P178j0034r766J2070K3619M471j9372j4906P006J1969m187j5042
$$ plain form
15639 -617223 -614026 -597898 -604004 -629207 -633023 -607478 -592746 -606790 -613102 -587244 -565505 -585808
15627 -585808 -620054 -614865 -573302 -545683 -554507 -575991 -588362 -594708 -599695 -601409 -606170 -618851 -621453
15614 -621453 -594375 -555040 -539947 -550917 -557393 -552344 -563594 -601418 -635688 -640369 -625881 -610894
15602 -610894 -594876 -577588 -574862 -591726 -604830 -594873 -575644 -569362 -573393 -573998 -574389 -583807 -592962
15589 -592962 -586228 -569611 -563209 -570789 -577032 -572793 -566632 -571001 -587327 -604339 -607135 -593253 -580610
15576 -580610 -588218 -608457 -615363 -602344 -588852 -584143 -573358 -552985 -548620 -573512 -597369 -588277
15564 -588277 -564339 -567011 -596550 -612819 -596189 -571463 -567891 -585240 -605587 -615124 -608946 -593458
15552 -593458 -586280 -596314 -606080 -594010 -570391 -565920 -585292 -600198 -593192 -581223 -585410 -600452
15540f00452o702Q507J5656J0862k757j3814o723J5518K5578P237j8751k4360
15528e90201j2312j803M170R822M908j4884k3646K00K8996J9015j8997k9756M304
15515f20184L8034L2227M019j0951j0120j1504j5836r768O086J4962N825j3602
15503e90812k2535n419K6337L6263M684l6368l6525M688L4593J9706j2241j8968
15491e96597j345J0429N115l644n992m110N37O716O179m793j3233o449N850N370
15477e95967m669m739P756J3112J679r290k059J3572J4047l659j7647j1386N425
15464e93825J2523N316m954j0656j3064j0063M063K2070K4123M369j7489k2066
15452e99653j2970j941J0148K0831J5140q768k2676p110J1509K35k1018q389K6974
$$ plain form
15540 -600452 -607154 -598647 -582991 -572129 -574886 -588700 -595423 -579905 -554327 -547090 -565841 -590201
15528 -590201 -602513 -604316 -600146 -590324 -585416 -600300 -623946 -623746 -594750 -575735 -594732 -624488 -620184
15515 -620184 -582150 -549923 -545904 -556855 -566975 -578479 -594315 -604083 -597997 -583035 -577210 -590812
15503 -590812 -613347 -618766 -592429 -556166 -551482 -587850 -624375 -619687 -585094 -565388 -577629 -596597
15491 -596597 -597942 -587513 -582398 -586042 -592034 -596144 -595607 -588891 -582712 -587505 -600738 -607187 -601337 -595967
15477 -595967 -600636 -605375 -597619 -584507 -582828 -592118 -594177 -580605 -566558 -570217 -587864 -599250 -593825
15464 -593825 -581302 -575986 -580940 -591596 -604660 -614723 -610660 -588590 -564467 -560098 -577587 -599653
15452 -599653 -612623 -614564 -604416 -583585 -568445 -577213 -599889 -606999 -595490 -595255 -616273 -624662 -597688
15439e97688K8596j1679l3941o041K3605P353k2906j1687K7076L5496N695j5580
15427e71701p127K238p175j5842p228L501P10n590k581L256L210K923O853N795
15413e88758n037j1793j592J4939J5550m201k4051k1605K002K1169J4460p453
15401e96370j4458L15J0319j679j4887n780J0796O739j0448j1449L000N581n376
15388f23697j303K2833L2861Q676k2868k7515p166J4122K2334J5006n426k3603
15376e95746j9115L106J3532K181n539O625J6209J437j7946j0948J3800K1239
15364e71165K584j6361j4736J167J3726J2871O17j0403p456M991Q766l29n457
15351e81185J099L282p872j3254K062J8168R467j3524k0928q424L649N559M940
$$ plain form
15439 -597688 -569092 -580771 -614712 -620753 -597148 -589795 -612701 -624388 -597312 -561816 -556121 -571701
15427 -571701 -578828 -576590 -583765 -599607 -606835 -603334 -602624 -608214 -610795 -607539 -604329 -601406 -594553 -588758
15413 -588758 -593795 -605588 -607180 -592241 -576691 -580892 -604943 -626548 -624546 -603377 -588917 -596370
15401 -596370 -610828 -610513 -600194 -601873 -616760 -622540 -611744 -605005 -615453 -626902 -623902 -618321 -623697
15388 -623697 -625000 -602167 -569306 -560630 -583498 -611013 -618179 -604057 -581723 -566717 -572143 -595746
15376 -595746 -614861 -611755 -598223 -596042 -601581 -594956 -578747 -577310 -595256 -606204 -592404 -571165
15364 -571165 -568581 -584942 -599678 -598511 -584785 -571914 -571297 -581700 -589156 -584165 -575399 -575728 -581185
15351 -581185 -580086 -576804 -584676 -597930 -595868 -577700 -568233 -581757 -602685 -611109 -607460 -601901 -596961
15338e96961N991N747L726k293j6381k5740p055K8250L0538j3384m2432p676M2022
15325e95648K8974k7380l8393J0175L7526M444k5398N80L5072J5920k8551l1433
15313f14112L088J7727J128n369J1320J6379p274k9211k1235K883J3025K376j0717
15300f19992o954J2307K3246P792j5062r522J9470K5311o844l0213j0899J5000
15288e96360M661j6650n143J6635J32l2541j9720K5699K8586j8729l8127J779
15276f49778L3643J0748j6948k238J3605j1355k6239K4461Q1790N1006l8371o7356
15264e97032r862L5626Q684k9713j3911K2857J9994q565j1914P839J0543p437
15252e72891j5030n763j748p393n374N279P328J00K69P666M178j0237j2794L271
$$ plain form
15338 -596961 -590970 -585223 -581497 -583790 -600171 -625911 -632966 -604716 -574178 -587562 -629994 -637670 -595648
15325 -595648 -566674 -594054 -632447 -622272 -584746 -580302 -605700 -605120 -570048 -554128 -582679 -614112
15313 -614112 -611024 -593297 -592169 -597538 -586218 -569839 -577113 -606324 -627559 -624676 -611651 -609275 -619992
15300 -619992 -626946 -614639 -591393 -583601 -598663 -608185 -588715 -563404 -570248 -600461 -611360 -596360
15288 -596360 -591699 -608349 -613492 -596857 -596725 -629266 -648986 -623287 -594701 -613430 -651557 -649778
15276 -649778 -616135 -605387 -622335 -624573 -610968 -622323 -648562 -624101 -542311 -491305 -529676 -597032
15264 -597032 -606894 -571268 -562584 -592297 -606208 -583351 -563357 -571922 -583836 -575997 -565454 -572891
15252 -572891 -587921 -593684 -595432 -602825 -608199 -602920 -595592 -595492 -595223 -587557 -583379 -593616 -606410 -603139
15238f03139J4136J929j7518j8429J61J8312K2476J5026L321p801j3901j0700
15226e96127Q86J2462J4091M164p656j0335l638L647N798L358l553j3663j6947
15213f07513m212J3208J2426n710j2488M716J8585L508k0877j7827R520K3771
15201e82893R596r683j1827p45J1015J6147O176j9728l6789j7543K2246L5609
15189e78419J0730j2732p083N663J509l295Q656J4160r312l2214j4586K2526K3876
15176e70521j2487l2580j1689J4989J7382J1760J6189J3648j0179l1086k2612
15165f17186P27R549N342P049J1724L863r422p674N535P246n775j3210o872r32
15151f10036k438J69J0196J0597o374j8794m795K0880K3546k138k2913j2898J1056
$$ plain form
15238 -603139 -589003 -587074 -604592 -623021 -622860 -604548 -582072 -567046 -563725 -571526 -585427 -596127
15226 -596127 -595241 -582779 -568688 -564524 -572180 -582515 -586153 -582506 -576708 -573350 -576903 -590566 -607513
15213 -607513 -611725 -598517 -586091 -591801 -604289 -599573 -580988 -577480 -598357 -616184 -606664 -582893
15201 -582893 -573297 -582980 -594807 -595552 -584537 -568390 -562214 -581942 -618731 -636274 -614028 -578419
15189 -578419 -567689 -580421 -587504 -581841 -580332 -583627 -574971 -560811 -570123 -602337 -616923 -594397 -570521
15176 -570521 -583008 -615588 -627277 -612288 -594906 -583146 -566957 -553309 -563488 -594574 -617186
15165 -617186 -616459 -606910 -601568 -594519 -582795 -578932 -588354 -596028 -590493 -583247 -589022 -602232 -609104 -610036
15151 -610036 -612474 -612305 -602109 -591512 -597886 -616680 -621475 -600595 -577049 -579187 -602100 -614998 -603942
15138f03942J5839Q64m501R135J4141o846k5460r486K0293J7332j4736k3787O446
15125f04708K7915P928j5869j663K1250K069l7998l2778J9144M5780J2283k9007
15113e85654k4727M363J2740M260Q155J7278M363k0673k2175R93J4008L420p333
15100e90982l775q50p054n334J2495K3063O166j9870k2428r56J4512N609j3676
15087f03080j9266n814J1064J4698N455j744J963P138K117n240J394J5975J3734
15074e61606p611j6744L568K2909O659k5827k6525N140J8926m872k0649P691M0898
15061e58043K1035l3176m7144j593L7648J7502k7861l4032J225K6237J4469r363
15049e93096j5778m688R498J7205J3238m18r272l518K298j0059k6845j7570J4311
$$ plain form
15138 -603942 -588103 -587239 -591740 -582605 -568464 -575310 -600770 -610256 -589963 -572631 -587367 -611154 -604708
15125 -604708 -576793 -568865 -584734 -586397 -565147 -563078 -601076 -633854 -614710 -568930 -556647 -585654
15113 -585654 -610381 -606018 -593278 -589018 -580863 -563585 -559222 -579895 -602070 -601077 -587069 -583649 -590982
15100 -590982 -594757 -595607 -602661 -607995 -595500 -572437 -566271 -586141 -608569 -609525 -595013 -589404 -603080
15087 -603080 -622346 -628160 -617096 -602398 -596943 -598687 -596724 -589586 -587469 -592709 -591315 -575340 -561606
15074 -561606 -569217 -585961 -582393 -559484 -552825 -578652 -605177 -600037 -581111 -585983 -606632 -598941 -558043
15061 -558043 -537008 -570184 -617328 -618921 -581273 -563771 -591632 -625664 -624439 -598202 -583733 -593096
15049 -593096 -608874 -613562 -604064 -586859 -573621 -574039 -583311 -586829 -584531 -594590 -621435 -639005 -624694
15036f24694L0561J4912m540k878O430L596k462K835R172L293j860Q169J5963
15023e41503p38k4521k0391O819J8197J653j3785r105j155n887j1723p188m480
15010f13807j3871j9146k871K1540K7201J1913k827l613L288P972P855L918j425
14997e73873l696k147k801p999r057N48J1034Q942R0L120J8113J9770o698l6609
14983e81263l2868J571K2783O425j5513k482K9078K7099j3273l6353j0624K1824
14971e83596J4423q928K22K6268J4466k9221l9087J447K8038Q31k9394q280K9232
14958e83579J8576k3971k7468J5632L6948L273l1864j4428K8704L5271p66k8141
14946e71813j4600J5605K3262M450j4001j3964l406L245M848M766l335k2152l1830
$$ plain form
15036 -624694 -594133 -579221 -583761 -586639 -580209 -576613 -579075 -576240 -567068 -563775 -565635 -557466 -541503
15023 -541503 -542241 -566762 -587153 -580334 -562137 -560484 -574269 -583374 -584529 -590416 -602139 -609327 -613807
15010 -613807 -627678 -646824 -649695 -628155 -600954 -589041 -591868 -595481 -592193 -584221 -576366 -572448 -573873
14997 -573873 -577569 -579716 -582517 -590516 -599573 -599025 -587991 -579049 -578959 -575839 -557726 -537956 -544654 -581263
14983 -581263 -614131 -612560 -589777 -583352 -598865 -601347 -572269 -545170 -558443 -594796 -605420 -583596
14971 -583596 -569173 -578101 -577879 -551611 -537145 -566366 -605453 -604006 -575968 -575137 -604531 -612811 -583579
14958 -583579 -565003 -588974 -616442 -600810 -563862 -560589 -592453 -606881 -578177 -542906 -543672 -571813
14946 -571813 -586413 -570808 -547546 -543096 -557097 -571061 -574467 -571222 -566374 -561608 -564943 -587095 -618925
14933f18925j1176K2671K7540k501k3399n813K1497J9706j774j0854p840j1680
14921f02548j3648O145L0563K5109k313j2582j332L43j0664m888J5329J0802j9617
14908e79301k4314J4335M1647J6314k3774k6858o064l07l160R447J9113k015k7469
14895e92406j4139J7709J3558j9265k0447J9031L8789R762j9404n015K4807K3882
14883e23138p69j3377q833o341q773n087L537Q727J1358J1450j57k0058k3982
14870e75443k647J6523R079p210k794J3359R385j5441k9103j6557J644L822o110
14857f01493j2231p443M111J1818N751r088j1428Q362K7698J9788n303j3422L012
14844e79868J6316Q831l201j939L468j452q350k053J0423J1342L595M830J2899
$$ plain form
14933 -618925 -630101 -607430 -579890 -582391 -605790 -611603 -590106 -570400 -572174 -583028 -590868 -602548
14921 -602548 -616196 -610051 -579488 -554379 -556692 -569274 -570606 -570263 -580927 -585815 -570486 -559684 -579301
14908 -579301 -603615 -589280 -547633 -531319 -555093 -581951 -588015 -588322 -591482 -582035 -562922 -564937 -592406
14895 -592406 -606545 -588836 -575278 -594543 -614990 -595959 -557170 -547408 -566812 -571827 -547020 -523138
14883 -523138 -523907 -537284 -546117 -552458 -561231 -566318 -562781 -554054 -542696 -531246 -531403 -551461 -575443
14870 -575443 -578090 -561567 -552488 -559698 -562492 -549133 -539748 -555189 -584292 -600849 -599205 -595383 -601493
14857 -601493 -613724 -621167 -617056 -605238 -599487 -608575 -620003 -611641 -583943 -564155 -569458 -582880 -579868
14844 -579868 -563552 -554721 -557922 -559861 -556393 -557845 -566195 -568248 -557825 -546483 -542888 -538058 -525159
14831e25159M821k2619l7023j3523K3799K9668L03k0942n936J9743J8715k451
14819e30604r321L246P159p750j7443q100j41r070j5320R8J7589R537j2467j7571
14805e90158p008n380j1150n90K1036J9635q259k2193j184K1910J4344n949n904
14792e80850P426N258j0516j3028K712J4999J1909J394j0058j9555j4919Q729
14780e96499K5576Q273k2522j9352J7934L5753Q493k1456j2603J1553Q028j2157
14768e68979q095J5992J8352m829j1533J0609J8792j1643l9231j8877K5712L7200
14756e36530Q507j5666j0417K541J093n390j697P328J1138J0791R138K369q466
14743e25261j4423j4425j6021j5544q13J9334J6803j0641k6541r356J1607M295
$$ plain form
14831 -525159 -520338 -542957 -579980 -593503 -569704 -540036 -539733 -560675 -566611 -546868 -528153 -530604
14819 -530604 -539925 -536679 -529520 -537270 -554713 -562813 -562954 -572024 -587344 -587246 -569657 -560120 -572587 -590158
14805 -590158 -597166 -602546 -613696 -614286 -593250 -573615 -581874 -604067 -605251 -583341 -568997 -574946 -580850
14792 -580850 -573424 -568166 -578682 -591710 -588998 -573999 -562090 -560696 -570754 -590309 -605228 -596499
14780 -596499 -570923 -562650 -585172 -604524 -586590 -550837 -542344 -563800 -576403 -564850 -556822 -568979
14768 -568979 -577074 -561082 -542730 -547559 -559092 -548483 -529691 -541334 -580565 -599442 -573730 -536530
14756 -536530 -528023 -543689 -554106 -551565 -550472 -555862 -557559 -550231 -539093 -528302 -519164 -516795 -525261
14743 -525261 -539684 -554109 -570130 -585674 -586487 -567153 -550350 -560991 -587532 -596888 -585281 -580986
14731e80986j0499O001L9117L5953j0440m3759k4590J5861K5522J924j5906n735
14719e67537J5833K1724N317j5048j4957P501K3049N713k6494k9871L429L2650
14707e38691K7234M951o305j0170j8216j7209L941K0567P159j4625q626J1175
14695e38815K034k8695k6636J9061M8549K0091k5605k7419Q697K8236R926j5092
14683e25668j5623N323K6306K9682R428k1567l5240j8176P862J3230l12q360l213
14670e36328O84l696o716l089N45J041K112J652m912r620j830Q295J403j5268
14656e65727j3115J0726K3173N773j5093r667R923J3224J55n465R35J321q155
14643e51992q540P963K0856R844j5924k8793j4562J3328K6916J0571j9518k7331
$$ plain form
14731 -580986 -591485 -585484 -546367 -510414 -520854 -564613 -589203 -573342 -547820 -545896 -561802 -567537
14719 -567537 -551704 -529980 -524663 -539711 -554668 -547167 -524118 -518405 -544899 -574770 -571341 -538691
14707 -538691 -511457 -506506 -512811 -522981 -541197 -558406 -554465 -533898 -526739 -541364 -549990 -538815
14695 -538815 -536781 -565476 -592112 -573051 -524502 -504411 -530016 -557435 -548738 -520502 -510576 -525668
14683 -525668 -541291 -535968 -509662 -479980 -470552 -492119 -527359 -545535 -537673 -524443 -524755 -533115 -536328
14670 -536328 -535644 -539340 -546056 -549145 -548600 -547559 -545447 -543795 -548707 -558327 -560157 -551862 -550459 -565727
14656 -565727 -578842 -568116 -544943 -539170 -554263 -563930 -554007 -540783 -540628 -546093 -545158 -543837 -551992
14643 -551992 -560532 -552569 -531713 -521869 -537793 -566586 -581148 -567820 -540904 -530333 -549851 -577182
14631e77182O92L1820K3963j6279l7401j1669K6297K8297p28j3895P625K9005
14619e09455J4778j9972l2753j3030Q351P095m276m336K368m74p265L4J4358R192
14605e35385j3019j4780J5657L3527K036m1124l1136K3574M6858P130l5522k1529
14593e63713K1291K8228k794j9334l338R106k772j2470J00J1875O90j2965k518
14580e48614J5306P264j8297k2294K578K1375J3270L53O223J8257J3768J24J000
14567d89687J5652J9932L732j7066k6439k4058j2950O167K1698J4967j0232k2530
14555e20814n035J5611N998k1876k5642M494L0317J9798j1621k7705j7510J586
14543e52399J1164O311o033j1418r92J2943R929n154n958Q744O007k2958l4253
$$ plain form
14631 -577182 -576490 -544670 -520707 -536986 -574387 -586056 -559759 -531462 -532190 -546085 -538460 -509455
14619 -509455 -494677 -514649 -547402 -560432 -552081 -544986 -549262 -553598 -551230 -551704 -558969 -558935 -544577 -535385
14605 -535385 -548404 -563184 -547527 -514000 -511964 -553088 -584224 -560650 -513792 -506662 -542184 -563713
14593 -563713 -542422 -514194 -516988 -536322 -539660 -530554 -533326 -545796 -545696 -533821 -533131 -546096 -548614
14580 -548614 -533308 -526044 -544341 -566635 -564057 -542682 -529412 -529059 -522836 -504579 -490811 -490687 -489687
14567 -489687 -474035 -454103 -450371 -467437 -493876 -517934 -530884 -524717 -503019 -488052 -498284 -520814
14555 -520814 -525849 -510238 -504240 -526116 -551758 -547264 -516947 -497149 -508770 -536475 -553985 -552399
14543 -552399 -541235 -534924 -540957 -552375 -553367 -540424 -530495 -535649 -541607 -532863 -526856 -549814 -584067
14530e84067J333L8498K0093k6181k3590K9811N2982J0896k9790j1422K2881P748
14518d90808l3002k9555J5539L4483O329j7469m446J3716O234q040m886K157m819
14505e14567j1648k309O779l310j6098o227J5649J8642j83j4441q458P223J6263
14492e12685J2184k268j5717j4520q93O062j270o565j02R42j4046j9499Q165M1328
14478e18884L3135j0042l4615j9411r96p345j4327N346K9875K2471q371k2520
14466e45684q139R348J1892P464M023k815j0204m912J0382J2802n790k2032j5131
14453e58796K615Q663N055O068O558o355j9161o251K1834K4350n229k2153K56
14440e42546K4682R130k2720k0124R526J4694r780j3314J9697L7370O936k7339
$$ plain form
14530 -584067 -582734 -544236 -524143 -550324 -573914 -544103 -491121 -480225 -510015 -521437 -498556 -490808
14518 -490808 -523810 -553365 -537826 -503343 -497014 -514483 -518929 -505213 -498979 -507019 -511905 -509748 -514567
14505 -514567 -526215 -528524 -521745 -525055 -541153 -547380 -531731 -513089 -513272 -527713 -536171 -528948 -512685
14492 -512685 -500501 -502769 -518486 -533006 -533899 -527837 -529107 -535672 -535774 -534832 -548878 -568377 -560212 -518884
14478 -518884 -485749 -495791 -530406 -549817 -550813 -558158 -572485 -567139 -537264 -514793 -523164 -545684
14466 -545684 -553823 -544475 -532583 -525119 -521096 -523911 -534115 -539027 -528645 -515843 -521633 -543665 -558796
14453 -558796 -556181 -547518 -542463 -536395 -529837 -536192 -555353 -561604 -539770 -515420 -520649 -542802 -542546
14440 -542546 -517864 -508734 -531454 -551578 -542052 -527358 -537138 -550452 -530755 -493385 -486449 -513788
14428e13788j6284J5026J4490j0121j3852K481m03k2397k1854P472K2215L885
14416e33130j2072p23J3812Q983K055P654M664j8497k8820j667K8196J6792j7035
14403e29788k2142K710J2734n787j7162J402K6684K9947J3414n501j6429j3585
14391e23503J874J1049l846k5953j9929J2661K9125Q784j5705j0311R990J0914
14379e14850o513j4146m178M507J215m225l711j856k108m56L494M099J111O41
14365e36976K315j723j1387j4404l638J0900J4881P892R19qJ037p9j283o05j309
14350e33468n394p760m003Q67Q54J159Q241J1634l623k4887j9432J4171L1810
14337e29831N194k9501k1233J6792K5752o796k7885l999K7494K0595q533j3222
$$ plain form
14428 -513788 -530072 -515046 -500556 -510677 -524529 -522048 -522451 -544848 -566702 -559230 -537015 -533130
14416 -533130 -545202 -545925 -532113 -523130 -521075 -513421 -508757 -527254 -556074 -557741 -529545 -512753 -529788
14403 -529788 -551930 -549220 -536486 -542273 -559435 -558033 -531349 -501402 -487988 -493489 -509918 -523503
14391 -523503 -521629 -510580 -514426 -540379 -560308 -547647 -518522 -509738 -525443 -535754 -525764 -514850
14379 -514850 -521363 -535509 -539687 -535180 -533965 -538190 -541901 -543757 -545865 -546321 -542827 -538728 -537617 -536976
14365 -536976 -534661 -536384 -547771 -562175 -565813 -554913 -540032 -532140 -531221 -531229 -530192 -530271 -531554 -532159 -533468
14350 -533468 -538862 -546622 -550625 -549758 -548904 -547745 -539504 -527870 -531493 -556380 -575812 -561641 -529831
14337 -529831 -524637 -554138 -575371 -558579 -532827 -539623 -567508 -571507 -544013 -523418 -531951 -545173
14325e45173R901K2928P772j5700k6667k3023o744J7566L0096J3745j3256j4175
14313e42730J1951K5510N618j9142j7263j231q33j2027o358J8158K9865J0510
14301d97972j8139k5793j2147P48J809p85K51N72k852k447O783J4204P023p391
14287e36136q277P586J7966O535j1845j1317Q326K2146J4364m579j7084j9082
14275e31397j5468p698L650J1468Q862J245J345J0413J3587K23j7643j8104M46
14262e39071J5366J1165N33J674P979J045j4239j4677J201P591o303j7814q821
14249e54371N886P919O052J2446J3503l836j8435n125J7819J2978j4789k5679
14237e45632r269M863K261J477Q910M327j3424j3831J0600K3015L347j3782K429
$$ plain form
14325 -545173 -535272 -512344 -504572 -520272 -546939 -569962 -576706 -559140 -529044 -515299 -528555 -542730
14313 -542730 -530779 -505269 -499651 -518793 -536056 -537287 -538120 -550147 -556505 -538347 -508482 -497972
14301 -497972 -516111 -541904 -554051 -553303 -551494 -552279 -552028 -551456 -554308 -556755 -549972 -535768 -528745 -536136
14287 -536136 -544413 -536827 -518861 -512326 -524171 -535488 -527162 -505016 -490652 -495231 -512315 -531397
14275 -531397 -546865 -554563 -550913 -539445 -530583 -529338 -527993 -517580 -503993 -503770 -521413 -539517 -539071
14262 -539071 -523705 -512540 -512007 -510333 -502354 -501309 -515548 -530225 -529024 -521433 -527736 -545550 -554371
14249 -554371 -548485 -540566 -534514 -522068 -508565 -512401 -530836 -535961 -518142 -505164 -519953 -545632
14237 -545632 -554901 -550038 -547777 -546300 -537390 -533063 -546487 -560318 -549718 -526703 -523356 -537138 -534709
14224e34709K3550R264k3223k7243j301J5748J0010L081M244N7r404p837J587
14211e36176j374j2765o016J9261L0111J1923j0314j4508r292n491M232J9309
14199e11100J8693l728k0729j1719N664P461P02K423N365m967j7656j2482M277
$$ plain form
14224 -534709 -511159 -501895 -525118 -552361 -553662 -537914 -527904 -524823 -520579 -520522 -529926 -537763 -536176
14211 -536176 -537550 -550315 -556331 -537070 -506959 -495036 -505350 -519858 -529150 -534641 -530409 -511100
14199 -511100 -492407 -496135 -516864 -528583 -522919 -515458 -514756 -512333 -506968 -511935 -529591 -542073 -537796
$$ [...]
##END NTUPLES=NMR SPECTRUM
##END=
