##TITLE=1H ikalashn
CA-9300-1
18.11.2024
##JCAMPDX= 6.0         $$ Bruker NMR JCAMP-DX V2.0
##DATA TYPE= NMR SPECTRUM
##DATA CLASS= NTUPLES
##ORIGIN= UXNMR, Bruker Analytische Messtechnik GmbH
##OWNER= root
$$ TOPSPIN		Version 1.3
$$ 2024-11-18 09:59:00.640 +0400  Irina@DPX200
$$ Compression mode = diff/dup
##.OBSERVE FREQUENCY= 200.131300845
##.OBSERVE NUCLEUS= ^1H
##.ACQUISITION MODE= SIMULTANEOUS
##.ACQUISITION SCHEME= undefined
##.AVERAGES= 16
##.DIGITISER RES= 18
##SPECTROMETER/DATA SYSTEM= spect
##.PULSE SEQUENCE= zg
##.SOLVENT NAME= CDCl3
##.SHIFT REFERENCE= INTERNAL, CDCl3, 1, 17.49637
##AUDIT TRAIL= $$ (NUMBER, WHEN, WHO, WHERE, WHAT)
$$ ##TITLE= Audit trail, TOPSPIN		Version 1.3
$$ ##JCAMPDX= 5.01
$$ ##ORIGIN= Bruker BioSpin GmbH
$$ ##OWNER= Irina
$$ $$ F:/spectra/data/iren/nmr/1H/4/pdata/1/auditp.txt
$$ ##AUDIT TRAIL=  $$ (NUMBER, WHEN, WHO, WHERE, VERSION, WHAT)
(   1,<2024-11-18 09:58:36.250 +0400>,<Irina>,<DPX200>,<TOPSPIN 1.3>,
      <created by zg
	started at 2024-11-18 09:57:28.000 +0400,
	POWCHK disabled, PULCHK disabled
       configuration hash MD5:
       BE 6D 3F 07 2A EA 11 49 91 17 2B D3 AF B3 58 0D
       data hash MD5: 16K
       ED 31 E1 5F 4A AA AE A8 85 0F 3A F7 51 1A 32 29>)
(   2,<2024-11-18 09:58:36.468 +0400>,<Irina>,<DPX200>,<TOPSPIN 1.3>,
      <Start of raw data processing
       efp BC_mod = 2 LB = 0.02 FT_mod = 6 PKNL = 1 PHC0 = 326.8341 PHC1 = -6.346261 SI = 32K 
       data hash MD5: 32K
       8E 32 4C D5 93 4D F2 9D 19 C7 C2 EF 69 45 F7 EB>)
$$ ##END=
$$ 
$$ $$ hash MD5
$$ $$ 6B 27 F8 4A A6 7D 33 B2 BA 9A 19 3D FC 33 E3 77
##$RELAX= 
##$RELAX= 
##$RELAX= 
##$RELAX= 
##$RELAX= 
##$RELAX= 
##$RELAX= 
##$RELAX= 
##$RELAX= 
$$ Bruker specific parameters
$$ --------------------------
##$DU= <F:/spectra>
##$EXPNO= 4
##$NAME= <1H>
##$PROCNO= 1
##$TYPE= <nmr>
##$USER= <iren>
##$AMP= (0..31)
100 100 100 100 100 100 100 100 100 100 100 100 100 100 100 100 100 100 
100 100 100 100 100 100 100 100 100 100 100 100 100 100 
##$ANAVPT= -1
##$AQSEQ= 0
##$AQ_mod= 1
##$AUNM= <au_zg>
##$AUTOPOS= <>
##$BF1= 200.13
##$BF2= 200.13
##$BF3= 200.13
##$BF4= 200.13
##$BF5= 200.13
##$BF6= 200.13
##$BF7= 200.13
##$BF8= 200.13
##$BYTORDA= 1
##$CFDGTYP= 0
##$CFRGTYP= 5
##$CHEMSTR= <none>
##$CNST= (0..63)
1 1 145 1 1 1 1 1 1 1 1 1 1 1 1 1 1 1 1 1 1 1 1 1 1 1 1 1 1 1 1 1 1 1 
1 1 1 1 1 1 1 1 1 1 1 1 1 1 1 1 1 1 1 1 1 1 1 1 1 1 1 1 1 1 
##$CPDPRG= <>
##$CPDPRG1= <>
##$CPDPRG2= <>
##$CPDPRG3= <>
##$CPDPRG4= <mlev>
##$CPDPRG5= <mlev>
##$CPDPRG6= <mlev>
##$CPDPRG7= <mlev>
##$CPDPRG8= <mlev>
##$CPDPRGB= <>
##$CPDPRGT= <>
##$D= (0..63)
0 2 0 0 0 0 0 0 0 0.06 0 0.03 0 0 0 0 0.0002 0 0 0 0 0 0 0 0 0 0 0 0 0 
0 0 0 0 0 0 0 0 0 0 0 0 0 0 0 0 0 0 0 0 0 0 0 0 0 0 0 0 0 0 0 0 0 0 
##$DATE= 1731909513
##$DBL= (0..7)
120 120 120 120 120 120 120 120 
##$DBP= (0..7)
150 150 150 150 150 150 150 150 
##$DBP07= 0
##$DBPNAM0= <>
##$DBPNAM1= <>
##$DBPNAM2= <>
##$DBPNAM3= <>
##$DBPNAM4= <>
##$DBPNAM5= <>
##$DBPNAM6= <>
##$DBPNAM7= <>
##$DBPOAL= (0..7)
$$ [...]
##$SW_h= 4401.40845070422
##$TD= 16384
##$TD0= 1
##$TE= 300
##$TE2= 300
##$TE3= 300
##$TEG= 300
##$TL= (0..7)
0 120 120 120 120 120 120 120 
##$TP= (0..7)
150 150 150 150 150 150 150 150 
##$TP07= 0
##$TPNAME0= <>
##$TPNAME1= <>
##$TPNAME2= <>
##$TPNAME3= <>
##$TPNAME4= <>
##$TPNAME5= <>
##$TPNAME6= <>
##$TPNAME7= <>
##$TPOAL= (0..7)
0.5 0.5 0.5 0.5 0.5 0.5 0.5 0.5 
##$TPOFFS= (0..7)
0 0 0 0 0 0 0 0 
##$TUNHIN= 0
##$TUNHOUT= 0
##$TUNXOUT= 0
##$USERA1= <user>
##$USERA2= <user>
##$USERA3= <user>
##$USERA4= <user>
##$USERA5= <user>
##$V9= 5
##$VALIST= <valist>
##$VCLIST= <CCCCCCCCCCCCCCC>
##$VD= 0
##$VDLIST= <DDDDDDDDDDDDDDD>
##$VPLIST= <PPPPPPPPPPPPPPP>
##$VTLIST= <TTTTTTTTTTTTTTT>
##$WBST= 1024
##$WBSW= 25
##$XGAIN= (0..3)
0 0 0 0 
##$XL= 0
##$YL= 0
##$YMAX_a= 433107
##$YMIN_a= -430229
##$ZGOPTNS= <>
##$ZL1= 120
##$ZL2= 120
##$ZL3= 120
##$ZL4= 120
##$ABSF1= 0
##$ABSF2= 0
##$ABSG= 0
##$ABSL= 0
##$ALPHA= 0
##$AQORDER= 0
##$ASSFAC= 0
##$ASSFACI= 0
##$ASSFACX= 0
##$ASSWID= 0
##$AUNMP= <proc_1d>
##$AXLEFT= 0
##$AXRIGHT= 0
##$AXTYPE= 0
##$AXUNIT= <>
##$AZFE= 0.1
##$AZFW= 0.1
##$BCFW= 0
##$BC_mod= 2
##$BYTORDP= 0
##$COROFFS= 0
##$CY= 7568.61572265625
##$DATMOD= 1
##$DC= 0
##$DFILT= <>
##$DTYPP= 0
##$F1P= 17.9538593292236
##$F2P= -4.03888763876832
##$FCOR= 0.5
##$FTSIZE= 32768
##$FT_mod= 6
##$GAMMA= 0
##$GB= 0
##$INTBC= 0
##$INTSCL= 1.367314e-010
##$ISEN= 128
##$LB= 0.02
##$LEV0= 0
##$LPBIN= 0
##$MAXI= 945.577
##$MC2= 0
##$MEAN= 0
##$ME_mod= 0
##$MI= -402.1523
##$NCOEF= 0
##$NC_proc= -5
##$NLEV= 6
##$NOISF1= 8.587773
##$NOISF2= 6.764455
##$NSP= 0
##$NTH_PI= 0
##$NZP= 0
##$OFFSET= 17.49637
##$PC= 1
##$PHC0= 326.8341
##$PHC1= -6.346261
##$PH_mod= 1
##$PKNL= yes
##$PPARMOD= 0
##$PPDIAG= 0
##$PPIPTYP= 0
##$PPMPNUM= 100
##$PPRESOL= 1
##$PSCAL= 0
##$PSIGN= 0
##$REVERSE= no
##$SF= 200.13
##$SI= 32768
##$SIGF1= 16.12182
##$SIGF2= -4.496377
##$SINO= 3.521527
##$SIOLD= 32768
##$SREGLST= <1H.CDCl3>
##$SSB= 0
##$STSI= 32768
##$STSR= 0
##$SW_p= 4401.40845070422
##$SYMM= 0
##$S_DEV= 0
##$TDeff= 16384
##$TDoff= 0
##$TI= <>
##$TILT= no
##$TM1= 0
##$TM2= 0
##$TOPLEV= 0
##$USERP1= <user>
##$USERP2= <user>
##$USERP3= <user>
##$USERP4= <user>
##$USERP5= <user>
##$WDW= 1
##$XDIM= 32768
##$YMAX_p= 277952775
##$YMIN_p= -573865
$$ End of Bruker specific parameters
$$ ---------------------------------
##NTUPLES= NMR SPECTRUM
##VAR_NAME=  FREQUENCY,     SPECTRUM/REAL,   SPECTRUM/IMAG
##SYMBOL=    X,             R,               I
##VAR_TYPE=  INDEPENDENT,   DEPENDENT,       DEPENDENT
##VAR_FORM=  AFFN,          ASDF,            ASDF
##VAR_DIM=   32768,         32768,           32768
##UNITS=     HZ,            ARBITRARY UNITS, ARBITRARY UNITS
##FACTOR=    0.134324425510551, 1,           1
##FIRST=     4401.40845070422, -307971,      -230487
##LAST=      0,             -321715,         -237373
##MIN=       0,             -573865,         0
##MAX=       4401.40845070422, 277952775,    0
$$ Real data points
##PAGE= N=1
##DATA TABLE= (X++(R..R)), XYDATA
$$ [...]
16964 1489944 1509666 1530702 1528019 1529660 1552137 1560622 1535471 1519037 1551859 1609934 1646285 1654566
16952 1654566 1655598 1657648 1662250 1675862 1689214 1679567 1655731 1661424 1709304 1752354 1749368 1721049
16940 1721049 1710988 1724805 1737934 1735698 1720953 1706713 1715460 1755579 1791900 1782179 1749770 1764444
16928 1764444 1835321 1886609 1868659 1828958 1832229 1870124 1899689 1918315 1945413 1972923 1986412
16917 1986412 1996918 2006827 1989405 1948438 1943728 1999704 2044927 2013205 1952557 1950628 1995466 2003864
16905 2003864 1957886 1915410 1901268 1885147 1863163 1867498 1889748 1882255 1845998 1835158 1862216 1877742
16893 1877742 1857958 1834483 1823323 1804144 1785882 1808844 1859551 1869463 1826976 1803088 1830275
16882 1830275 1847853 1816632 1795646 1837540 1890080 1883697 1850251 1864130 1914347 1930127 1905381
16871 1905381 1906303 1962221 2025590 2045946 2026701 2001750 1995880 2010695 2024955 2018610 2010265 2039106
16859 2039106 2091676 2097596 2032699 1967867 1962892 1971401 1923126 1848440 1831670 1875591 1908694 1908840
16847 1908840 1921872 1959287 1970729 1931041 1875609 1835904 1810458 1806731 1837701 1870049 1854411
16836 1854411 1815780 1827645 1882085 1883640 1804734 1746301 1788118 1869167 1888942 1852749 1833512
16825 1833512 1847014 1854578 1852751 1872717 1908173 1920722 1910476 1916317 1948258 1975568 1981760 1982215
16813 1982215 1986688 1987833 1988567 2003544 2032036 2058337 2074301 2076605 2056559 2023003 2016526 2062584
16801 2062584 2125423 2149032 2131433 2117078 2127593 2145450 2158764 2175295 2193628 2204387 2219508
16790 2219508 2256667 2294699 2291850 2255024 2244186 2293003 2364795 2405359 2407077 2402206 2417635 2452402
16778 2452402 2483600 2488081 2472415 2475361 2519106 2570938 2586325 2577528 2595857 2652300 2705561 2729761
16766 2729761 2741548 2753246 2754371 2753776 2783837 2840621 2874727 2870067 2877641 2934443 3000323 3021873
16754 3021873 3014992 3030501 3071874 3104635 3124915 3161216 3218601 3272509 3314586 3360508 3412499
16743 3412499 3452685 3476373 3500296 3534773 3572179 3603653 3629047 3654961 3696283 3765882 3848642
16732 3848642 3907641 3933867 3960934 4007772 4044877 4053080 4073970 4148917 4242766 4293100 4310809
16721 4310809 4359541 4449461 4529140 4580546 4641651 4724352 4789302 4824410 4873611 4957415 5035308
16710 5035308 5083527 5142186 5240239 5336691 5389069 5425386 5492610 5583651 5672870 5774305 5899547
16699 5899547 6004577 6054145 6100731 6215703 6370077 6475151 6526151 6606268 6744187 6868694
16689 6868694 6932245 6988067 7098022 7238560 7355270 7453909 7574951 7716041 7840942 7945391
16679 7945391 8062333 8210534 8376362 8539783 8689345 8819591 8937430 9062710 9205859
16670 9205859 9357765 9512777 9679037 9852591 10011067 10152592 10308307 10491918 10673908
16661 10673908 10838584 11026178 11270350 11527761 11729273 11879821 12044977 12251785 12470246
16652 12470246 12688659 12932545 13195694 13426340 13613760 13825064 14111399 14427848 14698420
16643 14698420 14923841 15167762 15456878 15752687 16020996 16281072 16571823 16897838 17224673
16634 17224673 17517753 17781007 18058669 18390985 18765467 19128043 19447307 19744021 20047827
16625 20047827 20357951 20668852 20999646 21360130 21713343 22017278 22288840 22580183 22900413
16616 22900413 23209465 23487818 23760935 24045843 24322867 24578903 24835170 25106689 25370728
16607 25370728 25605360 25830842 26080743 26351544 26610773 26841828 27054296 27259518 27460300
16598 27460300 27660392 27865211 28074102 28282054 28485650 28683801 28881609 29093023 29323619
16589 29323619 29553140 29759868 29960349 30188994 30434550 30644091 30806542 30978493 31194846
16580 31194846 31409286 31573929 31726189 31924947 32137819 32279389 32346636 32424046 32547645 32654895
16570 32654895 32695432 32705925 32730356 32740059 32692312 32611251 32545023 32484090 32387944 32261722 32139403
16559 32139403 32012710 31845082 31645252 31459533 31291829 31096127 30856673 30614174 30395315
16550 30395315 30172939 29921630 29663262 29425688 29197597 28959350 28724051 28509828 28298528
16541 28298528 28062240 27811887 27579681 27365654 27140437 26894567 26647513 26409907 26174567
16532 26174567 25948018 25750259 25568060 25345436 25049228 24720972 24431675 24197140 23969823
16523 23969823 23709432 23425855 23144003 22860548 22559730 22249112 21946921 21643711 21312444
16514 21312444 20959267 20628283 20339982 20055600 19728742 19370311 19030501 18730034 18443990
16505 18443990 18147163 17837400 17511976 17161424 16801445 16474667 16196056 15924519 15617810
16496 15617810 15293511 15000731 14745278 14483534 14190791 13896973 13640351 13415033 13186663
16487 13186663 12943078 12704315 12486473 12277334 12055264 11820955 11598746 11405866 11228378
16478 11228378 11036265 10822866 10619104 10458609 10332896 10195438 10015379 9815290 9642377
16469 9642377 9507053 9369390 9195091 9007173 8858145 8756073 8650645 8504918 8348218
16460 8348218 8226966 8128220 8001218 7847782 7730941 7674081 7608353 7464914 7279169 7144276
16450 7144276 7080829 7017198 6899797 6759616 6649304 6568973 6489495 6407849 6334983 6255265 6146048
16439 6146048 6026142 5939171 5888811 5832030 5744934 5656928 5600683 5559141 5490544 5389422 5293905
16428 5293905 5235865 5204801 5162953 5083892 4977021 4883041 4839632 4839280 4827467 4758866 4650159
16417 4650159 4557315 4505047 4466808 4416989 4366882 4330543 4288277 4217119 4136403 4085460 4067482
16406 4067482 4052551 4027466 4000292 3959366 3879107 3777472 3716810 3722576 3742753 3716288 3644453
16395 3644453 3565875 3501917 3462366 3461005 3478157 3452145 3370229 3325934 3400464 3511358 3482387
16384 3482387 3271508 3030048 2908288 2897940 2911481 2919720 2932989 2921872 2856783 2787171 2786713
16373 2786713 2837778 2854697 2811382 2762836 2740953 2713626 2662513 2622564 2614232 2602444 2560088
16362 2560088 2517809 2510162 2516471 2497264 2454921 2417592 2390601 2363235 2342444 2341637 2349017 2338660
16350 2338660 2304256 2259427 2216689 2184674 2169844 2163006 2143854 2116421 2113861 2144778 2164185 2130208
16338 2130208 2064282 2018670 2007313 2009166 2017199 2033931 2033736 1987428 1922383 1900494 1927203 1937421
16326 1937421 1890906 1830585 1815996 1840395 1851678 1826625 1784752 1745192 1708090 1675253 1659349
16315 1659349 1666581 1684894 1693121 1677956 1646191 1621320 1618364 1622816 1610030 1583712 1570828 1575345
16303 1575345 1568064 1534606 1501538 1494060 1497274 1486940 1472949 1478356 1493768 1489174 1460840 1432837
16291 1432837 1418689 1411741 1405991 1396461 1369132 1325472 1306400 1347617 1414094 1428931 1375467 1320276
16279 1320276 1316776 1336287 1325605 1287995 1263132 1259041 1254965 1254358 1282275 1330832 1353264 1324501
16267 1324501 1275825 1254939 1271808 1294436 1284437 1232420 1170198 1145840 1171587 1202728 1189642
16256 1189642 1143922 1122031 1143851 1165698 1146983 1106518 1087125 1093599 1099308 1095133 1094393 1097509
16244 1097509 1088878 1069919 1061422 1066152 1061075 1039811 1031948 1057499 1087341 1080696 1047241 1035003
16232 1035003 1058705 1078406 1061238 1030164 1026237 1046322 1051840 1028693 1002789 994529 991536 978138
16220 978138 962816 957493 953307 941039 936279 953688 968765 942429 883360 847807 864670 894075
16208 894075 884018 843454 826598 855065 889811 885879 848157 816406 809809 808059 787735 758829
16196 758829 751328 772541 795953 796173 777537 757748 741862 732423 747589 795652 839690 830360
16184 830360 780175 759868 800431 843298 823721 764928 737762 752106 751906 713248 681661 694555
16172 694555 722866 721894 697519 682284 675283 650242 609588 588338 603537 631836 644024 638838
16160 638838 633432 635707 636853 625982 605483 589269 583907 576920 555596 534188 541280 575045 596404
16147 596404 581737 557959 561632 584497 591848 580770 580622 597659 599774 567900 528931 517603
16135 517603 530013 538236 534553 534725 543027 539787 511851 480332 482282 523316 559994 543121 478658
16122 478658 428327 438273 482510 498391 468705 438859 449779 484929 501266 489949 479463 486854
16110 486854 493526 476704 446611 435347 451609 463447 438539 393999 384156 430941 486960 488450
16098 488450 433146 379778 373727 401038 421457 420046 410314 404631 402296 401588 408185 427888 453943
16085 453943 464080 437959 384602 343570 345704 380097 414248 434677 445160 438525 405367 365620
16073 365620 351498 357162 347785 324034 326537 359590 367485 322229 282842 315216 390695 424231
16061 424231 391034 345509 335115 352772 373717 387467 386621 366464 342468 334197 332819 318816
16049 318816 302954 306399 310064 278322 230384 226513 275724 320198 326288 325296 340163 340829 310645
16036 310645 291679 312958 331116 301872 260338 262634 290087 288415 270556 294003 349913 364830
16024 364830 319153 279575 291736 316960 311055 299112 321844 356037 345664 287168 233935 226137
16012 226137 253910 284855 297623 288865 269463 256818 259618 270734 278151 274548 255379 223882
16000 223882 201857 214604 255853 287380 284284 261299 243823 235929 231901 235508 247138 252474
15988 252474 246771 251162 278687 301542 284336 240152 219481 243339 276694 274729 234138 191149
15976 191149 182278 210440 240749 233315 190090 159296 177869 222528 241922 225981 210192 214848
15964 214848 219670 207951 197416 205755 216712 209565 199585 214417 242121 239879 195476 147204
15952 147204 132525 144315 155052 161914 181083 207802 213762 189995 166255 171626 194295 202339
15940 202339 192280 188957 200836 207935 201292 200896 215473 215274 175688 125361 112966 139340 163658
15927 163658 169930 180443 200387 200818 174383 159105 176623 189901 162988 127477 139210 191919
15915 191919 227635 220580 196612 175145 149941 132126 151838 198993 218389 190067 161334 165728
15903 165728 165986 127235 95567 133075 206956 224975 172259 130325 148901 178284 160877 120311
15891 120311 109670 123473 121493 107354 119516 156109 167584 129950 80402 66848 92954 126109
15879 126109 137727 124334 103351 96055 107706 125191 138947 155243 175719 182704 165696 145942
15867 145942 148347 163641 168274 165859 171079 167500 131322 91196 105108 167778 201077 161378
15855 161378 101086 87098 108054 111729 95690 100601 132949 153972 143503 125580 124128 131706
15843 131706 131418 121169 109192 106477 122519 146935 143449 92755 35902 37314 100450 156961
15831 156961 151641 106051 80903 101335 139429 153074 124455 71661 34639 40658 77496 110649
15819 110649 125466 133047 135385 114815 69867 33427 34139 59322 77491 81016 82719 83855 74382
15806 74382 60079 59909 72157 69969 43385 23575 42971 84205 97995 71581 46508 53569
15794 53569 63083 34115 -10175 -7326 48761 94088 90170 75283 89638 106000 84467 49162
15782 49162 46104 58639 38361 24 4831 52396 71334 32126 -5550 15187 72306 110293
15770 110293 107596 72240 22140 -6038 18193 62544 57912 3125 -23710 13062 51705 43044
15758 43044 32422 68165 104845 78574 17606 -7219 7271 17972 18905 21597 4268 -34857
15746 -34857 -38392 -4422 -58105 -262232 -425565 -298275 56670 298871 251371 98925 71745
15735 71745 137599 142222 84322 71242 109440 120418 103753 119585 147070 114006 46081 40237
15723 40237 95623 111460 61279 32855 68718 96088 62141 25295 48271 91458 84632 38361
15711 38361 13590 25632 41063 41586 40634 52543 76616 96660 83680 27686 -24896 -7992
15699 -7992 73715 135674 116307 45339 -12817 -35077 -28690 5511 54198 74068 41924 -2447
15687 -2447 -5410 29854 59296 61585 46057 19161 -12284 -20450 12898 52828 46707 4532 -4331
15674 -4331 51519 114698 113762 58825 23371 41079 65152 46198 12499 28654 88521 109460
15662 109460 51524 -16302 -14763 29236 33597 -3394 -7046 38949 57830 6103 -51859 -42291
15650 -42291 14991 55841 64170 57108 31917 -7170 -15198 30106 69224 38640 -24781 -36522
15638 -36522 4191 23683 2131 -927 43610 87837 92725 82969 85291 80141 52026 30837 43355
15625 43355 68371 74217 61464 41731 17298 7134 43026 106970 124241 62357 -9431 -9450
15613 -9450 48336 91025 95646 95708 101799 87593 52705 34372 44872 50820 32384 18080 37234
15600 37234 73033 90280 86761 89533 110474 127513 111160 60974 13301 9551 52180 98414
15588 98414 107050 83909 66874 73453 84366 79015 65122 64000 80936 101590 111074 107905 101104
15575 101104 98795 101207 104231 106401 107311 101994 87454 75594 86060 119822 151209 153860 126127
15562 126127 87232 60713 64614 99600 138762 148548 130445 121126 139090 157346 149020 131853
15550 131853 135740 149088 138637 110382 105285 133464 155826 144264 125017 140166 187202 219784
15538 219784 202423 150562 114437 124903 158919 168767 143460 117727 114287 113966 106301 126599
15526 126599 194494 250130 220444 134879 98345 143953 191727 177449 143892 157146 198637
15515 198637 205346 173264 151693 158862 167176 160653 150497 139060 118868 105126 122443 159209
15503 159209 178557 174481 173182 177866 160443 116715 82554 78911 83404 76978 78735 107247 140962
15490 140962 149240 138813 137915 151265 160755 159495 157068 156094 147744 131065 119453 124407 140783
15477 140783 149039 131658 93286 62525 61886 79362 88303 91176 113696 152328 166001 137785
15465 137785 108229 117834 145737 142006 100792 63319 59848 82793 108312 114059 87298 46443
15453 46443 37909 74295 96613 49523 -22942 -25630 45345 88961 50410 3311 30337 92767
15441 92767 94699 31518 -12392 4283 35490 40109 40409 62846 82979 68174 33959 18820
15429 18820 28368 37730 32367 18486 4253 -6203 -7062 4038 20081 33199 41084 40212 26619
15416 26619 8997 4126 12586 17688 14989 19158 31315 27274 -3761 -35099 -40489 -32592 -36069
15403 -36069 -43218 -29661 -305 15190 6540 -8998 -19337 -29130 -39041 -39904 -29693 -15924 -2530
15390 -2530 7594 4295 -14009 -25863 -13911 3514 -2155 -22596 -26426 -13343 -14200 -38085 -60349
15377 -60349 -65673 -61569 -46199 -9649 25098 14242 -36976 -67508 -46691 -16878 -21509 -42470
15365 -42470 -47107 -47676 -65102 -76142 -52867 -22019 -26509 -52777 -55164 -32713 -22015 -28871 -28671
15352 -28671 -25003 -44841 -78257 -84623 -61218 -47111 -55439 -60656 -56798 -65438 -78545 -61326 -25504
15339 -25504 -28016 -75038 -101765 -78329 -57840 -75805 -82129 -35513 8522 -15883 -70504 -76427
15327 -76427 -45750 -48745 -80224 -71094 -26004 -32640 -111522 -163959 -116344 -27798 5401 -19213
15315 -19213 -43473 -56015 -86049 -120680 -109913 -51872 -7686 -19155 -58795 -77459 -66145 -52401
15303 -52401 -59791 -88861 -123910 -143716 -132793 -94311 -52716 -37623 -58603 -92825 -104436 -84921
15291 -84921 -65781 -74556 -88118 -61007 -428 28213 -11189 -71178 -86168 -61213 -53123 -82991
15279 -82991 -115853 -121174 -106550 -87313 -65547 -49563 -54904 -70878 -62320 -23910 1326 -17906
15267 -17906 -53762 -62253 -47224 -44384 -59802 -66186 -54157 -46432 -56386 -67245 -63434 -54561 -54335
15254 -54335 -57864 -55090 -49653 -49225 -50183 -46517 -45003 -58676 -89830 -126197 -148218 -138975 -99939 -60040
15240 -60040 -51250 -67287 -66591 -29339 10305 10384 -19149 -33038 -17506 -6612 -29298 -69963 -93161
15227 -93161 -86458 -65137 -48213 -43253 -48891 -62577 -84113 -109625 -122622 -104876 -66792 -50589
15215 -50589 -81367 -127092 -135824 -105506 -82906 -94192 -114568 -115078 -102448 -96374 -98903 -104143 -110555
15202 -110555 -108502 -85810 -59912 -67836 -105836 -122077 -95884 -75340 -96102 -113648 -74823 -14473
15190 -14473 -7963 -55936 -95878 -110068 -133279 -157483 -127434 -50570 -15669 -62137 -116018 -107535
15178 -107535 -72995 -74747 -92192 -75170 -49012 -70085 -111987 -98491 -37627 -21419 -81909 -140740
15166 -140740 -130127 -82849 -61082 -64135 -58677 -48618 -57696 -76433 -80459 -79575 -98722 -124240 -116901
15153 -116901 -74096 -36768 -31700 -42213 -42707 -32628 -26560 -33646 -56338 -90938 -120906 -125867 -105446
15140 -105446 -80795 -67280 -61081 -58010 -65426 -82963 -89766 -69509 -35969 -15630 -16690 -35072
15128 -35072 -74991 -131019 -160707 -122213 -45917 -17931 -68207 -123894 -113611 -70832 -71927 -107832
15116 -107832 -103106 -52857 -42206 -104346 -153501 -115980 -50789 -59954 -131470 -163585 -119263 -62717
15104 -62717 -45231 -44764 -37329 -47538 -90441 -125025 -111756 -75039 -65674 -89600 -110132 -100410 -66197
15091 -66197 -35584 -44875 -108758 -185538 -204003 -149766 -91360 -89656 -116641 -106666 -58233 -29816
15079 -29816 -48684 -81075 -94732 -99324 -110921 -119012 -111048 -99951 -103332 -113608 -109411 -87224 -67421
15066 -67421 -73202 -108372 -149115 -158348 -121539 -69459 -49361 -70575 -97399 -101671 -97980 -109892
15054 -109892 -124875 -115130 -92454 -100301 -141583 -156090 -101768 -28914 -24686 -93421 -147889 -129760
15042 -129760 -81112 -65332 -71620 -53035 -20697 -28851 -80401 -118107 -112239 -92572 -85072 -81191
15030 -81191 -83865 -115605 -156994 -148120 -87721 -59783 -110242 -165238 -140508 -73837 -63674 -115715
15018 -115715 -144642 -111995 -70596 -68266 -88329 -101724 -110440 -117650 -109129 -85268 -68680 -66604
15006 -66604 -64562 -62890 -78145 -105181 -120316 -122163 -125186 -118499 -83845 -48939 -61402 -109651 -134729
14993 -134729 -123179 -117535 -129178 -120463 -87927 -78457 -98402 -94465 -58445 -58399 -117908 -157527 -120408
14980 -120408 -69462 -83250 -133765 -152166 -143390 -142298 -124075 -64207 -28709 -85639 -170368 -165394
14968 -165394 -85654 -51744 -92039 -112631 -74934 -60732 -119108 -175262 -154283 -94108 -68129
14957 -68129 -78446 -91399 -106681 -125467 -112883 -58085 -18937 -44716 -100456 -125510 -121755 -125053
14945 -125053 -132344 -120578 -103894 -109409 -121956 -110408 -86761 -85206 -102275 -109040 -104956 -110195 -119951
14932 -119951 -113724 -97829 -96042 -109269 -121236 -129416 -136626 -132228 -115564 -112164 -130161 -133222 -101172
14919 -101172 -80480 -116503 -168586 -162929 -107704 -78837 -101822 -127611 -128136 -135189 -166350 -184992
14907 -184992 -163799 -129962 -116610 -117460 -117209 -123279 -141205 -156960 -164485 -172433 -169468 -130929 -78321
14894 -78321 -75993 -137157 -187754 -166486 -111852 -97318 -121095 -124133 -92758 -75031 -98698 -133242
14882 -133242 -144579 -140283 -142519 -151164 -154856 -154786 -156573 -153401 -137351 -120355 -123371 -141424 -138352 -93549
14868 -93549 -43484 -47004 -103848 -142837 -114852 -64240 -66750 -122031 -163536 -162640 -156579 -167956 -166090
14855 -166090 -132371 -101580 -103678 -118287 -123614 -136837 -163109 -159567 -105445 -58815 -78996 -133844
14843 -133844 -154121 -142050 -144837 -150951 -109044 -39238 -24042 -77279 -118017 -100168 -76179 -93018
14831 -93018 -112977 -94276 -73112 -94394 -122533 -102113 -63011 -78265 -142252 -177616 -156748 -134233
14819 -134233 -149455 -171229 -161567 -131964 -107254 -86224 -70728 -86304 -133921 -161107 -128487 -76119
14807 -76119 -71607 -110416 -124931 -89175 -55684 -73563 -122007 -153640 -161165 -162635 -153986 -124546
14795 -124546 -99906 -116005 -155928 -164815 -131433 -101970 -100898 -95511 -65397 -49565 -80271 -119172
14783 -119172 -116514 -95060 -107699 -139525 -130705 -85944 -77012 -126582 -169824 -157274 -123815 -118927
14771 -118927 -131942 -130902 -121798 -121418 -116993 -100012 -97769 -123960 -140375 -117936 -92013 -101168 -116867
14758 -116867 -100645 -85577 -118684 -160186 -137770 -78540 -78621 -145110 -181880 -148879 -120054 -144285
14746 -144285 -160765 -115853 -65663 -79774 -120867 -113083 -73339 -78010 -134646 -178685 -177848 -158182
14734 -158182 -139946 -122011 -118514 -141159 -157455 -135293 -112211 -143687 -198761 -196739 -141679 -120851
14722 -120851 -160121 -185684 -156907 -131150 -148733 -155021 -106015 -62544 -93128 -153659 -158996 -120556
14710 -120556 -111539 -133609 -126000 -88879 -88515 -136265 -164241 -140804 -117728 -131561 -143022 -117725
14698 -117725 -92636 -108000 -133610 -123271 -96480 -102767 -136970 -152320 -137885 -124371 -124258 -122025
14686 -122025 -120373 -141871 -177581 -183131 -143240 -101065 -100470 -128217 -139344 -120621 -100878 -105049
14674 -105049 -122761 -128410 -118190 -114862 -135799 -165549 -170278 -139650 -102987 -96880 -124808 -157338
14662 -157338 -165526 -144527 -110485 -86166 -86136 -103570 -112565 -95351 -67879 -65853 -100453 -138851 -139113
14649 -139113 -99978 -63412 -64661 -92348 -110574 -110928 -117381 -136829 -137976 -102082 -65770 -73970 -108011
14636 -108011 -110966 -80107 -74943 -118973 -154166 -128613 -78171 -70706 -105773 -126634 -109688 -84566
14624 -84566 -76523 -83105 -102741 -134017 -148317 -116890 -68400 -64371 -108386 -137432 -121029 -108442
14612 -108442 -144349 -192185 -189315 -140091 -101849 -101233 -113867 -115677 -110442 -108967 -115756 -136277 -170085
14599 -170085 -197966 -199035 -177974 -155723 -140021 -125988 -116600 -116959 -114523 -93333 -67261 -71084 -112081
14586 -112081 -153593 -158188 -132536 -117294 -138407 -177779 -194650 -173562 -142427 -135067 -146920 -149018
14574 -149018 -138722 -142426 -162969 -164413 -128654 -90339 -87315 -109237 -128299 -148251 -181014 -203449
14562 -203449 -188189 -157133 -150102 -155360 -131152 -88566 -86088 -134910 -175168 -165564 -136866 -129510
14550 -129510 -133561 -126511 -122519 -140068 -156357 -139375 -102136 -85341 -103104 -138013 -171702 -189884
14538 -189884 -176977 -138778 -113331 -126454 -152300 -151127 -129725 -125694 -143101 -147144 -123227 -101565
14526 -101565 -111556 -139794 -148703 -123488 -90918 -93352 -139977 -184286 -169609 -104186 -61097 -84001
14514 -84001 -128037 -130024 -103767 -110829 -156164 -179163 -149888 -109528 -97981 -100504 -96052 -105845 -149641
14501 -149641 -191246 -178881 -121937 -81714 -92426 -129700 -155356 -158045 -145007 -124393 -107490 -107815
14489 -107815 -126128 -148187 -162821 -170361 -170547 -157625 -134193 -115994 -113435 -118700 -120451 -121623 -131675
14476 -131675 -148965 -162989 -168352 -164213 -146355 -116371 -94640 -102965 -132403 -150404 -145710 -141760
14464 -141760 -154673 -165990 -157986 -148898 -161682 -179138 -169022 -139823 -128250 -138101 -137775 -118155
14452 -118155 -104662 -105964 -100427 -84903 -86268 -108754 -122619 -124204 -148104 -192764 -199971 -149284
14440 -149284 -105730 -118986 -141986 -119774 -94589 -132064 -195202 -197805 -148386 -127516 -143563 -133584
14428 -133584 -101970 -125444 -201850 -227723 -168289 -121985 -154817 -192236 -157558 -107241 -125505
14417 -125505 -174935 -168240 -121639 -116173 -151786 -159198 -130399 -124203 -153876 -172156 -163256 -155724 -148118
14404 -148118 -114636 -82597 -109063 -174936 -196843 -156420 -124059 -135874 -142675 -111239 -83895 -95127
14392 -95127 -111555 -102902 -98696 -123695 -144626 -134320 -126408 -151176 -175728 -165688 -150103 -161571
14380 -161571 -164612 -116607 -58019 -62579 -123462 -165907 -160000 -149500 -170528 -203840 -214290 -190734
14368 -190734 -143763 -101379 -101076 -147985 -190532 -177951 -130204 -107160 -121528 -133986 -127478 -128612
14356 -128612 -149075 -159301 -137871 -106802 -99659 -123106 -160301 -187205 -182642 -148916 -120543 -123186
14344 -123186 -131853 -108186 -70295 -73821 -122193 -154499 -139261 -122695 -151432 -195117 -189785 -128504
14332 -128504 -66539 -52342 -86994 -140986 -183260 -199705 -200585 -201830 -192930 -147717 -79938 -53616
14320 -53616 -106835 -191391 -227561 -202027 -168358 -159968 -154209 -131733 -121526 -155452 -208736 -225008
14308 -225008 -190679 -149806 -143015 -161206 -171109 -162668 -151287 -148176 -151756 -161188 -174901 -178543 -158783
14295 -158783 -129613 -119652 -131302 -141164 -143956 -158684 -180872 -173924 -132103 -105991 -129005 -163494
14283 -163494 -167313 -168362 -207257 -244122 -207791 -119783 -76385 -105884 -137135 -126141 -117655 -145465
14271 -145465 -163885 -133665 -96880 -101311 -118224 -106084 -94975 -128130 -170980 -165376 -134125 -139645
14259 -139645 -168411 -154673 -103745 -90725 -135034 -172661 -167034 -156697 -169602 -175469 -155662 -142794
14247 -142794 -154051 -157189 -141872 -152664 -204084 -233127 -194733 -141891 -143738 -177704 -177706 -145895 -133549
14234 -133549 -139424 -114519 -59149 -33524 -65092 -114968 -147937 -172251 -193250 -187633 -150960 -122399
14222 -122399 -131736 -157965 -167368 -161112 -158434 -159362 -152053 -139335 -134465 -141808 -156846 -173935 -184351
14209 -184351 -179797 -164381 -149299 -134768 -116083 -104584 -114768 -131840 -127823 -112969 -127451 -170644
14197 -170644 -188799 -157318 -124272 -134424 -158069 -146699 -118636 -125268 -159989 -172225 -158292 -163493
14185 -163493 -194211 -203829 -179235 -166909 -187462 -196281 -167044 -145331 -166763 -184580 -146986 -95589
14173 -95589 -103829 -150484 -148309 -89450 -65497 -124250 -193607 -189050 -129097 -91679 -103743 -129559
14161 -129559 -138610 -133016 -122670 -115037 -120733 -138282 -144751 -127497 -108307 -109373 -117864 -117379 -128213
14148 -128213 -169308 -200354 -162583 -74978 -27431 -64099 -131042 -164307 -173501 -195894 -215308 -188994
14136 -188994 -132448 -110125 -138474 -158344 -126284 -83357 -92655 -141209 -158091 -122062 -94239 -125078
14124 -125078 -176756 -178951 -133073 -108112 -138965 -182678 -189390 -169336 -160996 -169126 -171284 -162162 -153481
14111 -153481 -144260 -126533 -110787 -112863 -124146 -127051 -131084 -157646 -194684 -204951 -180074 -151267
14099 -151267 -144104 -154709 -170025 -177854 -159676 -112149 -73443 -84984 -128184 -148132 -140008 -152140
14087 -152140 -194391 -212135 -176689 -134926 -130995 -139419 -121404 -92135 -82010 -83443 -89720 -131798
14075 -131798 -211835 -253620 -199476 -114902 -108115 -175255 -219145 -201402 -173908 -164651 -140204 -98104
14063 -98104 -94415 -144901 -185853 -172571 -139894 -126865 -118713 -107257 -130441 -196155 -238460 -213397
14051 -213397 -174164 -181898 -201667 -167154 -99930 -77031 -112953 -158746 -192291 -223215 -228506 -176716
14039 -176716 -110069 -108550 -165361 -189580 -149268 -118076 -146232 -177444 -150417 -104627 -110026 -147542
14027 -147542 -144869 -101248 -89871 -138478 -184255 -168000 -116019 -95872 -125846 -162661 -163453 -132125
14015 -132125 -106049 -112517 -141050 -155074 -133209 -98386 -96461 -141955 -196267 -210001 -178563 -140835
14003 -140835 -127234 -130561 -133438 -139742 -158544 -174741 -166382 -145266 -146898 -176091 -195641 -180940
13991 -180940 -154299 -146426 -152848 -153198 -148655 -151070 -154607 -148173 -139603 -138546 -133222 -115936 -111952 -143821
13977 -143821 -183750 -186952 -160883 -151283 -165872 -167903 -147639 -139796 -155651 -157759 -128639 -109247
13965 -109247 -131875 -162036 -152625 -119562 -113567 -140682 -160752 -153163 -139467 -142818 -159016 -168090
13953 -168090 -151908 -107617 -64274 -70421 -136748 -205630 -211703 -162973 -125406 -133082 -155171 -156112
13941 -156112 -145901 -151222 -168896 -177030 -176321 -189702 -219642 -229781 -186203 -109907 -66007 -90243
13929 -90243 -144155 -165111 -147093 -137367 -157335 -172624 -155875 -133949 -142524 -169651 -181711 -178138
13917 -178138 -180345 -186942 -180891 -166644 -161802 -164407 -163648 -166722 -177876 -172045 -135019 -107756 -133549
13904 -133549 -178381 -172559 -124079 -111403 -155080 -181691 -145122 -101830 -115168 -155152 -159611 -140946
13892 -140946 -154305 -192396 -193791 -147392 -114325 -134898 -172226 -169348 -121863 -72311 -58713 -85329
13880 -85329 -127385 -154299 -157741 -155939 -160895 -154509 -118706 -76694 -72507 -111692 -152812 -162162 -150964
13867 -150964 -151359 -176416 -210558 -224206 -197157 -143896 -111838 -132168 -175785 -185903 -154373 -131403
13855 -131403 -150112 -178112 -168279 -129292 -110237 -126933 -140720 -117211 -78515 -77152 -127381 -182461
13843 -182461 -186689 -139216 -92766 -90232 -118336 -132888 -117094 -97436 -104643 -136208 -163941 -168790
13831 -168790 -158566 -151479 -149460 -137937 -115114 -106133 -129195 -157886 -149240 -110337 -96849 -129506
13819 -129506 -155704 -128408 -84313 -91787 -146471 -181000 -169621 -155957 -167769 -170578 -134601 -92161
13807 -92161 -87212 -108189 -116282 -112121 -127129 -164157 -191623 -192924 -184524 -182150 -178192 -159651 -129948
13794 -129948 -107337 -110135 -139754 -171454 -173992 -149120 -134750 -152878 -174381 -160413 -121451 -102212
13782 -102212 -116811 -134134 -127931 -109261 -102734 -116567 -143590 -169829 -175847 -151079 -113982 -98072
13770 -98072 -111075 -127523 -128381 -125535 -135348 -149265 -148556 -134148 -123167 -123341 -127157 -128856 -133938 -148811
13756 -148811 -166950 -170543 -150258 -123136 -119376 -142758 -158222 -137376 -103990 -105024 -141440 -164892
13744 -164892 -150045 -130256 -140173 -158937 -145772 -108724 -96090 -126507 -165156 -172500 -147013 -113348
13732 -113348 -92764 -93270 -108813 -119658 -109588 -88839 -84572 -104467 -127601 -136409 -136826 -137783 -133812
13719 -133812 -124234 -128407 -157612 -185981 -178190 -140803 -116927 -127276 -144782 -138761 -119605 -119627 -144704
13706 -144704 -168024 -166828 -145447 -122153 -110891 -118927 -145346 -173606 -179547 -158762 -136518 -137510
13694 -137510 -153337 -156376 -141857 -134655 -149047 -163538 -152423 -127657 -124944 -151595 -174006 -164298
13682 -164298 -136516 -120365 -116888 -104926 -83594 -79638 -107665 -146739 -167624 -164875 -149321 -126716
13670 -126716 -102061 -90935 -104183 -129333 -148101 -163593 -185088 -195040 -167972 -123976 -120390 -171226
13658 -171226 -213504 -186739 -117896 -86425 -120930 -174507 -197202 -187218 -164274 -137339 -118460 -130318
13646 -130318 -169671 -190211 -157041 -102485 -90982 -133876 -175577 -169887 -136062 -120980 -131263 -132834
13634 -132834 -109754 -91714 -111200 -153949 -175565 -162983 -152484 -173311 -195279 -163753 -83627
13623 -83627 -31783 -66134 -148042 -187802 -156255 -112616 -116005 -149091 -156480 -131253 -120388 -148286
13611 -148286 -178550 -169465 -134986 -120400 -135953 -150079 -142831 -129394 -124922 -121616 -116980 -131756
13599 -131756 -171563 -196500 -167963 -113357 -100704 -146040 -187671 -169393 -115115 -92262 -122136
13588 -122136 -161046 -166094 -147650 -144350 -165893 -182704 -170858 -146732 -142394 -157086 -157544 -129673
13576 -129673 -102800 -105845 -123158 -121197 -101846 -95101 -108692 -123109 -132929 -150764 -166342 -147660
13564 -147660 -97788 -66824 -83965 -116707 -124967 -118155 -124605 -138664 -139096 -132752 -136572 -138281 -119827
13551 -119827 -100688 -109514 -128049 -116435 -85225 -84294 -119155 -137850 -113891 -85688 -89509 -103548
13539 -103548 -93693 -76755 -95801 -151597 -195825 -188864 -141658 -99861 -96576 -120472 -131950 -115143
13527 -115143 -99958 -115618 -142197 -142280 -125152 -132105 -163597 -176068 -156682 -142677 -150402 -145449 -110739
13514 -110739 -85596 -99289 -120396 -117669 -118510 -150586 -173612 -140289 -90278 -101582 -162464 -175744
13502 -175744 -100854 -18826 -26432 -115681 -192446 -187051 -119662 -67781 -83127 -139988 -170834 -151648
13490 -151648 -123902 -120664 -115636 -81311 -52958 -76929 -127341 -141539 -117593 -105150 -114144 -111102
13478 -111102 -99549 -117756 -151004 -137804 -83820 -76124 -146495 -209765 -191179 -134150 -115883 -127445
13466 -127445 -116598 -94690 -113990 -170711 -209855 -207929 -184688 -151871 -113034 -95112 -116890 -142586
13454 -142586 -128905 -101285 -117449 -169279 -192460 -168201 -142791 -142417 -139085 -114010 -91456 -92032
13442 -92032 -106113 -126643 -155957 -170932 -138887 -80618 -58425 -85982 -111118 -105829 -105586 -131174
13430 -131174 -141929 -110455 -81379 -101561 -141665 -144103 -110090 -84092 -83887 -97585 -120803 -147694
13418 -147694 -153984 -136128 -134285 -166442 -180428 -135349 -89288 -120513 -189072 -180308 -84806 -25486
13406 -25486 -76249 -155890 -159538 -110367 -100317 -138547 -153562 -122617 -106348 -144211 -189040 -176967
13394 -176967 -115369 -66165 -67941 -104758 -137750 -142727 -123183 -105362 -117762 -160937 -199471 -197206
13382 -197206 -159816 -128632 -130051 -145880 -141422 -109790 -75595 -63728 -79641 -114456 -151524 -169621
13370 -169621 -159047 -137652 -133328 -146892 -151102 -131452 -106026 -95607 -97843 -106035 -129246 -170204
13358 -170204 -201349 -190507 -141748 -89172 -59393 -59026 -84666 -119871 -134417 -114981 -88525 -88825
13346 -88825 -110104 -123100 -124415 -132194 -141181 -126346 -91932 -72512 -78441 -83230 -74817 -74802 -92478
13333 -92478 -105951 -108631 -126061 -158978 -160175 -108700 -61164 -76423 -125536 -137756 -109961 -100672
13321 -100672 -126224 -137570 -109887 -85507 -100445 -126367 -124530 -112418 -128998 -162513 -164453 -125718
13309 -125718 -92582 -101674 -134430 -149275 -134569 -112579 -104433 -108223 -109247 -101196 -94679 -106476 -138428
13296 -138428 -166770 -160357 -117000 -75801 -79270 -121745 -151464 -132758 -89782 -70800 -83228 -92793
13284 -92793 -81723 -71389 -79126 -89840 -91177 -102629 -137509 -163974 -146485 -108262 -102698 -128371
13272 -128371 -127703 -80784 -45075 -71083 -123588 -133199 -98927 -84600 -118847 -153214 -137360 -93372
13260 -93372 -80793 -110809 -137130 -130233 -119465 -141408 -175925 -169156 -110918 -52494 -41598 -71600
13248 -71600 -108311 -135780 -152256 -147959 -120791 -98091 -107172 -132591 -136782 -116530 -101868 -102832 -100770
13235 -100770 -96393 -117681 -162739 -182063 -148600 -106247 -108364 -137083 -131437 -80971 -41607 -55537
13223 -55537 -96700 -111011 -84361 -52812 -56844 -97550 -136841 -140089 -116612 -105893 -121101 -130158
13211 -130158 -109451 -89347 -111334 -156291 -161971 -113692 -70918 -84829 -128550 -141495 -116711 -102245
13199 -102245 -122454 -140423 -114072 -60486 -35360 -58091 -88721 -87039 -66447 -65160 -82663 -82640
13187 -82640 -58024 -50805 -88153 -133605 -133633 -90246 -51766 -45555 -57898 -74187 -98527 -128260 -144415
13174 -144415 -139719 -130090 -128493 -130835 -134512 -144278 -150939 -133292 -94975 -71134 -80933 -100205 -101301
13161 -101301 -92449 -91774 -89353 -69912 -52391 -65338 -94229 -97877 -75258 -69162 -94346 -109972 -87740
13148 -87740 -64071 -83192 -118387 -105107 -44181 -12063 -51442 -105178 -98010 -44786 -21619 -48695
13136 -48695 -68618 -47493 -29393 -57256 -97067 -94125 -64724 -67062 -103303 -120968 -105299 -96367
13124 -96367 -105043 -88898 -41174 -29857 -95917 -172059 -170210 -108925 -78925 -105997 -129148 -111635
13112 -111635 -92057 -104208 -117064 -95079 -66716 -81911 -129507 -147552 -109412 -60346 -60477 -112923
13100 -112923 -159332 -142265 -69173 -9750 -20722 -79035 -110595 -85611 -54495 -72845 -120540
13089 -120540 -130183 -83545 -38826 -51685 -100230 -114527 -68873 -15145 -15530 -62997 -91986 -64100
13077 -64100 -16526 -11869 -58209 -102409 -98404 -59846 -38010 -59975 -98613 -103992 -62842 -20341
13065 -20341 -30420 -86931 -128312 -118430 -91053 -91018 -104612 -90687 -57276 -50523 -73696 -78719 -49281
13052 -49281 -32453 -60576 -93823 -80139 -33773 -10336 -29151 -60978 -75246 -64667 -38920 -23972
13040 -23972 -48161 -99223 -120937 -89131 -60936 -97027 -159474 -154119 -67970 7830 5467 -36711
13028 -36711 -48644 -27911 -20313 -41735 -68835 -85362 -92905 -86393 -57602 -20478 -2991 -13686
13016 -13686 -38224 -65090 -91589 -107260 -97453 -68802 -50028 -57302 -73061 -70836 -52353 -45640
13004 -45640 -65466 -88780 -82436 -51768 -40883 -73136 -111207 -102755 -54612 -25227 -41850 -66463
12992 -66463 -60692 -44429 -56690 -87915 -95188 -71048 -52288 -61001 -77838 -82027 -81693 -88318 -89723
12979 -89723 -69419 -35097 -10746 -13063 -45378 -96658 -134610 -122424 -63302 -10275 -7207 -34940
12967 -34940 -44211 -28467 -25292 -47374 -56321 -22421 24961 35264 3714 -29098 -33354 -18599
12955 -18599 -10702 -22664 -47068 -61303 -45067 -7626 12464 -6477 -37454 -44792 -38704 -51221
12943 -51221 -71725 -61075 -29090 -31960 -74002 -83037 -25619 21138 -20078 -98486 -105190 -40396
12931 -40396 -9753 -56185 -98938 -68371 -8775 4919 -20960 -35236 -35416 -52002 -73242 -59102
12919 -59102 -16647 3591 -15080 -36794 -34792 -23035 -18665 -16703 -14736 -26061 -53021 -75748
12907 -75748 -80286 -73453 -60530 -34611 -524 16132 2051 -19404 -15337 15302 42062 38730
12895 38730 7814 -27536 -47887 -52331 -51217 -49187 -43903 -40518 -51294 -73714 -85744 -74766 -55075
12882 -55075 -43989 -40639 -44751 -70399 -114260 -135878 -107165 -62147 -54076 -77191 -80164 -49714
12870 -49714 -26045 -32312 -44736 -45904 -53718 -74935 -79238 -49982 -19953 -23663 -47395 -58720 -55919
12857 -55919 -55758 -58210 -55654 -55643 -65102 -71384 -64289 -55363 -52252 -40812 -18886 -16947 -51350 -86163
12843 -86163 -80914 -51082 -38764 -46295 -46477 -40605 -53842 -81706 -92669 -82487 -78162 -85678 -79644
12830 -79644 -52035 -29645 -32251 -47838 -58534 -61218 -57076 -49124 -51154 -69875 -82186 -64511 -37815
12817 -37815 -40281 -59912 -47049 1807 30601 9906 -20561 -21748 -13722 -28020 -48304 -43489
12805 -43489 -25465 -26741 -43461 -44525 -23539 -4541 -5325 -23670 -49008 -64318 -52476 -24401
12793 -24401 -21257 -61855 -108303 -113922 -84812 -59881 -49344 -33846 -11836 -3763 -11970 -16457 -13408
12780 -13408 -22848 -51858 -79571 -85872 -72098 -50113 -32318 -32181 -51255 -65891 -51258 -19174
12768 -19174 -6797 -25246 -45295 -40702 -22500 -19377 -39730 -63276 -63363 -35121 -4103 1260 -10926
12755 -10926 -5267 20563 17063 -44789 -113121 -115150 -58376 -15159 -15148 -18501 -2956 -7089 -56730
12742 -56730 -107390 -104245 -58133 -17526 2436 17255 25168 11472 -11412 -12522 12125 36817
12730 36817 45011 40720 27261 6529 -4679 9650 33201 33053 8698 -6450 2733 12605 3451
12717 3451 -9784 -8514 -4123 -13749 -22869 -5318 28208 37372 12307 -6648 13651 48731 51558
12704 51558 21881 4597 21500 43618 43012 34480 40982 49758 38285 19823 20577 27592 7660
12691 7660 -29304 -38221 -11887 8597 6843 17551 58657 93581 93434 84280 92574 94663 70551
12678 70551 59091 95236 131749 100956 31427 18522 81812 135309 115630 65023 56279 95542
12666 95542 137158 149934 132594 97307 67923 66995 83665 84086 67706 73170 110032 132428 110763
12653 110763 82440 89864 109514 94086 54516 42999 70360 94883 89522 73763 75584 97832
12641 97832 126187 143703 138124 116238 103610 110550 114786 101646 97045 125693 161245 163582 145798
12628 145798 150847 175694 179676 163658 174512 222040 255877 244059 215424 200825 190859 181390
12616 181390 201351 254052 284864 258230 222112 239546 292628 316154 300388 294729 321242 347349
12604 347349 345978 331130 327051 341012 368340 391661 382142 336126 297106 301359 320787 309976
12592 309976 287784 304494 343070 337919 293595 289715 344761 373878 328569 282113 305403 345124
12580 345124 321111 276102 310860 408332 448426 392900 336153 352585 401871 423753 430299 450098
12568 450098 461931 448847 454008 512322 574873 573646 527639 513956 555791 607527 638183 662598
12556 662598 690647 706347 705992 707343 711785 701281 680761 680061 703180 717176 704306 684853 673114
12543 673114 652237 614894 590270 600354 619220 608460 571777 542998 535802 535727 531270 524101 514217
12530 514217 500258 491564 498010 510277 510837 502847 506576 525726 540448 542598 556363 603304 657458
12517 657458 664087 613391 572007 611588 711775 772307 737057 669205 667464 735163 786289 772872
12505 772872 742603 753124 788756 801689 792051 795686 816382 821838 798874 768108 744199 719853
12493 719853 693356 678902 682152 691479 698195 701089 688656 645524 584600 546025 551010 577264
12481 577264 592016 589212 579616 563044 532269 496736 482019 502023 541321 570224 575258 570252
12469 570252 574240 583851 579742 559347 543315 541820 538170 524175 528757 581062 658546 705568 699720
12456 699720 670335 654125 661195 682262 699820 694034 666781 654557 683561 719997 709392 660956
12444 660956 637734 658209 671906 651501 638854 661081 670127 626813 587088 624043 701285 715854
12432 715854 654676 613676 648005 692929 673168 617158 601954 632647 647375 623528 609868
12421 609868 642937 686192 683937 644209 626424 653563 679176 658670 618537 616424 651376 667566
12409 667566 650658 659232 729240 802243 804139 757674 746828 786458 805111 764789 722147 738119
12397 738119 786115 797200 759455 724845 736175 786038 837970 858440 835689 790742 763494
12386 763494 771046 789756 792333 786832 800513 839373 883220 909958 909726 889184 875674 897548
12374 897548 943312 964129 940160 917450 944796 998253 1014932 988357 975182 1003181 1027227
12363 1027227 999796 942528 913205 927643 951246 957131 957975 976504 1010086 1038742 1056557 1078370
12351 1078370 1113339 1145551 1154363 1148306 1157423 1186198 1198298 1167514 1124785 1124577 1172288 1217401
12339 1217401 1220853 1198528 1187765 1197326 1208024 1205760 1195812 1192018 1202991 1224165 1240716 1247652
12327 1247652 1264692 1311891 1369379 1389510 1362131 1339895 1374127 1446270 1494540 1496786 1490739 1511394
12315 1511394 1544153 1555746 1546590 1548483 1579528 1622252 1648241 1651315 1649121 1656087 1663355 1652254
12303 1652254 1626280 1617130 1647227 1692315 1699857 1650415 1586084 1566222 1604455 1663389 1704057 1719742
12291 1719742 1719695 1704704 1677158 1661131 1686223 1749056 1809890 1834850 1828291 1816948 1816994 1828043 1846503
12278 1846503 1868150 1884516 1893414 1909281 1946559 1994605 2026613 2035054 2041327 2066586 2110040 2161858
12266 2161858 2218523 2273944 2313346 2334431 2362636 2424147 2510132 2590303 2659506 2742997 2845908
12255 2845908 2924047 2929884 2875453 2821172 2801959 2792466 2757026 2707477 2683722 2689877 2685404 2645334
12243 2645334 2597934 2584197 2602801 2621150 2627474 2640926 2670593 2693690 2686245 2657521 2640453 2656844
12231 2656844 2700903 2750069 2784946 2803772 2822600 2858448 2912056 2971694 3029079 3080263 3115787
12220 3115787 3129719 3140713 3181450 3256271 3329818 3374980 3414204 3487682 3590448 3673213 3711276
12209 3711276 3744636 3831000 3974122 4120787 4224896 4293482 4363373 4448950 4526750 4564450 4552386
12198 4552386 4511090 4480708 4497726 4563050 4632913 4662880 4665662 4701657 4802812 4932980 5040488
12187 5040488 5120985 5202182 5295431 5400424 5533743 5702625 5862255 5953693 5983870 6013961
12177 6013961 6062811 6080539 6035531 5969475 5935620 5932681 5935148 5942634 5959066 5966583 5965877 6001743
12165 6001743 6096396 6195028 6238711 6260505 6338909 6475398 6595023 6665013 6735810 6851574 6989996
12154 6989996 7116417 7239220 7379008 7527551 7668960 7806971 7944807 8069122 8177473
12145 8177473 8292843 8429206 8569301 8695803 8819221 8958363 9117530 9294623 9483978
12136 9483978 9662916 9810546 9949996 10130447 10352159 10555951 10710502 10861615 11061384
12127 11061384 11294212 11514663 11717466 11921184 12117880 12296141 12490790 12750417 13064317
12118 13064317 13372817 13646422 13910352 14194304 14501487 14828757 15179249 15551671 15947601
12109 15947601 16387469 16888404 17429341 17969637 18501066 19053946 19656578 20315713 21028814
12100 21028814 21786367 22571873 23389812 24280380 25272730 26340812 27447854 28618277 29913229
12091 29913229 31343632 32864856 34457283 36150974 37956274 39820060 41661890 43399926
12083 43399926 44924283 46101894 46844846 47145768 47033346 46536750 45713733 44668447 43510871
12074 43510871 42326313 41194280 40188372 39332401 38599449 37979609 37507005 37198281 37016250
12065 37016250 36927633 36948854 37099530 37360229 37716217 38191876 38795874 39485788 40242984 41129454
12055 41129454 42202085 43418503 44708231 46097681 47672268 49440621 51339267 53367681
12047 53367681 55615176 58134433 60876783 63778429 66827585 70009853 73259879 76509205
12039 76509205 79721295 82842845 85787778 88520282 91093993 93545323 95787933 97669744
12031 97669744 99094195 100016695 100348848 99950094 98731481 96724925 94047393 90842942
12023 90842942 87273515 83525621 79786795 76205148 72867380 69809507 67050262 64613905
12015 64613905 62514176 60727580 59211657 57951576 56957554 56213300 55670066 55307544 55155821
12006 55155821 55231841 55499976 55930378 56550520 57392344 58430518 59631706 61031701 62696430
11997 62696430 64629056 66789113 69193589 71921149 75006168 78390942 81985169 85696142
11989 85696142 89378282 92826594 95862949 98381152 100282440 101438110 101779341 101387639
11981 101387639 100440139 99082474 97385235 95381845 93088334 90500665 87622160 84489144
11973 84489144 81141925 77598072 73899797 70165382 66538605 63095863 59851228 56837819
11965 56837819 54117549 51703993 49539366 47573151 45817193 44296981 42987871 41831673
11957 41831673 40794073 39883283 39127383 38541984 38100447 37737225 37412927 37173253 37096779
11948 37096779 37181545 37345707 37558944 37898970 38431493 39104749 39837587 40661078 41679875
11939 41679875 42913682 44264502 45630465 46955658 48153139 49072018 49583715 49638318 49206991
11930 49206991 48245435 46769347 44908474 42825284 40619448 38359344 36151054 34098092
11922 34098092 32220797 30487154 28902720 27498680 26249351 25085972 23995075 23024023
11914 23024023 22176296 21380865 20594104 19859458 19224371 18660184 18115020 17594777 17133410
11905 17133410 16720107 16316625 15923652 15572097 15261347 14958978 14655614 14372037 14113639
11896 14113639 13861922 13612525 13380484 13163493 12938728 12703688 12484544 12293476 12109055
11887 12109055 11910394 11703401 11502983 11315309 11147488 11008565 10889042 10762762 10619981
11878 10619981 10476891 10345375 10219978 10103509 10013230 9944400 9858402 9731229 9589098 9471233
11868 9471233 9380925 9301131 9235168 9195920 9169849 9129905 9076895 9032004 8993927 8943992 8894632
11857 8894632 8886089 8917765 8924406 8852578 8734282 8648592 8624131 8615895 8575799 8510600 8458918 8436972
11845 8436972 8425795 8399289 8349052 8288469 8244256 8236439 8252462 8246843 8184851 8087719 8016770 8006045
11833 8006045 8025754 8021992 7978166 7922552 7886741 7877090 7883555 7895485 7903720 7902806 7899564 7910516 7943985
11820 7943985 7989406 8027515 8048690 8063406 8097375 8167073 8251767 8304783 8312239 8326262 8407217
11809 8407217 8538969 8643976 8689928 8733574 8832795 8959702 9046247 9086737 9139420 9236038 9344799
11798 9344799 9429118 9494404 9559876 9624864 9687429 9765926 9875749 10005720 10139299 10279221
11788 10279221 10430285 10579651 10719867 10871927 11055872 11255399 11445687 11642300 11880348
11779 11880348 12149992 12398812 12603463 12790295 12968644 13096807 13152726 13196279 13306564 13479808
11769 13479808 13647948 13789571 13958098 14188931 14440768 14660940 14860242 15080011 15320110
11760 15320110 15549030 15764764 15995479 16248143 16502998 16758029 17035793 17341893 17656040
11751 17656040 17969941 18295410 18629627 18957087 19297694 19702653 20177820 20659557 21102989
11742 21102989 21549968 22061030 22616231 23144492 23631236 24131693 24681599 25258303 25838812
11733 25838812 26434212 27043732 27631673 28188961 28774429 29445884 30175332 30882925 31544407
11724 31544407 32215187 32943729 33707185 34453411 35171970 35891065 36623322 37353064 38076869
11715 38076869 38821831 39610494 40435463 41289042 42193020 43167760 44190032 45224494 46292790
11706 46292790 47464659 48772491 50183246 51675842 53298154 55110516 57110422 59256766
11698 59256766 61540240 63983767 66596105 69376557 72356546 75594680 79139813 83033629
11690 83033629 87330763 92077494 97296376 103040095 109435145 116624536 124709263 133813102
11682 133813102 144154661 155962344 169364838 184453452 201296193 219550678 237965351
11675 237965351 254533433 267370260 275366986 277952775 274591578 264988483 249822071
11668 249822071 230933286 210600124 190668144 172257653 155895884 141647749 129247515
11661 129247515 118366153 108820897 100512582 93272899 86893267 81241716 76237455 71756735
11653 71756735 67676453 63978849 60702029 57801760 55162539 52733308 50546475 48596711
11645 48596711 46801929 45107795 43541808 42127052 40815006 39546921 38325741 37183887
11637 37183887 36121172 35111717 34136255 33171368 32177251 31135968 30086502 29090841 28172470
11628 28172470 27307355 26466275 25649121 24881998 24190033 23571038 22997211 22448374 21932612
11619 21932612 21459059 21005986 20543964 20079248 19637860 19212264 18767567 18305535 17876194
11610 17876194 17507706 17164824 16802825 16430133 16086834 15784833 15502501 15226024 14965168
11601 14965168 14728567 14503908 14268577 14015047 13764174 13546880 13363974 13175365 12948766
11592 12948766 12707612 12500689 12333120 12168129 11994821 11842552 11716693 11576983 11408956
11583 11408956 11263930 11182577 11120282 11004367 10839039 10693673 10597779 10506020 10372400 10209744
11573 10209744 10059552 9937307 9825123 9697414 9542219 9370991 9211708 9081852 8971770
11564 8971770 8864843 8760629 8660463 8547910 8411541 8273622 8164088 8076171 7981801 7880905
11554 7880905 7794745 7715717 7611114 7482760 7376945 7319645 7281158 7223528 7148312 7077069 7015716
11543 7015716 6960160 6910834 6861398 6797122 6721757 6660913 6623318 6587236 6540873 6501970 6477169
11532 6477169 6441545 6388120 6356573 6370934 6385471 6345547 6274647 6239898 6247189 6236749 6181020
11521 6181020 6120578 6090562 6072807 6044341 6019047 6009312 5991954 5949393 5907010 5888776 5866211
11510 5866211 5796877 5693734 5610292 5566543 5532223 5480418 5417794 5358511 5304872 5263230 5248011
11499 5248011 5256102 5260423 5242004 5210996 5187606 5181173 5195845 5234760 5286141 5326427 5353618 5398762
11487 5398762 5484923 5591015 5678895 5743051 5807172 5879587 5940497 5971190 5967399 5921448 5821405
11476 5821405 5679084 5533271 5410030 5300680 5193430 5102235 5040708 4987875 4911837 4818018
11466 4818018 4742373 4699324 4666379 4622014 4569292 4515550 4457214 4396227 4346088 4307027 4257572
11455 4257572 4186383 4111254 4049646 3992072 3924935 3857989 3803752 3749170 3677736 3603508 3549197
11444 3549197 3503457 3439240 3367328 3327420 3323790 3314292 3273730 3225404 3193257 3165167 3128565 3102508
11432 3102508 3100133 3092684 3052159 3005050 2997885 3024013 3031634 2999749 2960791 2944226 2940085 2930625
11420 2930625 2921997 2925577 2933522 2932179 2924000 2922808 2938431 2970880 3006343 3019886 3002045 2980877
11408 2980877 2990667 3018038 3012864 2960062 2902503 2875991 2860341 2822094 2770305 2732947 2705580 2666430
11396 2666430 2623705 2602203 2593361 2565485 2520600 2493156 2486742 2460745 2397340 2338109 2325903 2343811
11384 2343811 2345361 2321936 2303665 2305522 2308873 2297197 2280925 2278049 2288652 2298621 2298139 2288724 2277963
11371 2277963 2273433 2279970 2299483 2331991 2375042 2421425 2459934 2481034 2483603 2479234 2489670 2531302
11359 2531302 2595520 2652524 2685058 2710712 2756944 2822340 2883120 2933379 2992948 3072871 3159599
11348 3159599 3241038 3321767 3399891 3454509 3473276 3468925 3448831 3392617 3287088 3164044 3071314
11337 3071314 3016448 2967150 2898107 2809985 2713504 2627345 2582651 2590376 2605905 2568564 2484091
11326 2484091 2425953 2437204 2469629 2448809 2371423 2304142 2300529 2349110 2397056 2400352 2353095 2288319
11314 2288319 2252503 2266838 2312088 2355350 2382441 2395882 2395740 2381972 2369373 2378775 2409908 2437388
11302 2437388 2439730 2424758 2421448 2449071 2495336 2524722 2511842 2468202 2431750 2429192 2455117 2488279
11290 2488279 2516979 2543194 2571988 2604969 2638669 2665728 2684614 2707768 2746502 2786484 2798043
11279 2798043 2778599 2762692 2774366 2790778 2777035 2741356 2724260 2737629 2747349 2725143 2691073
11268 2691073 2684572 2705874 2710455 2667858 2609440 2596418 2640184 2681231 2666678 2624351 2621427 2663384
11256 2663384 2689159 2672013 2660774 2690770 2717087 2691840 2657016 2685231 2758824 2793748 2774518
11245 2774518 2774929 2831023 2882062 2875184 2852246 2877818 2939826 2985429 3013301 3061296 3126265 3164295
11233 3164295 3165555 3171238 3210624 3266182 3308728 3331114 3339725 3342367 3350900 3372425 3396166 3408760
11221 3408760 3415862 3425767 3425637 3407411 3403308 3449373 3518173 3540770 3504013 3472336 3492837 3531021
11209 3531021 3533895 3510600 3504587 3519460 3525247 3519559 3530014 3562662 3596035 3625153 3664184 3701413
11197 3701413 3701653 3668504 3656001 3692822 3739348 3755148 3767043 3819505 3889743 3918615 3913466 3946125
11185 3946125 4038096 4121448 4146870 4163712 4237997 4343484 4406035 4424232 4465343 4552571 4639924
11174 4639924 4707989 4800708 4935373 5052392 5107824 5157530 5283892 5476501 5653089 5777936
11164 5777936 5892831 6034788 6182208 6291778 6344890 6347455 6317053 6277597 6242387 6203674 6159596
11153 6159596 6135576 6147815 6166656 6160993 6160183 6213924 6300858 6345503 6331134 6326127 6380506 6464239
11141 6464239 6535782 6604994 6687587 6757254 6793843 6830903 6903523 6991316 7065379 7148863 7269812
11130 7269812 7392018 7464527 7514053 7611621 7760577 7896671 7999500 8123664 8300536 8481321
11120 8481321 8612772 8714981 8844451 9018795 9215157 9414155 9610298 9798540 9980679
11111 9980679 10172606 10382723 10594385 10788789 10976572 11190718 11451891 11748473 12046447
11102 12046447 12317774 12565748 12819042 13093514 13373036 13643774 13927762 14251665 14596951
11093 14596951 14921144 15221232 15531491 15860281 16179195 16481757 16799885 17144875 17483402
11084 17483402 17797658 18121439 18484059 18861894 19224206 19590265 19999069 20452027 20927663
11075 20927663 21428128 21969031 22543610 23138144 23766504 24451587 25188571 25962955 26787813
11066 26787813 27685731 28650682 29665704 30740554 31892296 33108651 34376446 35728929
11058 35728929 37214365 38830735 40544663 42366418 44351822 46534944 48913550 51497199
11050 51497199 54311452 57353748 60600319 64047933 67673516 71346484 74861378 78074481
11042 78074481 80924535 83295515 84966644 85770840 85728474 84951390 83488038 81361995 78713565
11033 78713565 75786002 72773627 69768354 66847168 64115160 61642190 59435132 57500253
11025 57500253 55869843 54540752 53446813 52529190 51792307 51262417 50932413 50777380 50788035
11016 50788035 50958274 51269681 51715096 52310853 53065777 53969948 55033416 56295266 57764011
11007 57764011 59388470 61128172 63021908 65145534 67532546 70185837 73142521 76466411
10999 76466411 80184586 84288201 88792402 93729680 99062994 104652675 110327253 115935932
10991 115935932 121299056 126152121 130190946 133161465 134882868 135223106 134118430 131624611
10983 131624611 127907012 123169011 117620051 111513003 105154808 98831292 92730377 86960017
10975 86960017 81614925 76779947 72473715 68641696 65227886 62220190 59601647 57294371
10967 57294371 55201317 53293874 51611936 50173871 48931045 47827616 46863969 46068976
10959 46068976 45436996 44930875 44534902 44267557 44141485 44140144 44240562 44440525 44759505 45225742
10949 45225742 45859573 46656012 47592766 48674541 49956112 51489997 53256810 55181122
10941 55181122 57209221 59320581 61450730 63456038 65187023 66554763 67487106 67864101
10933 67864101 67564964 66571609 64971882 62862449 60304104 57383048 54257371 51101942
10925 51101942 48029317 45087287 42307496 39724779 37360840 35215681 33274710 31515534
10917 31515534 29919036 28482539 27206141 26057604 24975948 23929384 22946323 22062655
10909 22062655 21259830 20489706 19744005 19054714 18430040 17838486 17267011 16748222 16302957
10900 16302957 15891560 15459567 15012361 14605726 14266909 13958819 13629100 13270130 12917644
10891 12917644 12603454 12323335 12049471 11765593 11482530 11216467 10961175 10698153 10433321
10882 10433321 10199847 10012854 9843301 9656530 9457425 9270855 9094504 8907961 8720142
10873 8720142 8563345 8435241 8291387 8111788 7933050 7789732 7664732 7533139 7415605
10864 7415605 7336211 7256545 7118571 6943763 6817737 6765707 6713882 6603129 6473652 6388029
10854 6388029 6326762 6227746 6092816 5978962 5900201 5816078 5717488 5644754 5602506 5533310 5412460
10843 5412460 5300101 5246590 5205255 5108108 4983538 4913864 4897161 4844674 4723428 4611786
10833 4611786 4577622 4575838 4522572 4417397 4324486 4264006 4195463 4102816 4027231 3997437 3980303
10822 3980303 3930701 3855140 3792548 3754248 3717158 3665267 3604952 3541525 3472521 3411141 3385934
10811 3385934 3397917 3400308 3349336 3265164 3211049 3211612 3224470 3204259 3162002 3134851 3121905 3088532
10799 3088532 3025577 2964392 2927729 2899761 2857777 2806206 2762806 2732905 2714267 2708336 2707915 2689327
10787 2689327 2637194 2567930 2513057 2487355 2483987 2487798 2480673 2448268 2396733 2350693 2322921 2302077
10775 2302077 2280911 2271430 2273447 2256739 2203899 2145868 2119083 2109048 2078028 2030677 2003553 2000302
10763 2000302 1989809 1965379 1951194 1946529 1920443 1874010 1851362 1868089 1881526 1858416 1822284
10752 1822284 1803456 1790944 1769710 1758487 1768266 1766930 1732918 1703669 1716634 1738142 1712438 1653657
10740 1653657 1622656 1630557 1633536 1614576 1601786 1604060 1593046 1558376 1524461 1502959 1480857 1462254
10728 1462254 1467434 1483548 1473703 1443039 1433466 1442931 1421874 1368758 1348517 1380687 1391675 1332494
10716 1332494 1267031 1271861 1314150 1313821 1274591 1257828 1262790 1236556 1186099 1174494 1202575 1196725
10704 1196725 1134775 1088195 1103464 1128962 1109660 1078126 1088280 1119298 1117503 1092037 1093779 1121783
10692 1121783 1123008 1080274 1037118 1027437 1033221 1029010 1026888 1051855 1095646 1118997 1094409 1036423
10680 1036423 990333 989454 1019990 1035215 1010206 970156 953201 959989 960043 939340 918617 924076 956562
10667 956562 992198 1003476 980337 938409 904726 891495 889457 886746 880001 865480 841181 824132
10655 824132 838202 872064 880636 847899 813245 807400 802320 768115 740036 765293 810786 802507
10643 802507 747906 732042 779767 811875 775291 732134 756333 808552 796299 720003 672923
10632 672923 706125 769525 794505 773599 741479 723321 721610 723716 711267 685111 679273 720326
10620 720326 778418 797664 774162 759552 781381 807213 802921 780658 764407 748012 718817 691927
10608 691927 687601 695985 693111 674806 652334 634636 635822 674011 734857 762562 723787 661650
10596 661650 646684 685777 719341 703505 656624 622931 624305 654121 691226 712602 711435 704701
10584 704701 708381 714162 710486 710026 724503 728729 694465 651152 658164 712668 744516 721270 697772
10571 697772 725424 767991 763556 730934 744765 818329 880329 878385 847327 847884 880600 898529
10559 898529 881765 858673 857276 870220 877218 875170 866472 836854 776083 715061 703967 741872
10547 741872 766460 739947 706634 719720 744247 703225 609267 565695 617120 681729 677731 643179
10535 643179 660864 720677 744375 717030 700861 722975 737810 717608 702509 728558 767484
10524 767484 776777 763077 757558 765085 774992 793459 829702 870453 897297 912390 925374 935388
10512 935388 946458 976953 1030332 1078676 1098610 1101222 1103019 1092863 1057328 1016010 997110 993549
10500 993549 975924 936497 890089 844218 799694 769021 761107 756270 728839 687385 660374 649202
10488 649202 630878 603340 590247 598159 604801 597012 587623 584446 572360 540624 505026 488841
10476 488841 497700 521150 543204 547235 528512 505821 502874 516841 525059 521888 523271 533382 537118
10463 537118 533076 542262 569937 589016 582276 575272 600226 644492 664646 645416 617939 616247
10451 616247 635414 644102 630043 616768 626114 635605 600175 522650 468246 480678 513596 492018
10439 492018 423735 388318 414732 439074 409834 371252 391852 453772 474761 422318 349754
10428 349754 319226 333604 354158 354143 340190 335349 350334 369925 371560 355340 338671 321307
10416 321307 286193 244865 242112 288084 323285 293547 232619 219584 269032 316962 313433 277874
10404 277874 253641 252727 262782 274056 278917 268176 244783 225566 220351 223827 230647 240395 246023
10391 246023 237864 222260 217013 226046 236266 238756 234390 222430 205735 202087 223868 250484 250459
10378 250459 228023 214857 217236 210873 194010 202344 251629 300517 297695 245675 195362 189324
10366 189324 224469 261333 262695 230180 200650 198652 208052 207945 210210 226553 226623 183351 139632
10353 139632 160500 225884 248606 205515 168243 184521 214954 220180 223067 237673 223948 174541
10341 174541 161958 223073 275873 240907 172043 161943 185228 160996 117891 148998 227114
10330 227114 223788 122019 55678 100027 167353 169819 151789 178318 209575 188318 160161 195078
10318 195078 254955 250687 187405 147971 160348 178855 180074 186595 202590 206921 207582 230100 255093
10305 255093 238253 190870 170220 188265 199336 183089 169232 169870 157889 129476 120152 136838
10293 136838 140006 119138 118935 157090 183080 163007 141501 162552 186160 155232 102476 107585
10281 107585 168538 199623 158890 101175 87422 108238 127268 144121 171944 191665 175856
10270 175856 137812 115358 116694 119133 115586 124806 151781 171805 166696 151181 147362 152816 151956
10257 151956 143651 137240 130694 113222 85876 62888 55010 64944 93420 133129 161609 159503 134638
10244 134638 111455 100629 97092 99953 108957 108210 85760 65882 83308 123390 132188 95952 62910
10231 62910 67872 85299 85009 83465 100523 112617 97068 80785 91965 104414 90432 87124 134368
10218 134368 182031 151245 69466 43246 96392 139428 118136 87872 102241 126644 118847 108882
10206 108882 129739 141189 99929 48413 54141 103952 135051 133915 128513 116370 81713 58548
10194 58548 91346 146501 146714 89494 50501 65821 90993 90260 89468 114053 139360 134978 109491
10181 109491 84796 67431 63313 78474 90961 67061 18855 -1716 21062 47646 53766 62436
10169 62436 85448 94045 77280 70005 86952 87922 51814 27345 56530 99705 98501 69464 67038
10156 67038 88472 88758 66863 62894 81588 89523 82924 89057 100567 79182 33024 19452 51792
10143 51792 70974 40375 6389 21782 60871 64950 36723 30992 67717 108672 118976 105364
10131 105364 85126 57139 23186 8461 31677 67821 71311 38090 16786 43483 88728 97298
10119 97298 67083 49573 70424 92737 77470 40134 16294 5236 -9841 -12052 26157 82500
10107 82500 102147 76433 53219 60733 71116 56842 36678 38238 51840 53036 44200 43204 49897
10094 49897 50921 43914 35523 28638 28426 44256 68362 72094 45031 19913 33124 73317 95795
10081 95795 80329 49331 31104 27960 24802 14060 5392 14774 44708 76250 86859 74721
10069 74721 56000 42431 36689 43060 58439 57510 19912 -26998 -32313 3176 21331 -4966 -26617
10056 -26617 5010 60030 74085 38034 -4301 -22971 -18340 7669 46035 62993 39197 12569
10044 12569 29845 69957 74947 45800 37941 61885 65199 29487 9055 39762 77209 70474
10032 70474 39900 29603 31142 14263 -3110 18539 63670 75324 40256 5024 4435 22401
10020 22401 32331 33599 33179 25455 8489 -3976 -2647 4090 9913 24922 53979 75306 62662
10007 62662 25723 7088 29559 60807 50402 -1009 -36088 -16104 25953 35537 16466 16336
9995 16336 43217 53215 28582 9211 21308 30436 5824 -16977 8973 60414 77368 55320
9983 55320 41827 53266 57874 41006 27394 29754 28939 18432 19313 34830 36423 14242 -2086
9970 -2086 5072 11436 -1905 -11858 4026 23696 16242 -6483 -12503 -2947 -3442 -16348 -20697 -14365
9956 -14365 -20491 -48180 -73285 -65867 -22454 30973 59067 45197 9810 -6003 14828 46073
9944 46073 53293 36263 23207 33322 59061 77964 71454 40344 8769 948 10081 9439 -1572
9931 -1572 7439 42962 63559 39388 4967 13034 56281 78783 55287 16634 -863 8224 33907
9918 33907 64469 78123 54810 6694 -29649 -38770 -39421 -48140 -57239 -55252 -42575 -20263 10127
9905 10127 30164 18208 -12161 -19359 8170 33610 27777 9570 6891 9677 -4686 -23586 -16495
9892 -16495 12185 26611 13723 -1169 1639 7995 -431 -11874 -1315 29244 49733 42883 27443
9879 27443 28160 35185 17169 -24668 -45356 -17532 21259 15550 -28265 -50475 -24973 6996 3288
9866 3288 -19866 -21018 4035 24107 19610 375 -13542 -9109 11951 28897 19637 -5356 -7396
9853 -7396 26409 57814 48418 12040 -11824 -14823 -16148 -19301 -10722 6927 15971 14314 13800 13110
9839 13110 2623 -10529 -14595 -22339 -51141 -80846 -74825 -41901 -29568 -48906 -56218 -25772 8304
9826 8304 9566 -5255 -3710 5570 -3996 -22474 -18581 2412 450 -38354 -78552 -81875 -51086
9813 -51086 -16789 766 3707 612 -7094 -19785 -27117 -12769 21010 44382 32688 2361 -8787
9800 -8787 4856 12005 -2334 -13966 -5473 216 -19689 -43075 -36368 -13934 -21104 -63356 -94458
9787 -94458 -82564 -52650 -45603 -59703 -57264 -21680 14293 6539 -41938 -77192 -58557 -12542
9775 -12542 989 -30304 -59226 -53479 -39699 -49664 -63077 -45104 -12341 -10787 -41836 -61544
9763 -61544 -50722 -35870 -34682 -29353 -10069 -2196 -25498 -58361 -69006 -59446 -53915 -60090 -64065
9750 -64065 -54579 -36735 -27014 -39551 -67754 -81813 -62886 -35941 -40638 -70280 -77089 -46422 -23065
9737 -23065 -42615 -77671 -84340 -67222 -57976 -56851 -42359 -22283 -25945 -51122 -64357 -55392 -48612
9724 -48612 -54833 -54444 -41299 -41596 -66159 -80293 -54427 -19318 -30497 -87898 -131340 -120439 -83087
9711 -83087 -67371 -74707 -72107 -55752 -60136 -95675 -116800 -82377 -22847 -5352 -40589 -70953
9699 -70953 -58704 -38354 -55897 -95825 -108942 -88522 -73837 -87037 -108318 -114592 -106393 -90189
9687 -90189 -65979 -43119 -41656 -64203 -86466 -88043 -76582 -71133 -76220 -82291 -79974 -66480 -48715
9674 -48715 -43977 -63849 -93128 -100381 -76368 -47689 -44613 -68265 -96889 -111240 -104852 -81103 -51324
9661 -51324 -30175 -26230 -39625 -66353 -95816 -109171 -96329 -72983 -63212 -67257 -68115 -67944 -87587
9648 -87587 -123211 -135983 -102176 -47364 -11569 -4448 -15664 -43270 -81358 -99557 -72191 -20831
9636 -20831 5653 -7263 -27267 -26657 -18124 -29404 -63212 -95978 -105864 -92014 -70675 -57759 -55044
9623 -55044 -54377 -53316 -56784 -61511 -54547 -36015 -27181 -42064 -65555 -75654 -72283 -64821 -47526 -14353
9609 -14353 13139 4460 -35637 -70165 -78066 -73247 -73388 -75914 -71246 -57953 -38529 -18932 -15077
9596 -15077 -38778 -74051 -89636 -79423 -67687 -69459 -71299 -60705 -49912 -56624 -80049 -107853
9584 -107853 -129733 -135345 -118301 -91988 -81706 -91374 -98373 -90234 -82499 -88510 -97228 -96435 -92710 -91281
9570 -91281 -82683 -69655 -78421 -115788 -141592 -117829 -65124 -34853 -41069 -56770 -64760 -72452 -82590
9557 -82590 -87825 -92741 -106550 -116007 -100341 -70570 -56783 -58560 -50664 -38981 -59460 -108059 -125487
9544 -125487 -81606 -29680 -36024 -89289 -125153 -118029 -98897 -92568 -87603 -73772 -66880 -80103 -100219
9531 -100219 -110070 -113398 -119974 -122648 -108863 -85598 -73867 -81375 -96729 -110120 -122325 -128481 -112618
9518 -112618 -74872 -49888 -70834 -117085 -129420 -88721 -48076 -61295 -105715 -114554 -72081 -31279
9506 -31279 -36038 -70137 -95697 -102230 -97946 -87804 -84641 -109651 -152273 -159530 -102768 -32328 -23041
9493 -23041 -78501 -133314 -144234 -132021 -127329 -121670 -94675 -58059 -43710 -61547 -89499 -99181
9481 -99181 -80921 -50420 -37132 -57517 -94760 -114017 -101737 -80396 -80215 -104896 -129333 -125910
9469 -125910 -92789 -59814 -60082 -89703 -108686 -94050 -74107 -86618 -119746 -129472 -106371 -83449
9457 -83449 -78095 -72167 -59548 -65981 -99485 -123487 -109672 -82797 -80719 -101359 -123168 -145502 -167621
9444 -167621 -159421 -105964 -57854 -75500 -133908 -149523 -104952 -77072 -118486 -175954 -170079 -109320
9432 -109320 -71366 -95784 -146117 -171047 -160808 -138969 -128053 -131709 -135317 -121649 -94718 -81290
9420 -81290 -96853 -120257 -118947 -91293 -65643 -63548 -82467 -109410 -130977 -132500 -109434 -82153
9408 -82153 -80052 -106296 -134909 -146343 -147145 -147566 -140449 -118272 -96777 -100097 -125506 -142281 -130796
9395 -130796 -108458 -105471 -122219 -126857 -99106 -62455 -59200 -99031 -148289 -170558 -161473 -138873
9383 -138873 -116834 -101423 -97357 -102700 -106276 -104462 -110130 -129261 -141219 -124197 -90858 -73162 -78125
9370 -78125 -87055 -93888 -108836 -122430 -108029 -73716 -68289 -108543 -140424 -112883 -58743 -49916 -90457
9357 -90457 -114657 -91062 -65860 -82937 -116367 -119498 -99857 -98263 -118557 -128112 -117715 -112237 -120291
9344 -120291 -119074 -101528 -97564 -125867 -157112 -154049 -124969 -105727 -104861 -101517 -90248 -90797 -109841
9331 -109841 -126590 -127875 -128608 -140307 -144574 -122719 -94893 -99941 -140813 -176747 -173873 -143056 -119701
9318 -119701 -121744 -138518 -151067 -150724 -140362 -127791 -121198 -125658 -138014 -145259 -135005 -112466 -99891
9305 -99891 -108477 -116870 -95673 -52961 -32072 -55748 -95993 -114320 -108465 -97927 -87295 -75513
9293 -75513 -81688 -119750 -156525 -141684 -83140 -48532 -79037 -140102 -173327 -161318 -123170 -81298
9281 -81298 -55987 -61667 -84317 -89798 -74169 -73180 -101566 -124107 -116247 -108030 -126586 -140416 -115349
9268 -115349 -84967 -98449 -130950 -122791 -85069 -80291 -109028 -110469 -80305 -87206 -147268 -182188
9256 -182188 -146881 -104630 -113719 -126380 -81957 -28365 -51283 -128278 -156891 -107375 -52006 -47240
9244 -47240 -72949 -94877 -111196 -123066 -121381 -115243 -121679 -125327 -102669 -80185 -102183 -144540 -138529
9231 -138529 -86760 -69695 -116915 -160854 -153164 -137814 -157422 -172058 -139456 -101384 -109363 -127326
9219 -127326 -99254 -62539 -90910 -158203 -170625 -122964 -108321 -159870 -193466 -146468 -78513 -75516
9207 -75516 -124850 -152446 -135338 -111374 -106017 -108833 -109583 -111512 -114860 -118489 -127879 -138327 -129916 -104983
9193 -104983 -103699 -145452 -180115 -147974 -74719 -48545 -98036 -150500 -135983 -84253 -76472 -129980
9181 -129980 -182480 -185065 -160908 -153926 -158110 -135187 -85697 -58549 -83155 -128971 -152367 -153327 -155282
9168 -155282 -152907 -123700 -82142 -73084 -103525 -126822 -113596 -96098 -112373 -142749 -142975 -116387
9156 -116387 -106415 -127149 -146782 -142508 -131804 -137413 -152462 -157365 -150918 -147727 -154510 -159466 -142901
9143 -142901 -100915 -63496 -74688 -136756 -189716 -176828 -119793 -89064 -103873 -113868 -91024 -79441
9131 -79441 -116808 -158780 -141167 -85736 -73969 -124691 -169710 -162764 -143662 -160922 -188995 -174815
9119 -174815 -128672 -108021 -127275 -142921 -128244 -108744 -111248 -125420 -136641 -155302 -184292 -192559
9107 -192559 -158653 -116278 -115290 -151213 -174705 -164506 -148519 -149965 -154921 -147384 -140656 -151454 -168066
9094 -168066 -168522 -155000 -148999 -160892 -179428 -186199 -173511 -154796 -155776 -180045 -189646 -149303 -88137
9081 -88137 -74318 -117420 -147651 -120986 -90631 -121519 -178307 -172512 -100418 -53012 -84255 -144616
9069 -144616 -167479 -155738 -147365 -148104 -142315 -134725 -139632 -151807 -159583 -164630 -164586 -145456 -117385 -122145
9055 -122145 -169841 -204730 -179556 -130849 -124266 -151746 -151550 -117982 -113313 -160117 -196525 -170863
9043 -170863 -120535 -112245 -147468 -176619 -178338 -174017 -177363 -176185 -163258 -148503 -137397 -127376 -128817
9030 -128817 -158591 -202482 -213086 -166966 -106448 -97790 -151775 -211116 -222890 -199170 -186272 -192438
9018 -192438 -181970 -141523 -111257 -127575 -166843 -180933 -166864 -158387 -161202 -147926 -119097 -114991
9006 -114991 -149145 -179630 -174776 -162819 -177827 -195248 -171761 -123310 -106716 -133959 -159856 -155890
8994 -155890 -144016 -146149 -148052 -134561 -121781 -127926 -141061 -141587 -133181 -126061 -111326 -81762 -62571
8981 -62571 -87284 -146446 -190261 -187718 -160419 -147967 -157030 -161169 -145360 -131574 -149055 -188782
8969 -188782 -209187 -192178 -168913 -170878 -179779 -161840 -134361 -144675 -182456 -176586 -104412 -42739
8957 -42739 -62739 -125421 -146385 -125925 -132418 -173917 -181483 -133436 -103065 -140365 -185303 -162291
8945 -162291 -101783 -90973 -140010 -178833 -171580 -153464 -151039 -142699 -119070 -114574 -143592 -160421
8933 -160421 -127831 -84767 -95550 -156848 -204247 -198359 -159873 -125083 -108938 -114006 -137061 -156735
8921 -156735 -146106 -111147 -91826 -110702 -141530 -145591 -122635 -106336 -118418 -146276 -164451 -163230
8909 -163230 -152103 -144116 -143495 -146423 -148160 -146960 -144506 -146242 -156648 -167394 -158245 -125867 -105030
8896 -105030 -132281 -184757 -192378 -131018 -66381 -69839 -122799 -153531 -144078 -136707 -144087 -128585 -84806
8883 -84806 -68698 -109189 -153086 -144299 -106422 -94530 -109800 -120801 -130597 -154898 -163554 -120496
8871 -120496 -65452 -74605 -141365 -177449 -144120 -102494 -108495 -134544 -135406 -124005 -129903 -136681 -118076
8858 -118076 -95933 -105215 -131496 -136478 -120705 -110897 -108787 -103087 -109156 -142308 -171186 -156000 -118897
8845 -118897 -115102 -142825 -146715 -110180 -77511 -75646 -80407 -78332 -96942 -143904 -174034 -154799 -117849
8832 -117849 -106897 -115244 -114122 -105279 -102969 -96095 -72962 -57663 -76803 -109757 -115302 -93107 -79332
8819 -79332 -93303 -122795 -147393 -144782 -96469 -25413 -1474 -59399 -133453 -132831 -67048 -28516
8807 -28516 -55044 -86237 -70959 -42096 -49036 -78857 -92053 -90316 -99095 -115251 -118290 -109683 -100840
8794 -100840 -85020 -60065 -54938 -89234 -125254 -108994 -49556 -11277 -29457 -76168 -109568 -115944
8782 -115944 -99668 -71996 -57729 -75585 -102355 -93234 -49208 -25261 -53425 -96253 -103767 -82199
8770 -82199 -70361 -74422 -69913 -54649 -53291 -69121 -74308 -58977 -51109 -66727 -74818 -46214 -13638
8757 -13638 -35525 -103536 -138143 -96938 -41664 -54702 -119121 -141995 -91450 -43506 -68854 -131454
8745 -131454 -146872 -102264 -59647 -57641 -69759 -61406 -36212 -13435 -404 -1336 -18904 -35022
8733 -35022 -23740 5846 15709 -294 -3572 22491 38433 12074 -26008 -30802 -11572 -5316 -9650
8720 -9650 4247 28860 26728 -4605 -24810 -11154 16192 32467 33090 19748 1420 7055 51949
8707 51949 93428 74585 16232 900 48132 77304 32891 -22076 721 80330 120709 89012
8695 89012 40844 19417 9139 -1929 12700 61245 98169 83737 43584 34256 72419 125530
8683 125530 154463 143663 106630 80586 97866 144639 167147 137765 93719 86904 116443 141771
8671 141771 146077 147913 154549 144897 110569 82962 98704 152645 200887 203888 159486 101736 72867
8658 72867 87905 121975 139788 138385 147654 185035 227071 238790 219774 204529 220468 259111
8646 259111 290464 297571 293248 303232 332296 352913 339629 312015 320615 380699 444834 462892
8634 462892 447752 449718 482382 517135 545179 591542 655377 691255 681366 678762 732795 808761
8622 808761 838764 827009 837202 883735 906713 865153 788018 711301 629771 545402 500604 511589
8610 511589 519712 470633 402631 388350 419454 427281 400984 396877 425926 422874 357389 294927
8598 294927 297591 330587 329699 310774 336835 404599 443188 423293 396805 411964 447192 458699
8586 458699 452108 468941 522080 578435 602197 593680 583108 598459 644057 705363 767657 826616
8574 826616 886797 961337 1069361 1212245 1348213 1419161 1419347 1407130 1419525 1406095 1295837
8563 1295837 1110650 950274 863985 803279 720411 644997 618019 606906 552918 470696 428423
8552 428423 440220 449045 421168 388665 377782 360360 314282 277259 288631 317910 310459 276617
8540 276617 268958 284979 267418 209255 183471 235785 309087 321665 275791 236169 233664 247757
8528 247757 263849 288452 314981 329308 347793 398140 462994 497659 506988 542779 611985 654468
8516 654468 638634 611802 614096 606898 545112 465159 428357 417138 368695 287047 235534 226085
8504 226085 203398 148821 116675 140632 175600 169113 131945 99387 73538 45671 32096 43245
8492 43245 51158 29814 -637 -8644 -3180 -11906 -31039 -35980 -23167 -6691 7812 13994 -7258
8479 -7258 -55070 -87205 -71589 -38719 -40258 -73670 -93637 -83617 -67013 -56268 -41127 -25622
8467 -25622 -29220 -48603 -61432 -70643 -101679 -150022 -173732 -149086 -99312 -60322 -48673 -64961
8455 -64961 -95052 -108010 -88224 -66174 -78339 -105638 -102353 -78336 -87529 -131979 -151386 -125913
8443 -125913 -112306 -144381 -172768 -151860 -117810 -119836 -135084 -122733 -110388 -143638 -187288 -168348
8431 -168348 -99920 -71236 -113268 -158896 -152829 -125948 -130854 -162896 -181376 -169945 -145721 -133197
8419 -133197 -144793 -165659 -157477 -107740 -67105 -91650 -152818 -165029 -110789 -70923 -105256 -169221
8407 -169221 -190553 -171036 -157578 -157601 -147278 -136061 -157144 -202868 -226773 -211433 -188180 -185430
8395 -185430 -197044 -207411 -212522 -208856 -192299 -176051 -181919 -205640 -216604 -201387 -183362 -186601
8383 -186601 -200894 -198523 -172455 -142426 -129009 -133094 -140827 -143514 -148689 -166906 -189649 -194025 -175102
8370 -175102 -156987 -158859 -166712 -157617 -136189 -122625 -118965 -117094 -126648 -155581 -171461 -133779 -71510
8357 -71510 -70751 -156818 -240823 -231280 -160438 -137329 -193951 -249152 -232687 -176793 -150844 -158037 -150040
8344 -150040 -116434 -100861 -129712 -173876 -194858 -192639 -189127 -192078 -197001 -203459 -206901 -191931 -157673
8331 -157673 -134079 -145251 -169206 -166862 -143858 -145941 -190521 -239939 -252953 -229438 -191275 -152946
8319 -152946 -129240 -138329 -172170 -193198 -186542 -184542 -208506 -221533 -185082 -133190 -131360 -176726
8307 -176726 -203283 -184815 -166542 -182099 -203539 -200321 -190400 -195664 -194788 -163923 -126556 -118838 -136744
8294 -136744 -159978 -194726 -242520 -258935 -207578 -136175 -127999 -181428 -210247 -173643 -132219 -146561
8282 -146561 -188245 -198389 -180875 -178451 -191844 -186846 -165037 -164697 -191188 -202145 -175173 -145383
8270 -145383 -154678 -196122 -230142 -232042 -204138 -161517 -126267 -120031 -141798 -163296 -162691 -152265 -156900
8257 -156900 -176791 -190720 -187794 -175810 -164178 -158907 -169371 -197030 -219888 -213993 -191994 -191657 -218550
8244 -218550 -231870 -205470 -173462 -184966 -232900 -263372 -247994 -211897 -189885 -188698 -200144 -219719
8232 -219719 -236608 -230873 -200494 -172857 -170406 -180826 -180988 -175020 -183664 -205393 -215708 -204315 -189127
8219 -189127 -189234 -202551 -214934 -215977 -201821 -177014 -157965 -161107 -183437 -206729 -221848 -232750
8207 -232750 -235421 -216517 -183225 -170747 -199258 -238880 -242051 -203949 -167185 -166948 -192411 -207178
8195 -207178 -191902 -159840 -140345 -151038 -178955 -190667 -171619 -150655 -166936 -214326 -244874 -234354
8183 -234354 -213666 -215985 -223750 -204009 -174333 -182184 -221037 -224226 -163965 -105749 -121999 -187184
8171 -187184 -214498 -180609 -151396 -176736 -219330 -217872 -176613 -149889 -163145 -192930 -213696 -222891
8159 -222891 -220448 -201257 -176851 -174108 -198622 -221973 -219450 -201969 -196112 -208269 -224568 -233950 -234255
8146 -234255 -223768 -203645 -184116 -173320 -163702 -145174 -129588 -143055 -188208 -230426 -234006 -203463
8134 -203463 -176389 -179858 -206737 -233175 -243511 -233466 -206133 -178558 -178532 -213075 -246620 -236919 -193640
8121 -193640 -171398 -195121 -225319 -219038 -192992 -190084 -207699 -207461 -185410 -178474 -197012 -205298 -186832
8108 -186832 -177645 -204239 -233220 -223245 -191160 -179109 -182871 -166315 -131438 -118218 -138539 -162949
8096 -162949 -175765 -191369 -207467 -196627 -163200 -155223 -188811 -209319 -170407 -111831 -105208 -149049
8084 -149049 -177632 -163228 -147004 -161089 -178248 -164529 -137382 -135885 -161048 -181570 -182753 -176002
8072 -176002 -168283 -154758 -141412 -145805 -168839 -188838 -191604 -185876 -180173 -166689 -143729 -133901 -157083
8059 -157083 -198084 -225106 -230662 -227878 -215161 -180025 -138555 -131171 -166126 -204027 -217387 -227050
8047 -227050 -250879 -256870 -214157 -160832 -161967 -213688 -250221 -243356 -229911 -231635 -217442 -172841
8035 -172841 -142454 -160156 -189631 -184744 -164134 -168410 -181360 -161546 -127191 -135151 -183096 -205722
8023 -205722 -175896 -143305 -154329 -190806 -212489 -211671 -199145 -177360 -154593 -151685 -171477 -191705
8011 -191705 -203297 -219701 -235670 -223370 -188943 -180322 -209612 -223473 -191394 -166178 -199637 -249153
7999 -249153 -240684 -188007 -168558 -201743 -234107 -237304 -237295 -241710 -220544 -177189 -163056 -194851 -224908
7986 -224908 -222475 -217911 -232232 -230878 -193564 -167665 -195432 -239585 -241462 -209557 -188525 -180470 -164756
7973 -164756 -161166 -197563 -239337 -231531 -197199 -209072 -264322 -275792 -206453 -131429 -131384 -189928 -237280
7960 -237280 -243009 -224668 -207027 -210225 -242201 -272683 -253688 -193806 -165464 -203711 -249132 -237972
7948 -237972 -197909 -192161 -211910 -201722 -165411 -161547 -199904 -225702 -216408 -214556 -240240 -245892 -199222
7935 -199222 -148890 -154302 -195329 -209729 -189886 -181930 -203377 -220789 -211459 -196598 -199019 -206807 -199671
7922 -199671 -184138 -179380 -184695 -184167 -176774 -180947 -206638 -238101 -253483 -253355 -256622 -268566 -268722 -240757
7908 -240757 -202386 -187708 -204482 -228733 -241246 -246616 -250829 -245245 -227427 -216206 -225236 -237847
7896 -237847 -232122 -218842 -226079 -250534 -254807 -219876 -175664 -165966 -198196 -240505 -258332 -242554
7884 -242554 -209360 -184714 -186738 -213401 -244312 -257561 -247117 -225513 -211218 -212491 -221950 -227761
7872 -227761 -228779 -232634 -238568 -233525 -211999 -188700 -180255 -183824 -187796 -193865 -208771 -220838 -210503
7859 -210503 -185790 -181071 -211056 -248046 -257762 -239624 -218334 -212883 -228143 -258976 -284915 -278805
7847 -278805 -242726 -217982 -232080 -252168 -227789 -169983 -142107 -168608 -201718 -197408 -177829 -183942
7835 -183942 -204060 -198110 -171779 -172163 -211627 -245770 -238809 -210147 -197332 -205815 -218833 -231711 -249353
7822 -249353 -264456 -262409 -241582 -214436 -196139 -199568 -225880 -251203 -244400 -211683 -197767 -222435
7810 -222435 -245182 -224439 -184963 -182862 -221558 -253010 -255282 -254715 -266239 -265774 -239857 -215757 -216622
7797 -216622 -224118 -212485 -189311 -177885 -185819 -210880 -247844 -270796 -245335 -183572 -148546 -172551
7785 -172551 -209791 -207196 -181499 -178533 -194525 -196990 -193206 -210515 -229374 -209233 -171018 -176731 -224462
7772 -224462 -242059 -202058 -168358 -198042 -260585 -291894 -276291 -238061 -197975 -174915 -188951 -227040
7760 -227040 -243349 -224995 -216645 -247601 -279591 -266803 -225730 -201725 -203915 -216235 -234584 -248786
7748 -248786 -228992 -178871 -158770 -200772 -247036 -237848 -212637 -241049 -295683 -294317 -243772 -229651
7736 -229651 -266538 -274125 -221030 -180263 -202212 -233887 -218949 -190145 -197794 -219600 -211369 -189683
7724 -189683 -196086 -224974 -247528 -263621 -274499 -252575 -198054 -174584 -220586 -274296 -263052 -219740
7712 -219740 -222328 -258720 -254408 -208910 -193674 -221624 -231110 -207514 -207892 -241582 -239799 -185733 -165324
7699 -165324 -227020 -290383 -272477 -218768 -215387 -242398 -222014 -164326 -149912 -189707 -214034 -199712
7687 -199712 -203298 -251435 -292011 -283866 -254947 -237177 -215873 -182801 -172522 -199744 -219384 -199134
7675 -199134 -178332 -199517 -230997 -222134 -194799 -206318 -248888 -263520 -240643 -229045 -245936 -254422
7663 -254422 -240244 -237015 -255291 -257771 -234706 -234808 -278886 -306373 -263978 -196077 -181639 -218009
7651 -218009 -236172 -208797 -175065 -168873 -185999 -218905 -263536 -289318 -260974 -199768 -170601 -196402
7639 -196402 -233588 -243745 -239887 -245488 -254682 -253190 -239852 -214655 -185436 -189013 -250071 -314371 -296261
7626 -296261 -211677 -178345 -243864 -305689 -269374 -197502 -202578 -262423 -266955 -209209 -191987 -247442
7614 -247442 -285649 -252771 -218253 -248359 -293875 -276937 -214322 -176528 -178457 -187328 -200000 -236266
7602 -236266 -277782 -283862 -259016 -245308 -251372 -242963 -206620 -174467 -175163 -197461 -215523 -223173 -230331
7589 -230331 -243075 -256769 -260304 -245789 -219774 -199611 -194095 -198430 -210869 -233888 -252589 -241225
7577 -241225 -207133 -196194 -228862 -261907 -248947 -211753 -206565 -237891 -257161 -242319 -227896 -246744
7565 -246744 -283329 -301080 -286802 -253964 -224735 -219096 -241267 -268481 -271593 -252536 -242381 -256756
7553 -256756 -273021 -260633 -219325 -179002 -171050 -201841 -245376 -264133 -247611 -225351 -230621 -260210
7541 -260210 -284681 -286601 -269638 -242597 -217937 -213625 -229096 -231925 -200780 -169658 -188889 -247900
7529 -247900 -282624 -263573 -230679 -228667 -251417 -269466 -273863 -268862 -253796 -237348 -241640 -267028
7517 -267028 -278463 -253195 -219160 -217464 -244645 -261396 -247133 -218998 -202267 -203746 -213052 -216199
7505 -216199 -208749 -200398 -200451 -200199 -185685 -167471 -173707 -207755 -237938 -239244 -221395 -206283 -203281 -216267
7491 -216267 -245640 -271448 -266413 -239673 -232202 -252220 -256698 -221845 -187335 -194042 -219309 -220136 -205624
7478 -205624 -213496 -240689 -252565 -242888 -231116 -216031 -187430 -170416 -198322 -249204 -270300 -261158
7466 -261158 -266567 -286731 -270613 -214734 -189872 -232583 -279640 -262344 -210593 -201097 -240392 -266112
7454 -266112 -246331 -215131 -210120 -224854 -232931 -225353 -213908 -217131 -244120 -277732 -282778 -249178 -213592
7441 -213592 -214633 -241491 -256838 -256112 -264729 -283829 -285159 -264728 -254352 -263215 -253335 -203200 -157747
7428 -157747 -172860 -234296 -277902 -277648 -264691 -260894 -246438 -209605 -181581 -190521 -214704 -217929 -208284
7415 -208284 -221959 -260955 -286258 -271701 -233546 -205601 -208624 -240258 -272991 -272910 -245718 -244325 -294121
7402 -294121 -336615 -304519 -232832 -217751 -269030 -295561 -256714 -227627 -266389 -311954 -287708 -226413
7390 -226413 -204170 -216279 -216343 -222276 -272240 -316681 -276843 -189984 -171859 -239099 -292684 -284536 -272082
7377 -272082 -285138 -271205 -217363 -199603 -248149 -280166 -240233 -197448 -216895 -241274 -205774 -174561
7365 -174561 -235136 -328988 -328100 -237452 -181026 -205009 -231778 -213545 -201472 -232946 -262568 -251956
7353 -251956 -240251 -272263 -320314 -327498 -285456 -230921 -197333 -196419 -220182 -242989 -243466 -229913 -222418
7340 -222418 -218386 -206624 -200559 -215875 -230048 -213260 -186409 -193245 -225425 -236281 -222550 -225490
7328 -225490 -249807 -251563 -217988 -192731 -203434 -224081 -229222 -230289 -237367 -235518 -219545 -208699 -212868
7315 -212868 -224076 -244046 -274777 -287297 -255355 -212414 -211117 -236459 -234312 -213703 -228248 -262822
7303 -262822 -249143 -200589 -206890 -270254 -282306 -211132 -169708 -224044 -272828 -220934 -144947 -157855
7291 -157855 -217021 -213463 -168077 -180723 -241522 -253884 -212556 -202347 -233987 -232237 -188723 -181218
7279 -181218 -224047 -236880 -193972 -177572 -237054 -304216 -301549 -245942 -196667 -176211 -183356 -216130
7267 -216130 -248491 -247372 -233033 -253751 -289707 -266925 -183910 -129528 -145583 -169337 -154076 -147994
7255 -147994 -194596 -243931 -234641 -193154 -179398 -191807 -193943 -186267 -188788 -194434 -193618 -204699 -234505
7242 -234505 -252313 -242337 -231233 -227573 -197975 -146022 -140076 -203645 -252976 -218262 -158489 -167975
7230 -167975 -226151 -239557 -194288 -164114 -184053 -209567 -201174 -173550 -154548 -151735 -161025 -168397
7218 -168397 -154679 -129935 -134047 -171451 -191146 -170583 -159239 -186705 -198455 -153780 -112926 -136919
7206 -136919 -174115 -154517 -125895 -165552 -218834 -180619 -95173 -100920 -192902 -226211 -167372 -148005
7194 -148005 -222445 -265373 -194718 -119226 -149564 -215145 -203844 -157041 -175924 -232128 -228227 -176936
7182 -176936 -165814 -191464 -179359 -139011 -151616 -213032 -230412 -183984 -160711 -201907 -236679 -206754
7170 -206754 -154983 -141219 -155045 -162585 -168667 -181643 -176923 -146601 -134556 -170914 -213088 -204063
7158 -204063 -158797 -141402 -174433 -217811 -231981 -222920 -219195 -230569 -241159 -234465 -216170 -207624
7146 -207624 -216410 -223751 -210615 -185703 -172656 -179127 -195620 -214004 -226573 -218979 -190161 -169011
7134 -169011 -181473 -208832 -210989 -185373 -166942 -171956 -181100 -181876 -186095 -193264 -177158 -131578 -97866
7121 -97866 -118365 -180646 -232005 -238137 -208731 -173443 -149912 -135244 -120969 -112774 -128101 -167795
7109 -167795 -202837 -207068 -192930 -190474 -198346 -187289 -152890 -130292 -144997 -177737 -194324 -187902
7097 -187902 -174358 -164001 -157379 -158971 -177059 -210063 -240197 -243092 -209712 -164393 -149901 -179733
7085 -179733 -215246 -209672 -165662 -125970 -117039 -131882 -160915 -200593 -229591 -218323 -175717 -150146
7073 -150146 -165277 -186915 -175633 -143751 -132262 -151449 -173940 -176571 -163360 -148966 -138120 -125842
7061 -125842 -111406 -107827 -130424 -169938 -189850 -168665 -134289 -130316 -155234 -167374 -148665 -126832
7049 -126832 -128129 -144019 -156615 -164199 -167221 -159023 -145026 -143400 -154480 -157770 -148031 -140969 -135166
7036 -135166 -110496 -78454 -85481 -140622 -187229 -181405 -155501 -162355 -194760 -207948 -191764 -170605
7024 -170605 -154116 -136999 -131533 -153558 -186523 -199433 -189798 -174355 -154416 -128101 -117979 -144053
7012 -144053 -184476 -203200 -198970 -186848 -156940 -103146 -68195 -95890 -152983 -167067 -136380 -130092
7000 -130092 -175484 -218330 -212006 -177654 -150736 -129306 -105696 -95715 -104117 -107186 -97464 -99950 -118964
6987 -118964 -120796 -98904 -99574 -142073 -169665 -134480 -82217 -85629 -129070 -134576 -86801 -55486 -87296
6974 -87296 -141138 -154201 -124889 -100179 -108738 -134881 -147732 -136904 -119045 -114689 -121603 -118187 -95316
6961 -95316 -71708 -69889 -90148 -116826 -134503 -128711 -92284 -46803 -34909 -68386 -103593 -95650
6949 -95650 -60554 -51770 -85316 -122036 -123127 -93000 -61428 -46481 -44185 -40993 -29492 -17047 -17941
6936 -17941 -33582 -48602 -51658 -47964 -44782 -40693 -37887 -45006 -55733 -47761 -18957 1653 -406
6923 -406 1410 26144 42245 15942 -22563 -15627 30378 47829 5776 -48182 -58144 -26512 9073
6910 9073 26900 26682 14945 7188 19453 39547 33006 -3416 -23005 10578 69223 97656 86407
6897 86407 73009 80722 92900 90187 80891 82904 97976 117182 134903 142906 125685 82973 49817
6884 49817 68514 135233 196812 213200 203406 210293 238404 257494 257872 263460 286142 305477 307576
6871 307576 309190 323205 332807 325791 324744 350880 382175 383647 361925 353841 373592 404755 432270
6858 432270 448804 442847 417306 407910 443202 495725 515244 502867 505217 537312 562451 556829
6846 556829 545331 555707 577857 590182 595297 608983 635708 669342 701222 722336 734810 758176
6834 758176 802945 847265 866988 874907 895372 917454 918626 918437 953384 1010737 1049513 1077287
6822 1077287 1134365 1206712 1237714 1231656 1254010 1312110 1335422 1307717 1313843 1399359 1484117 1491939
6810 1491939 1478077 1534870 1640141 1700519 1697708 1694106 1725256 1775239 1834493 1903119 1958562 1989070
6798 1989070 2033345 2125041 2234191 2325285 2423321 2550953 2660447 2716815 2787378 2944171 3135024
6787 3135024 3268457 3369973 3520749 3695141 3814901 3922938 4128311 4404644 4633746 4837015
6777 4837015 5151643 5570934 5948041 6294789 6808037 7515515 8192849 8789552 9625787 10892352
6767 10892352 12205125 13011889 13287584 13434226 13557438 13273004 12311518 10944300 9635811
6758 9635811 8551344 7609162 6794441 6167580 5677430 5197758 4713087 4305772 3991775
6749 3991775 3710657 3452652 3262670 3126986 2974197 2792551 2643872 2550421 2459066 2335306
6739 2335306 2211907 2118705 2032886 1930430 1830932 1755853 1685192 1593426 1498819 1438001 1405699
6728 1405699 1356001 1265814 1169707 1116103 1103058 1081782 1024486 959267 919856 890698 839921
6717 839921 785679 774010 793132 772934 689018 608851 599752 639988 664214 655458 640080 622091
6705 622091 581095 522293 475811 449607 426513 405459 403981 418492 420984 401586 381908 379087
6693 379087 384378 383720 374709 357867 334358 316942 320066 333286 327080 293274 258993 248843 250219
6680 250219 232054 189674 154921 159103 195316 226876 231529 222588 217714 205592 168419 124766
6668 124766 113417 135567 152236 144002 130354 121186 101590 83572 111196 177497 199984 136645
6656 136645 69283 94515 175392 193362 122862 52882 38263 34695 3733 -15885 12581 52065
6644 52065 54096 33876 29011 31031 11098 -23135 -44595 -50297 -47542 -28262 5464 24059 14999
6631 14999 7344 15302 3788 -43085 -70640 -34369 14087 -140 -52477 -59915 -22101 -18411 -65536
6618 -65536 -87286 -51887 -34224 -89021 -151718 -138015 -74592 -48425 -72145 -87157 -75758 -81195
6606 -81195 -116513 -133800 -104501 -67557 -68445 -97456 -119966 -130670 -142631 -149281 -135405 -112668
6594 -112668 -109413 -127985 -140860 -132040 -118085 -119519 -130246 -129220 -112067 -96503 -99120 -118049 -138973
6581 -138973 -149350 -145161 -132390 -125614 -136790 -158713 -166284 -143219 -104085 -81738 -95672 -138858
6569 -138858 -188148 -216121 -202087 -152780 -110273 -114881 -155098 -178705 -161874 -138313 -142754 -157791
6557 -157791 -150023 -133728 -151155 -198071 -220347 -192831 -154361 -145428 -154403 -154338 -153559 -168542 -176731
6544 -176731 -148082 -108437 -115897 -173394 -217772 -208914 -180996 -181535 -203223 -211631 -206656 -211981 -222949
6531 -222949 -211904 -180336 -162566 -172414 -183665 -175456 -164679 -175030 -199100 -212922 -209800 -197159
6519 -197159 -174670 -142819 -125624 -152487 -210427 -242607 -214145 -161680 -150966 -192103 -228587 -217539
6507 -217539 -187343 -190087 -222195 -233944 -209702 -190145 -203206 -219131 -202550 -171831 -166697 -182378
6495 -182378 -181727 -159002 -144452 -149564 -153916 -150053 -157444 -182396 -204922 -217078 -233297 -248934 -234755
6482 -234755 -195709 -186886 -233641 -278134 -255307 -191727 -170791 -214344 -259244 -253928 -222307 -213133
6470 -213133 -229270 -236308 -216658 -187536 -174879 -187574 -214039 -234808 -239806 -234953 -229350 -221356 -205972
6457 -205972 -190279 -188571 -203910 -225251 -241053 -246809 -242642 -232503 -223119 -218534 -220441 -233226 -254792
6444 -254792 -263361 -238106 -198087 -188843 -217442 -238138 -224142 -210930 -233278 -263006 -259813 -245919
6432 -245919 -266422 -303404 -301832 -264138 -242451 -245368 -234557 -213874 -231405 -278435 -280900 -222707
6420 -222707 -184193 -211129 -237185 -202475 -164581 -203567 -280335 -289884 -219431 -157765 -163887 -210466
6408 -210466 -250450 -266148 -255203 -230464 -227570 -257387 -268661 -219359 -160509 -172871 -240264 -274345
6396 -274345 -254815 -245461 -266377 -258475 -203313 -173356 -212007 -254549 -234089 -192054 -208046 -273288
6384 -273288 -310165 -285119 -236030 -207774 -212863 -239248 -257953 -243063 -211581 -210650 -240996 -244120
6372 -244120 -201229 -181569 -234926 -298166 -287185 -230634 -218022 -251134 -254317 -217052 -211756 -259440
6360 -259440 -288495 -260111 -233831 -257020 -277527 -235365 -172610 -171519 -227094 -262419 -248966 -235855
6348 -235855 -261940 -302728 -315950 -292785 -249664 -204508 -175644 -178056 -206330 -236806 -252755 -253457
6336 -253457 -239276 -209593 -180208 -179385 -212627 -247474 -250012 -226206 -208179 -205045 -192185 -156461
6324 -156461 -126983 -137481 -173038 -188487 -178640 -189286 -241111 -282674 -256753 -187260 -151936 -178488
6312 -178488 -217836 -223388 -206718 -197546 -193635 -180982 -172038 -187897 -218807 -233910 -224238 -213431 -228126
6299 -228126 -271013 -318341 -336476 -311071 -266519 -243204 -250162 -258645 -248115 -232495 -228305 -226512
6287 -226512 -218349 -221576 -250391 -280505 -279798 -260198 -261362 -288027 -300986 -274857 -233600 -217626 -236570
6274 -236570 -265050 -272683 -252884 -229723 -234433 -267531 -292753 -279901 -241272 -209529 -194771 -187416
6262 -187416 -189988 -213868 -248837 -267268 -260324 -243757 -227841 -209109 -192920 -194985 -215648 -238622
6250 -238622 -257362 -274455 -275217 -239827 -189735 -180612 -229290 -283610 -289824 -258172 -233223 -229735 -234639
6237 -234639 -248754 -281545 -313685 -308789 -267351 -234981 -246159 -283586 -304260 -288813 -255034 -233869
6225 -233869 -239772 -258872 -264441 -248777 -235644 -251949 -291466 -319163 -310740 -277293 -250745 -252816
$$ [...]
##END NTUPLES=NMR SPECTRUM
##END=
