##TITLE=1H ikalashn
CA-9298-1
24.10.2024
##JCAMPDX= 6.0         $$ Bruker NMR JCAMP-DX V2.0
##DATA TYPE= NMR SPECTRUM
##DATA CLASS= NTUPLES
##ORIGIN= UXNMR, Bruker Analytische Messtechnik GmbH
##OWNER= root
$$ TOPSPIN		Version 1.3
$$ 2024-10-24 15:20:27.375 +0400  Irina@DPX200
$$ Compression mode = diff/dup
##.OBSERVE FREQUENCY= 200.131300845
##.OBSERVE NUCLEUS= ^1H
##.ACQUISITION MODE= SIMULTANEOUS
##.ACQUISITION SCHEME= undefined
##.AVERAGES= 32
##.DIGITISER RES= 18
##SPECTROMETER/DATA SYSTEM= spect
##.PULSE SEQUENCE= zg
##.SOLVENT NAME= DMSO
##.SHIFT REFERENCE= INTERNAL, DMSO, 1, 17.49637
##AUDIT TRAIL= $$ (NUMBER, WHEN, WHO, WHERE, WHAT)
$$ ##TITLE= Audit trail, TOPSPIN		Version 1.3
$$ ##JCAMPDX= 5.01
$$ ##ORIGIN= Bruker BioSpin GmbH
$$ ##OWNER= Irina
$$ $$ F:/spectra/data/iren/nmr/1H/4/pdata/1/auditp.txt
$$ ##AUDIT TRAIL=  $$ (NUMBER, WHEN, WHO, WHERE, VERSION, WHAT)
(   1,<2024-10-24 15:20:09.500 +0400>,<Irina>,<DPX200>,<TOPSPIN 1.3>,
      <created by zg
	started at 2024-10-24 15:18:01.640 +0400,
	POWCHK disabled, PULCHK disabled
       configuration hash MD5:
       BE 6D 3F 07 2A EA 11 49 91 17 2B D3 AF B3 58 0D
       data hash MD5: 16K
       CA E4 FE 8D 7F 18 6C 4B 60 8B BA C1 20 B7 C0 04>)
(   2,<2024-10-24 15:20:16.390 +0400>,<Irina>,<DPX200>,<TOPSPIN 1.3>,
      <Start of raw data processing
       fp BC_mod = 2 FT_mod = 6 PKNL = 1 PHC0 = -36.48821 PHC1 = -4.678399 SI = 32K 
       data hash MD5: 32K
       6B B4 BF 80 75 77 E6 4F A2 DA 14 B6 0A 97 A9 8F>)
(   3,<2024-10-24 15:20:19.656 +0400>,<Irina>,<DPX200>,<TOPSPIN 1.3>,
      <abs n ABSG = 5 
       data hash MD5: 32K
       ED 42 72 61 F1 9E 36 B4 DF 4C 7F 1C 8E AC F7 E2>)
$$ ##END=
$$ 
$$ $$ hash MD5
$$ $$ 07 0A 31 CE 8F 98 62 5A F9 73 9D 62 DB 2C EC 7A
##$RELAX= 
##$RELAX= 
##$RELAX= 
##$RELAX= 
##$RELAX= 
##$RELAX= 
##$RELAX= 
##$RELAX= 
##$RELAX= 
$$ Bruker specific parameters
$$ --------------------------
##$DU= <F:/spectra>
##$EXPNO= 4
##$NAME= <1H>
##$PROCNO= 1
##$TYPE= <nmr>
##$USER= <iren>
##$AMP= (0..31)
100 100 100 100 100 100 100 100 100 100 100 100 100 100 100 100 100 100 
100 100 100 100 100 100 100 100 100 100 100 100 100 100 
##$ANAVPT= -1
##$AQSEQ= 0
##$AQ_mod= 1
##$AUNM= <au_zg>
##$AUTOPOS= <>
##$BF1= 200.13
##$BF2= 200.13
##$BF3= 200.13
##$BF4= 200.13
##$BF5= 200.13
##$BF6= 200.13
##$BF7= 200.13
##$BF8= 200.13
##$BYTORDA= 1
##$CFDGTYP= 0
##$CFRGTYP= 5
##$CHEMSTR= <none>
##$CNST= (0..63)
1 1 145 1 1 1 1 1 1 1 1 1 1 1 1 1 1 1 1 1 1 1 1 1 1 1 1 1 1 1 1 1 1 1 
1 1 1 1 1 1 1 1 1 1 1 1 1 1 1 1 1 1 1 1 1 1 1 1 1 1 1 1 1 1 
##$CPDPRG= <>
##$CPDPRG1= <>
##$CPDPRG2= <>
##$CPDPRG3= <>
##$CPDPRG4= <mlev>
##$CPDPRG5= <mlev>
##$CPDPRG6= <mlev>
##$CPDPRG7= <mlev>
##$CPDPRG8= <mlev>
##$CPDPRGB= <>
##$CPDPRGT= <>
##$D= (0..63)
0 2 0 0 0 0 0 0 0 0.06 0 0.03 0 0 0 0 0.0002 0 0 0 0 0 0 0 0 0 0 0 0 0 
0 0 0 0 0 0 0 0 0 0 0 0 0 0 0 0 0 0 0 0 0 0 0 0 0 0 0 0 0 0 0 0 0 0 
##$DATE= 1729768808
##$DBL= (0..7)
120 120 120 120 120 120 120 120 
##$DBP= (0..7)
$$ [...]
##$SW_h= 4401.40845070422
##$TD= 16384
##$TD0= 1
##$TE= 300
##$TE2= 300
##$TE3= 300
##$TEG= 300
##$TL= (0..7)
0 120 120 120 120 120 120 120 
##$TP= (0..7)
150 150 150 150 150 150 150 150 
##$TP07= 0
##$TPNAME0= <>
##$TPNAME1= <>
##$TPNAME2= <>
##$TPNAME3= <>
##$TPNAME4= <>
##$TPNAME5= <>
##$TPNAME6= <>
##$TPNAME7= <>
##$TPOAL= (0..7)
0.5 0.5 0.5 0.5 0.5 0.5 0.5 0.5 
##$TPOFFS= (0..7)
0 0 0 0 0 0 0 0 
##$TUNHIN= 0
##$TUNHOUT= 0
##$TUNXOUT= 0
##$USERA1= <user>
##$USERA2= <user>
##$USERA3= <user>
##$USERA4= <user>
##$USERA5= <user>
##$V9= 5
##$VALIST= <valist>
##$VCLIST= <CCCCCCCCCCCCCCC>
##$VD= 0
##$VDLIST= <DDDDDDDDDDDDDDD>
##$VPLIST= <PPPPPPPPPPPPPPP>
##$VTLIST= <TTTTTTTTTTTTTTT>
##$WBST= 1024
##$WBSW= 25
##$XGAIN= (0..3)
0 0 0 0 
##$XL= 0
##$YL= 0
##$YMAX_a= 2581212
##$YMIN_a= -3208068
##$ZGOPTNS= <>
##$ZL1= 120
##$ZL2= 120
##$ZL3= 120
##$ZL4= 120
##$ABSF1= 17.49637
##$ABSF2= -4.496376
##$ABSG= 5
##$ABSL= 3
##$ALPHA= 0
##$AQORDER= 0
##$ASSFAC= 0
##$ASSFACI= 0
##$ASSFACX= 0
##$ASSWID= 0
##$AUNMP= <proc_1d>
##$AXLEFT= 0
##$AXRIGHT= 0
##$AXTYPE= 0
##$AXUNIT= <>
##$AZFE= 0.1
##$AZFW= 0.1
##$BCFW= 0
##$BC_mod= 2
##$BYTORDP= 0
##$COROFFS= 0
##$CY= 7568.61572265625
##$DATMOD= 1
##$DC= 0
##$DFILT= <>
##$DTYPP= 0
##$F1P= 17.9538593292236
##$F2P= -4.03888763876832
##$FCOR= 0.5
##$FTSIZE= 32768
##$FT_mod= 6
##$GAMMA= 0
##$GB= 0
##$INTBC= 0
##$INTSCL= 1.936888e-010
##$ISEN= 128
##$LB= 0
##$LEV0= 0
##$LPBIN= 0
##$MAXI= 945.577
##$MC2= 0
##$MEAN= 0
##$ME_mod= 0
##$MI= -402.1523
##$NCOEF= 0
##$NC_proc= -3
##$NLEV= 6
##$NOISF1= 8.587773
##$NOISF2= 6.764455
##$NSP= 0
##$NTH_PI= 0
##$NZP= 0
##$OFFSET= 17.49637
##$PC= 1
##$PHC0= -36.48821
##$PHC1= -4.678399
##$PH_mod= 1
##$PKNL= yes
##$PPARMOD= 0
##$PPDIAG= 0
##$PPIPTYP= 0
##$PPMPNUM= 100
##$PPRESOL= 1
##$PSCAL= 0
##$PSIGN= 0
##$REVERSE= no
##$SF= 200.13
##$SI= 32768
##$SIGF1= 16.12182
##$SIGF2= -4.496377
##$SINO= 3.521527
##$SIOLD= 32768
##$SREGLST= <1H.CDCl3>
##$SSB= 0
##$STSI= 32768
##$STSR= 0
##$SW_p= 4401.40845070422
##$SYMM= 0
##$S_DEV= 0
##$TDeff= 16384
##$TDoff= 0
##$TI= <>
##$TILT= no
##$TM1= 0
##$TM2= 0
##$TOPLEV= 0
##$USERP1= <user>
##$USERP2= <user>
##$USERP3= <user>
##$USERP4= <user>
##$USERP5= <user>
##$WDW= 0
##$XDIM= 32768
##$YMAX_p= 278013292
##$YMIN_p= -201854
$$ End of Bruker specific parameters
$$ ---------------------------------
##NTUPLES= NMR SPECTRUM
##VAR_NAME=  FREQUENCY,     SPECTRUM/REAL,   SPECTRUM/IMAG
##SYMBOL=    X,             R,               I
##VAR_TYPE=  INDEPENDENT,   DEPENDENT,       DEPENDENT
##VAR_FORM=  AFFN,          ASDF,            ASDF
##VAR_DIM=   32768,         32768,           32768
##UNITS=     HZ,            ARBITRARY UNITS, ARBITRARY UNITS
##FACTOR=    0.134324425510551, 1,           1
##FIRST=     4401.40845070422, 7230,         -776082
##LAST=      0,             -199629,         -817874
##MIN=       0,             -201854,         0
##MAX=       4401.40845070422, 278013292,    0
$$ Real data points
##PAGE= N=1
##DATA TABLE= (X++(R..R)), XYDATA
$$ [...]
12478A552602N3100Q2145Q4372P8665Q0687P8959P0991P5601R4692J02280Q6820
12467B440914P0079O7872O3433M0509J8126K5910N5430O0932J4392n2294p5852
12456B729451l8462O54k4073r1930j17449p1610k6162m5834r2533r3436n8432
12445B070184n2028p5779p0609l2431k7886p3404r3412m4313N011j7680o8268
12434A519385n8464N73J9960k3338n7419l3565P886J1413j7644l9387l4895r634
12422A284871K1339L1512J929m0886m3502K7L3571K0986k614N144K3245Q903k4186
12409A320339k6966L660K3065J3056K640J0997K1077K0725K3369L2686L0047J4950
12397A489645J5776L8970N0045L1776J8269L6726N7182M4430K2643L4583O6011
$$ plain form
12478 1552602 1605702 1687847 1772219 1850884 1931571 2010530 2081521 2157122 2251814 2354094 2440914
12467 2440914 2510993 2578865 2642298 2682807 2700933 2726843 2782273 2843205 2857597 2805303 2729451
12456 2729451 2690989 2691643 2667570 2575640 2458191 2386581 2360419 2314585 2222052 2128616 2070184
12445 2070184 2018156 1942377 1871768 1839337 1811451 1738047 1644635 1600322 1605333 1587653 1519385
12434 1519385 1460921 1461494 1481454 1458116 1400697 1367132 1375018 1386431 1368787 1329400 1294505 1284871
12422 1284871 1306210 1337722 1339651 1298765 1255263 1255290 1288861 1309847 1307233 1312377 1335622 1344525 1320339
12409 1320339 1293373 1297033 1320098 1333154 1335794 1346791 1367868 1388593 1411962 1444648 1474695 1489645
12397 1489645 1505421 1544391 1594436 1626212 1644481 1681207 1738389 1782819 1805462 1840045 1906056
12386A906056P1648N5482N7907P3885N7583J1646l237L4146O9268O1304M2319
12375B438007M9714O1884M8779L1835L8989M7071K7511P803K4097M9142L6381
12364B861213M791M917K5184J4927j4781l946M4277N8576K0683j792K7577N4723
12352C096349L6393J5684L7197O1441L7203M33J7988P1534Q1975L1515j5493j0134
12340C462085K6350M8398L6388j011l4608k9222J3567M0504J3432k9913l0935
12329C515035l252o627m2056m9463j3803O078k2227m9186k8024O663k587m3322
12317C267229n7003l0255n942j1159k3467j5859J466J711j6110k6175j4767k344
12305C067325j3278l3790k8010O59L233l7312o5257l3867J0175q952p1428q5296
$$ plain form
12386 1906056 1977704 2033186 2091093 2164978 2222561 2234207 2230970 2265116 2334384 2395688 2438007
12375 2438007 2487721 2549605 2598384 2630219 2669208 2716279 2743790 2751593 2775690 2824832 2861213
12364 2861213 2866004 2870921 2896105 2911032 2896251 2892305 2936582 2995158 3015841 3014049 3041626 3096349
12352 3096349 3132742 3148426 3185623 3247064 3284267 3284700 3302688 3374222 3456197 3487712 3472219 3462085
12340 3462085 3488435 3536833 3573221 3572210 3537602 3508380 3521947 3562451 3575883 3545970 3515035
12329 3515035 3511783 3505156 3463100 3413637 3399834 3405912 3383685 3334499 3306475 3313138 3310551 3267229
12317 3267229 3210226 3179971 3174029 3162870 3139403 3123544 3125010 3126721 3110611 3084436 3069669 3067325
12305 3067325 3054047 3020257 2992247 2992906 2996139 2958827 2893570 2859703 2869878 2860926 2789498 2704202
12293B704202l2118L573k8343o9949o3578m6149o8177r3066o3452j3957k0688
12282B208298p0180p9417l5053j1837m2440o5278l4235K879j4205o0766p0145
12271A727621l4566m621q735k5313k9947k7743l1380l5060k3564L245K3901J5167
12259A549005j9936m8574m1902r237J3919Q647j2040k7429k9188j7406K740J7319
12247A385918J5003L701j766n407j9499l1842j6795J6697K5196o548l7657k8104
12235A298897O081K2103J1226j179q54K358Q52J124Q433J7602J9710Q211j5658
12222A378906l5109k7364O880L6476L6026J5769J252Q6O653K0399L4290K3633
12210A497897j9680n4518l2699K8534N9389L1554l190R786M9179N2544Q606k8259
$$ plain form
12293 2704202 2672084 2675657 2647314 2577365 2513787 2467638 2399461 2306395 2242943 2228986 2208298
12282 2208298 2138118 2058701 2023648 2011811 1969371 1904093 1869858 1872737 1858532 1797766 1727621
12271 1727621 1693055 1688434 1679699 1654386 1624439 1596696 1565316 1530256 1506692 1509937 1533838 1549005
12259 1549005 1529069 1480495 1438593 1429356 1443275 1451922 1439882 1412453 1383265 1365859 1368599 1385918
12247 1385918 1400921 1404622 1402856 1397449 1377950 1346108 1329313 1346010 1371206 1364658 1327001 1298897
12235 1298897 1304978 1327081 1338307 1337128 1336274 1338632 1339484 1340608 1349041 1366643 1386353 1394564 1378906
12222 1378906 1343797 1316433 1323313 1359789 1395815 1411584 1412836 1412922 1419575 1439974 1474264 1497897
12210 1497897 1478217 1423699 1391000 1419534 1478923 1510477 1507287 1517073 1566252 1618796 1627402 1599143
12198A599143j5815K0699K7992k618k7152j0341K7184L5726R88l7155l5666l080
12186A579905J2943j1848m8016n2906k6642r315k4539m6996l9594r271o2k8403
12174A295256n4099l5877N365J2157k7985o4898n7146k4464r429j7862k6537k8005
12162I66476l2882l8928l2298j6582j0184j4402j2467k227r72j2392j7964j1251
12150G63927j1949k9596l9798k0138R604J1020j8661m2823l4578o784J1092P897
12138E99213n296j3945j2834n816j018n269j8103k9707k7535q752J2879J6939
12126E00756j397k1558j8494N472J9934M051k3853k7098J281K6770J6991j5462
12114D67393k9876j2408P650L414j0742o342J0261Q109j4569k4351p869N093o978
$$ plain form
12198 1599143 1583328 1604027 1632019 1629401 1602249 1591908 1619092 1654818 1655806 1618651 1582985 1579905
12186 1579905 1592848 1581000 1532984 1480078 1453436 1444121 1419582 1372586 1332992 1323721 1323659 1295256
12174 1295256 1241157 1205280 1210645 1222802 1194817 1129919 1072773 1048309 1038880 1021018 994481 966476
12162 966476 933594 894666 862368 845786 835602 821200 808733 806506 805534 793142 775178 763927
12150 763927 751978 722382 682584 662446 672050 683070 664409 621586 587008 580224 591316 599213
12138 599213 593917 579972 567138 561322 560304 555035 536932 507225 479690 470938 483817 500756
12126 500756 499359 477801 459307 464779 484713 488764 464911 437813 439094 465864 482855 467393
12114 467393 437517 425109 432759 436173 425431 419089 429350 437459 422890 398539 390670 395763 388785
12101C88785j8799k297K1024J2995j6149k2596O76J6730P449m680m662p785j9719
12088C50972j8290M645K3109K0346J2299N961j8821n4913m8182J8390O9345L3244
12076C98105m1332m8467J4942M6050m61m4881j6673L3298K2343k8108l2593J7352
12064C19575M3605Q618l1887k3629Q250J2967n906j1471j572m578k1352k0660
12052B71960N104K1350L150k5325k5206K601K1743J1083j1698j8325m531J0453
12040B62359R360n770j8738j7501o877j597o378r370q14R273L936j4221k4571
12027A79091j7147l740M129J0765J9510J7282n989l2372l1953k665K4357K2566
12015A83834j563k2522k4798j0971P682J8590J3333l496j4157o333R313R976r262
$$ plain form
12101 388785 369986 367689 388713 401708 385559 362963 363639 380369 387818 383138 378476 370691 350972
12088 350972 332682 337327 360436 380782 393081 399042 380221 325308 277126 295516 364861 398105
12076 398105 356773 308306 323248 369298 368837 323956 307283 340581 362924 334816 302223 319575
12064 319575 363180 371798 339911 316282 324532 337499 331593 320122 318550 313972 292620 271960
12052 271960 277064 298414 301564 276239 251033 253634 275377 286460 274762 256437 251906 262359
12040 262359 271719 265949 247211 229710 222833 221236 214858 205488 204674 213947 217883 203662 179091
12027 179091 161944 158204 162333 173098 192608 209890 203901 171529 139576 136911 161268 183834
12015 183834 182271 159749 134951 123980 131662 150252 163585 160089 145932 139599 148912 158888 149626
12002A49626k6209j8976M786J6935M808j4318j7859m933Q815J2817O805o733k0580
11989I4984j9743J538K2412J5700j2508k5157l203K8393L5576J7691q64p117q403
11976A39299j1599j1132P94J9841K7766R118k3685l2545o60L2923J9414k3116
11964A46418k7071K1007N1455J6624l2660k7162J3570K2649j302m277J8358J5910
11952B13519j7452k5024J1133L4517J1219j5103o392N654r509j6097J7164M2739
11940B46368Q969m0555l0575J8103K1429k5108l9621N758L9835J5518j5573L2
11928B04580K5640M970l4477k5899K3194M1250O727k1909k086K9155J7508k5741
11916B42912m3736j5870K0933K9837J7591R046N980n118j9965k0649q882m655
$$ plain form
12002 149626 123417 104441 109227 126162 130970 116652 98793 93860 102675 115492 122297 115564 94984
11989 94984 75241 76779 99191 114891 102383 77226 74023 102416 137992 155683 154819 147702 139299
11976 139299 127700 116568 117362 137203 164969 174087 150402 117857 117197 150120 169534 146418
11964 146418 119347 140354 191809 208433 175773 148611 162181 184830 183528 179251 197609 213519
11952 213519 196067 171043 182176 216693 227912 212809 206417 212071 202562 186465 203629 246368
11940 246368 255337 214782 184207 202310 223739 198631 159010 164768 204603 220121 204548 204580
11928 204580 230220 235190 200713 174814 198008 239258 245985 224076 221990 251145 268653 242912
11916 242912 199176 183306 204239 234076 251667 260713 266693 261575 241610 220961 212079 207424
11904B07424q051M343L2170L6260k803m2973l5774N46R724j4476k2639P360L6384
11891B07495K8424R81j3362j5493j9616j7284L473K5632K4102M539q569r528q046
11878B02748r97J8860L2811J2061l2371n0356j7971K5576K8793k940j8367N172
11866B03019L1387K1124r840j7901k10M792j4124j9284Q190K4992q294n3250m3519
11853A27082J0306L2484j711l1103q906K7205K2360j0449k0787q85J4596Q243
11841A68435n106j1739j1429m708L911N95j5695k0808m5K2850J9121j067q850
11828A35465l103k730p430j805J2045J8938J7302J1803n102l1390l5005L251M3672
11815A55911L3174j4261l5249j0224J6502J2708k287o506j0055k0148j7909M269
$$ plain form
11904 207424 199373 203716 235886 272146 269343 226370 190596 191142 200866 186390 163751 171111 207495
11891 207495 235919 236900 223538 208045 188429 171145 174618 200250 224352 228891 220322 210794 202748
11878 202748 201751 220611 253422 265483 233112 182756 164785 190361 219154 216214 197847 203019
11866 203019 234406 255530 245690 227789 227579 232371 218247 198963 207153 232145 223851 170601 127082
11853 127082 137388 169872 168161 137058 128152 155357 177717 167268 146481 145596 160192 168435
11841 168435 163329 151590 140161 135453 139364 139959 124264 103456 103411 126261 145382 144315 135465
11828 135465 132362 129632 122202 120397 132442 151380 168682 180485 175383 143993 108988 112239 155911
11815 155911 189085 174824 139575 129351 145853 158561 156274 149768 139713 119565 101656 105925
11803A05925K0115R539j0199j5423q830j180J0210K3115J8402r298l1563k1094
11791H9719R411K3904P602j9840k8753j0592J0618M015k2767k4467J4733M4912
11779I8495K1197j9725j3909K2626J8968k7462m3453n890K0677R74j2360J6829
11767G6967L7463P045k6452j2232J1181n105k1882J0916M3030K632o2626m7784
11755A3153L4006O6382J3029l9770l3802j0767q005K624L1126K9093j5841l7521
11743D3707k79L2902M125m1857l4122J1486K9462Q659j1348j4004j2184o920N416
11730A5043Q261o281j1016R998K1879n210l4538j4599L4318M6964J0609k3628
11718E1800j9925M676J9947J5177o429k9565k8734q53J6792m198l3575k3261J8155
$$ plain form
11803 105925 126040 135579 125380 109957 101127 99947 110157 133272 151674 142376 110813 89719
11791 89719 99130 123034 130636 110796 82043 71451 82069 86084 63317 38850 53583 98495
11779 98495 119692 99967 86058 108684 127652 100190 56737 50847 71524 72498 60138 76967
11767 76967 114430 121475 95023 82791 93972 88867 66985 77901 120931 123563 60937 13153
11755 13153 47159 113541 126570 86800 52998 42231 34226 36850 67976 97069 81228 43707
11743 43707 43428 76330 80455 38598 4476 15962 45424 54083 42735 28731 16547 9627 15043
11730 15043 23304 17023 6007 16005 37884 32674 -1864 -16463 17855 64819 75428 51800
11718 51800 31875 36551 56498 71675 65246 35681 6947 6094 22886 18688 -14887 -38148 -19993
11705a9993L8097J7053j3348k3098j1253J3408L6834L2305p449l9236j8615K7672
11693C2377L3164p293k9790l495K3297M268l3265l5297n48K6954K1520k045j7610
11680A2237j4147J203J2441J0848M223K156j112j2449j8122j602K4023L0386J5455
11667F5540P22o364j2932j1766O987K1127J126l1946k7094J3089K9046r15k4967
11654B1653m690K3004J2385j4786j1879J2050J1736j6200k9619q565J8742K1209
11642C5040M342l613J0768K8395J8241j9029m0124j4748K2460J6702k0442k7324
11630A0668M818J8029o149r733L2376N0803m886o5947m4212K5352M1450k493k1994
11617B8082J0175K9547J868k2500m332J9827Q045j8865k0980o90J5947K0111J4497
$$ plain form
11705 -19993 18104 35157 21809 -1289 -12542 866 37700 70005 62556 23320 4705 32377
11693 32377 65541 58248 28458 24963 48260 52528 19263 -16034 -16582 10372 31892 29847 12237
11680 12237 -1910 -707 11734 22582 26805 28961 27849 15400 -2722 -4324 19699 50085 65540
11667 65540 66262 59898 46966 35200 42187 63314 64440 32494 5400 18489 47535 46620 21653
11654 21653 16963 39967 52352 37566 25687 37737 49473 33273 3654 -4911 13831 35040
11642 35040 39382 35769 46537 74932 93173 74144 34020 19272 41732 58434 37992 10668
11630 10668 15486 33515 27366 17633 50009 100812 95926 29979 -14233 11119 52569 50076 28082
11617 28082 38257 67804 69672 47172 42840 62667 70712 51847 30867 30177 46124 66235 80732
11604H0732K85j1079n534M355n466k3452j6542P350Q159j0066n34L3441K6042
11591H7691l5938o5743k910Q0148P3391j3464o9718l8529K3229L9285N068k9883
11579E2627k8867O69K3457J5454r494j9344q528J152M681J9741L9229K6987j7151
11566A00613m0164j5758J1396J813j3503L895K5602J0191j6324q023J4142M596
11554G8476j4515M856L2896N438m6836l1687M0603N4838j9858o8436j4520N4992
11542G6247L5570k7465k6116L0729M7346P596j3515Q245J1276l0315n4306j6763
11530D8529L1605K5909j4696k3973J2347M6326M0256P111j8580k0703p910L734
11518A29955P648R315J3460J4302O110k635L16R533P846o183j4606p576K606J954
$$ plain form
11604 80732 81017 69938 64404 68759 63293 39841 23299 30649 38808 28742 28208 61649 87691
11591 87691 51753 -13990 -16900 63248 136639 123175 53457 14928 38157 77442 82510 52627
11579 52627 23760 24429 47886 63340 53846 34502 25974 27126 31807 51548 90777 117764 100613
11566 100613 60449 44691 56087 57900 44397 48292 73894 84085 67761 59738 73880 78476
11554 78476 63961 68817 101713 107151 60315 28628 69231 124069 104211 35775 21255 76247
11542 76247 111817 84352 58236 88965 136311 143907 130392 138637 149913 119598 65292 48529
11530 48529 80134 106043 91347 67374 79721 126047 166303 173414 154834 134131 126221 129955
11518 129955 137603 146918 160378 174680 180790 178155 178471 188004 195850 189667 175061 167485 170091 172045
11504A72045n389o793O32J0723J8322J9625J0039p554j6892l192K4467L6718J7250
11491B70001j4531k5465r805P407R693J0054K0596K5140P407j2537n307J5902
11479B98555J3219r923j0643J8712L3094J1875l906J4284K7652k17k9417n908
11467C57377M0871M0736l58j1951J9584L1904M98j8749P759L0063N223k3088J347
11454D81216M9778N5911K1737L766J8176K9544K1209J1514N367r490j9411K776
11442F72093L9917M4309J6343Q313L5888M9912K2846K76K4311N9611N0228J0868
11430A034915O76K9263M9472L5055J0688L803J3390L0855N0273N3788K7595k837
11418A336936L632L8317M8726K2947J3271M8188P6555M6445o014q434L6104N8462
$$ plain form
11504 172045 166656 159863 160495 171218 189540 209165 219204 211650 194758 191566 216033 252751 270001
11491 270001 255470 230005 220200 227607 237300 247354 267950 293090 300497 287960 282653 298555
11479 298555 311774 301851 291208 309920 343014 354889 350983 365267 392919 392702 363285 357377
11467 357377 398248 438984 438626 426675 446259 478163 478661 459912 467671 497734 502957 479869 481216
11454 481216 530994 586905 608642 612408 630584 660128 681337 692851 698218 688728 669317 672093
11442 672093 712010 756319 772662 780975 816863 866775 889621 889897 914208 973819 1024047 1034915
11430 1034915 1035591 1064854 1114326 1149381 1160069 1163872 1177262 1208117 1258390 1312178 1339773 1336936
11418 1336936 1340568 1378885 1427611 1450558 1463829 1512017 1588572 1635017 1629003 1620569 1656673 1715135
11406A715135L3813J1643K7778N2404M9229L1387K6486K9666K6135K4963L5544
11395B064183M1242L0863K6418M2697N0135K2637o080J1235N2774N4582J3134
11384B403820o433K6333O0942M7536Q345p216N710J9622K4794K7882K5385J4507
11372B651227J0321K0466K3934O573o052J1777L6188K7855r53l813K2821L3568
11360B833912R623j1415J949K6801K5185r88k1575k2004j0817O23N599J410l863
11347B834440L137J7251J3572j5936m2960l8864j4870m380j6027k7903k3949j3506
11335B670005j2075j9402k3110j5922m875m761k0982l9581m1803k8385j7224j5537
11323B426348j2944q710k1538n4131p0844m0975Q636K0219j6729m9939l7374l199
$$ plain form
11406 1715135 1748948 1760591 1788369 1840773 1890002 1921389 1947875 1977541 2003676 2028639 2064183
11395 2064183 2105425 2136288 2162706 2205403 2255538 2278175 2272095 2283330 2336104 2390686 2403820
11384 2403820 2397387 2423720 2484662 2532198 2540543 2533327 2539037 2558659 2583453 2611335 2636720 2651227
11372 2651227 2661548 2682014 2705948 2712521 2706469 2718246 2754434 2782289 2781336 2777523 2800344 2833912
11360 2833912 2843535 2832120 2834069 2860870 2886055 2885067 2863492 2841488 2830671 2831294 2836893 2838303 2834440
11347 2834440 2837577 2854828 2868400 2852464 2809504 2770640 2755770 2751390 2735363 2707460 2683511 2670005
11335 2670005 2657930 2638528 2615418 2599496 2594621 2589860 2568878 2529297 2487494 2459109 2441885 2426348
11323 2426348 2413404 2404694 2383156 2329025 2258181 2217206 2225842 2246061 2229332 2179393 2142019 2138820
11311B138820R06l2694o3598o1262l8068k2177k1341k5725l1136m1382n1579m7128
11299A703636k5806q675j6558m0731n1176l4958j2623j0358k7708m3068m2632
11288A389343l1408k0189j4881j7947k8181l6525l1900j5366k113n482k2719l8232
11276A124400l8106k2160n467o142k6036m5349m3169k2156n067p329k1970l2891
11264H48558l3229k6400j7342r590o117o769p148n021o164j8381l8063m6810k8453
11251E99071P189K5163K858l5287m0328l887K3169j145m4689m2231P145L3435
11239E30463j614m6158l6782N745J2294k4856m1058j404M5780M2325J084k3371
11227D62448j4337j568n709j4853j4740r410o978q371j3640k0445j7168J508J5469
$$ plain form
11311 2138820 2139726 2107032 2043434 1982172 1944104 1921927 1900586 1874861 1843725 1802343 1750764 1703636
11299 1703636 1677830 1669155 1652597 1611866 1560690 1525732 1513109 1502751 1475043 1431975 1389343
11288 1389343 1357935 1337746 1322865 1304918 1276737 1240212 1208312 1192946 1190833 1185351 1162632 1124400
11276 1124400 1086294 1064134 1058667 1052525 1026489 981140 937971 915815 910748 903419 881449 848558
11264 848558 815329 788929 771587 761997 755880 749111 741963 736942 730778 712397 674334 627524 599071
11251 599071 606260 631423 634281 598994 558666 554779 577948 576803 532114 489883 497028 530463
11239 530463 528849 482691 445909 451654 463948 439092 398034 396630 442410 484735 485819 462448
11227 462448 448111 446543 440834 425981 411241 401831 394853 386482 372842 352397 335229 336737 352206
11214C52206K229k2355j9897R399K0921l542k1746J431L0971J3082l6303n1537
11202B74859j6626J5616J0662r96J2148K5649O148k4788k3551K820R154j2607
11190B78488k2593j155J9654R117j5877k1330n172J0271J5340J5221P510j3515
11178B75959l3480k6509N755K5635N057l2913l8290P28L7484K4921k0176l6776
11166A87395l329L0210J3560k8589l0793J5586M7424K1887k3259k9540j240J2549
11154B11861l123j6592r827k258o080k416J7333K3710o399m3436l8894P242M5782
11141A76903M0976N828k4574l0320j4742M358Q671q89k287J4020K2481M60k5639
11128A75246j4538J7103J2121l0071m0089R698M8439J3962m3667l8803J4990L5185
$$ plain form
11214 352206 354435 332080 312183 321582 342503 338961 317215 318646 349617 362699 326396 274859
11202 274859 258233 273849 284511 283515 295663 321312 327460 302672 279121 281941 291095 278488
11190 278488 255895 254740 274394 283511 267634 246304 241132 251403 266743 281964 289474 275959
11178 275959 242479 215970 221725 247360 252417 219504 181214 181942 219426 244347 224171 187395
11166 187395 184066 214276 227836 199247 168454 184040 231464 253351 230092 200552 199312 211861
11154 211861 208738 192146 182319 180061 173981 171565 188898 212608 206209 162773 123879 131121 176903
11141 176903 217879 223707 199133 168813 154071 158429 167100 166211 163924 177944 200425 200885 175246
11128 175246 160708 177811 189932 159861 119772 129470 177909 191871 148204 109401 124391 159576
11116A59576P765m898J3452Q493l0725l9130N753L3008J166k3409J5451N5227
11104B01729J8943m4978l9806J4657J9330l0321l9637J7082N3373J9902k1389
11093A68885j4517M446p037j8441L903K4787N541k2716j7252J122m495j6559m471
11080A03196J2105N797l37J6693K1015j6956m6033j0189M4059L2806k3965l1894
11068A06297K1649N0317J2664l1005k7498l769J016k359N059J0992O282M291M701
11055A58637q182j9885j039K4567K814m8095m6186J8874N5093J4129k9818o814
11043A14095L5635K3634j8678k4692j372K766n408Q718K5093N985k0749p146J9387
11030A57268J923l4053j8601L2458L6071j4782l8753o099J9490J531j2960O989
$$ plain form
11116 159576 167341 162443 175895 184388 153663 114533 120286 153294 154460 131051 146502 201729
11104 201729 220672 175694 135888 150545 169875 139554 99917 116999 170372 190274 168885
11093 168885 154368 158814 151777 133336 137239 162026 167567 144851 127599 128721 124226 107667 103196
11080 103196 115301 121098 120761 137454 158469 141513 95480 85291 129350 162156 138191 106297
11068 106297 127946 178263 190927 159922 132424 128655 129671 127312 132371 143363 149645 153936 158637
11055 158637 150455 130570 129531 154098 156912 108817 62631 81505 136598 150727 120909 114095
11043 114095 149730 173364 154686 129994 128622 131388 125980 134698 159791 165776 145027 137881 157268
11030 157268 159191 125138 106537 138995 175066 160284 121531 115432 134922 136453 123493 130482
11018A30482J9360k467j3970J4355L5372Q696k5072j6024J1063R411o917M9J6937
11005A81275Q024j5507j8532n072j90K661J8690K4523n346l8969k6912J6335L4243
10992A75223J8054R802K2109K1072o264k7937k2797q491J96J4326L5590L9310
10980B70193J2921j9591k9035j3981P237J6650N658j5188j8720L145J7492l349
10968B33432k8619r177L8263M6227Q45l3344j4421J4207R00k9168k0387J9391
10956B18149L3159N788j8620r983Q744P776n413q734l386m508j0165m588J2071
10943B20290J8880M186j5181j6535l179L093k694l112P602R586p489j9990o108
10930A89349J4125P741j5945j7964P715K5522J5215k779q044p824j0398p124K093
$$ plain form
11018 130482 149842 147375 133405 147760 183132 191828 166756 150732 161795 171206 164289 164338 181275
11005 181275 189299 173792 155260 150188 149998 152659 171349 195872 190526 151557 124645 140980 175223
10992 175223 193277 203079 225188 246260 239996 212059 189262 180771 180967 195293 230883 270193
10980 270193 283114 263523 234488 220507 227744 244394 250052 234864 216144 219289 236781 233432
10968 233432 204813 195636 233899 280126 280971 247627 233206 247413 248313 219145 198758 218149
10956 218149 251308 257096 238476 228493 237237 245013 239600 230866 227480 222972 212807 208219 220290
10943 220290 239170 243356 228175 211640 208461 211554 208860 205748 213350 222936 215447 195457 189349
10930 189349 203474 211215 195270 177306 185021 210543 225758 222979 214935 207111 196713 189589 191682
10917A91682m45j5620j7168M022J9925J2434L702J1357J1981j3265l2637j0711
10905A65257K6811K8293k729j7285j385J0457P79q033m065n889j7583j2909J4298
10892A76017K7905M787k4329j9751R956K5989J3266j0821k4729j7259R896L4523
10880B05450K7695n493k1287L783L3901K4304j2099k6924r683N148p08o560K813
10867B20340J1278M675m078j713J699m415r241k961J210q403j4949P08K2146J8919
10853B35215k683o997J2694K1432l24k2348j0594J9345K5604J653j8550j2824
10841B41623L043O624j22l183o15O16l01J18O56l17J468P577R075m38j0014m261
10825B51549J1644J6234L323o845L432K1368J8743r106l3626k6751M815K7386
$$ plain form
10917 191682 191237 175617 158449 162471 182396 194830 198532 209889 221870 208605 175968 165257
10905 165257 192068 220361 217632 200347 198962 209419 210198 202165 198100 192211 174628 161719 176017
10892 176017 203922 208709 184380 164629 174585 200574 213840 203019 178290 161031 170927 205450
10880 205450 233145 227652 206365 210148 244049 268353 256254 229330 219647 224795 224087 217527 220340
10867 220340 231618 236293 232215 230502 232201 227786 218545 215584 216794 208391 193442 194150 216296 235215
10853 235215 232532 225535 238229 259661 259337 236989 226395 245740 271344 272997 254447 241623
10841 241623 244666 251290 251168 247985 247370 247986 247685 247803 248459 248142 249610 257187 266262 265824 255810 251549
10825 251549 263193 279427 282750 275905 279337 300705 319448 310342 276716 249965 254780 282166
10813B82166J9654m803j7207q399M668N593Q11P485K4025K5870j610l3972k9167
10800B75114J6254N0686K7465k9155m8801q044L7507L1876o282k1445n229N813
10788C25759R60O174K2568J3888k5606m5755j5052K6251K7856M831L426K1942
10776C67242K0239q274k7539j6886O844K3209K5624R673j8570l0146q080J6372
10764C59708O279j6705n968K4553J8003k3298l2879P728L5205J4334k617K4100
10752D08443M3296M237m3569k8604J8766J8645j9836k0298J8796K0164k7030l5482
10740C57528L0247P9495L4371m4348n1256O280L5632P240j8334k770J7552P087
10728D58724j1599p070O162K24j3006k429K5985L2797L954k5659j8823J4056K9743
$$ plain form
10813 282166 301820 297017 279810 271411 276079 281672 282483 289968 313993 339863 338253 304281 275114
10800 275114 291368 342054 369519 340364 291563 283519 321026 352902 346620 325175 319946 325759
10788 325759 326719 332893 355461 369349 343743 297988 282936 309187 337043 341874 345300 367242
10776 367242 387481 379207 351668 334782 341626 364835 390459 400132 381562 351416 343336 359708
10764 359708 365987 349282 343314 367867 385870 362572 329693 337421 372626 386960 384343 408443
10752 408443 451739 455976 412407 383803 402569 421214 401378 381080 399876 420040 393010 357528
10740 357528 387775 467270 501641 457293 406037 412317 447949 455189 436855 434085 451637 458724
10728 458724 447125 440055 446217 446441 433435 431006 456991 489788 493742 468083 449260 463316 493059
10715D93059R670j7349j5942Q114J8141r87k2507j6570R304K4235J7068N441M321
10702E15998N701l250j6546j7239l240Q389N244l106M65J4763K0462P113j1245
10689E23509j3865J238J8081K3508J7777P367k838r978j2854j1683n069Q643K2588
10676E66424K2224M225j3354j2733j566j51q286n555J3988K8563J8486o764k1799
10663E83702j4531O987K7751L6237K7592N460j9439l4702l1011p717K0409K9995
10651F30733J4040o174p138O711J5096J4357J4358J1027o789k4746j3369K2112
10639F70218L8929J7751r138j0403l28k810m521J6863M2125L3624k716k2726r143
10626G57725Q854N328r298j4096o131Q165K4720L4079K4929N581p26Q114P456
$$ plain form
10715 493059 502729 485380 469438 477552 495693 494706 472199 455629 464933 489168 506236 511677 515998
10702 515998 521699 518449 501903 484664 481424 489813 495057 491951 492416 507179 527641 534754 523509
10689 523509 509644 510882 528963 552471 570248 577615 574777 564799 551945 540262 535193 543836 566424
10676 566424 588648 592873 579519 566786 565220 565069 556783 551228 565216 593779 612265 605501 583702
10663 583702 569171 576158 603909 640146 667738 673198 653759 619057 588046 580329 600738 630733
10651 630733 644773 638599 631461 638172 653268 667625 681983 693010 686221 661475 648106 670218
10639 670218 709147 726898 717760 707357 707029 704219 699698 716561 758686 792310 789594 766868 757725
10626 757725 766579 771907 762609 748513 742382 750547 775267 809346 834275 839856 839130 847244 854700
10613H54700r428j0399K5451O0939M3153j6243m6180j0460M1957M4813L178k1946
10601I59535k419K7048L0207J7490J3698J3677J898r083J978K1737J8759k567
10589A091958n251K1124M3385L5502J1831j543J327J3228K5148K4470R969P724
10577A278872L5616N7534K5989k9719k7641L9183P8931M0160q607M700M0507K8620
10565A564145n150P391M7807M5651R787J0378M5969M6471Q199N773N2853P0085
10553A909359K5961m221K9833O7419M6098N208Q285L9663N2090N0299N4656M4358
10541B329008J0142K839N1850R3264O3423J0001J6962O5618P3373L7328K9232
10530B783040O2716P5491M7212L2629N9315Q2391O8088M6172M9394O4307P0296
$$ plain form
10613 854700 845272 834873 860324 921263 964416 948173 901993 891533 933490 978303 981481 959535
10601 959535 957116 984164 1014371 1031861 1045559 1059236 1061134 1052051 1054029 1075766 1094525 1091958
10589 1091958 1086707 1107831 1151216 1186718 1198549 1197006 1198333 1211561 1236709 1261179 1271148 1278872
10577 1278872 1314488 1372022 1398011 1368292 1340651 1379834 1458765 1498925 1490318 1495018 1535525 1564145
10565 1564145 1558995 1566386 1614193 1659844 1669631 1680009 1725978 1772449 1780648 1786421 1839274 1909359
10553 1909359 1935320 1931099 1960932 2028351 2074449 2079657 2087942 2127605 2179695 2229994 2284650 2329008
10541 2329008 2339150 2341989 2393839 2487103 2550526 2560527 2577489 2643107 2716480 2753808 2783040
10530 2783040 2845756 2921247 2968459 3001088 3060403 3142794 3210882 3257054 3306448 3370755 3441051
10519C441051P3582P9283P7485P3739Q7182J07898J04970Q4409Q5406J10481J17037
10508D442523R1751P5484R5972J29818J49916J59231J60727J46038J30131J43868
10498E725459J76984J84741J65620J69558K10284K37487K22620K03395K10300
10489G506448K18073K09042K14941K49631K68747K49154K40510K76420L01558
10480I734524K62025K08617K22168K80472K93978K47611K12957K27703K50146
10471A1940201K40594K14917K01325J99057J94974J82553J59648J37020J38868
10462A3609157J63298J63771J10072M3058K1480L9352M8375L6091K1716j412n0748
10451A4204210r8745j02590p9329q2846j16058j36749j40620j61060j91553j91279
$$ plain form
10519 3441051 3514633 3593916 3671401 3745140 3832322 3940220 4045190 4129599 4215005 4325486 4442523
10508 4442523 4534274 4609758 4705730 4835548 4985464 5144695 5305422 5451460 5581591 5725459
10498 5725459 5902443 6087184 6252804 6422362 6632646 6870133 7092753 7296148 7506448
10489 7506448 7724521 7933563 8148504 8398135 8666882 8916036 9156546 9432966 9734524
10480 9734524 9996549 10205166 10427334 10707806 11001784 11249395 11462352 11690055 11940201
10471 11940201 12180795 12395712 12597037 12796094 12991068 13173621 13333269 13470289 13609157
10462 13609157 13772455 13936226 14046298 14089356 14110836 14150188 14198563 14234654 14256370 14254958 14204210
10451 14204210 14105465 14002875 13923546 13840700 13724642 13587893 13447273 13286213 13094660 12903381
10441A2903381j70325j84289k34453k58799k37822k22943k38865k46200k29408
10432A0880277k31645k64548k73270k38558k25017k69318l04957k69317k09781
10423H593866k02904k32590k35497k14448k14861k28055k11176j77940j79729
10414F696666k09686k09423j67305j34671j41503j61273j64133j49270j22922
10405E236480r4548r1100j25040j55422j33456p9259n7657q3093j06634r6594
10395D213677p4160o4647o6686p4867q4645p5098l6888j1625m4325j00606j00132
10384C479998l7471M641k0993o4653p0620n5855n5185n3460k7671n840k3307n5342
10372C014242n2326j9228m684k3673m1852l4529j8418j8102l1208l7529k7369
$$ plain form
10441 12903381 12733056 12548767 12314314 12055515 11817693 11594750 11355885 11109685 10880277
10432 10880277 10648632 10384084 10110814 9872256 9647239 9377921 9072964 8803647 8593866
10423 8593866 8390962 8158372 7922875 7708427 7493566 7265511 7054335 6876395 6696666
10414 6696666 6486980 6277557 6110252 5975581 5834078 5672805 5508672 5359402 5236480
10405 5236480 5141932 5050832 4925792 4770370 4636914 4557655 4499998 4416905 4310271 4213677
10395 4213677 4139517 4074870 4008184 3933317 3848672 3773574 3736686 3725061 3680736 3580130 3479998
10384 3479998 3442527 3447168 3426175 3361522 3290902 3235047 3179862 3126402 3098731 3092891 3069584 3014242
10372 3014242 2961916 2942688 2938004 2914331 2872479 2837950 2819532 2801430 2770222 2732693 2705324
10361B705324j3472j7010l9118n1044k7918J1612K4341J403k2714k5066k1750
10350B524588k7529k6681p403Q530m78j9035k1421j2779j3804k2151j9298m385
10338B358154M812j980j8309l0531k5875l281J7219J4054k966m768Q341N837j6326
10325B304381k2211J417J5731o169l0605j8566R889J2620o505j5926j4471j9172
10313B210413j9087L669K5244R551k5840l0490j087J6007P39j7388j6086q324
10301B147321n618o11M832k360j3003l308J7771J4121j6301l2983j8102l137j2416
10288B076206k4752j4807N306J0561q44j6007k5814k1514l34J7148O847j6878
10276A995118j7553J423m20k6685l0462M262K7231K088l3378l0728n623Q69o772
$$ plain form
10361 2705324 2691852 2674842 2635724 2584680 2556762 2568374 2592715 2594118 2571404 2546338 2524588
10350 2524588 2497059 2470378 2462975 2471505 2471027 2451992 2430571 2417792 2403988 2381837 2362539 2358154
10338 2358154 2362966 2360986 2342677 2312146 2286271 2282990 2300209 2314263 2311297 2306529 2314870 2320707 2304381
10325 2304381 2282170 2283587 2299318 2293149 2262544 2243978 2253867 2266487 2259982 2244056 2229585 2210413
10313 2210413 2191326 2194995 2220239 2229790 2203950 2173460 2172373 2188380 2189119 2171731 2155645 2147321
10301 2147321 2141703 2141092 2145924 2143564 2130561 2127253 2145024 2159145 2142844 2109861 2091759 2088622 2076206
10288 2076206 2051454 2036647 2041953 2052514 2051670 2035663 2009849 1988335 1988001 2005149 2011996 1995118
10276 1995118 1977565 1978988 1978568 1951883 1921421 1925683 1952914 1955002 1921624 1890896 1885273 1886142 1879370
10263A879370j415P275n569k5039k0819o231j5055l5223k5234J1837K9835J3378
10251A807110n964r908j4891k5295j8994N024J3510o211k1589q544R382L444j2165
10238A714909p443J2054J5061o874l0577l6234k7465j6266n829O685J9345K3274
10226A660640J1530j0262k5587k2919o671J0520J9410J4350n697k7314k7962m840
10214A585198J5730J4300P133J6366K8319J3856j9289l1560q950J9049K4281J1394
10202A675827l532j6209k3873j7230K948J9978K2894J7455R392l795j7318j6268
10190A650269J480J6959J4475K99q902l035J7314L8460L7500Q268k0497j7144
10178A735446P723J8087R416R317K0855J3460j6519k6198N912L6556J9450k3840
$$ plain form
10263 1879370 1877955 1885230 1879661 1854622 1833803 1827572 1812517 1777294 1752060 1763897 1793732 1807110
10251 1807110 1801146 1791238 1776347 1751052 1732058 1737082 1750592 1744381 1722792 1714248 1723630 1727074 1714909
10238 1714909 1707466 1719520 1734581 1727707 1697130 1660896 1633431 1617165 1611336 1618021 1637366 1660640
10226 1660640 1672170 1661908 1636321 1613402 1606731 1617251 1636661 1651011 1645314 1618000 1590038 1585198
10214 1585198 1600928 1615228 1622361 1638727 1667046 1680902 1661613 1630053 1621103 1640152 1664433 1675827
10202 1675827 1672295 1656086 1632213 1614983 1617931 1637909 1660803 1678258 1687650 1683855 1666537 1650269
10190 1650269 1651749 1668708 1683183 1683482 1674580 1671545 1688859 1727319 1764819 1773087 1752590 1735446
10178 1735446 1743169 1761256 1770672 1779989 1800844 1814304 1797785 1771587 1777499 1814055 1833505 1809665
10166A809665l6981r745J6872J4227l818j1242o37J7570K7735K1683Q441M013
10154A857783P674N584O06J0165K7091K0051j0759k0947Q266L2101J2749j4703
10142A935661J518M2097M6455Q925j8443r826Q411J3802J3208R605l518j0369
10130B037526J2739M5584L9620n232l2924j4636J3471J5799Q515J7118K9114K3104
10118B189798R103O567J0757R730R229J5306J6717P524K908J1898J9255J3611
10106B322403P362J0463J2240O528M845Q314J125j1357O41L4940M5074J4279q535
10093B448322J2688L7408J7338j6387k897M2771M8916j43m1501k6281K3910O0305
10081B604449N9412K6690j2392k3702l9K2785J7051P416K2140L3129O376j9336
$$ plain form
10166 1809665 1772684 1762939 1779811 1794038 1790220 1778978 1778341 1795911 1823646 1845329 1853770 1857783
10154 1857783 1865457 1871041 1871647 1881812 1908903 1928954 1918195 1897248 1905514 1937615 1950364 1935661
10142 1935661 1937179 1979276 2025731 2034656 2016213 2006387 2014798 2028600 2041808 2051413 2047895 2037526
10130 2037526 2050265 2095849 2135469 2130237 2097313 2082677 2096148 2111947 2120462 2137580 2166694 2189798
10118 2189798 2198901 2205468 2216225 2225955 2235184 2250490 2267207 2274731 2277639 2289537 2308792 2322403
10106 2322403 2329765 2340228 2352468 2358996 2363841 2372155 2373280 2361923 2362564 2397504 2442578 2456857 2448322
10093 2448322 2461010 2498418 2515756 2499369 2496472 2539243 2588159 2588016 2546515 2520234 2544144 2604449
10081 2604449 2663861 2690551 2678159 2654457 2654418 2677203 2694254 2701670 2723810 2756939 2763315 2743979
10069B743979J3886P0708O1227j0482m2333L975M6360K5130n408J3023M1219K8397
10057B989681J1351L6149N5928J1926m3199j9665N2398O4277P577j6395K9630
10046C179658O2718K8052j2635M952M1271K9602j2166j9312J7603N3688O0805
10035C434236M4836J8860J642J4219M1526L3219j8607m5656K228P0640P2383J4545
10023C684071j8174R794M9092N4224L7174K2292J0947Q596L1124O2942N9464J6079
10011D027625j1714J4375N9265O7835L9560J5286J6331L0473M0231L7636K5339
10000D362242K0425L7372N6360M1063K632J167N5008R8422P5437K8953L2967P2993
9988D885041P3718K7687Q162M7625Q7982P7608M4619L6338M7589N2834N8086P3921
$$ plain form
10069 2743979 2757865 2828573 2889800 2879318 2836985 2840960 2887320 2912450 2907042 2920065 2961284 2989681
10057 2989681 3001032 3037181 3093109 3105035 3061836 3042171 3094569 3158846 3166423 3150028 3179658
10046 3179658 3242376 3270428 3257793 3262745 3304016 3333618 3321452 3302140 3319743 3373431 3434236
10035 3434236 3479072 3497932 3499574 3513793 3555319 3588538 3569931 3524275 3526503 3597143 3669526 3684071
10023 3684071 3665897 3675691 3724783 3779007 3816181 3838473 3849420 3858016 3889140 3952082 4011546 4027625
10011 4027625 4015911 4030286 4089551 4157386 4196946 4212232 4228563 4259036 4299267 4336903 4362242
10000 4362242 4382667 4420039 4476399 4517462 4520094 4521261 4576269 4674691 4750128 4779081 4812048 4885041
9988 4885041 4958759 4986446 4994608 5042233 5130215 5207823 5252442 5288780 5336369 5389203 5447289 5521210
9976E521210P9465O0499M6409O2545Q1658P2481O0890Q4268J15664J01671N6537
9965F343297M4887P6490R3499P0871N6182Q5577J24355J26554J03354R3542J03952
9954G322560J15862J21057J19414J05979Q8088R0304J17273J37919J31353J19960
9944H469769J29344J44837J40490J25403J25992J43171J60016J71665J76714J63413
9934I950814J38482J41707J89863K32798K15304J61253J40962J71012K06012K19065
9924A1767272K25402K28613K11912J90241K03687K45128K61347K43790K46245
9915A3823637K86060L05880K75879K55567K92999L34941L16411K78303K99741
9906A6469418L57725L64439L22645L24642L90574M27699L86220L45603L84173
$$ plain form
9976 5521210 5600675 5661174 5707583 5770128 5851786 5924267 5985157 6069425 6185089 6286760 6343297
9965 6343297 6388184 6464674 6558173 6629044 6685226 6770803 6895158 7021712 7125066 7218608 7322560
9954 7322560 7438422 7559479 7678893 7784872 7872960 7963264 8080537 8218456 8349809 8469769
9944 8469769 8599113 8743950 8884440 9009843 9135835 9279006 9439022 9610687 9787401 9950814
9934 9950814 10089296 10231003 10420866 10653664 10868968 11030221 11171183 11342195 11548207 11767272
9924 11767272 11992674 12221287 12433199 12623440 12827127 13072255 13333602 13577392 13823637
9915 13823637 14109697 14415577 14691456 14947023 15240022 15574963 15891374 16169677 16469418
9906 16469418 16827143 17191582 17514227 17838869 18229443 18657142 19043362 19388965 19773138
9897A9773138M54798M70510M43190M44370M76379M83617M69037M96072N70033
9888B4081144O12979N84312N46425N68165O27083O59236O57183O60425O81463
9879B9678415P01211P19416P51898P85776P93139P89064Q19825Q83813R21408
9870C6843965R06750Q95013R39030J004997J026093J009151J020980J077515J118090
9861D5841584J107141J096485J144509J220328J246949J218596J210678J266250
9853E5352520J330905J333424J291850J289254J355997J428381J438712J403628
9845F6224671J388916J413145J433456J422524J409999J429441J463541J473528
9837G7659221J457298J442676J438292J427946J407416J391754J385521J375543
$$ plain form
9897 19773138 20227936 20698446 21141636 21586006 22062385 22546002 23015039 23511111 24081144
9888 24081144 24694123 25278435 25824860 26393025 27020108 27679344 28336527 28996952 29678415
9879 29678415 30379626 31099042 31850940 32636716 33429855 34218919 35038744 35922557 36843965
9870 36843965 37750715 38645728 39584758 40589755 41615848 42624999 43645979 44723494 45841584
9861 45841584 46948725 48045210 49189719 50410047 51656996 52875592 54086270 55352520
9853 55352520 56683425 58016849 59308699 60597953 61953950 63382331 64821043 66224671
9845 66224671 67613587 69026732 70460188 71882712 73292711 74722152 76185693 77659221
9837 77659221 79116519 80559195 81997487 83425433 84832849 86224603 87610124 88985667
9829H8985667J354403J324717J283278J231115J193424J190222J189659J139471
9821I8891956J051144R95930R97099R86733R07969Q04167P50900P43058P15988
9812A06844944O49735N79790N18142M38727L44562K78894K52093K17012J40100
9803A10263999M6167l1365r6969j63080k19501k64639l26072m13932m90173n23842
9793A07780593n45424o02837o88705p57508p96350q31022q73644r13328r54807
9784A00816968j016981j087642j126228j126281j134039j183100j245152j274731
9776I1622814j276630j292931j335737j370938j372109j358562j363929j388479
9768H0863499j405459j404484j402094j407868j406893j389121j373544j380535
$$ plain form
9829 88985667 90340070 91664787 92948065 94179180 95372604 96562826 97752485 98891956
9821 98891956 99943100 100939030 101936129 102922862 103830831 104634998 105385898 106128956 106844944
9812 106844944 107494679 108074469 108592611 109031338 109375900 109654794 109906887 110123899 110263999
9803 110263999 110310166 110278801 110181832 110018752 109799251 109534612 109208540 108794608 108304435 107780593
9793 107780593 107235169 106632332 105943627 105186119 104389769 103558747 102685103 101771775 100816968
9784 100816968 99799987 98712345 97586117 96459836 95325797 94142697 92897545 91622814
9776 91622814 90346184 89053253 87717516 86346578 84974469 83615907 82251978 80863499
9768 80863499 79458040 78053556 76651462 75243594 73836701 72447580 71074036 69693501
9760F9693501j395352j387507j358825j340927j344477j342821j314345j272733
9752E8936514j242536j228376j221189j213471j196813j165921j134460j122151
9744D9411597j117883j087669j031614r93963r94901r94476r57147r10858q96938
9735D0426148q97212q67108q15746p90059p91996p76417p30764o94387o89252
9726C3373207o88459o69033o44007o23341n92367n52196n34929n50040n56606
9717B7962229n21565m71547m52680m65592m73309m53886m17263l85817l78505
9708B3942065l96255m08697l81235l29315l09952l37740l52412l07120k48072
9699B0871267k51981l10454l39601k98118k35595k13607k30039k43898k37490
$$ plain form
9760 69693501 68298149 66910642 65551817 64210890 62866413 61523592 60209247 58936514
9752 58936514 57693978 56465602 55244413 54030942 52834129 51668208 50533748 49411597
9744 49411597 48293714 47206045 46174431 45180468 44185567 43191091 42233944 41323086 40426148
9735 40426148 39528936 38661828 37846082 37056023 36264027 35487610 34756846 34062459 33373207
9726 33373207 32684748 32015715 31371708 30748367 30156000 29603804 29068875 28518835 27962229
9717 27962229 27440664 26969117 26516437 26050845 25577536 25123650 24706387 24320570 23942065
9708 23942065 23545810 23137113 22755878 22426563 22116611 21778871 21426459 21119339 20871267
9699 20871267 20619286 20308832 19969231 19671113 19435518 19221911 18991872 18747974 18510484
9690A8510484k24803k18383k14545k06475j95834j89159j87759j84586j75032
9681A6713908j68807j79219j98127j98172j69080j35394j25741j39751j58089
9672A5241528j67715j62038j35432r8300q1058j00376j33276j44114j25196r5424
9662A3998599p6033q2733j17598j49451j32438p1062l3643o4634j16956j18638
9652A3035413p6793n6274p5171q8684p1847n2350n3799o3882o9856p5226p2954
9641A2278577n1481l2000m6042p2714o0072j5826n352m2932o3677l4716j2407
9630A1841358l9969o6497l6095Q824m178n4499o3125k0835P114q779l1310l4482
9618A1497527l4769l7136k1310L663l494m4679o6766m1041m666L410l064P66J885
$$ plain form
9690 18510484 18285681 18067298 17852753 17646278 17450444 17261285 17073526 16888940 16713908
9681 16713908 16545101 16365882 16167755 15969583 15800503 15665109 15539368 15399617 15241528
9672 15241528 15073813 14911775 14776343 14678043 14596985 14496609 14363333 14219219 14094023 13998599
9662 13998599 13922566 13839833 13722235 13572784 13440346 13369284 13335641 13271007 13154051 13035413
9652 13035413 12958620 12902346 12827175 12738491 12666644 12614294 12560495 12496613 12426757 12351531 12278577
9641 12278577 12227096 12195096 12149054 12076340 12016268 12000442 11995090 11952158 11888481 11853765 11841358
9630 11841358 11801389 11734892 11698797 11707621 11703443 11648944 11585819 11564984 11572098 11563319 11532009 11497527
9618 11497527 11462758 11425622 11404312 11407975 11404481 11359802 11293036 11251995 11247329 11250739 11247675 11248441 11250326
9605A1250326j7114l2382j3016K1785K5199p639l3117k1995N269J4416K931n955
9593A1188708j463J595j0432k4666j7331Q841K2472O578j5287j2491Q974J9653
9581A1175151J2936R693J8851K2221O173j3729j2115J3505L8270L5138M986j7536
9569A1293544O43M4946O2102K8626j3529j3571J9711M0041L4576K9708L6448L7034
9557A1600279K6186K1722K7925K7723J8460J8327L0544L7763L7596M4926N4224
9546A1945675M3268K1650K6605N7927O9670M6591L3646N9416Q4189O5245K6758
9535A2480640J7131L5628N1380O2140Q0941R1085P0242M1301M5104P4531Q7436
9524A3137559P6337P3112Q7351R1855P5392O3954P7299J00542J11623J09228J03814
$$ plain form
9605 11250326 11233212 11200830 11187814 11209599 11234798 11227159 11194042 11172047 11177316 11191732 11194663 11188708
9593 11188708 11187245 11188840 11178408 11153742 11136411 11145252 11167724 11174302 11159015 11146524 11155498 11175151
9581 11175151 11188087 11197780 11216631 11238852 11245025 11231296 11219181 11232686 11270956 11306094 11311080 11293544
9569 11293544 11294187 11339133 11401235 11429861 11416332 11402761 11422472 11462513 11497089 11526797 11563245 11600279
9557 11600279 11626465 11648187 11676112 11703835 11722295 11740622 11771166 11808929 11846525 11891451 11945675
9546 11945675 11988943 12010593 12037198 12095125 12164795 12211386 12245032 12304448 12388637 12453882 12480640
9535 12480640 12497771 12533399 12584779 12646919 12727860 12818945 12889187 12930488 12975592 13050123 13137559
9524 13137559 13213896 13287008 13374359 13466214 13541606 13605560 13682859 13783401 13895024 14004252 14108066
9513A4108066J02723J09058J17835J15488J00366R4138J11578J33004J33457J23816
9503A5249529J30331J48367J54426J51569J60336J73381J65341J44537J47504
9494A6625321J79394K04730K03083J91966J89024J92704K04666K28757K44540
9485A8464185K28518K05184K23728K75719K95435K59544K24724K38569K73888
9476B0689494K89279K96765L19588L33340L09372K80585L00451L58082L93544
9467B3570500L85455L68810L71584L84570L95276M07129M18737M19754M14290
9458B7136105M20313M42228M67573M89710N09911N20733N14249N05450N20151
9449C1526423N56405N81536N73783N49608N43526N71096O15064O44310O48427
$$ plain form
9513 14108066 14210789 14319847 14437682 14553170 14653536 14747674 14859252 14992256 15125713 15249529
9503 15249529 15379860 15528227 15682653 15834222 15994558 16167939 16333280 16477817 16625321
9494 16625321 16804715 17009445 17212528 17404494 17593518 17786222 17990888 18219645 18464185
9485 18464185 18692703 18897887 19121615 19397334 19692769 19952313 20177037 20415606 20689494
9476 20689494 20978773 21275538 21595126 21928466 22237838 22518423 22818874 23176956 23570500
9467 23570500 23955955 24324765 24696349 25080919 25476195 25883324 26302061 26721815 27136105
9458 27136105 27556418 27998646 28466219 28955929 29465840 29986573 30500822 31006272 31526423
9449 31526423 32082828 32664364 33238147 33787755 34331281 34902377 35517441 36161751 36810178
9440C6810178O50492O73511P01668P02634O85425O93882P34231P61012P57702
9431D3170735P72630Q32893Q81279Q62356Q22811Q45865R19030R58411R48852
9422E1014862R60712J021503J070523J069719J069035J116069J178048J209110
9414E9709581J230425J280670J339204J367082J385845J444044J529139J583461
9406G0869451J599147J631685J713511J808971J870846J902166J943742K024173
9398H5363692K134593K240178K314947K373315K455988K573934K690139K778891
9390A04925677K872468L009095L160567L268025L338992L445189L616325L798187
9382A31434525L938938M059998M204998M366587M511887M645115M790066M932336
$$ plain form
9440 36810178 37460670 38134181 38835849 39538483 40223908 40917790 41652021 42413033 43170735
9431 43170735 43943365 44776258 45657537 46519893 47342704 48188569 49107599 50066010 51014862
9422 51014862 51975574 52997077 54067600 55137319 56206354 57322423 58500471 59709581
9414 59709581 60940006 62220676 63559880 64926962 66312807 67756851 69285990 70869451
9406 70869451 72468598 74100283 75813794 77622765 79493611 81395777 83339519 85363692
9398 85363692 87498285 89738463 92053410 94426725 96882713 99456647 102146786 104925677
9390 104925677 107798145 110807240 113967807 117235832 120574824 124020013 127636338 131434525
9382 131434525 135373463 139433461 143638459 148005046 152516933 157162048 161952114 166884450
9374A66884450N037476N117800N220788N345889N432435N450022N444477N458828
9366B09392165N458277N385450N254374N125199N002287M827593M579330M308933
9358B49333608M058057L800830L504433L191628K892784K580691K216953J835529
9350B73414513J509386J241807R59119O19714K68753l5990l00446n67168q51767
9341B76257921j139621j421513j703565j993309k290833k584393k854774l102458
9333B59167455l362328l658893l954205m185801m355990m528527m727282m900280
9325B25494149n007256n078403n148176n191226n175309n127125n087575n042944
9317A84636135m960050m853020m752569m642019m491569m328438m200595m091352
$$ plain form
9374 166884450 171921926 177039726 182260514 187606403 193038838 198488860 203933337 209392165
9366 209392165 214850442 220235892 225490266 230615465 235617752 240445345 245024675 249333608
9358 249333608 253391665 257192495 260696928 263888556 266781340 269362031 271578984 273414513
9350 273414513 274923899 276165706 277124825 277744539 278013292 277977302 277676856 277109688 276257921
9341 276257921 275118300 273696787 271993222 269999913 267709080 265124687 262269913 259167455
9333 259167455 255805127 252146234 248192029 244006228 239650238 235121711 230394429 225494149
9325 225494149 220486893 215408490 210260314 205069088 199893779 194766654 189679079 184636135
9317 184636135 179676085 174823065 170070496 165428477 160936908 156608470 152407875 148316523
9309A48316523l945270l764972l604855l476530l340717l191815l067090k964323
9301A20960951k835091k677085k549148k469158k380121k251390k130792k052186
9293A01615980j972308j855765j747227j691026j645347j553725j446021j383466
9285H8321095j347705j275760j175330j110958j089743j052667r78347r08720
9277G9381865q63655q12792p48663p08355o96682o62657n87374n26079n17935
9268G3257673n15699m60835l79217l38143l41018l31005k83750k34145k11447
9259G0162414k01725j84782j65045j49368j26514q8393n0988l6169m3247m9936
9249F9066247l5763p12L2849L8171J3962p537L438L4375M6998L2140K0576L1501
$$ plain form
9309 148316523 144371253 140606281 137001426 133524896 130184179 126992364 123925274 120960951
9301 120960951 118125860 115448775 112899627 110430469 108050348 105798958 103668166 101615980
9293 101615980 99643672 97787907 96040680 94349654 92704307 91150582 89704561 88321095
9285 88321095 86973390 85697630 84522300 83411342 82321599 81268932 80290585 79381865
9277 79381865 78518210 77705418 76956755 76248400 75551718 74889061 74301687 73775608 73257673
9268 73257673 72741974 72281139 71901922 71563779 71222761 70891756 70608006 70373861 70162414
9259 70162414 69960689 69775907 69610862 69461494 69334980 69246587 69195599 69159430 69116183 69066247
9249 69066247 69030484 69029772 69062621 69100792 69114754 69107217 69110655 69145030 69192028 69224168 69244744 69276245
9237F9276245M1422K5692M317J2567M1503M7829K0480l903q79O182r188l1444
9225F9430823l3244k4462l3766n7386o5423n2314m3234n0417n8323n6385n4021
9214F8901848n6409n5138m9477m7736m1952j3972K5670M1241K6786K0438M6776
9203F8798075Q2629J01654J14185J35755J55073J67135K00251K68615L31906L50044
9193G0705322L49156L80291M37637M78250N05040N60697O42687O96410P06517
9184G5462007P28965Q05394R00892R61291R88468J020711J071278J125974J180555
9175H4245535J243538J311540J370510J418061J465063J517100J567049J605858
9167I5744254J635735J671967J725142J777004J791364J766129J753128J794454
$$ plain form
9237 69276245 69317667 69343359 69347676 69360243 69401746 69449575 69470055 69466152 69465273 69471455 69462267 69430823
9225 69430823 69397579 69373117 69339351 69281965 69216542 69164228 69120994 69070577 69012254 68955869 68901848
9214 68901848 68845439 68790301 68740824 68693088 68651136 68637164 68662834 68704075 68730861 68751299 68798075
9203 68798075 68880704 68982358 69096543 69232298 69387371 69554506 69754757 70023372 70355278 70705322
9193 70705322 71054478 71434769 71872406 72350656 72855696 73416393 74059080 74755490 75462007
9184 75462007 76190972 76996366 77897258 78858549 79847017 80867728 81939006 83064980 84245535
9175 84245535 85489073 86800613 88171123 89589184 91054247 92571347 94138396 95744254
9167 95744254 97379989 99051956 100777098 102554102 104345466 106111595 107864723 109659177
9159A09659177J856919J873357J838665J811892J822384J832782J810606J779155
9151A24284937J767797J759816J726379J675680J632866J600463J569665J542182
9143A37559785J512377J458625J382134J320867J291025J249909J159112J053021
9135A47986855R93106R75076R36181Q47296P47293O81779O47512O07994N39560
9126A54962652M54372L88655L64305L58072L27637K72823K36187K29800K09922
9117A57804425J54564J12044J21155J32733Q1657P09k2079J7330L2325j8860p9215
9106A58336788r6506r9917j33559j78934j94933j90479k05315k44487k77312k89205
9096A56426141k99051l27533l70608m06918m23930m34994m63931n09092n42660
$$ plain form
9159 109659177 111516096 113389453 115228118 117040010 118862394 120695176 122505782 124284937
9151 124284937 126052734 127812550 129538929 131214609 132847475 134447938 136017603 137559785
9143 137559785 139072162 140530787 141912921 143233788 144524813 145774722 146933834 147986855
9135 147986855 148979961 149955037 150891218 151738514 152485807 153167586 153815098 154423092 154962652
9126 154962652 155417024 155805679 156169984 156528056 156855693 157128516 157364703 157594503 157804425
9117 157804425 157958989 158071033 158192188 158324921 158406578 158407287 158385208 158402538 158434863 158416003 158336788
9106 158336788 158240282 158140365 158006806 157827872 157632939 157442460 157237145 156992658 156715346 156426141
9096 156426141 156127090 155799557 155428949 155022031 154598101 154163107 153699176 153190084 152647424
9087A52647424n60513o02442o90241p77820q13820q27842q88620r91737j066205
9078A45428184j092258j129529j211921j296839j349588j400459j475247j539333
9070A34933010j562530j579409j630394j694352j733523j757327j787791j809435
9062A21378249j810243j825315j877941j922361j912137j882590j891285j916924
9054A06339453j902249j865413j872228j913005j908149j840654j786174j789984
9046I1461597j801490j765388j702987j659729j631850j591835j542035j498559
9038G8267724j453933j393969j328592j275586j231984j183813j127727j067792
9030F8204328j007456r54111r13281q73778q19464p56569p05769o69909o36634
$$ plain form
9087 152647424 152086911 151484469 150794228 150016408 149202588 148374746 147486126 146494389 145428184
9078 145428184 144335926 143206397 141994476 140697637 139348049 137947590 136472343 134933010
9070 134933010 133370480 131791071 130160677 128466325 126732802 124975475 123187684 121378249
9062 121378249 119568006 117742691 115864750 113942389 112030252 110147662 108256377 106339453
9054 106339453 104437204 102571791 100699563 98786558 96878409 95037755 93251581 91461597
9046 91461597 89660107 87894719 86191732 84532003 82900153 81308318 79766283 78267724
9038 78267724 76813791 75419822 74091230 72815644 71583660 70399847 69272120 68204328
9030 68204328 67196872 66242761 65329480 64455702 63636238 62879669 62173900 61503991 60867357
9021F0867357o06398n85037n57440n08675m62313m50058m50851m16720l56369
9012E6473496l27893l42781l48262l20865l02574l16186l20157k88006k61073
9003E3645699k72292k84506k62781k44527k69473k97901k78011k46126k70299
8994E1219783l29197l43711l10281l03285l46353l79642l71403l69772m09815
8985D8056324m49338m44569m26188m45127m88293n05240m91259m90259n24488
8976D3791563n64693n73932n54094n39699n55034n83816n87791n59508n40230
8967C8732766n65010o06631o10137n75283n58701n88132o22375o16167n82591
8958C3407739n61946n62556n66298n67566n71118n67933n47363n23334n17815
$$ plain form
9021 60867357 60260959 59675922 59118482 58609807 58147494 57697436 57246585 56829865 56473496
9012 56473496 56145603 55802822 55454560 55133695 54831121 54514935 54194778 53906772 53645699
9003 53645699 53373407 53088901 52826120 52581593 52312120 52014219 51736208 51490082 51219783
8994 51219783 50890586 50546875 50236594 49933309 49586956 49207314 48835911 48466139 48056324
8985 48056324 47606986 47162417 46736229 46291102 45802809 45297569 44806310 44316051 43791563
8976 43791563 43226870 42652938 42098844 41559145 41004111 40420295 39832504 39272996 38732766
8967 38732766 38167756 37561125 36950988 36375705 35817004 35228872 34606497 33990330 33407739
8958 33407739 32845793 32283237 31716939 31149373 30578255 30010322 29462959 28939625 28421810
8949B8421810n24625n18359m96322m83215m90605m96341m75272m35082m07911
8940B4094078m10450m22751m12227l76119l48211l54304l73228l63685l24545
8931B0708558k98219l07935l24302l12640k83901k69852k70565k63159k49003
8922A8128982k49849k59305k43581k02952j88676k29423k74763k55619j84280
8913A6040534j43612j73114k16236k05597j58281j42260j72377j94969j74646
8904A4459442j41697j34813j43072j37234j23627j26434j38906j35344j19644
8895A3258671j19014j33333j32631j08685r0084r5836j08614j08587j03605j08024
8885A2150258j15799j13344j01052q6705p3432o6705p6540r9787j15256j08585
$$ plain form
8949 28421810 27897185 27378826 26882504 26399289 25908684 25412343 24937071 24501989 24094078
8940 24094078 23683628 23260877 22848650 22472531 22124320 21770016 21396788 21033103 20708558
8931 20708558 20410339 20102404 19778102 19465462 19181561 18911709 18641144 18377985 18128982
8922 18128982 17879133 17619828 17376247 17173295 16984619 16755196 16480433 16224814 16040534
8913 16040534 15896922 15723808 15507572 15301975 15143694 15001434 14829057 14634088 14459442
8904 14459442 14317745 14182932 14039860 13902626 13778999 13652565 13513659 13378315 13258671
8895 13258671 13139657 13006324 12873693 12765008 12674924 12579088 12470474 12361887 12258282 12150258
8885 12150258 12034459 11921115 11820063 11733358 11659926 11593221 11516681 11416894 11301638 11193053
8875A1193053q8787p1508o1512o0285p3037r5915j11202j07388r2933q2628q2048
8864A0265810q9467r8896r9327q7108p7893q6237r8139r1081p5669q0441r7870
8853I283682r1828o3780n8282q7677j08297r6625q9434j11146j21527q7690n3322
8842H314074p0822j08861j02140o1183n2223q5940j07677r3533p8268q2545q4483
8831G386399p4844p4565q4023p6862n7348o1658q7932r0014n9156m4473o6767
8820F608757q0477n5972l4081n4837q9819r3297p0864n0854l5003k3313l8903
8809E981337p8827q9649m6308n852k2844o1735o2783m4787n8072p8832n0471k134
8797E379043j4864p7280r0514l0547R597k4821o2775l4767Q755j2099o9609p5964
$$ plain form
8875 11193053 11104266 11032758 10971246 10910961 10837924 10742009 10630807 10523419 10430486 10347858 10265810
8864 10265810 10176343 10077447 9978120 9891012 9813119 9726882 9628743 9537662 9461993 9381552 9283682
8853 9283682 9191854 9128074 9069792 8982115 8873818 8777193 8687759 8576613 8455086 8367396 8314074
8842 8314074 8243252 8134391 8032251 7971068 7918845 7832905 7725228 7631695 7553427 7470882 7386399
8831 7386399 7311555 7236990 7152967 7076105 7018757 6957099 6869167 6779153 6719997 6675524 6608757
8820 6608757 6528280 6472308 6438227 6383390 6293571 6200274 6129410 6078556 6043553 6020240 5981337
8809 5981337 5902510 5812861 5766553 5760701 5737857 5676122 5613339 5568552 5510480 5431648 5381177 5379043
8797 5379043 5364179 5286899 5196385 5165838 5175435 5150614 5087839 5053072 5061827 5049728 4980119 4904155
8785D904155k5543L646k4711o1409n7817k9280j5802k6498m2953m8191l7656j9525
8773D518416j0608j9112l2884l6431l1933k9788k9233k4627k0250k2394k7320
8762D233836l0683l5105l6660k4170n323o028k5864k8730m332K128l7655p5134
8750C926280n5019q934n624l3608k3261K2103K0000m7245q6216l8134K2000L219
8738C695561n9375o8104j6337J6854j915k7482k6581j6647j0493K275R777j5645
8726C481888n3694m9094m854R842k9325n7309k6162J4913K264l9006m2897r820
8714C196746P657k351p793o660k7549n7231m3178J5376M7134J0673l9245l0482
8702C063097K1231L7740q508n8523n0650j516K2320l744l2930j8007J9097K1575
$$ plain form
8785 4904155 4878612 4882258 4857547 4796138 4738321 4709041 4693239 4666741 4623788 4575597 4537941 4518416
8773 4518416 4507808 4488696 4455812 4419381 4387448 4357660 4328427 4303800 4283550 4261156 4233836
8762 4233836 4203153 4168048 4131388 4107218 4101895 4095867 4070003 4041273 4036941 4039069 4001414 3926280
8750 3926280 3871261 3862327 3856703 3823095 3799834 3821937 3841937 3794692 3708476 3670342 3692342 3695561
8738 3695561 3636186 3568082 3551745 3568599 3566684 3539202 3512621 3495974 3485481 3487756 3497533 3481888
8726 3481888 3428194 3379100 3374246 3384088 3354763 3297454 3271292 3286205 3288469 3249463 3206566 3196746
8714 3196746 3204403 3202052 3194259 3187599 3160050 3102819 3059641 3075017 3122151 3132824 3093579 3063097
8702 3063097 3084328 3122068 3113560 3055037 3004387 3002871 3025191 3021447 2988517 2970510 2989607 3011182
8690C011182j3426k9320n18K5450N551k8694k5937N37L689j0706N91L0480K5940
8677B994819j6927l7951r802K0482J2927p608q511m367j4723j9952l176R793l446
8664B911558j8189q647M546j607m486J6355K5988j0877n7497n3364p815K0082
8652B816047J3063J246m646j7354k4638n671J4703k809l6083k9679Q883J9968
8640B753030l961j1459N078o048m8729n4321j657L2546k911m6881l0426R020Q82
8627B594163l3449k3915J9984K4242k1409m5040j0144K9128J5490k9594m5739
8616B473717j7889J2543N218l2537n6142l5443Q430K8101R210j7304k4214j8320
8604B335370j2504l758L988p320l2554l7313j3611j38j8577l5631k3124o768j2534
$$ plain form
8690 3011182 2997756 2968436 2967918 2993368 2998919 2970225 2944288 2944825 2948514 2937808 2938399 2968879 2994819
8677 2994819 2977892 2939941 2930139 2950621 2963548 2955940 2947429 2943062 2928339 2908387 2905211 2915004 2911558
8664 2911558 2893369 2884722 2889268 2887661 2883175 2899530 2925518 2914641 2857144 2803780 2795965 2816047
8652 2816047 2829110 2830356 2825710 2808356 2783718 2778047 2792750 2789941 2753858 2724179 2733062 2753030
8640 2753030 2749069 2737610 2742688 2736640 2687911 2633590 2631933 2664479 2661568 2614687 2584261 2593281 2594163
8627 2594163 2560714 2536799 2556783 2581025 2559616 2514576 2504432 2533560 2549050 2519456 2473717
8616 2473717 2455828 2468371 2473589 2441052 2384910 2349467 2357897 2385998 2395208 2377904 2353690 2335370
8604 2335370 2322866 2319108 2323096 2315776 2283222 2245909 2232298 2232160 2213583 2177952 2154828 2148060 2135526
8591B135526j5840M340J2943j7927m4452k1837R199r738m5392k8887J5334P844
8579B001113m0753m4674K217J4188k9677m6304n26L0193l609l6766j3179J3099
8567A845322j5169m7751k0838K0781K925m1916l1705J9295K8313j0837k5216N177
8555A728381K0992n459k9686k1545q419j0941q060J0665J9449M692j2865j9391
8543A667813k2906j9666K210K0945J389l6176l2090J4469L2555j0678n5487m2147
8531A520231K887J9588K791j2587j5728j8369j7600o943k378j5883k4598p007
8519A424404J1671m813l8794l8209M021L6786K2630j6331l6921k8901j3040n122
8507A317381j930K668K902j0939l2257l6396j0234K2498K4508n667k9931k3024
$$ plain form
8591 2135526 2119686 2124026 2136969 2119042 2074590 2052753 2061952 2052214 2006822 1977935 1993269 2001113
8579 2001113 1960360 1915686 1917903 1932091 1902414 1856110 1855584 1885777 1882168 1845402 1832223 1845322
8567 1845322 1830153 1782402 1761564 1782345 1785270 1743354 1711649 1730944 1759257 1748420 1723204 1728381
8555 1728381 1749373 1743914 1714228 1692683 1684264 1673323 1665263 1675928 1695377 1700069 1687204 1667813
8543 1667813 1644907 1625241 1627451 1648396 1649785 1613609 1581519 1595988 1628543 1617865 1562378 1520231
8531 1520231 1523118 1542706 1545497 1532910 1517182 1498813 1481213 1474270 1471892 1456009 1431411 1424404
8519 1424404 1436075 1431262 1392468 1354259 1358280 1395066 1417696 1401365 1364444 1335543 1322503 1317381
8507 1317381 1315451 1318119 1321021 1310082 1277825 1241429 1231195 1253693 1278201 1272534 1242603 1219579
8495A219579m301l049j5301j7107m697L473k743j3893j7690j1786j754L551j553
8482A132729j1071j2705o255m575j0982j2689n135k423j0268j0635O670J7855
8470A070516k187l5822m2359j5277J0687J0066l908p307K13K176p114j5468j0587
8457I53629K948Q201k147j4384j2756m036o404j6459j2195O672J1352r160k4668
8444H80593j0159J3064J3212m16K19Q251l520k5317j8338J7979L5864R742k6154
8431H95020l1319j3801n182r032n244J0380J9965J2249k669p552K422J3279N073
8418H83589k1595l7040j7999J2875J1079k3404l9018p007L2603K7759j1459l3009
8406G77374j9373j696l098r689m847L008R44o941j3449k1596k9294k2159P62J4297
$$ plain form
8495 1219579 1215278 1212229 1196928 1179821 1175124 1178597 1175854 1161961 1144271 1132485 1130731 1134282 1132729
8482 1132729 1121658 1108953 1102698 1098123 1087141 1074452 1069317 1066894 1056626 1045991 1052661 1070516
8470 1070516 1068329 1032507 990148 974871 985558 995624 991716 984409 984622 986798 979684 964216 953629
8457 953629 956577 964778 962631 948247 935491 931455 925051 908592 896397 903069 914421 905261 880593
8444 880593 870434 883498 896710 896294 896513 904764 901244 875927 857589 875568 911432 921174 895020
8431 895020 863701 849900 844718 835686 830442 840822 860787 873036 870367 862815 865237 878516 883589
8418 883589 861994 824954 806955 819830 830909 807505 768487 761480 794083 821842 810383 777374
8406 777374 758001 756305 753207 743518 738671 741679 742623 735682 722233 700637 671343 649184 649946 664243
8392F64243K587j0796K993K7128J9400j8973l6775p922K6420J8222j6392k5563
8380F44572j619J3774P5j4222n035R037M359o565j397J0091L995j4461j9459p088
8366F16057K857K959N069J1859J1349K966N48L182p959l1716l4343L152M5302
8353F31282L9603j1796m7331k2876K8703L8494n627l9857j2317M1218M6398k360
8341F83534l6433j7805J0513M352r916Q399L4043J7117k5676l4052m353R002q307
8328F30418r051K3301L7002o07m3448l7618j00J9077J1440J191m054r604q696
8315F09251k27m288k4569k6782O927L6291K0983j2420j4042P124M516k2080k7743
8302E52941l12K3010J7984k75j5081k3895j6354J4264L7729J7326k4575k7628
$$ plain form
8392 664243 666830 656034 659027 686155 705555 686582 649807 641885 668305 686527 670135 644572
8380 644572 642953 656727 656802 642580 637545 646582 650941 644376 642979 653070 657065 642604 623145 616057
8366 616057 618914 621873 626942 638801 650150 653116 653664 656846 648887 617171 582828 585980 631282
8353 631282 670885 659089 611758 588882 617585 656079 650452 610595 598278 639496 685894 683534
8341 683534 647101 629296 639809 644161 634245 642644 676687 693804 668128 634076 629723 638725 630418
8328 630418 621367 644668 681670 681063 637615 599997 599897 618974 630414 631605 627551 617947 609251
8315 609251 609024 604736 580167 553385 560312 596603 617586 605166 591124 598248 602764 580684 552941
8302 552941 552629 575639 593623 593348 578267 554372 538018 552282 590011 607337 582762 555134
8290E55134J3178L6133J0468j7183k841K5834K1820n323j2813O736K4681K4342
8278F80166J1136r816l1921l5572j0693J7272J2884k1178m4946k9541J1138L6262
8266E85191J7510l1296o0171l2122K8469N5408J8304l9514n5037j9163K2033K6601
8254E16213j801k6833k1640K397J0233q913k1637J580L3760K4142k2273m5386
8242D39842j8158J5703J2919p894p854R227J4647N828q6k145q777j2154j674J1722
8228D51146J1773J899p461j5077j3675J0201L8107K2076m0573p8365l8952K8971
8216C70070M4456R320j3136n951o650k1535j4647J4577J9918j1167l4513k4295
8204C26447p585m707K706K0910K1218m802k2674j4925r249j9225j4670J5336K8139
$$ plain form
8290 555134 568312 604445 614913 597730 594889 620723 642543 637220 624407 631143 655824 680166
8278 680166 691302 681486 649565 613993 603300 620572 633456 612278 567332 537791 548929 585191
8266 585191 602701 571405 511234 479112 507581 562989 581293 541779 486742 467579 489612 516213
8254 516213 514412 487579 465939 468336 478569 469656 448019 449599 483359 507501 485228 439842
8242 439842 421684 437387 450306 442412 434558 443785 458432 464260 464174 462029 453252 441098 439424 451146
8228 451146 462919 464818 457357 442280 428605 438806 476913 498989 458416 380051 341099 370070
8216 370070 414526 423846 410710 404759 398109 376574 361927 376504 396422 385255 350742 326447
8204 326447 318862 314155 316861 337771 358989 354187 331513 316588 307339 288114 273444 288780 316919
8191C16919k247l4875k7776l077L100M875K3958L1058k977l7644j8622K6639K7826
8178C07157j3093k8006K442K3196K650k1830j7005l103j796L464K0794J8343j9411
8165B73802m9008k7735J7686K8954n66k6091k0695j081J0585J2162P221k910p545
8152B14779O493K8753K8804k942l6027l6088q496J0681L088r979N0K7491L8185
8139B64792J5220j7000k3613m079Q996n679l0130l1309m200K1259J7237p886k1284
8126A82324q139J1369J3188K443o83L033m670k1965k2535K450K5847K4117J0668
8113B17447Q037Q660p926l2587l3390k567K9450L0938L293k4280k5314k640J3142
8100A82263J363j4958J349L6169L1218k3277n4566j0859M8037L1919l8893n9395
$$ plain form
8191 316919 314672 279797 252021 248944 252044 256919 280877 311935 308958 271314 252692 279331 307157
8178 307157 294064 266058 268500 291696 294346 272516 255511 252408 250612 254076 274870 293213 273802
8165 273802 224794 197059 214745 243699 243133 217042 196347 195266 205851 218013 225234 222324 214779
8152 214779 221272 250025 278829 275887 239860 203772 195276 205957 209045 199066 199116 226607 264792
8139 264792 280012 263012 239399 235320 244316 238637 208507 177198 172998 194257 211494 203608 182324
8126 182324 174185 185554 198742 201185 200502 203535 198865 176900 154365 156815 182662 206779 217447
8113 217447 225484 234144 226218 193631 160241 157674 187124 218062 221355 197075 171761 169121 182263
8100 182263 183626 168668 170017 206186 237404 214127 159561 148702 196739 228658 189765 130370
8088A30370j51N0113K3392l1478l6471Q24J9531M757r375p825n944o186M853K0738
8074A57148J8836p91j4001r697k89L332K355k351j0896j4922o712N467P327j439
8060A33367j0572j3776p682R952K7637K3857l48j4224k798O528r441k4527m113
8047A13860L1395L3086J379j5677j196P487j3592l4152k0769R865J9540M832o400
8034A29658r57N516j736j3004p620J5268K8508Q355k8282l7005n129K5475J4814
8021A33861j8431k7052m295J5924J7145J5236J6718O304j6415k7383j6533k155
8009I2924K740N339O734k968j4497l707K2000K3769n917k4947q324J2297N618
7996A11061p257L821K2081J6283k857o466j881j3273k7942j4151J9068L0709J1460
$$ plain form
8088 130370 130219 180332 203724 172246 135775 136599 156130 160887 151512 143687 137743 131557 136410 157148
8074 157148 175984 175193 161192 151495 151206 154538 156893 154542 143646 128724 122012 127479 134806 133367
8060 133367 122795 109019 101337 111289 138926 162783 162435 148211 145413 151941 142500 117973 113860
8047 113860 145255 178341 179720 164043 162847 170334 156742 122590 101821 111686 131226 136058 129658
8034 129658 128701 134217 132481 119477 111857 127125 155633 163988 135706 98701 93572 119047 133861
8021 133861 115430 88378 84083 100007 117152 132388 149106 155410 138995 111612 95079 92924
8009 92924 95664 101003 107737 104769 90272 86565 108565 132334 126417 101470 93146 105443 111061
7996 111061 103804 107625 129706 145989 143132 136666 134785 121512 93570 79419 98487 129196 140656
7983A40656p741q847m897n143l075o31n939p302J1056K9169J2339k6141l3547
7970H9957R84K5517N654k3963j8816Q212J7650P940M810Q062m253k6611k4777
7957G0366J0274M0815K9311j3039m0525k7462M854J7489J738j3729n383J1640
7945H6349Q289j2087j7933J951K1757J7039m330j9144j6218J606K2501K5891R29
7932A16600k8119k2849J2835L0153N662k2309j3868J1483J1502j0426j8798p845
7920F4021j362k704N248J5515L789j9039j4308J5776K2312q852k6731J209K9176
7907H4050O183l4768k5385K5434M1557k91l4452j1455K6424J7001k3673l1702
7895C8923L401K9540J8240P45N261J0375r934l4318k6530L839J5106k475j6927
$$ plain form
7983 140656 132915 124068 119171 114028 110953 110322 104383 97081 108137 137306 149645 123504 89957
7970 89957 90941 116458 122112 98149 79333 87545 105195 113135 117945 126007 121754 95143 70366
7957 70366 80640 121455 150766 137727 97202 69740 74594 92083 93821 80092 74709 86349
7945 86349 94638 82551 64618 66569 88326 105365 101035 81891 65673 67279 89780 115671 116600
7932 116600 88481 65632 78467 108620 114282 91973 78105 89588 101090 90664 71866 64021
7920 64021 62659 59955 65203 80718 84507 65468 51160 66936 89248 80396 53665 54874 84050
7907 84050 90233 55465 30080 55514 97071 96780 62328 50873 77297 94298 70625 38923
7895 38923 42324 71864 90104 90849 96110 106485 96551 62233 35703 39542 54648 52173 35246
7882C5246q039P389J1067R431J0644N645r038j5200j982J0591K051j2805p401
7869C7599J1036J1904r293k5157k0043o954M190K1446M0844L4168q364m7135l7133
7856G108Q252L1040O229k6799k2381R449K3548O582q885J784J8988J2990r066
7843E8839j7109o374J15n281l628J0828J4174n202j9343l577J8817J1058j5343
7830C7974j6348J2556K5819j837l5456l0727N215K9095J9081o735k0116j2173
7818F348L735Q208l110j3140n204J2306J7840R311K907R18r931k3746j4038J8748
7804A1152L3921Q705k2483j8888M394M882j6734k1191J832J8267P170q227j926
7791H74J5361J8132M396q540j2051j1341j0066m705O595J7663J8995Q623k918
$$ plain form
7882 35246 27207 34596 45663 55094 65738 71383 62345 47145 45163 55754 57805 45000 37599
7869 37599 48635 60539 51246 26089 6046 -908 3282 24728 65572 99740 91376 44241 7108
7856 7108 15360 46400 52629 25830 3449 12898 36446 43028 34143 35927 54915 67905 58839
7843 58839 41730 35356 35471 30190 26562 37390 51564 46362 27019 23442 42259 53317 37974
7830 37974 21626 34182 60001 58164 22708 -8019 -2804 26291 45372 38637 18521 6348
7818 6348 10083 18291 15181 2041 -3163 9143 26983 36294 39201 40119 30188 6442 -7596 11152
7804 11152 45073 53778 31295 12407 16801 21683 4949 -16242 -14410 3857 11027 2800 874
7791 874 16235 34367 38763 30223 18172 6831 -3235 -7940 -1345 16318 35313 43936 41018
7778D1018l905J961O22q836j2259p374r524j8637j0102J9011K7786p580m1388
7765b9207j8701L4105M2828J69k5447k456J8959J53k1575n533J9355J0298j2263
7752A0685p124Q413q413m1146l5537P971L3778K0182K560L514L668o273m016J5108
7738C370K0471o34j9066j4445m728l836M038K2557K1936r213l3447k0895L477
7725c0415N922j786M174R809m079j3060J1204L9205K3107k0240l1186l443R622
7712a166j3035k9690j1521J4225J9533J7061J8394M615k6976l6204k167L0951
7700a5980J7568j6582j8386O392J1339o029m941J8015J7550j8385l8713r399K9326
7687b8225K5011q054j8361J069J1683q18p143Q977K0035J279k4933k0820R076
$$ plain form
7778 41018 37113 39074 39696 30860 18601 11227 1703 -16934 -27036 -8025 19761 12181 -29207
7765 -29207 -47908 -13803 29025 29194 3747 1291 20250 20403 -1172 -6705 12650 22948 10685
7752 10685 3561 11974 3561 -37585 -73122 -65151 -31373 -11191 -8631 -5117 -1449 -7722 -11738 3370
7738 3370 23841 23207 4141 -10304 -15032 -18868 -14830 7727 29663 20450 -12997 -33892 -30415
7725 -30415 -24493 -26279 -22105 -12296 -16375 -29435 -18231 20974 44081 23841 -7345 -10788 -1166
7712 -1166 -14201 -43891 -55412 -41187 -21654 -4593 13801 18416 -8560 -44764 -46931 -15980
7700 -15980 1588 -14994 -33380 -26988 -15649 -21678 -26619 -8604 8946 -9439 -48152 -57551 -28225
7687 -28225 -3214 -11268 -29629 -28560 -16877 -17695 -24838 -15861 4174 5453 -19480 -40300 -31224
7674c1224K3708M317k1770k2058k1J7708J7749O151r777k4203k2978L998L7532
7661b0868M0509N185l1426l3915j1412M191M594L693L906k984p239R520L3539
7648b707K6590j2838l5290j0941K1956J4534j7132k1165M392J1580j3548k6497
7636f1066q09K5570J3384j2949q357J6643J5582j4717l0052j1970Q222P782M780
7623d7957J3161J2424q457j7943P690L3354J2644l4595m5884r941J8832P209r905
7610f9368O040L0785J5490l3352n5778j7333M5901O9809L3263k2497m0943j1434
7598d9417K2004J6278j8335l8141k7529j0060j92J5777L8322L6989J534k6436
7586c9206j0466K2224K2912k634j1160K694N788o220l243J3819O406k6886l3303
$$ plain form
7674 -31224 -7516 -3199 -24969 -47027 -47048 -29340 -11591 -5440 -15217 -39420 -62398 -58400 -20868
7661 -20868 19641 24826 -6600 -40515 -51927 -47736 -43142 -39449 -35543 -38527 -45766 -36246 -2707
7648 -2707 23883 11045 -24245 -35186 -13230 1304 -15828 -36993 -32601 -21021 -34569 -61066
7636 -61066 -61875 -36305 -22921 -35870 -44227 -27584 -12002 -26719 -56771 -68741 -60519 -52737 -47957
7623 -47957 -34796 -22372 -30829 -48772 -41082 -7728 4916 -29679 -75563 -85504 -66672 -59463 -69368
7610 -69368 -63328 -32543 -17053 -50405 -106183 -123516 -77615 -7806 25457 2960 -37983 -49417
7598 -49417 -27413 -11135 -29470 -67611 -95140 -105200 -105392 -89615 -51293 -14304 -12770 -39206
7586 -39206 -49672 -27448 -4536 -7170 -18330 -15636 -9848 -16068 -19311 -5492 914 -25972 -59275
7573e9275P043L8207J4893k3092j8193Q973J15l3962k6622K9955O1623K2625l5885
7560a3595m2446k887K1756O146j6235j2616N698R242l932p660J1215K9118J6401
7547B05j6722k9038p032J4306O078r908j698J5277N756j8719j5506J2573J6734
7534b7694j3487k7644J136K8513J2446j8287j6683M872N515r029m650J0310n18
7521e5200k5956j5765L0313M9743J3022k8738k3274P643J3361n569j0439P206
7509d3653J8156P102q707j1324k330Q541J1302m087l1681l9611m863M3496M8494
7496i165L07m3927l2470J4354L5359J0745j8777j4747Q009J0280j0937j9444K953
7483f7460K5678J3448j9618k9837r292N869k281l907K2797M3605J6565l5397m9816
$$ plain form
7573 -59275 -52232 -14025 868 -22224 -40417 -31444 -31329 -65291 -91913 -61958 -335 22290 -13595
7560 -13595 -56041 -58928 -37172 -31026 -47261 -59877 -54179 -44937 -48869 -56529 -45314 -16196 205
7547 205 -16517 -45555 -52587 -38281 -32203 -42111 -43809 -28532 -22776 -41495 -57001 -44428 -27694
7534 -27694 -41181 -68825 -67689 -39176 -26730 -45017 -61700 -56828 -51313 -60342 -64992 -54682 -55200
7521 -55200 -81156 -96921 -66608 -16865 -3843 -32581 -55855 -48212 -34851 -40420 -50859 -43653
7509 -43653 -25497 -18395 -27102 -38426 -40756 -32215 -20913 -25000 -56681 -96292 -101155 -57659 -9165
7496 -9165 -8858 -52785 -85255 -70901 -35542 -24797 -43574 -58321 -50312 -40032 -50969 -70413 -67460
7483 -67460 -41782 -28334 -47952 -77789 -87081 -81212 -83493 -87400 -64603 -20998 -4433 -39830 -89646
7470h9646j3831K3609L0182K5806K5870P489l4598n1662j1022L7821K8162k0146
7458d1966l1569M076K0123j0772l0927O44L5242J5999k5981k3699J6830L2875
7446c9125R561o225O590J2652r524k8086j3443J3996J8948q88k4004l1974j2942
7433a04464K7823N0127J4802m7658n6661M557N2643K3649k9559k2063K9215L8094
7421a9495j1040m6008k7524k29m128j1998R251L5705K8831j703j9134j3695j241
7408h2408P825R870O63j0396k580K0614K6872N311j2665n773K600p475j1404J1519
7394d7427K7813J075l7418l0580J1959K8498L461j6338o317K156j1541j9084Q26
7381i2917K1073J4537L53M821J2812r20k0616j3775J2014K0093K979j1859j1784
$$ plain form
7470 -89646 -103477 -79868 -49686 -23880 1990 9479 -25119 -76781 -87803 -49982 -21820 -41966
7458 -41966 -73535 -69459 -49336 -60108 -91035 -90391 -55149 -39150 -65131 -88830 -72000 -39125
7446 -39125 -29564 -35789 -29199 -16547 -26071 -54157 -67600 -53604 -34656 -35544 -59548 -91522 -104464
7433 -104464 -76641 -26514 -11712 -59370 -116031 -111474 -58831 -35182 -64741 -86804 -57589 -19495
7421 -19495 -30535 -76543 -104067 -104296 -108424 -120422 -111171 -75466 -46635 -48338 -67472 -81167 -82408
7408 -82408 -74583 -64713 -64050 -74446 -77026 -56412 -29540 -24229 -36894 -42667 -40067 -47542 -58946 -47427
7394 -47427 -19614 -18539 -55957 -86537 -74578 -46080 -42619 -58957 -65274 -63118 -74659 -93743 -92917
7381 -92917 -71844 -57307 -56954 -52133 -39321 -40241 -60857 -74632 -62618 -42525 -39546 -51405 -63189
7368f3189j4030k4435j8989J4575M4755L3342q920l2407j3893J4832J4882n758
7356e9235j0330P111J4250m238j9953p719J1947P032j2682j3194P456K0266J5542
7343d3747J1405J3088M621j4188k1424j1432k607k16Q887J7505Q61k8899k3655
7330h9801K1573M4777Q319l6982k7178J8486L3378M086k4631k5058r154J0263
7318g1922K6850K0887j4905m0942j7186K6601K7226j2901l0562n856J2314k072
7306h2468j0622J1350K6343N445j4892K614K6777J0384k8228l6130j0301Q078
7294i1650N523N243J3635J1438k465n578N544P342r151k2958j7654k983N787O915
7280i1012M290Ln31P929J9211K0547P965j1911k8499k8160l352K8294L4387J1913
$$ plain form
7368 -63189 -77219 -101654 -120643 -106068 -61313 -27971 -36891 -69298 -83191 -68359 -53477 -59235
7356 -59235 -69565 -62454 -48204 -52442 -72395 -80114 -68167 -61135 -73817 -87011 -79555 -59289 -43747
7343 -43747 -32342 -19254 -14633 -28821 -50245 -61677 -64284 -64500 -55613 -38108 -37247 -66146 -89801
7330 -89801 -68228 -23451 -15132 -52114 -79292 -60806 -27428 -23342 -47973 -73031 -82185 -71922
7318 -71922 -45072 -24185 -39090 -80032 -97218 -70617 -43391 -56292 -86854 -92710 -80396 -82468
7306 -82468 -93090 -81740 -55397 -49952 -64844 -62230 -35453 -25069 -53297 -89427 -99728 -91650
7294 -91650 -86127 -80884 -67249 -55811 -58276 -63854 -58310 -50968 -60119 -83077 -100731 -103714 -97927 -91012
7280 -91012 -86722 -86719 -87250 -79321 -60110 -39563 -31598 -43509 -72008 -100168 -103520 -75226 -40839 -28926
7266b8926m605K164L734j8133k6964Q581M6141K5637l0293m6797j5565P90j5408
7253i9644j0213L0186L7994j6830n5054q876N8531M5133k8872n4312k393M3769
7241f0581K7817q217j3701m275p801o645J6383K9716N163k3587j1903J7644J0276
7228b9711k6245k9245J5326M3175Q590m3542m3294L407L0239J0821j1346M62K0395
7215e0968R008j9536k2185M36O171j4917k0323J3313M4074K4934k2785l9868j4582
7202a07228R390M377q496m444Q592J3898J2829R600k798k1641k3736K268L1567
7189g5822L3124R665j1756j6108q639J558Q207P292L843P816J2738k044l2667
7176f2793l9776k356M0745L8187k024k7983j9906n690l771O81J3858J4151o448
$$ plain form
7266 -28926 -33531 -31367 -27633 -45766 -72730 -64149 -18008 7629 -22664 -69461 -85026 -84236 -99644
7253 -99644 -109857 -79671 -41677 -58507 -113561 -122437 -63906 -18773 -47645 -101957 -104350 -60581
7241 -60581 -32764 -40981 -54682 -58957 -66758 -73403 -57020 -27304 -22141 -45728 -57631 -39987 -29711
7228 -29711 -55956 -85201 -69875 -26700 -18110 -61652 -104946 -101539 -71300 -60479 -71825 -71363 -50968
7215 -50968 -41960 -61496 -83681 -83245 -77074 -91991 -112314 -99001 -54927 -29993 -52778 -92646 -107228
7202 -107228 -97838 -93461 -101957 -106401 -97809 -83911 -71082 -61482 -64280 -85921 -109657 -107389 -75822
7189 -75822 -42698 -33033 -44789 -60897 -69536 -67978 -59771 -52479 -48636 -40820 -28082 -30126 -62793
7176 -62793 -102569 -104925 -64180 -25993 -28017 -56000 -75906 -81596 -85367 -84686 -70828 -56677 -63125
7163f3125k0904r744P857Q484m91l832n851q944L578L1728L7433j293m2008l1176
7149i8288J4135L1071N867j4275l490R092Q17o855L101P392j1843k7365j0922
7136a01563J6778K0505O959M014O502r579l2710k6121R731L1693J7351o661j0688
7123g3789n23N020M316L066j350q076n232R469J7805O553j0854j3582k194N956
7109f3415P35j2917k3000j7963M528K9493L5294J8127m540j7405k0162j5620m317
7096i1162N044J779m662N660K4153J6513k0373m0446j3986K2470J8731j3485k2583
7083a12347K170K0782R051j1116j3238o7J2983J8330J3263O92o026j120j362j5940
7069h3945j8325J1354L4925N850m1775l0007L3079N0177j0368n2331l046O2286
$$ plain form
7163 -63125 -84029 -93773 -85916 -77432 -77923 -81755 -87606 -96550 -92972 -61244 -23811 -25104 -67112 -98288
7149 -98288 -84153 -53082 -47215 -61490 -64980 -55888 -55071 -61926 -58825 -51433 -63276 -90641 -101563
7136 -101563 -84785 -64280 -57321 -53307 -46805 -56384 -89094 -115215 -105484 -73791 -56440 -63101 -73789
7123 -73789 -74312 -69292 -64976 -61910 -63260 -71336 -76568 -67099 -49294 -42741 -53595 -67177 -69371 -63415
7109 -63415 -62680 -75597 -98597 -116560 -112032 -82539 -47245 -29118 -33658 -51063 -71225 -86845 -91162
7096 -91162 -86118 -84339 -89001 -83341 -59188 -42675 -63048 -103494 -117480 -95010 -76279 -89764 -112347
7083 -112347 -110177 -89395 -80344 -91460 -104698 -104765 -91782 -73452 -60189 -59497 -65523 -66643 -68005 -83945
7069 -83945 -102270 -90916 -55991 -50141 -91916 -121923 -88844 -38667 -49035 -101366 -104412 -42126
7057d2126L7145m4054o1841l00M1530J6978j1159J593J1497j3589k6474O818L2434
7044e1548m15m3641k6783K5097L7445R658n19J0385o008m3014l6694J6487L8457
7031g1093k222l3437r27L7469R820m4960l8376K3521N2128J6365k1534j6009R23
7018h8332o558j6161J650K6672K6956J2423P449L816j4777k9052j2265J7274J9155
7005e1750n218j7464m799P269L969p99J53m180j1284k542J6563J4319j3661k9013
6991i8437r968J2532N141j6606j9483m476P828J7190L0301K9956L09l2372k7801
6978a05886P916L0260J8726o667k4769k9602j3603K2281M5115K2658k0731k9650
6966h3952r89J3473m580j2901R079J8589j0680l0476L305M5335K5465l4773m8487
$$ plain form
7057 -42126 -4981 -49035 -110876 -111176 -69646 -52668 -63827 -62234 -50737 -64326 -90800 -83982 -51548
7044 -51548 -51963 -95604 -122387 -97290 -59845 -50187 -50706 -40321 -46329 -89343 -126037 -109550 -71093
7031 -71093 -73315 -106752 -107679 -70210 -60390 -105350 -143726 -120205 -68077 -51712 -73246 -89255 -88332
7018 -88332 -94890 -111051 -109401 -82729 -55773 -43350 -35901 -32085 -46862 -75914 -88179 -70905 -51750
7005 -51750 -56968 -74432 -79231 -71962 -67993 -68792 -68639 -72819 -84103 -86645 -70082 -55763 -69424 -98437
6991 -98437 -108405 -95873 -90732 -107338 -126821 -131297 -123469 -106279 -75978 -46022 -45713 -78085 -105886
6978 -105886 -97970 -67710 -48984 -55651 -80420 -110022 -123625 -101344 -56229 -33571 -54302 -83952
6966 -83952 -84941 -71468 -76048 -88949 -79870 -61281 -71961 -102437 -99132 -53797 -28332 -63105 -111592
6953a11592N524N3655L6575j7500m7503l5788o034J5993J6847q25j3328m43J8379
6940h6040N631k9736l2924J3663N3903L6632r200k1649K044J3335l064j0872P627
6927f0650J8286n369l2759k2163J2034K0842k623j4444O237K0385p546m5009l3695
6914a46474K0656N1605K7175q956r438J0521J1624l450o642m40p671k0819j2376
6901i4685J0861J4356l506p760J0389J7738j700k0195j6430o398m653J69J0087
6888i1727N094j0653j581L1064L1778j6710m4721M92N7871L8283l3951n6976p827
6875i9564L3841J8965q228j658J5805Q290j2481k0788j9225j4735O88J8261J0090
6862g0739j5953j2908K5169L9488O55l5854j8398J6672J1960j4179j1932M675
$$ plain form
6953 -111592 -106068 -52413 -15838 -33338 -80841 -116629 -122663 -106670 -89823 -90648 -103976 -104419 -86040
6940 -86040 -80409 -110145 -143069 -129406 -75503 -38871 -48071 -69720 -67676 -54341 -57405 -68277 -60650
6927 -60650 -42364 -47733 -80492 -102655 -90621 -69779 -72402 -86846 -80609 -60224 -67770 -112779 -146474
6914 -146474 -125818 -74213 -47038 -55994 -65432 -54911 -43287 -46737 -53379 -53819 -61490 -82309 -94685
6901 -94685 -83824 -69468 -72974 -80734 -70345 -52607 -54307 -74502 -90932 -97330 -101983 -101814 -91727
6888 -91727 -86633 -97286 -98867 -67803 -36025 -52735 -97456 -96964 -39093 -810 -34761 -91737 -99564
6875 -99564 -65723 -46758 -54986 -56644 -40839 -32549 -45030 -65818 -85043 -99778 -99090 -80829 -70739
6862 -70739 -86692 -99600 -74431 -34943 -34288 -70142 -88540 -71868 -59908 -74087 -86019 -81344
6850h1344p758k5983N688O1757N7663j0822n0529j5729K4918O485l2992k8496
6838i7142O711J9475Q569P447J1889m588k7061j9752M078L63k3678j4966L1243
6825i7412N1489J1913l4790k8277J0948K0385p299k0037R263M3100L4800r820
6813a5737m4434l8628n824J8815J6675M90n753K631P696k667j5774j4352l848
6800a00710j067l347N404J8700R367k1613l1618K896M1085L1397r317k0012Q073
6787g0762J8506j3782l5170k16M6891L5821j9231m1599j0928J3990k117j8363
6775i6960L844L2943K3539o848j1876M650L032j6507j3779J6498K8468j259l3364
6762f7619k5392O429J7826L316m370R625K1690Q500j8534k8474q953J9855K6690
$$ plain form
6850 -81344 -89102 -115085 -109397 -47640 10023 -799 -51328 -67057 -42139 -35654 -68646 -97142
6838 -97142 -90431 -70956 -62387 -54940 -43051 -47639 -74700 -94452 -90374 -90011 -113689 -128655 -97412
6825 -97412 -45923 -34010 -68800 -97077 -86129 -65744 -73043 -93080 -83817 -40717 -5917 -15737
6813 -15737 -60171 -98799 -104623 -85808 -69133 -68643 -74396 -71765 -64069 -66736 -82510 -96862 -100710
6800 -100710 -101777 -105124 -99720 -81020 -71653 -93266 -124884 -121988 -80903 -49506 -58823 -78835 -70762
6787 -70762 -52256 -66038 -101208 -101424 -54533 -18712 -37943 -79542 -90470 -76480 -78597 -96960
6775 -96960 -93116 -60173 -36634 -43482 -55358 -50708 -47676 -64183 -77962 -61464 -32996 -34255 -67619
6762 -67619 -93011 -86582 -68756 -65440 -69810 -60185 -38495 -29995 -48529 -77003 -85956 -66101 -39411
6749c9411K413k7808k9455R85K8028J8492j5496l0304p833K0534J8399m177p503
6736g3136J5677K6658K25l2235k5967J0398K7464P276j7046j8143r598q459k259
6723i9145J8639K9352Q049j9482j4174J4331K3841O885m935N2m66j2964j3269
6710f3286N110J3601j481j4204o441J722m460k761K0185L1959N661k7213k3831
6697f5439N27M886j436J9674N2550L9693k0671n9799l8405K559J5721J1470J4690
6684b3980J3273o303j8568k804J1696m926k4039o417K1911R196k7521k3867K1536
6671f0813L9162L286k6107o777J6293n422l5771j6563K8291K9152j3805l1877
6659h0951j67K8490J5348q107m035J0294L787j1141o632P985O408n123k422R231
$$ plain form
6749 -39411 -36998 -64806 -94261 -93276 -65248 -46756 -62252 -92556 -100389 -79855 -61456 -65633 -73136
6736 -73136 -57459 -30801 -30576 -62811 -88778 -78380 -50916 -43640 -60686 -78829 -88427 -96886 -99145
6723 -99145 -80506 -51154 -43105 -62587 -76761 -62430 -38589 -31704 -36639 -36587 -37053 -50017 -63286
6710 -63286 -58176 -44575 -46056 -60260 -66701 -64979 -69439 -72200 -52015 -20056 -14395 -41608 -65439
6697 -65439 -64912 -60026 -61462 -41788 10762 50455 29784 -30015 -68420 -65861 -50140 -38670 -23980
6684 -23980 -10707 -17010 -35578 -38382 -26686 -31612 -55651 -62068 -40157 -30961 -58482 -82349 -60813
6671 -60813 -21651 -18365 -44472 -51249 -34956 -40378 -76149 -92712 -64421 -35269 -49074 -80951
6659 -80951 -81118 -52628 -37280 -45387 -49422 -39128 -35341 -46482 -53114 -45129 -38721 -43844 -46266 -37035
6645c7035N796q524q362M888N632p194q481K821j325k2123k1357J3854L9096J7306
6631b5008k2592l0197o643R387N820J251m32j1239k0871n362K3815K5557o594
6618f3108k9475j4998J0909J5715R320J6199K8200K0086n751k3042k0596j0692
6606f7233n418o656j2608j5527k809K1045K7395J791k5000j4646K0159L0547K546
6593d6414k4813j9648Q61N485l809l178J3232K7792K4603M073k0231k8649r906
6580h0602K0757L0195O944j9885j6783R449K1931L219k4456k9560p182J9215K3305
6567d3453O71k6899l2118j0352J6117K4061J2000o464j9985k1307m881K2054L5118
6554e5438J7897j2572k2824m099J9602K3931Q711j0456j9587j3744p42K903o750
$$ plain form
6645 -37035 -31239 -39763 -48125 -43237 -37605 -44799 -53280 -50459 -51784 -73907 -95264 -81410 -42314 -25008
6631 -25008 -47600 -77797 -84440 -75053 -69233 -67982 -68414 -79653 -100524 -105886 -82071 -56514 -63108
6618 -63108 -92583 -107581 -96672 -80957 -71637 -55438 -27238 -7152 -12903 -35945 -56541 -67233
6606 -67233 -72651 -79307 -91915 -107442 -110251 -89206 -61811 -60020 -85020 -99666 -79507 -48960 -46414
6593 -46414 -71227 -90875 -90014 -84529 -88338 -91516 -78284 -50492 -25889 -21816 -42047 -70696 -80602
6580 -80602 -59845 -29650 -22706 -42591 -59374 -49925 -27994 -24775 -49231 -78791 -85973 -66758 -43453
6567 -43453 -42782 -69681 -101799 -112151 -96034 -71973 -59973 -66437 -86422 -107729 -112610 -90556 -55438
6554 -55438 -37541 -50113 -72937 -77036 -57434 -33503 -24792 -35248 -54835 -68579 -69321 -66418 -73168
6541g3168r170J1141L0121J0850l3964m6122m062L9172K9781r430j7665J1954
6529f0562L0227J2533j1429j3926o042l001L221J3911O354k3404l5334j137M1518
6516d7071L4905j4015m1514j6455K2720K7971O27k4706k6899j1476M680Q567K480
6503h0186L789J9541K6364O58l5297l3860O091L0027Q022j8844l563L2634L4804
6490i820j336k7972j8327L802Q225m741j6633j3132P420K6876J6893k0285l7603
6477h6633n154L3035J5328l6901m1557J7084N8111K7673j9307j0206L1944L2735
6465A6152j4174m4722k6403M838J1327J005l718j218P36K119M369N960P593P033
6451b9103l930k0707k0519Q59R759j3986l1615O75N2312N2723k652m4721l2115
$$ plain form
6541 -73168 -82338 -71197 -41076 -30226 -64190 -110312 -114374 -75202 -45421 -54851 -72516 -60562
6529 -60562 -30335 -17802 -29231 -43157 -49199 -52200 -48979 -35068 -28714 -52118 -87452 -88589 -47071
6516 -47071 -12166 -26181 -67695 -84150 -61430 -33459 -32832 -57538 -84437 -95913 -91233 -82666 -80186
6503 -80186 -76397 -56856 -30492 -29834 -65131 -98991 -92900 -62873 -54851 -73695 -77258 -44624 -9820
6490 -9820 -11156 -39128 -57455 -53653 -45428 -50169 -66802 -79934 -72514 -45638 -28745 -49030 -86633
6477 -86633 -91787 -58752 -43424 -80325 -121882 -104798 -46687 -19014 -38321 -48527 -16583 16152
6465 16152 1978 -42744 -69147 -64309 -52982 -51977 -55695 -56913 -56177 -54058 -49689 -43729 -36136 -29103
6451 -29103 -33033 -53740 -74259 -73400 -63641 -77627 -109242 -108567 -56255 -3532 -6184 -50905 -83020
6438h3020L580K3567K7528J7095j8462n4031l4765L2963O3652J2683n0147m5102
6426a04459OR288j4738j0548K7338M3006J8476m475l505k823j3546j3973o48J274
6412f9327j0072p348J0654J3719j473n412M306q78j6017l452K8378K3715j9834
6399e3041l1908J2964M3320Q802l2657j5559K0246L923l9185l3064J7046L9245
6387e9868J8022M304J3622R332j3028j5146L605Q95k2844j8628J5986K3003j1258
6374e2003k5403Q758L3083M734k9415j7557R240L31k3663j4949J4441K1567R821
6361f1015P746N105j9271l6315p696L5663L2406q035k0704P186K3030M340j0729
6348d8289k88O518q617k0695j3303n314m475R306L2379K6514j3663l7983j6294
$$ plain form
6438 -83020 -79440 -55873 -28345 -11250 -29712 -83743 -118508 -85545 -21893 -9210 -59357 -104459
6426 -104459 -104453 -95165 -109903 -120451 -93113 -50107 -31631 -36106 -39611 -42434 -55980 -69953 -70601 -69327
6412 -69327 -79399 -86747 -76093 -62374 -63847 -69259 -64953 -65831 -81848 -85300 -56922 -33207 -53041
6399 -53041 -84949 -71985 -28665 -19863 -52520 -68079 -47833 -43910 -83095 -116159 -99113 -59868
6387 -59868 -41846 -37542 -23920 -14588 -27616 -42762 -39157 -38262 -61106 -79734 -63748 -40745 -52003
6374 -52003 -77406 -68648 -35565 -30831 -60246 -77803 -68563 -68232 -91895 -106844 -92403 -70836 -61015
6361 -61015 -53269 -48164 -67435 -103750 -111446 -75783 -43377 -51412 -72116 -64930 -41900 -37560 -48289
6348 -48289 -48577 -42059 -50676 -71371 -84674 -89988 -94463 -85157 -52778 -26264 -39927 -77910 -94204
6335i4204J5918K0163J0647J0552M978j8514l0428r118J3230M942p306R125K4713
6322d5302j274l6822k1239K8936M0285J042k4113m187J5290J129j2530N293K2782
6309c0710M403k1501r108K5571K8030j0265m2105l4625o530Q885N217k598l921
6296h9257k45L472O236R251R119l60j4059j3331P665K3999J1803j0112l398K6520
6282c2697L1365n012l5739j9647J6892K1986n796k3661j0517J2668K1559J3314
6270a5285n019k3903k7422p090J9702K5615P463j2698j7133o878P244J1796k196
6257d5804k2734k0664R896L2156J5089j6516j6837J0205J9751O8j2507J098J2629
6244c4170n36j7348j3764l384o770j1223M491K8021L0674J1705o112j3625j8130
$$ plain form
6335 -94204 -78286 -58123 -47476 -36924 -31946 -50460 -80888 -90006 -76776 -71834 -79140 -70015 -45302
6322 -45302 -46576 -83398 -104637 -75701 -35416 -34374 -58487 -62674 -47384 -46255 -58785 -53492 -30710
6309 -30710 -26307 -47808 -56916 -31345 -3315 -13580 -55685 -90310 -96840 -87955 -82738 -85336 -89257
6296 -89257 -89502 -86030 -79794 -70543 -61424 -61784 -75843 -89174 -81509 -57510 -45707 -55819 -59217 -32697
6282 -32697 -1332 -6344 -42083 -61730 -44838 -22852 -28648 -52309 -62826 -50158 -28599 -15285
6270 -15285 -20304 -44207 -71629 -78719 -59017 -33402 -25939 -38637 -55770 -62648 -55404 -43608 -45804
6257 -45804 -68538 -89202 -79306 -47150 -32061 -48577 -65414 -55209 -35458 -35390 -47897 -46799 -34170
6244 -34170 -34706 -52054 -65818 -69202 -75972 -87195 -82704 -54683 -24009 -12304 -18416 -32041 -50171
6231e0171j8077n696Q670M486j4041j6763J0011L9266L4513m027l7045l0984K204
6218g7654J9471K051j8949p251K3079K6389n026k8341j5665P259Q073l117j730
6205g1411N288j125j0297q83J4533P516j2794r368K0746L7749J9129j0274j9568
6192c0759j0108Q54O915Q439L250o717j5202k1918k6635j7507J0263L0997J7710
6179e0418r707p677J8906J9143j7556l5188K30M0684K9472j0413j7100J2139K5440
6166b045L303k0398k2305j7751j6954m178K2012L0728N254k4268k0857Q343K5845
6153c3271J4783o220j3420n604O57m536j0337l13J9584K2914J142j8408j1464
6140d4493M912J516j1539k386K1085J6036k1910m0802j0520K6701J9352j5833
$$ plain form
6231 -50171 -68248 -73944 -65274 -60788 -74829 -91592 -81581 -42315 -7802 -11829 -48874 -79858 -77654
6218 -77654 -58183 -56132 -75081 -82332 -59253 -32864 -37890 -66231 -81896 -74637 -66564 -69681 -71411
6205 -71411 -66123 -67248 -77545 -78428 -63895 -56379 -69173 -78541 -57795 -20046 -917 -11191 -30759
6192 -30759 -40867 -40013 -33098 -24659 -21409 -28126 -43328 -65246 -91881 -109388 -99125 -68128 -50418
6179 -50418 -60125 -67802 -48896 -29753 -47309 -82497 -82267 -41583 -12111 -22524 -39624 -27485 -2045
6166 -2045 1258 -19140 -41445 -59196 -76150 -80328 -58316 -27588 -22334 -46602 -67459 -59116 -33271
6153 -33271 -18488 -24708 -38128 -43732 -43075 -47611 -57948 -58261 -38677 -15763 -14621 -33029 -44493
6140 -44493 -39581 -38065 -49604 -51990 -30905 -14869 -36779 -77581 -88101 -61400 -42048 -57881
6128e7881k4053L358K4554J7615N749P558P456p427j7485l717J5105Q963j3722
6115c3927j5610J2294L4074J9836j1926k2870r300j252j2554k1762j0283Q014
6103f5266J2479Q708J2063J4701j179k5858l0010r226J0262J3685J4147J8994
6091b6500J2650j0431k5028j0595J4541J9159L090r164o583K75J579j974o648
6078d5629p521L52J0878Q795n441r882L828J1142n838k1496k910L3259M0197J0145
6064A9879j7574j8542j1533j5265j6360J55J8559J4854o889k1196j3875N744J7830
6051d4213J0229r114j7370m418J0406N420q215l749J5412K0064M046q228o929
6038c6659r222j7189p365J9982K6130m279k8860j0292K3423K3191o769k4112j5517
$$ plain form
6128 -57881 -81934 -78576 -54022 -36407 -30658 -23100 -15644 -23071 -40556 -44273 -29168 -20205 -33927
6115 -33927 -49537 -37243 -3169 16667 4741 -18129 -27429 -28681 -41235 -62997 -73280 -65266
6103 -65266 -52787 -44079 -32016 -17315 -18494 -44352 -74362 -83588 -73326 -59641 -45494 -26500
6091 -26500 -13850 -24281 -49309 -59904 -45363 -26204 -23114 -32278 -38861 -38586 -37007 -38981 -45629
6078 -45629 -53150 -52798 -41920 -33125 -38566 -48448 -44620 -33478 -39316 -60812 -63722 -30463 9734 19879
6064 19879 2305 -16237 -27770 -43035 -59395 -59240 -40681 -25827 -32716 -53912 -67787 -62043 -44213
6051 -44213 -33984 -43098 -60468 -64886 -54480 -49060 -57275 -61024 -45612 -25548 -21502 -29730 -36659
6038 -36659 -45881 -63070 -70435 -50453 -24323 -28602 -57462 -67754 -44331 -21140 -27909 -52021 -67538
6025f7538k726K663O806Q089L460O626K1936J9991j5854m1902j1010M0980L6082
$$ plain form
6025 -67538 -70264 -67601 -60795 -52706 -49246 -42620 -20684 -693 -16547 -58449 -69459 -28479 7603
$$ [...]
##END NTUPLES=NMR SPECTRUM
##END=
