##TITLE=1H ikalashn
CA-9297-2
25.10.2024
##JCAMPDX= 6.0         $$ Bruker NMR JCAMP-DX V2.0
##DATA TYPE= NMR SPECTRUM
##DATA CLASS= NTUPLES
##ORIGIN= UXNMR, Bruker Analytische Messtechnik GmbH
##OWNER= root
$$ TOPSPIN		Version 1.3
$$ 2024-10-25 15:14:34.796 +0400  Irina@DPX200
$$ Compression mode = diff/dup
##.OBSERVE FREQUENCY= 200.131300845
##.OBSERVE NUCLEUS= ^1H
##.ACQUISITION MODE= SIMULTANEOUS
##.ACQUISITION SCHEME= undefined
##.AVERAGES= 8
##.DIGITISER RES= 18
##SPECTROMETER/DATA SYSTEM= spect
##.PULSE SEQUENCE= zg
##.SOLVENT NAME= CDCl3
##.SHIFT REFERENCE= INTERNAL, CDCl3, 1, 17.49637
##AUDIT TRAIL= $$ (NUMBER, WHEN, WHO, WHERE, WHAT)
$$ ##TITLE= Audit trail, TOPSPIN		Version 1.3
$$ ##JCAMPDX= 5.01
$$ ##ORIGIN= Bruker BioSpin GmbH
$$ ##OWNER= Irina
$$ $$ F:/spectra/data/iren/nmr/1H/4/pdata/1/auditp.txt
$$ ##AUDIT TRAIL=  $$ (NUMBER, WHEN, WHO, WHERE, VERSION, WHAT)
(   1,<2024-10-25 15:14:15.250 +0400>,<Irina>,<DPX200>,<TOPSPIN 1.3>,
      <created by zg
	started at 2024-10-25 15:13:38.562 +0400,
	POWCHK disabled, PULCHK disabled
       terminated by command 'halt'
       configuration hash MD5:
       BE 6D 3F 07 2A EA 11 49 91 17 2B D3 AF B3 58 0D
       data hash MD5: 16K
       DF C8 22 A7 27 7E 83 2A 51 52 61 61 DE A6 48 AA>)
(   2,<2024-10-25 15:14:18.578 +0400>,<Irina>,<DPX200>,<TOPSPIN 1.3>,
      <Start of raw data processing
       fp BC_mod = 2 FT_mod = 6 PKNL = 1 PHC0 = 321.3682 PHC1 = 1.603909 SI = 32K 
       data hash MD5: 32K
       D2 84 ED AE 30 F9 52 72 24 22 59 77 D4 11 DC C7>)
(   3,<2024-10-25 15:14:23.640 +0400>,<Irina>,<DPX200>,<TOPSPIN 1.3>,
      <apk 
       data hash MD5: 32K
       FB 5B 2C DB 8F BB 5A 5F E0 15 79 08 18 50 CA FF>)
(   4,<2024-10-25 15:14:25.750 +0400>,<Irina>,<DPX200>,<TOPSPIN 1.3>,
      <abs n ABSG = 5 
       data hash MD5: 32K
       F8 EE 28 F2 E4 DE 2E 2A 14 FD 84 52 E9 40 6F 2C>)
$$ ##END=
$$ 
$$ $$ hash MD5
$$ $$ BE 65 8D 0D C9 87 D1 8D 16 67 16 BB F2 B1 FD 73
##$RELAX= 
##$RELAX= 
##$RELAX= 
##$RELAX= 
##$RELAX= 
##$RELAX= 
##$RELAX= 
##$RELAX= 
##$RELAX= 
$$ Bruker specific parameters
$$ --------------------------
##$DU= <F:/spectra>
##$EXPNO= 4
##$NAME= <1H>
##$PROCNO= 1
##$TYPE= <nmr>
##$USER= <iren>
##$AMP= (0..31)
100 100 100 100 100 100 100 100 100 100 100 100 100 100 100 100 100 100 
100 100 100 100 100 100 100 100 100 100 100 100 100 100 
##$ANAVPT= -1
##$AQSEQ= 0
##$AQ_mod= 1
##$AUNM= <au_zg>
##$AUTOPOS= <>
##$BF1= 200.13
##$BF2= 200.13
##$BF3= 200.13
##$BF4= 200.13
##$BF5= 200.13
##$BF6= 200.13
##$BF7= 200.13
##$BF8= 200.13
##$BYTORDA= 1
##$CFDGTYP= 0
##$CFRGTYP= 5
##$CHEMSTR= <none>
##$CNST= (0..63)
1 1 145 1 1 1 1 1 1 1 1 1 1 1 1 1 1 1 1 1 1 1 1 1 1 1 1 1 1 1 1 1 1 1 
1 1 1 1 1 1 1 1 1 1 1 1 1 1 1 1 1 1 1 1 1 1 1 1 1 1 1 1 1 1 
##$CPDPRG= <>
##$CPDPRG1= <>
##$CPDPRG2= <>
##$CPDPRG3= <>
##$CPDPRG4= <mlev>
##$CPDPRG5= <mlev>
##$CPDPRG6= <mlev>
##$CPDPRG7= <mlev>
##$CPDPRG8= <mlev>
##$CPDPRGB= <>
##$CPDPRGT= <>
##$D= (0..63)
$$ [...]
##$SW_h= 4401.40845070422
##$TD= 16384
##$TD0= 1
##$TE= 300
##$TE2= 300
##$TE3= 300
##$TEG= 300
##$TL= (0..7)
0 120 120 120 120 120 120 120 
##$TP= (0..7)
150 150 150 150 150 150 150 150 
##$TP07= 0
##$TPNAME0= <>
##$TPNAME1= <>
##$TPNAME2= <>
##$TPNAME3= <>
##$TPNAME4= <>
##$TPNAME5= <>
##$TPNAME6= <>
##$TPNAME7= <>
##$TPOAL= (0..7)
0.5 0.5 0.5 0.5 0.5 0.5 0.5 0.5 
##$TPOFFS= (0..7)
0 0 0 0 0 0 0 0 
##$TUNHIN= 0
##$TUNHOUT= 0
##$TUNXOUT= 0
##$USERA1= <user>
##$USERA2= <user>
##$USERA3= <user>
##$USERA4= <user>
##$USERA5= <user>
##$V9= 5
##$VALIST= <valist>
##$VCLIST= <CCCCCCCCCCCCCCC>
##$VD= 0
##$VDLIST= <DDDDDDDDDDDDDDD>
##$VPLIST= <PPPPPPPPPPPPPPP>
##$VTLIST= <TTTTTTTTTTTTTTT>
##$WBST= 1024
##$WBSW= 25
##$XGAIN= (0..3)
0 0 0 0 
##$XL= 0
##$YL= 0
##$YMAX_a= 417660
##$YMIN_a= -734777
##$ZGOPTNS= <>
##$ZL1= 120
##$ZL2= 120
##$ZL3= 120
##$ZL4= 120
##$ABSF1= 17.49637
##$ABSF2= -4.496376
##$ABSG= 5
##$ABSL= 3
##$ALPHA= 0
##$AQORDER= 0
##$ASSFAC= 0
##$ASSFACI= 0
##$ASSFACX= 0
##$ASSWID= 0
##$AUNMP= <proc_1d>
##$AXLEFT= 0
##$AXRIGHT= 0
##$AXTYPE= 0
##$AXUNIT= <>
##$AZFE= 0.1
##$AZFW= 0.1
##$BCFW= 0
##$BC_mod= 2
##$BYTORDP= 0
##$COROFFS= 0
##$CY= 7568.61572265625
##$DATMOD= 1
##$DC= 0
##$DFILT= <>
##$DTYPP= 0
##$F1P= 17.9538593292236
##$F2P= -4.03888763876832
##$FCOR= 0.5
##$FTSIZE= 32768
##$FT_mod= 6
##$GAMMA= 0
##$GB= 0
##$INTBC= 0
##$INTSCL= 1.936888e-010
##$ISEN= 128
##$LB= 0
##$LEV0= 0
##$LPBIN= 0
##$MAXI= 945.577
##$MC2= 0
##$MEAN= 0
##$ME_mod= 0
##$MI= -402.1523
##$NCOEF= 0
##$NC_proc= -6
##$NLEV= 6
##$NOISF1= 8.587773
##$NOISF2= 6.764455
##$NSP= 0
##$NTH_PI= 0
##$NZP= 0
##$OFFSET= 17.49637
##$PC= 1
##$PHC0= 325.9998
##$PHC1= -3.698865
##$PH_mod= 1
##$PKNL= yes
##$PPARMOD= 0
##$PPDIAG= 0
##$PPIPTYP= 0
##$PPMPNUM= 100
##$PPRESOL= 1
##$PSCAL= 0
##$PSIGN= 0
##$REVERSE= no
##$SF= 200.13
##$SI= 32768
##$SIGF1= 16.12182
##$SIGF2= -4.496377
##$SINO= 3.521527
##$SIOLD= 32768
##$SREGLST= <1H.CDCl3>
##$SSB= 0
##$STSI= 32768
##$STSR= 0
##$SW_p= 4401.40845070422
##$SYMM= 0
##$S_DEV= 0
##$TDeff= 16384
##$TDoff= 0
##$TI= <>
##$TILT= no
##$TM1= 0
##$TM2= 0
##$TOPLEV= 0
##$USERP1= <user>
##$USERP2= <user>
##$USERP3= <user>
##$USERP4= <user>
##$USERP5= <user>
##$WDW= 0
##$XDIM= 32768
##$YMAX_p= 316114781
##$YMIN_p= -392198
$$ End of Bruker specific parameters
$$ ---------------------------------
##NTUPLES= NMR SPECTRUM
##VAR_NAME=  FREQUENCY,     SPECTRUM/REAL,   SPECTRUM/IMAG
##SYMBOL=    X,             R,               I
##VAR_TYPE=  INDEPENDENT,   DEPENDENT,       DEPENDENT
##VAR_FORM=  AFFN,          ASDF,            ASDF
##VAR_DIM=   32768,         32768,           32768
##UNITS=     HZ,            ARBITRARY UNITS, ARBITRARY UNITS
##FACTOR=    0.134324425510551, 1,           1
##FIRST=     4401.40845070422, 23410,        -1216429
##LAST=      0,             -151582,         -1266326
##MIN=       0,             -392198,         0
##MAX=       4401.40845070422, 316114781,    0
$$ Real data points
##PAGE= N=1
##DATA TABLE= (X++(R..R)), XYDATA
$$ [...]
$$ plain form
15565 2817553 2862160 2928256 2951972 2945560 2954280 2966122 2930234 2850663 2789507 2768175 2732877 2642095
15553 2642095 2528256 2437488 2360226 2265836 2164995 2088315 2031674 1970576 1908153 1864037 1831564
15542 1831564 1788455 1736483 1689930 1639529 1572830 1516780 1505414 1508370 1454050 1340865 1265549
15531 1265549 1299819 1380249 1377287 1260338 1137258 1116323 1176400 1211132 1172146 1111437 1082361
15520 1082361 1064744 1025128 996321 1027853 1083182 1068432 968368 875772 861373 886665 884463
15509 884463 858920 851516 863450 874466 893809 926075 925593 858655 781128 775155 828452 857056
15497 857056 834290 811032 812609 808263 793077 805753 838606 821291 736933 671852 693217 746549
15485 746549 740263 677631 634901 646813 682680 712250 731808 736081 717240 689302 677049 685700
$$ packed form
15565B817553M4607O6096K3716o412Q720J1842l5888p9571o1156k1332l5298r0782
15553B642095j13839r0768p7262r4390j00841p6680n6641o1098o2423m4116l2473
15542A831564m3109n1972m6553n0401o6699n6050j1366K956n4320j13185p5316
15531A265549L4270Q0430k962j16949j23080k0935O0077L4732l8986o0709k9076
15520A082361j7617l9616k8807L1532N5329j4750j00064r2596j4399K5292k202
15509H84463k5543p404J1934J1016J9343L2266m82o6938p7527n973N3297K8604
15497H57056k2766k3258J577m346j5186J2676L2853j7315q4358o5081K1365N3332
15485G46549o286o2632m2730J1912L5867K9570J9558M273j8841k7938j2253Q651
$$ plain form
15473 685700 703589 716698 701844 639176 559029 535074 590377 650350 638857 583486 566428
15462 566428 604200 645490 663783 673587 665533 609889 533931 516815 580963 651783 656052 608273
15450 608273 569441 567610 592471 627725 652580 642331 601208 570736 577695 597421 595102 579144
15438 579144 582007 604701 612750 583602 536840 516754 551069 619165 661038 636015 575255 552367
15426 552367 595640 655983 672035 638982 597728 582403 597217 623547 633668 617826 607445
15415 607445 642342 703763 720929 668171 610905 614226 646252 631449 574721 559399 619883 686553
15403 686553 684854 635365 612986 640057 668916 660155 632817 626964 648460 671521 678348 671970
15391 671970 656330 630125 605508 607446 638075 660828 641855 593433 553566 538213 543168 574647
$$ packed form
15473F85700J7889J3109j4854o2668q0147k3955N5303N9973j1493n5371j7058
15462E66428L7772M1290J8293R804q054n5644p5958j7116O4148P0820M269m7779
15450F08273l8832j831K4861L5254K4855j0249m1123l0472O959J9726k319j5958
15438E79144K863K2694Q049k9148m6762k0086L4315O8096M1873k5023o0760k2888
15426E52367M3273O0343J6052l3053m1254j5325J4814K6330J0121j5842j0381
15415F07445L4897O1421J7166n2758n7266L321L2026j4803n6728j5322O0484O6670
15403F86553j699m9489k2379K7071K8859q761k7338n853K1496K3061O827o378
15391F71970j5640k6205k4617J938L0629K2753j8973m8422l9867j5353M955L1479
$$ plain form
15379 574647 631057 662474 610023 501370 447273 507236 605814 627418 557730 480573 461784
15368 461784 492230 530877 546829 520522 456648 404013 416236 479341 519051 496308 455939
15357 455939 454573 474231 448706 364241 291929 304734 385528 444605 426528 370680 348179 364248
15345 364248 362774 319717 281675 296569 349313 391290 398373 374894 336623 316829 348256 406322
15333 406322 416064 356713 307296 332279 376778 353340 285575 266856 305406 321597 291036 274534
15321 274534 294354 296272 263773 257792 299623 322851 297570 294975 355605 396027 339427 250377
15309 250377 233378 271036 278703 259036 274672 309715 293753 242603 239054 277713 267629 204578
15297 204578 199065 289217 359338 316627 235893 237302 309048 354411 351221 354414 375723 370058
$$ packed form
15379E74647N6410L1417n2451j08653n4097N9963R8578K1604o9688p7157j8789
15368D61784L0446L8647J5952k6307o3874n2635J2223O3105L9710k2743m0369
15357D55939j366J9658k5525q4465p2312J2805Q0794N9077j8077n5848k2501J6069
15345C64248j474m3057l8042J4894N2744M1977P083k3479l8271j9794L1427N8066
15333D06322R742n9351m9417K4983M4499k3438o7765j8719L8550J6191l0561j6502
15321B74534J9820J918l2499n981M1831K3228k5281k595O0630M0422n6600q9050
15309B50377j6999L7658P667j9667J5636L5043j5962n1150l549L8659j0084o3051
15297B04578n513R0152P0121m2711q0734J409P1746M5363l190L193K1309n665
$$ plain form
15285 370058 334884 326522 363234 391446 373706 343979 340143 336817 295233 243798 248081 309097
15273 309097 350768 325216 280096 283231 317572 309907 249903 210671 237803 286367 301971 299865
15261 299865 311097 309770 268112 237979 285139 366924 376744 308005 269741 319176 379580 367037
15249 367037 310732 288331 310849 336268 346778 350974 347188 338206 349982 389724 417994 404139
15237 404139 374605 366291 370412 364480 359571 370864 381191 378929 388820 418083 421616 376692 340055
15224 340055 363510 403674 395149 367219 393482 458014 475228 430387 398995 422854 459128 465696
15212 465696 456220 454087 459864 474926 497198 497578 465673 460680 532779 614519 598972 518651 518852
15199 518852 635755 735644 718064 648444 624744 637317 645736 679721 758277 804012 755584
$$ packed form
15285C70058l5174q362L6712K8212j7740k9727l836l326m1584n1435M283O1016
15273C09097M1671k5552m5120L135L4341p665o0004l9232K7132M8564J5604k106
15261B99865J1232j327m1658l0133M7160Q1785R820o8739l8264M9435O0404j2543
15249C67037n6305k2401K2518K5419J0510M196l786q982J1776L9742K8270j3855
15237D04139k9534q314M121n932m909J1293J0327k262R891K9263L533m4924l6637
15224C40055K3455M0164q525k7930K6263O4532J7214m4841l1392K3859L6274O568
15212D65696r476k133N777J5062K2272L80l1905m993P2099Q1740j5547q0321K01
15199E18852J16903R9889j7580o9620k3700J2573Q419L3985P8556M5735m8428
$$ plain form
15188 755584 692070 725236 823934 865841 823104 778432 784566 821779 876173 948375 993743 962491
15176 962491 899346 901691 976114 1036299 1046091 1056533 1086889 1084297 1038697 1030039 1104434 1193932
15164 1193932 1225296 1232615 1287791 1378056 1432439 1433958 1431373 1458107 1503738 1558996 1633851 1725254
15152 1725254 1805960 1855651 1880935 1899707 1921846 1949993 1988528 2041402 2097134 2126025 2115737
15141 2115737 2111532 2182147 2322407 2432400 2436911 2386680 2381440 2427338 2450845 2433015 2432692 2472455
15129 2472455 2500805 2492386 2491667 2518618 2522120 2481156 2467532 2536854 2627624 2651141 2628728 2651339
15117 2651339 2736687 2814908 2843255 2856103 2897723 2967071 3039173 3098081 3141987 3184059 3244341
15106 3244341 3319156 3374358 3392040 3401200 3436232 3490742 3538649 3571351 3588425 3586830 3583796 3604589
$$ packed form
15188G55584o3514L3166R8698M1907m2737m4672O134L7213N4394P2202M5368l1252
15176I62491o3145K345P4423O0185R792J0442L0356k592m5600q658P4395Q9498
15164A193932L1364P319N5176R0265N4383J519k585K6734M5631N5258P4855R1403
15152A725254Q0706M9691K5284J8772K2139K8147L8535N2874N5732K8891j0288
15141B115737m205P0615J40260J09993M511n0231n240M5898K3507j7830l23L9763
15129B472455K8350q419p19K6951L502m0964j3624O9322R0770K3517k2413K2611
15117B651339Q5348P8221K8347J2848M1620O9348P2102N8908M3906M2072O0282
15106C244341P4815N5202J7682R160L5032N4510M7907L2702J7074j595l034K0793
$$ plain form
15094 3604589 3621210 3565602 3444262 3365415 3388607 3422238 3357704 3237987 3183660 3202189 3196089
15083 3196089 3131672 3066742 3017163 2930926 2812253 2743816 2749446 2748759 2692641 2637801 2633215 2630837
15071 2630837 2575222 2501249 2474601 2497520 2530910 2552481 2545740 2493694 2429483 2426375 2488752 2522655
15059 2522655 2466957 2380601 2340561 2330192 2300700 2269517 2271908 2275786 2233359 2166960 2119411 2071289
15047 2071289 1995000 1935585 1937269 1939504 1858587 1734053 1673665 1679577 1655986 1576192 1509550 1478623
15035 1478623 1424038 1334832 1285041 1300710 1308577 1265186 1225031 1223679 1202602 1121801 1047058 1040488
15023 1040488 1050871 1006042 940759 930824 956943 940543 877007 830017 818380 808201 801006 827840
15011 827840 858987 822687 728805 676590 707547 739011 692198 610666 586770 624546 648757
$$ packed form
15094C604589J6621n5608j21340p8847K3192L3631o4534j19717n4327J8529o100
15083C196089o4417o4930m9579q6237j18673o8437N630o87n6118n4840m586k378
15071B630837n5615p3973k6648K2919L3390K1571o741n2046o4211l108O2377L3903
15059B522655n5698q6356m0040j0369k9492l1183K391L878m2427o6399m7549m8122
15047B071289p6289n9415J684K235q0917j24534o0388N912k3591p9794o6642l0927
15035A478623n4585q9206m9791J5669P867m3391m0155j352k1077q0801p4743o570
15023A040488J0383m4829o5283r935K6119j6400o3536m6990j1637j0179p195K6834
15011H27840L1147l6300r3882n2215L0957L1464m6813q1532k3896L7776K4211
$$ plain form
15000 648757 620586 573051 541074 521539 509578 517793 539635 539762 508625 488730 511696 541379
14988 541379 525090 478148 460344 477654 473976 429861 399131 418360 448298 450484 455361 490681
14976 490681 505793 453843 397951 427755 502286 499093 410208 354443 379144 393432 345688 321912
14964 321912 382388 432201 373443 282252 293975 383384 407937 329605 247038 222891 220119 214479
14952 214479 236884 280573 285324 246289 230670 251901 234856 151701 87660 109168 157260 144561
14940 144561 84332 47238 48759 54817 54628 58378 56746 42544 41016 67222 88639 79607 72376
14927 72376 99411 125891 101502 44744 11910 11359 11449 6319 9985 10662 -4688 -7368 23500 39569
14913 39569 -7205 -61247 -28925 63523 89166 11686 -55373 -22098 48794 53441 3355 -15930
$$ packed form
15000F48757k8171m7535l1977j9535j1961Q215K1842J27l1137j9895K2966K9683
14988E41379j6289m6942j7804J7310l678m4115l0730J9229K9938K186M877L5320
14976D90681J5112n1950n5892K9804P4531l193q8885n5765K4701J4288m7744k3776
14964C21912O0476M9813n8758r1191J1723Q9409K4553p8332q2567k4147k772n640
14952B14479K2405M3689M751l9035j5619K1231j7045q3155o4041K1508M8092j2699
14940A44561o0229l7094J521O058j89L750j632j4202j528K6206K1417r032p231
14927G2376K7035K6480k4389n6758l2834n51R0n130L666O77j5350k680L0868J6069
14913C9569m6774n4042L2322R2448K5643p7480o7059L3275P0892M647n0086j9285
$$ plain form
14901 -15930 10970 18255 -28400 -86471 -104563 -78999 -37151 -5512 1680 -7557 -6067 14625
14889 14625 21423 -14092 -60931 -63446 -25791 -12018 -52015 -97140 -96870 -76796 -93970 -138971
14877 -138971 -141499 -77129 -11743 -11081 -50718 -62410 -39226 -31926 -51745 -51724 -20694 -18648 -74222
14864 -74222 -116067 -76319 -10021 -21246 -99453 -133306 -87311 -56390 -110277 -179502 -159573 -61549
14852 -61549 12987 6727 -49942 -105933 -139924 -152400 -152279 -150478 -144016 -119436 -85571 -73224 -85175
14839 -85175 -86856 -68904 -67176 -88306 -79357 -24567 -5162 -83402 -182328 -180052 -88086 -27329
14827 -27329 -44222 -66621 -46904 -32895 -67217 -116355 -138120 -134855 -107935 -46342 8718 -15257
14815 -15257 -96676 -119981 -54430 -19469 -95163 -182529 -160140 -77659 -60261 -101653 -105507 -77615
$$ packed form
14901a5930K6900P285m6655n8071j8092K5564M1848L1639P192r237J490K0692
14889A4625O798l5515m6839k515L7655J3773l9997m5125K70K0074j7174m5001
14877a38971k528O4370O5386O62l9637j1692K3184P300j9819K1L1030K046n5574
14864g4222m1845L9748O6298j1225p8207l3853M5995L0921n3887o9225J9929R8024
14852f1549P4536o260n6669n5991l3991j2476J21J801O462K4580L3865J2347j1951
14839h5175j681J7952J728k1130Q949N4790J9405p8240r8926K276R1966O0757
14827b7329j6893k2399J9717J4009l4322m9138k1765L265K6920O1593N5060k3975
14815a5257q1419k3305O5551L4961p5694q7366K2389Q2481J7398m1392l854K7892
$$ plain form
14803 -77615 -108921 -189120 -205953 -137858 -87176 -95254 -81205 -11853 19106 -46908 -128370 -145818
14791 -145818 -144641 -177208 -178781 -83161 29656 34496 -54401 -126786 -151212 -177097 -204709 -190205
14779 -190205 -157412 -169113 -196660 -153861 -62603 -43606 -120433 -173846 -135493 -91809 -128252
14768 -128252 -192486 -199429 -169561 -163579 -162885 -123069 -84275 -116524 -193803 -227654 -201318 -171418
14756 -171418 -153705 -110463 -52388 -51325 -125416 -194102 -186918 -137558 -128477 -181859 -243339 -252449
14744 -252449 -203227 -144123 -126982 -151069 -167840 -152941 -146249 -189053 -250421 -265775 -229672 -192723
14732 -192723 -177696 -163639 -151976 -176201 -229101 -247901 -203036 -147079 -140579 -174752 -202835 -207913
14720 -207913 -202379 -192900 -182746 -184937 -202997 -218709 -219225 -211855 -198410 -170499 -146791 -169311 -234888
$$ packed form
14803g7615l1306q0199j6833O8095N0682q078J4049O9352L0959o6014q1462j7448
14791a45818J177l2567j573R5620J12817M840q8897p2385k4426k5885k7612J4504
14779a90205L2793j1701k7547M2799R1258J8997p6827n3413L8353M3684l6443
14768a28252o4234o943K9868N982O94L9816L8794l2249p7279l3851K6336K9900
14756a71418J7713M3242N8075J063p4091o8686P184M9360R081n3382o1480r110
14744b52449M9222N9104J7141k4087j6771J4899O692m2804o1368j5354L6103L6949
14732a92723J5027J4057J1663k4225n2900j8800M4865N5957O500l4173k8083n078
14720b07913N534R479J0154k191j8060j5712n16P370J3445K7911K3708k2520o5577
$$ plain form
14707 -234888 -276317 -248640 -191663 -166123 -171588 -176891 -188153 -222917 -250082 -227976 -183105 -177626
14695 -177626 -207632 -209489 -169603 -150176 -186108 -227658 -221061 -189102 -187351 -220735 -249226 -251319
14683 -251319 -240000 -228393 -214800 -199913 -195222 -210298 -239511 -260163 -246450 -197709 -150821 -146157
14671 -146157 -180385 -212760 -218746 -213852 -220698 -237632 -248855 -245973 -233063 -226270 -245399 -283330
14659 -283330 -292313 -236970 -157547 -133996 -180297 -226007 -220219 -197714 -208669 -237750 -245279 -245329 -276109
14646 -276109 -317076 -308018 -247528 -204454 -217922 -244850 -231227 -186362 -154023 -149341 -162656 -196199
14634 -196199 -252364 -301853 -309068 -285434 -274851 -282953 -266853 -212556 -175903 -206672 -264738 -268049
14622 -268049 -213520 -187144 -238578 -304012 -293600 -215803 -163033 -190915 -261183 -303051 -290354
$$ packed form
14707b34888m1429K7677N6977K5540n465n303j1262l4764k7165K2106M4871N479
14695a77626l0006j857L9886J9427l5932m1550O597L1959J751l3384k8491k093
14683b51319J1319J1607J3593J4887M691j5076k9213k0652J3713M8741M6888M664
14671a46157l4228l2375n986M894o846j6934j1223K882J2910O793j9129l7931
14659b83330q983N5343P9423K3551m6301m5710N788K2505j0955k9081p529n0l0780
14646b76109m0967R058O0490M3074j3468k6928J3623M4865L2339M682j3315l3543
14634a96199n6165m9489p215K3634J0583q102J6100N4297L6653l0769n8066l311
14622b68049N4529K6376n1434o5434J0412P7797N2770k7882p0268m1868J2697
$$ plain form
14611 -290354 -250356 -225361 -234561 -256871 -251306 -207087 -162469 -157667 -188574 -228907 -268739 -296564
14599 -296564 -278846 -211947 -164152 -196881 -265516 -277859 -234867 -218528 -246286 -251862 -225742 -245492
14587 -245492 -320639 -340191 -253136 -175426 -209048 -268247 -224659 -133278 -145931 -255217 -306972
14576 -306972 -253532 -213706 -257338 -298157 -256280 -185305 -167982 -201660 -253760 -321825 -370973
14565 -370973 -323897 -197193 -141658 -243562 -375455 -362647 -228647 -145257 -181460 -238327 -227215
14554 -227215 -187348 -196745 -256471 -305574 -301302 -256591 -223340 -241571 -286274 -285543 -217846 -153283
14542 -153283 -156262 -193682 -201323 -194518 -228051 -279511 -274820 -221027 -208833 -268497 -320279 -299922
14530 -299922 -248979 -237322 -264415 -284464 -276312 -245099 -198641 -160271 -165686 -212861 -250921 -247083
$$ packed form
14611b90354L9998K4995r200k2310N565M4219M4618M802l0907m0333l9832k7825
14599b96564J7718O6899M7795l2729o8635j2343M2992J6339k7758n576K6120j9750
14587b45492p5147j9552Q7055P7710l3622n9199M3588R1381j2653j09286n1755
14576c06972N3440L9826m3632m0819M1877P0975J7323l3678n2100o8065m9148
14565c70973M7076J26704N5535j01904j31893J2808J34000Q3390l6203n6867J1112
14554b27215L9867r397n9726m9103M272M4711L3251j8231m4703P31O7697O4563
14542a53283k979l7420p641O805l3533n1460M691N3793J2194n9664n1782K0357
14530b99922N0943J1657k7093k0049Q152L1213M6458L8370n415m7175l8060L838
$$ plain form
14518 -247083 -226847 -221906 -221548 -207555 -195077 -201602 -211964 -211564 -220152 -253980 -286004 -283778 -258841
14505 -258841 -239282 -222148 -196807 -188256 -224271 -274868 -279320 -232793 -198541 -224747 -286059 -321679
14493 -321679 -306228 -267466 -246354 -251564 -254233 -227159 -181800 -152493 -150149 -157629 -169989 -202793
14481 -202793 -250905 -279600 -276269 -271090 -281634 -280356 -251296 -233096 -256676 -281303 -255774 -213007
14469 -213007 -228948 -299758 -338312 -300190 -240890 -226936 -254058 -283949 -306046 -322201 -313915 -271921
14457 -271921 -231288 -233554 -269628 -295834 -292924 -275374 -254363 -228933 -210236 -217841 -246330 -266329
14445 -266329 -267691 -272732 -293139 -304555 -289544 -278442 -305622 -339313 -310779 -222369 -166826 -203754
14433 -203754 -269295 -266290 -204760 -175125 -201990 -218980 -196582 -193507 -241150 -272842 -236807 -198811
$$ packed form
14518b47083K0236M941L58J3993J2478o525j0362M00q588l3828l2024K226K4937
14505b58841J9559J7134K5341Q551l6015n0597m452M6527L4252k6206o1312l5620
14493c21679J5451L8762K1112n210k669K7074M5359K9307K344p480j2360l2804
14481b02793m8112k8695L331N179j0544J278K9060J8200k3580k4627K5529M2767
14469b13007j5941p0810l8554L8122N9300J3954k7122k9891k2097j6155Q286M1994
14457b71921M0633k266l6074k6206K910J7550K1011K5430J8697p605k8489j9999
14445b66329j362n041k0407j1416J5011J1102k7180l3691K8534Q8410N5543l6928
14433b03754o5541L005O1530K9635k6865j6990K2398L075m7643l1692L6035L7996
$$ plain form
14421 -198811 -240729 -315977 -313362 -232351 -182095 -212990 -259517 -265628 -263021 -287789 -307118 -280134
14409 -280134 -227755 -195036 -194172 -219355 -264451 -294439 -261767 -189946 -173700 -244957 -307381 -271561
14397 -271561 -190564 -173403 -215038 -220474 -173079 -159734 -216734 -262509 -228513 -167870 -168669 -221720
14385 -221720 -250221 -235609 -233994 -272193 -300563 -274420 -230012 -235142 -288117 -314782 -269014 -195440
14373 -195440 -171461 -215080 -279334 -319629 -330482 -322732 -303750 -287024 -289274 -306081 -312680 -294902
14361 -294902 -259567 -218971 -193271 -215738 -288674 -341457 -297153 -189545 -140666 -196650 -264619
14350 -264619 -257539 -220376 -238955 -291354 -287758 -221173 -178436 -210653 -277736 -322304 -327383 -300446
14338 -300446 -264285 -260809 -304041 -339602 -312888 -257992 -245086 -263213 -248362 -211137 -224856 -285318
$$ packed form
14421a98811m1918p5248K615Q1011N0256l0895m6527o111K607k4768j9329K6984
14409b80134N2379L2719Q64k5183m5096k9988L2672P1821J6246p1257o2424L5820
14397b71561Q0997J7161m1635n436M7395J3345n7000m5775L3996O0643p99n3051
14385b21720k8501J4612J615l8199k8370K6143M4408n130n2975k6665M5768P3574
14373a95440K3979m3619o4254m0295j0853P750J8982J6726k250j6807o599J7778
14361b94902L5335M0596K5700k2467p2936n2783M4304J07608M8879n5984o7969
14350b64619P080L7163j8579n2399L596O6585M2737l2217o7083m4568n079K6937
14338c00446L6161L476m3232l5561K6714N4896J2906j8127J4851L7225j3719o0462
$$ plain form
14326 -285318 -302685 -252607 -212815 -216944 -202945 -158775 -179147 -291995 -362243 -287130 -174347
14315 -174347 -183576 -279644 -305212 -240169 -212269 -268862 -312718 -283937 -248328 -259814 -270391 -237130
14303 -237130 -204332 -212159 -221850 -203268 -209488 -284024 -364705 -364772 -297430 -239278 -212758 -187101 -165205
14290 -165205 -184185 -238504 -275982 -273365 -257750 -249066 -233907 -205748 -186194 -191077 -207199 -215490
14278 -215490 -214338 -212077 -215268 -229604 -256545 -283841 -288812 -254708 -186717 -121180 -110989 -172951
14266 -172951 -248716 -259082 -209968 -194307 -259892 -332140 -321315 -255289 -228436 -252716 -255610 -218075
14254 -218075 -208989 -257399 -289961 -250334 -199970 -225629 -303167 -335827 -293908 -234199 -199366 -181104
14242 -181104 -179787 -217021 -273462 -289976 -257660 -238082 -260535 -270285 -229546 -200477 -250270 -324567
$$ packed form
14326b85318j7367N0078L9792m129J3999M4170k0372j12848p0248P5113J12783
14315a74347r229r6068k5568O5043K7900n6593m3856K8781L5609j1486j0577L3261
14303b37130L2798p827r691J8582o220p4536q0681o7O7342N8152K6520K5657K1896
14290a65205j8980n4319l7478K617J5615Q684J5159K8159J9554m883j6122q291
14278b15490J152K261l191j4336k6941k7296m971L4104O7991O5537J0191o1962
14266a72951p5765j0366M9114J5661o5585p2248J0825O6026K6853k4280k894L7535
14254b18075R086m8410l2562L9627N0364k5659p7538l2660M1919N9709L4833J8262
14242a81104J317l7234n6441j6514L2316J9578k2453r750M0739K9069m9793p4297
$$ plain form
14230 -324567 -313901 -225990 -186441 -255388 -342792 -346531 -289235 -254440 -251757 -226449 -168358 -129751
14218 -129751 -143047 -188312 -242380 -298194 -329115 -297066 -218770 -171433 -200175 -258654 -275911
14207 -275911 -251134 -241899 -276015 -317749 -323013 -295026 -269881 -263787 -256550 -230988 -210214 -231817
14195 -231817 -287194 -319463 -297761 -260838 -256844 -271544 -262180 -237140 -240337 -268257 -274260 -259040
14183 -259040 -277680 -333297 -344988 -269683 -185582 -188143 -256180 -296069 -281256 -266464 -283553 -306092
14171 -306092 -315883 -328728 -342665 -327241 -283213 -254457 -257395 -252275 -213932 -182312 -203595 -258195
14159 -258195 -291750 -293828 -298294 -313692 -302238 -244471 -190195 -208188 -290631 -346665 -313302 -242892
14147 -242892 -235677 -298965 -336592 -291290 -227725 -231390 -286877 -322385 -327956 -346226 -371619 -351094
$$ packed form
14230c24567J0666Q7911L9549o8947q7404l739N7296L4795K683K5308N8091L8607
14218a29751j3296m5265n4068n5814l0921L2049P8296M7337k8742n8479j7257
14207b75911K4777R235l4116m1734n264K7987K5145O094P237K5562K0774k1603
14195b31817n5377l2269K1702L6923L994j4700R364K5040l197k7920o003J5220
14183b59040j8640n5617j1691P5305Q4101k561o8037l9889J4813J4792j7089k2539
14171c06092r791j2845j3937J5424M4028K8756k938N120L8343L1620k1283n4600
14159b58195l3555k078m466j5398J1454N7767N4276j7993q2443n6034L3363P0410
14147b42892P215o3288l7627M5302O3565l665n5487l5508n571j8270k5393K0525
$$ plain form
14135 -351094 -285940 -248736 -281415 -343119 -375009 -357349 -295131 -213996 -177848 -233798 -325316
14124 -325316 -343003 -281884 -253456 -307515 -349995 -301189 -230204 -237475 -289772 -287887 -239165 -236990
14112 -236990 -298352 -343854 -333027 -308994 -301207 -284296 -251385 -239145 -255969 -262262 -245356 -243089
14100 -243089 -270799 -293075 -290365 -286901 -289832 -269266 -226264 -212411 -248093 -285291 -287649 -284809
14088 -284809 -306571 -323859 -302585 -263410 -241076 -232921 -230908 -251374 -285885 -280894 -224160 -193100
14076 -193100 -245806 -316640 -306372 -236322 -214227 -265528 -301025 -258805 -186067 -155818 -177235
14065 -177235 -217522 -250230 -252900 -212161 -160406 -156954 -203876 -230307 -193504 -146225 -159690 -219013
14053 -219013 -247018 -209851 -151124 -130769 -167656 -236363 -289027 -285188 -227746 -167066 -149257 -168040
$$ packed form
14135c51094O5154L7204l2679o1704l1890J7660O2218Q1135L6148n5950r1518
14124c25316j7687O1119K8428n4059m2480M8806P0985p271n2297J885M8722K175
14112b36990o1362m5502J0827K4033P787J6911L2911J2240j6824o293J6906K267
14100b43089k7710k2276K710L464k931K0566M3002J3853l5682l7198k358K840
14088b84809k1762j7288K1274L9175K2334Q155K013k0466l4511M991N6734L1060
14076a93100n2706p0834J0268P0050K2095n1301l5497M2220P2738L0249k1417
14065a77235m0287l2708k670M0739N1755L452m6922k6431L6803M7279j3465n9323
14053b19013k8005L7167N8727K0355l6887o8707n2664L839N7442O0680J7809j8783
$$ plain form
14041 -168040 -186790 -192194 -195522 -192942 -166328 -127335 -120284 -162258 -209310 -207493 -160601 -122462
14029 -122462 -130291 -168019 -193427 -183118 -149464 -126880 -141633 -182902 -205877 -178589 -123175 -91403
14017 -91403 -100814 -121147 -126638 -126236 -126997 -107948 -64159 -42626 -85077 -154801 -174966 -131574 -82230
14004 -82230 -64079 -55209 -37293 -30274 -39615 -32092 -223 8996 -24143 -38784 18043 98259 120066
13991 120066 93546 99355 160253 214445 215394 184733 158287 145728 156166 202317 261565 286156
13979 286156 268990 251205 253012 249546 228921 218499 233049 248888 251222 256480 265866 249505
13967 249505 202570 165745 162376 165658 154035 143685 137305 103060 42496 14793 45603 75762
13955 75762 57217 34706 61369 95201 68342 11562 8573 54342 63805 14078 -23105 -865
$$ packed form
14041a68040j8750n404l328K580K6614L8993P051m1974m7052J817M6892L8139
14029a22462p829l7728k5408J0309L3654K2584j4753m1269k2975K7288N5414L1772
14017i1403r411k0333n491M02p61J9049M3789K1533m2451o9724k0165M3392M9344
14004h2230J8151Q870J7916P019r341P523L1869R219l3139j4641N6827Q0216K1807
13991A20066k6520N809O0898N4192R49l0661k6446j2559J0438M6151N9248K4591
13979B86156j7166j7785J807l466k0625j0422J4550J5839K334N258R386j6361
13967B49505m6935l6825l369L282j1623j0350o380l4245o0564k7703L0810L0159
13955G5762j8545k2511K6663L3832k6859n6780k989M5769R463m9727l7183K2240
$$ plain form
13943 -865 41407 56747 52278 46569 33036 13168 8314 14394 -1699 -40787 -60863 -47764 -40777
13930 -40777 -64956 -93225 -101649 -106514 -114935 -93689 -28714 30194 29982 -13436 -44981 -45562 -39125
13917 -39125 -44593 -54335 -49323 -16872 32399 58531 29846 -26983 -49074 -17661 23496 38900
13905 38900 42664 54162 64066 66243 72418 72874 38142 -16094 -30253 1554 8828 -35548 -54380
13892 -54380 6985 71511 42244 -37911 -49714 15917 53877 16663 -26991 -20058 1497 -10200
13880 -10200 -38424 -50294 -56496 -77976 -99687 -95573 -67539 -35880 -19016 -31997 -70988 -96746
13868 -96746 -75397 -36177 -39392 -85818 -115119 -99892 -76621 -68991 -50344 -10592 6876 -23374
13856 -23374 -57143 -47778 -19693 -25928 -67278 -100983 -105139 -93614 -85215 -90291 -111804 -136448 -142472
$$ packed form
13943h65M2272J5340m469n709j3533j9868m854O080j6093l9088k0076J3099O987
13930d0777k4179k8269q424m865q421K1246O4975N8908k12m3418l1545n81O437
13917c9125n468r742N012L2451M9271K6132k8685n6829k2091L1413M1157J5404
13905C8900L764J1498R904K177O175M56l4732n4236j4159L1807P274m4376j8832
13892e4380O1365O4526k9267q0155j1803O5631L7960l7214m3654O933K1555j1697
13880a0200k8224j1870o202k1480k1711M114K8034L1659J6864j2981l8991k5758
13868i6746K1349L9220l215m6426k9301J5227K3271P630J8647L9752J7468l0250
13856b3374l3769R365K8085o235m1350l3705m156J1525Q399n076k1513k4644o024
$$ plain form
13843 -142472 -130950 -125775 -134339 -141375 -148107 -172916 -202653 -196899 -159140 -145221 -174283 -192364
13831 -192364 -160334 -117195 -112104 -131198 -140981 -149148 -169781 -181417 -173560 -180071 -211115 -214239 -167209
13818 -167209 -140811 -189302 -247132 -231863 -185387 -196574 -237594 -213426 -140596 -127769 -186369
13807 -186369 -211477 -166398 -138865 -178683 -219986 -216133 -220053 -266091 -294309 -266162 -241451 -260431
13795 -260431 -261649 -208219 -184133 -253265 -324054 -286722 -202879 -211634 -305782 -356464 -325106 -291460
13783 -291460 -283649 -245061 -187195 -211876 -328008 -392198 -314285 -202821 -205294 -296166 -339991
13772 -339991 -304055 -279921 -311704 -327251 -269041 -198236 -207880 -285638 -332017 -299641 -248989 -249281
13760 -249281 -279372 -275013 -242027 -250912 -315408 -352096 -299060 -212944 -188975 -229819 -265321 -271897
$$ packed form
13843a42472J1522N175q564p036o732k4809k9737N754L7759J3919k9062j8081
13831a92364L2030M3139N091j9094r783q167k0633j1636P857o511l1044l124M7030
13818a67209K6398m8491n7830J5269M6476j1187m1020K4168P2830J2827n8600
13807a86369k5108M5079K7533l9818m1303L853l920m6038k8218K8147K4711j8980
13795b60431j218N3430K4086o9132p0789L7332Q3843q755r4148n0682L1358L3646
13783b91460P811L8588N7866k4681j16132o4190P7913J11464k473r0872m3825
13772c39991L5936K4134l1783j5547N8210P0805r644p7758m6379L2376N0652k92
13760b49281l0091M359L2986q885o4496l6688N3036Q6116K3969m0844l5502o576
$$ plain form
13748 -271897 -288595 -322837 -326319 -281408 -239241 -243650 -273633 -289260 -286366 -279209 -271841 -270115 -281814
13735 -281814 -287198 -255114 -205473 -201258 -252973 -289970 -264244 -224059 -232339 -264251 -254654 -212891
13723 -212891 -212086 -271395 -320196 -296330 -229637 -199063 -230895 -268061 -243940 -173487 -146177 -211637
13711 -211637 -300843 -309179 -242381 -207705 -251652 -292582 -254969 -187456 -178460 -220810 -245350 -240854
13699 -240854 -247245 -261055 -245084 -216773 -230760 -277124 -291221 -268670 -273020 -313187 -313469 -239843
13687 -239843 -163064 -148607 -167607 -173437 -188713 -245600 -302807 -300436 -253640 -219260 -207583 -199556
13675 -199556 -214814 -278303 -341197 -324758 -241721 -189831 -211128 -236315 -198947 -136132 -126323 -171940
13663 -171940 -201173 -171292 -121092 -111905 -146585 -170376 -147453 -110863 -114662 -151344 -159692 -121396
$$ packed form
13748b71897j6698l4242l482M4911M2167m409k9983j5627K894P157P368J726j1699
13735b81814n384L2084M9641M215n1715l6997K5726M0185q280l1912R597M1763
13723b12891Q05n9309m8801K3866O6693L0574l1832l7166K4121P0453K7310o5460
13711b11637q9206q336O6798L4676m3947m0930L7613O7513Q996m2350k4540M496
13699b40854o391j3810J5971K8311j3987m6364j4097K2551m350m0167k82P3626
13687b39843P6779J4457j9000n830j5276n6887n7207K371M6796L4380J1677Q027
13675a99556j5258o3489o2894J6439Q3037N1890k1297k5187L7368O2815R809m5617
13663a71940k9233K9881N0200R187l4680k3791K2923L6590l799l6682q348L8296
$$ plain form
13651 -121396 -96728 -131156 -177017 -165974 -122272 -127016 -184606 -210649 -163914 -107116 -102251 -117800
13639 -117800 -93496 -44537 -37469 -89768 -150787 -170966 -144785 -92662 -40094 -13257 -23812 -55040
13627 -55040 -78852 -80000 -55487 -13329 14269 -8955 -64865 -82881 -37561 1982 -22840 -52154
13615 -52154 8716 124631 159218 76310 -66 30603 105295 112566 61783 41126 64545 70698
13603 70698 49545 60608 120304 167288 162302 140969 136683 124183 80431 39690 40154 63548
13591 63548 74136 76520 88577 95273 78792 60704 62041 52902 1022 -55241 -50393 4795 34118
13578 34118 9731 -16197 -6287 5606 -17531 -50330 -48750 -16969 10991 25430 38005 48524
13566 48524 50121 48454 45107 22010 -27251 -72484 -87484 -94117 -125350 -162858 -161790 -130200 -127316
$$ packed form
13651a21396K4668l4428m5861J1043M3702m744n7590k6043M6735N6798M865j5549
13639a17800K4304M8959P068n2299o1019k0179K6181N2123N2568K6837j0555l1228
13627e5040k3812j148K4513M2158K7598k3224n5910j8016M5320L9543k4822k9314
13615e2154O0870J15915L4587q2908p6376L0669P4692P271n0783k0657K3419O153
13603G0698k1153J1063N9696M6984m986k1333m286j2500m3752m0741M64K3394
13591F3548J0588K384J2057O696j6481j8088J337r139n1880n6263M848N5188K9323
13578C4118k4387k5928R910J1893k3137l2799J580L1781K7960J4439J2575J0519
13566D8524J597j667l347k3097m9261m5233j5000o633l1233l7508J068L1590K884
$$ plain form
13553 -127316 -172377 -208206 -182649 -125531 -106525 -140896 -178444 -178314 -156503 -151985 -174079 -199062
13541 -199062 -202953 -182051 -149684 -126673 -129661 -155057 -177547 -178332 -171540 -184873 -216398 -235636
13529 -235636 -231011 -223856 -222273 -199906 -149938 -121304 -153255 -203351 -201943 -159952 -149396 -181591
13517 -181591 -190302 -153242 -139282 -189961 -237818 -212025 -158442 -168376 -232156 -256905 -209521 -152468
13505 -152468 -139987 -159117 -181977 -205562 -223884 -219963 -201993 -198977 -211594 -214406 -208546 -218907
13493 -218907 -237249 -226821 -188906 -163974 -159544 -141536 -108236 -105211 -150113 -207853 -253763 -290676
13481 -290676 -293849 -227201 -134453 -114097 -169190 -190603 -138346 -116107 -187038 -244578 -186356 -103291
13469 -103291 -139795 -248499 -263815 -174791 -133120 -193654 -238353 -195045 -152820 -186669 -223045
$$ packed form
13553a27316m5061l5829K5557N7118J9006l4371l7548J30K1811M518k2094k4983
13541a99062l891K0902L2367K3011k988k5396k2490p85O792j3333l1525j9238
13529b35636M625P155J583K2367M9968K8634l1951n0096J408M1991J0556l2195
13517a81591q711L7060J3960n0679m7857K5793N3583r934o3780k4749M7384N7053
13505a52468J2481j9130k2860k3585j8322L921J7970L016j2617k812N860j0361
13493b18907j8342J0428L7915K4932M430J8008L3300L025m4902n7740m5910l6913
13481b90676l173O6648R2748K0356n5093k1413N2257K2239p0931n7540N8222Q3065
13469a03291l6504j08704j5316Q9024M1671o0534m4699M3308M2225l3849l6376
$$ plain form
13458 -223045 -181182 -123854 -148575 -217461 -220252 -155106 -129087 -196023 -288461 -314641 -258942 -178909
13446 -178909 -140500 -157006 -176829 -148656 -99471 -101600 -155183 -174329 -121028 -75416 -117101 -204614
13434 -204614 -243011 -216298 -177136 -150759 -129625 -128858 -165165 -202949 -195323 -159236 -143389 -147994
13422 -147994 -146054 -151672 -185600 -203691 -154408 -85666 -89989 -153450 -171309 -118349 -85547 -123160
13410 -123160 -164115 -147853 -113277 -109942 -112268 -89847 -78321 -104889 -117256 -68296 -10005 -19577
13398 -19577 -82920 -133539 -159312 -183596 -183917 -127742 -60269 -54575 -89160 -77683 -16608 4934
13386 4934 -42717 -76580 -38230 15412 17767 3509 34133 75965 48551 -35736 -78415 -42191
13374 -42191 -1963 -20466 -49570 -12982 61682 70886 -13112 -93215 -77497 -2293 24384 -29748
$$ packed form
13458b23045M1863N7328k4721o8886k791O5146K6019o6936r2438k6180N5699Q0033
13446a78909L8409j6506j9823K8173M9185k129n3583j9146N3301M5612m1685q7513
13434b04614l8397K6713L9162K6377K1134P67l6307l7784P626L6087J5847m605
13422a47994J940n618l3928j8091M9283O8742m323o3461j7859N2960L2802l7613
13410a23160m0955J6262L4576L335k326K2421J1526k6568j2367M8960N8291r572
13398a9577o3343n0619k5773k4284l21N6175O7473N694l4585J1477O1075K1542
13386D934m7651l3863L8350N3642K355j4258L0624M1832k7414q4287m2679L6224
13374d2191M0228j8503k9104L6588P4664R204q3998q0103J5718P5204K6677n4132
$$ plain form
13362 -29748 -91063 -90315 -43721 -10388 -18189 -55524 -97302 -112648 -80023 -20920 11801 1657
13350 1657 -11303 -1266 227 -30998 -55865 -36369 -9130 -23859 -46468 -9976 60668 73455
13338 73455 18639 -8637 41282 95003 73802 8433 -22392 -6750 10754 10965 10761 18004 24981
13325 24981 27617 16917 -22907 -77576 -96818 -58854 -7993 4673 -17451 -45322 -69763 -80509
13313 -80509 -50380 10718 36524 -3213 -42455 -19248 16833 -14124 -77667 -69861 13040 64199
13301 64199 30127 -22646 -25713 4674 29711 47019 50660 14179 -45646 -62773 -20337 16026
13289 16026 1806 -24224 -23003 -20391 -38230 -40491 -9179 3702 -31883 -56920 -24343 10039
13277 10039 -15134 -55299 -47960 -38548 -96751 -168769 -151383 -69403 -32252 -45518 -26855 6720
$$ packed form
13362b9748o1315P48M6594L3333p801l7335m1778j5346L2625N9103L2721j0144
13350A657j2960J0037J493l1225k4867J9496K7239j4729k2609L6492P0644J2787
13338G3455n4816k7276M9919N3721k1201o5369l0825J5642J7504K11k04P243O977
13325B4981K636j0700l9824n4669j9242L7964N0861J2666k2124k7871k4441j0746
13313h0509L0129O1098K5806l9737l9242K3207L6081l0957o3543P806Q2901N1159
13301F4199l4072n2773l067L0387K5037J7308L641l6481n9825j7127M2436L6363
13289A6026j4220k6030J221K612j7839k261L1312J2881l5585k5037L2577L4382
13277A0039k5173m0165P339R412n8203p2018J7386Q1980L7151j3266J8663L3575
$$ plain form
13265 6720 -50122 -175707 -207386 -99837 -16119 -71737 -156036 -128875 -46900 -43916 -101635 -107097
13253 -107097 -59871 -51385 -83252 -71250 -12940 606 -57533 -115953 -137678 -160803 -190189 -171151
13241 -171151 -101135 -56506 -70501 -83916 -57041 -37154 -68011 -114078 -123059 -96004 -56799 -17608
13229 -17608 -4590 -46185 -106809 -109283 -52584 -22172 -50631 -66196 -26572 2282 -31230 -66640
13217 -66640 -42693 -10106 -30906 -53435 -8860 41520 -4684 -103524 -114609 -17852 64117 60151
13205 60151 27782 18408 762 -39655 -46022 3872 34341 -17103 -98041 -115260 -56924 13602
13193 13602 43256 25453 -12539 -27135 3232 43233 45932 32151 59414 109997 98632 13861
13181 13861 -45170 -15942 38522 46731 41264 75561 110811 82605 19949 -662 25562 52426
$$ packed form
13265F720n6842j25585l1679J07549Q3718n5618q4299K7161Q1975K984n7719n462
13253a07097M7226Q486l1867J2002N8310J3546n8139n8420k1725k3125k9386J9038
13241a71151P0016M4629j3995j3415K6875J9887l0857m6067q981K7055L9205L9191
13229a7608J3018m1595o0624k474N6699L0412k8459j5565L9624K8854l3512l5410
13217f6640K3947L2587k0800k2529M4575N0380m6204r8840j1085R6757Q1969l966
13205F0151l2369r374j7646m0417o367M9894L0469n1444q0938j7219N8336P0526
13193A3602K9654j7803l7992j4596L0367M0001K699j3781K7263N0583j1365q4771
13181A3861n9031K9228N4464Q209n467L4297L5250k8206o2656k0611K6224K6864
$$ plain form
13169 52426 79761 129700 161573 119793 47426 41673 101154 126056 77581 30406 44922 87762
13157 87762 112516 127477 141973 129766 93884 90889 137101 161990 115587 56635 62999 110306
13145 110306 121214 94038 91678 123491 132473 103976 98674 149215 197886 184083 141021 147040
13133 147040 209325 257541 248201 218388 220239 249056 267879 269694 273143 275334 256268 225229
13121 225229 215677 230137 236920 229358 235239 251800 233179 174345 143672 183441 238781 248438
13109 248438 247061 294661 354343 343803 280289 261936 311018 347846 330857 312520 331116 352660
13097 352660 355846 373227 404335 387907 314656 272478 318032 393974 436665 468365 507166 490549
13085 490549 390814 312233 351015 435233 436398 375359 369655 422587 427484 366393 342550 401992
$$ packed form
13169E2426K7335M9939L1873m1780p2367n753N9481K4902m8475m7175J4516M2840
13157H7762K4754J4961J4496j2207l5882k995M6212K4889m6403n8952O364M7307
13145A10306J0908k7176k360L1813Q982k8497n302N0541M8671j3803m3062O019
13133A47040O2285M8216r340k9813J851K8817J8823J815L449K191j9066l1039
13121B25229r552J4460O783p562N881J6561j8621n8834l0673L9769N5340R657
13109B48438j377M7600N9682j0540o3514j8353M9082L6828j6989j8337J8596K1544
13097C52660L186J7381L1108j6428p3251m2178M5554P5942M2691L1700L8801j6617
13085D90549r9735p8581L8782Q4218J165o1039n704N2932M897o1091k3843N9442
$$ plain form
13073 401992 470314 493298 503563 514192 480521 413295 401191 464547 507757 478792 454469
13062 454469 493285 525899 487792 448913 495352 574515 586262 555568 577534 641768 654894
13051 654894 612307 605353 657700 688433 659559 638418 672511 707708 688724 658367 688578 765223
13039 765223 805252 762890 675502 620578 651343 753651 849327 866281 818658 791140 834162
13028 834162 907227 939547 913103 866608 846238 872504 932119 984757 997682 985815 996984
13017 996984 1050972 1119897 1174355 1212770 1232618 1215733 1170375 1150206 1191396 1255913 1280068
13006 1280068 1262764 1258680 1290196 1318594 1315588 1314082 1352767 1403217 1403054 1354775 1338444 1406533
12994 1406533 1508520 1557336 1543537 1536118 1582254 1659700 1732285 1798174 1864201 1920968 1970349
$$ packed form
13073D01992O8322K2984J0265J0629l3671o7226j2104O3356M3210k8965k4323
13062D54469L8816L2614l8107l8879M6439P9163J1747l0694K1966O4234J3126
13051F54894m2587o954N2347L0733k8874k1141L4093L5197j8984l0357L0211P6645
13039G65223M0029m2362q7388n4924L0765J02308R5676J6954m7623k7518M3022
13028H34162P3065L2320k6444m6495k0370K6266N9615N2638J2925j1867J1169
13017I96984N3988O8925N4458L8415J9848j6885m5358k0169M1190O4517K4155
13006A280068j7304m084L1516K8398l006j506L8685N0450j63m8279j6331O8089
12994A406533J01987M8816j3799p419M6136P7446P2585O5889O6027N6767M9381
$$ plain form
12983 1970349 2034389 2107879 2147618 2144048 2154245 2217403 2288564 2317787 2346118 2441385 2574276
12972 2574276 2653514 2666890 2687099 2741084 2780625 2796566 2850552 2956593 3037394 3052542 3071086
12961 3071086 3148296 3224478 3234255 3233346 3308358 3422520 3472711 3462581 3490815 3578476 3637496 3629277
12949 3629277 3633996 3715885 3819359 3863025 3861272 3880297 3926108 3952322 3952473 3975349 4052682 4162041
12937 4162041 4264867 4346153 4412371 4475262 4542318 4610982 4677639 4761442 4899737 5096028 5288546
12926 5288546 5406966 5461263 5540610 5711465 5943266 6154077 6306528 6426774 6539897 6629964
12916 6629964 6676630 6691752 6687309 6634625 6501948 6321114 6162869 6038978 5884095 5659765
12906 5659765 5425101 5259549 5151055 5015954 4815071 4597731 4429716 4321125 4237141 4150280
$$ packed form
12983A970349O4040P3490L9739l570J0197O3158P1161K9223K8331R5267J32891
12972B574276P9238J3376K0209N3985L9541J5941N3986J06041Q0801J5148J8544
12961C071086P7210P6182R777r09P5012J14162N0191j0130K8234Q7661N9020q219
12949C629277M719Q1889J03474M3666j753J9025M5811K6214J51K2876P7333J09359
12937D162041J02826Q1286O6218O2891O7056O8664O6657Q3803J38295J96291J92518
12926E288546J18420N4297P9347J70855K31801K10811J52451J20246J13123R0067
12916F629964M6666J5122m443n2684j32677j80834j58245j23891j54883k24330
12906E659765k34664j65552j08494j35101k00883k17340j68015j08591q3984q6861
$$ plain form
12896 4150280 4065138 4000278 3951540 3880778 3762878 3643117 3603306 3649942 3687116 3642247 3567082
12885 3567082 3550777 3579256 3569134 3513956 3491229 3523472 3541547 3513633 3505967 3562561 3616337
12874 3616337 3594623 3544819 3570087 3680586 3787255 3821025 3793745 3759947 3774996 3870283 4013500
12863 4013500 4113141 4117267 4085080 4102236 4154391 4161487 4116684 4095213 4120797 4124501 4069663 4024470
12851 4024470 4051562 4101805 4095697 4055718 4064981 4121403 4134621 4076415 4038951 4100628 4207392
12840 4207392 4252033 4224655 4209130 4252144 4316377 4366784 4423358 4500870 4567775 4610252 4674198
12829 4674198 4783592 4872800 4877953 4851353 4888524 4967528 4973188 4881831 4803969 4815231 4858056
12818 4858056 4859274 4836466 4820544 4776387 4689147 4638408 4680771 4733970 4694433 4607278 4589736
$$ packed form
12896D150280q5142o4860m8738p0762j17900j19761l9811M6636L7174m4869p5165
12885C567082j6305K8479j0122n5178k2727L2243J8075k7914p666N6594N3776
12874C616337k1714m9804K5268J10499J06669L3770k7280l3798J5049R5287J43217
12863D013500R9641M126l2187J7156N2155P096m4803k1471K5584L704n4838m5193
12851D024470K7092N0243o108l9979R263N6422J3218n8206l7464O1677J06764
12840D207392M4641k7378j5525M3014O4233N0407N6574P7512O6905M2477O3946
12829D674198J09394Q9208N153k6600L7171P9004N660r1357p7862J1262M2825
12818D858056J218k2808j5922m4157q7240n0739M2363N3199l9537q7155j7542
$$ plain form
12807 4589736 4633402 4626726 4549239 4492318 4487227 4464421 4406899 4395897 4457482 4500287 4469046 4436976
12795 4436976 4472798 4530559 4555209 4590840 4686354 4785933 4818624 4817471 4840412 4846182 4770734 4666775
12783 4666775 4632475 4641188 4584311 4466591 4411320 4456227 4482631 4392571 4242039 4139426 4104571
12772 4104571 4094917 4095754 4107123 4090829 4009879 3901708 3847794 3870453 3906039 3889815 3834382 3802730
12760 3802730 3818405 3835121 3810486 3779016 3803666 3865934 3876186 3812852 3771003 3822366 3904909
12749 3904909 3927479 3912118 3930357 3958865 3929459 3886893 3944595 4083170 4149092 4086057 4016703
12738 4016703 4038156 4085293 4083052 4093395 4187640 4285071 4266916 4179431 4171911 4269316 4350328 4340849
12726 4340849 4297585 4290185 4316640 4357096 4409603 4443585 4409053 4329420 4308001 4399356 4533132
$$ packed form
12807D589736M3666o676p7487n6921n091k2806n7522j1002O1585M2805l1241l2070
12795D436976L5822N7761K4650L5631R5514R9579L2691j153K2941N770p5448j03959
12783D666775l4300Q713n6877j17720n5271M4907K6404r0060j50532j02613l4855
12772D104571r654Q37J1369j6294q0950j08171n3914K2659L5586j6224n5433l1652
12760C802730J5675J6716k4635l1470K4650O2268J0252o3334m1849N1363Q2543
12749C904909K2570j5361J8239K8508k9406m2566N7702J38575O5922o3035o9354
12738D016703K1453M7137k241J0343R4245R7431j8155q7485p520R7405Q1012r479
12726D340849m3264p400K6455M0456N2507L3982l4532p9633k1419R1355J33776
$$ plain form
12715 4533132 4603520 4586732 4540827 4534465 4600624 4716148 4803992 4799645 4736550 4719709 4792845
12704 4792845 4882950 4907404 4885468 4899057 4980742 5090334 5180274 5237713 5272264 5302071 5350089
12693 5350089 5422123 5486139 5501264 5477801 5486288 5582000 5723706 5800106 5761812 5701031 5747743
12682 5747743 5893456 5992832 5965231 5908892 5949619 6053548 6093320 6049070 6017681 6041691 6064174
12671 6064174 6063544 6096462 6170119 6204516 6180517 6197077 6300219 6377986 6333953 6257397 6288021
12660 6288021 6396660 6451234 6440315 6464299 6532912 6548172 6500521 6511339 6630391 6740254 6737872
12649 6737872 6686513 6695346 6749794 6768656 6756659 6784572 6855090 6895798 6876936 6847992 6849646 6858609
12637 6858609 6837752 6792701 6758181 6755127 6773713 6785669 6772899 6750819 6752108 6782777 6818135 6849721
$$ packed form
12715D533132P0388j6788m5905o362O6159J15524Q7844m347o3095j6841P3136
12704D792845R0105K4454k1936J3589Q1685J09592Q9940N7439L4551K9807M8018
12693E350089P2034O4016J5125k3463Q487R5712J41706P6400l8294o0781M6712
12682E747743J45713R9376k7601n6339M0727J03929L9772m4250l1389K4010K2483
12671F064174o30L2918P3657L4397k3999J6560J03142P7767m4033p6556L0624
12660F288021J08639N4574j0919K3984O8613J5260m7651J0818J19052J09863k382
12649F737872n1359Q833N4448J8862j1997K7913P0518M0708j8862k8944J654Q963
12637F858609k0857m5051l4520l054J8586J1956j2770k2080J289L0669L5358L1586
$$ plain form
12625 6849721 6898894 6963395 6993092 6957196 6902394 6898546 6949440 7002929 7031159 7052085 7081758
12614 7081758 7113920 7146475 7187889 7235776 7281422 7330722 7387593 7426201 7420348 7394425 7400188 7442744
12602 7442744 7475109 7471028 7457376 7464777 7492295 7535971 7605445 7688212 7740076 7743369 7741273 7780841
12590 7780841 7849949 7906224 7944513 7994224 8062575 8122813 8160592 8199497 8271063 8377732 8491707
12579 8491707 8580824 8637024 8687235 8768422 8882224 8987179 9050815 9094044 9161257 9260021 9361981
12568 9361981 9457098 9568104 9703522 9834098 9936787 10031825 10146923 10268930 10371179 10476706
12558 10476706 10643311 10874498 11092548 11232173 11326695 11456498 11633368 11794318 11911164
12549 11911164 12042803 12248775 12501148 12729987 12924347 13132231 13374163 13614676 13823418
$$ packed form
12625F849721M9173O4501K9697l5896n4802l848N0894N3489K8230K0926K9673
12614G081758L2162L2555M1414M7887M5646M9300N6871L8608n853k5923N763M2556
12602G442744L2365m081j3652P401K7518M3676O9474Q2767N1864L293k096L9568
12590G780841O9108N6275L8289M9711O8351O0238L7779L8905P1566J06669J13975
12579H491707Q9117N6200N0211Q1187J13802J04955O3636M3229O7213R8764J01960
12568I361981R5117J11006J35418J30576J02689R5038J15098J22007J02249J05527
12558A0476706J66605K31187K18050J39625R4522J29803J76870J60950J16846
12549A1911164J31639K05972K52373K28839J94360K07884K41932K40513K08742
$$ plain form
12540 13823418 14012583 14198742 14373513 14536912 14722621 14957951 15222225 15473900 15701900
12531 15701900 15924984 16156671 16397641 16651356 16921529 17200823 17481922 17770918 18071937
12522 18071937 18372588 18666840 18974963 19308288 19627657 19881596 20088422 20334235 20668893
12513 20668893 21041252 21369676 21650953 21957798 22337370 22756883 23160360 23540210 23924997
12504 23924997 24323745 24722994 25127712 25557146 25993890 26389031 26745177 27145598 27652408
12495 27652408 28213836 28738244 29234671 29793668 30429400 31041875 31574253 32113246 32759571
12486 32759571 33469359 34119689 34690927 35280881 35950319 36655887 37348796 38047299 38778469
12477 38778469 39525200 40273784 41050187 41862073 42662584 43428703 44227575 45135510 46120146
$$ packed form
12540A3823418J89165J86159J74771J63399J85709K35330K64274K51675K28000
12531A5701900K23084K31687K40970K53715K70173K79294K81099K88996L01019
12522A8071937L00651K94252L08123L33325L19369K53939K06826K45813L34658
12513B0668893L72359L28424K81277L06845L79572M19513M03477L79850L84787
12504B3924997L98748L99249M04718M29434M36744L95141L56146M00421N06810
12495B7652408N61428N24408M96427N58997O35732O12475N32378N38993O46325
12486C2759571P09788O50330N71238N89954O69438P05568O92909O98503P31170
12477C8778469P46731P48584P76403Q11886Q00511P66119P98872R07935R84636
$$ plain form
12468 46120146 47076741 47972529 48883207 49876184 50925219 51974562 53036500 54171707 55393764
12459 55393764 56648517 57895346 59165927 60519831 61973792 63509205 65127305 66848542
12451 66848542 68662806 70537372 72488590 74587311 76861816 79254010 81720213 84312951
12443 84312951 87082499 89943040 92743496 95461417 98222337 101119420 104120507 107178769
12435 107178769 110325431 113604535 117021950 120633550 124597100 129050933 134007893 139448410
12427 139448410 145445081 152094564 159376241 167159839 175264987 183371055 190928225 197362030
12419 197362030 202436283 206331011 209359081 211713172 213487134 214791303 215777200 216646954
12411 216646954 217689350 219203869 221322882 223990482 227164722 230930890 235326260 240136276
$$ packed form
12468D6120146R56595Q95788R10678R92977J049035J049343J061938J135207J222057
12459E5393764J254753J246829J270581J353904J453961J535413J618100J721237
12451F6848542J814264J874566J951218K098721K274505K392194K466203K592738
12443H4312951K769548K860541K800456K717921K760920K897083L001087L058262
12435A07178769L146662L279104L417415L611600L963550M453833M956960N440517
12427A39448410N996671O649483P281677P783598Q105148Q106068P557170O433805
12419A97362030N074253L894728L028070K354091J773962J304169R85897Q69754
12411B16646954J042396J514519K119013K667600L174240L766168M395370M810016
$$ plain form
12403 240136276 244964352 249459992 253430512 256841379 259838089 262708288 265675026 268722175
12395 268722175 271712982 274656286 277747721 281162858 284935180 289053096 293536348 298317817
12387 298317817 303099663 307412161 310847087 313262060 314802579 315720819 316114781 315812144
12379 315812144 314510304 311999851 308221320 303173445 296891712 289537949 281415802 272845841
12371 272845841 264065955 255257134 246581035 238147522 230008242 222230799 214932386 208202729
12363 208202729 202046889 196445919 191413470 186927481 182848817 178984084 175220075 171549089
12355 171549089 167985739 164517960 161127068 157796096 154499291 151235222 148068184 145077523
12347 145077523 142253998 139505016 136790963 134203692 131861515 129762926 127810623 125970990
$$ packed form
12403B40136276M828076M495640L970520L410867K996710K870199K966738L047149
12395B68722175K990807K943304L091435L415137L772322M117916M483252M781469
12387B98317817M781846M312498L434926K414973J540519R18240L93962l02637
12379C15812144j301840k510453l778531n047875o281733p353763q122147q569961
12371B72845841q779886q808821q676099q433513q139280p777443p298413o729657
12363B08202729o155840n600970n032449m485989m078664l864733l764009l670986
12355A71549089l563350l467779l390892l330972l296805l264069l167038k990661
12347A45077523k823525k748982k714053k587271k342177k098589j952303j839633
$$ plain form
12339 125970990 124330886 122960635 121781017 120632415 119445492 118263862 117103127 115880942
12331 115880942 114519025 113027627 111430698 109687880 107778427 105798936 103865084 101951478
12323 101951478 99950147 97872744 95862833 93997414 92213322 90468457 88840674 87397779
12315 87397779 86086667 84836132 83669831 82627829 81669508 80753307 79926291 79225063 78566290
12306 78566290 77855073 77131698 76483694 75881795 75250094 74637121 74141889 73705496 73170655
12297 73170655 72547398 72016831 71633879 71227096 70669884 70065240 69552089 69091504 68579960
12288 68579960 68040166 67549962 67088337 66607259 66169385 65849666 65564864 65175011 64717866
12279 64717866 64366091 64160539 63961689 63685891 63418423 63238629 63089397 62906203 62747241
$$ packed form
12339A25970990j640104j370251j179618j148602j186923j181630j160735j222185
12331A15880942j361917j491398j596929j742818j909453j979491j933852j913606
12323A01951478k001331k077403k009911j865419j784092j744865j627783j442895
12315H7397779j311112j250535j166301j042002r58321r16201q27016p01228o58773
12306G8566290p11217p23375o48004o01899o31701o12973m95232m36393n34841
12297G3170655o23257n30567l82952m06783n57212o04644n13151m60585n11544
12288F8579960n39794m90204m61625m81078m37874l19719k84802l89853m57145
12279F4717866l51775k05552j98850k75798k67468j79794j49232j83194j58962
$$ plain form
12270 62747241 62687734 62680600 62641070 62607206 62692608 62906186 63136613 63323148 63539997 63873576
12260 63873576 64290498 64683087 65003167 65288715 65570077 65811326 65968040 66063887 66168753
12251 66168753 66314552 66473314 66615270 66741218 66847092 66911535 66951655 67039906 67211924 67397408
12241 67397408 67512742 67598983 67783907 68103502 68444881 68697083 68890416 69139955 69499271
12232 69499271 69922708 70344859 70746964 71151407 71585390 72053370 72532217 72997420 73454730
12223 73454730 73928722 74420612 74904748 75369314 75825507 76268455 76669847 77026878 77379236
12214 77379236 77755329 78139137 78512329 78885285 79257032 79593797 79890646 80206097 80577208
12205 80577208 80943352 81230777 81484948 81826753 82278257 82726631 83088657 83425804 83843580
$$ packed form
12270F2747241n9507p134l9530l3864Q5402K13578K30427J86535K16849L33579
12260F3873576M16922L92589L20080K85548K81362K41249J56714R5847J04866
12251F6168753J45799J58762J41956J25948J05874O4443M0120Q8251J72018J85484
12241F7397408J15334Q6241J84924L19595L41379K52202J93333K49539L59316
12232F9499271M23437M22151M02105M04443M33983M67980M78847M65203M57310
12223G3454730M73992M91890M84136M64566M56193M42948M01392L57031L52358
12214G7379236L76093L83808L73192L72956L71747L36765K96849L15451L71111
12205H0577208L66144K87425K54171L41805M51504M48374L62026L37147M17776
$$ plain form
12196 83843580 84342760 84841763 85310490 85808752 86401439 87097864 87879164 88729432 89620432
12187 89620432 90511929 91403749 92365579 93479822 94757632 96133589 97543044 98987302
12179 98987302 100521270 102194855 104016947 105968554 108038483 110239983 112591105 115085439
12171 115085439 117700611 120447000 123389590 126593326 130055822 133735415 137654085 141926041
12163 141926041 146653158 151827185 157372046 163241471 169403154 175729402 181964803 187812758
12155 187812758 193010382 197334899 200637132 202924586 204354193 205085313 205178979 204689966
12147 204689966 203801617 202779848 201808711 200954041 200290057 199972342 200146603 200843235 202003541
12138 202003541 203567325 205491783 207718858 210180944 212839341 215687958 218722829 221928649
$$ packed form
12196H3843580M99180M99003M68727M98262N92687O96425P81300Q50268Q91000
12187H9620432Q91497Q91820R61830J114243J277810J375957J409455J444258
12179I8987302J533968J673585J822092J951607K069929K201500K351122K494334
12171A15085439K615172K746389K942590L203736L462496L679593L918670M271956
12163A41926041M727117N174027N544861N869425O161683O326248O235401N847955
12155A87812758N197624M324517L302233K287454J429607P31120R3666m89013
12147B04689966q88349j021769r71137q54670o63984l17715J74261O96632J160306
12138B02003541J563784J924458K227075K462086K658397K848617L034871L205820
$$ plain form
12130 221928649 225283840 228752385 232278228 235815276 239356404 242896292 246356404 249576785
12122 249576785 252396919 254718218 256471792 257568788 257941071 257625089 256748668 255419350
12114 255419350 253674356 251561164 249203645 246729115 244170595 241513662 238814761 236185272
12106 236185272 233660008 231176456 228708120 226323572 224065427 221865430 219666720 217569321
12098 217569321 215759069 214329334 213269631 212608706 212461014 212914596 213952068 215497520
12090 215497520 217460518 219693258 221950756 223921099 225269448 225671548 224891134 222869851
12082 222869851 219706578 215532064 210441634 204549159 198037361 191121718 184004715 176875420
12074 176875420 169894517 163153760 156696275 150587747 144907359 139657695 134762039 130178353
$$ packed form
12130B21928649L355191L468545L525843L537048L541128L539888L460112L220381
12122B49576785K820134K321299J753574J096996L72283l15982q76421j329318
12114B55419350j744994k113192k357519k474530k558520k656933k698901k629489
12106B36185272k525264k483552k468336k384548k258145k199997k198710k097399
12098B17569321j810252j429735j059703o60925j47692M53582J037472J545452
12090B15497520J962998K232740K257498J970343J348349M02100p80414k021283
12082B22869851l163273m174514n090430n892475o511798o915643p117003p129295
12074A76875420o980903o740757o457485o108528n680388n249664m895656m583686
$$ plain form
12066 130178353 125935521 122023282 118343409 114835612 111567504 108618877 105947218 103454341
12058 103454341 101120646 98974121 96980806 95076064 93266106 91585359 89980446 88355486
12050 88355486 86720534 85174565 83738889 82327445 80897129 79505882 78189473 76898604
12042 76898604 75607538 74374363 73227719 72094677 70924957 69804326 68847291 68033051
12034 68033051 67244519 66434153 65657008 64955917 64303091 63663505 63047822 62482582 61970534
12025 61970534 61496619 61047908 60620095 60219019 59854591 59527072 59232463 58982919 58792968
12016 58792968 58639094 58472822 58289325 58138449 58045066 57966965 57861250 57738909 57613889 57456583
12006 57456583 57255034 57068457 56946807 56839179 56663957 56437545 56240718 56076730 55870255
$$ packed form
12066A30178353m242832l912239l679873l507797l268108k948627k671659k492877
12058A03454341k333695k146525j993315j904742j809958j680747j604913j624960
12050H8355486j634952j545969j435676j411444j430316j391247j316409j290869
12042G6898604j291066j233175j146644j133042j169720j120631r57035q14240
12034F8033051p88532q10366p77145p01091o52826o39586o15683n65240n12048
12025F1970534m73915m48711m27813m01076l64428l27519k94609k49544j89951
12016E8792968j53874j66272j83497j50876r3383p8101j05715j22341j25020j57306
12006E7456583k01549j86577j21650j07628j75222k26412j96827j63988k06475
$$ plain form
11997 55870255 55615820 55418012 55339946 55297915 55168078 54936871 54678990 54428698 54149603 53821828
11987 53821828 53488873 53193604 52907449 52560384 52135258 51701453 51337034 51034951 50720217
11978 50720217 50358846 50004573 49716390 49475046 49224377 48963110 48743309 48596750 48513590
11969 48513590 48477781 48470906 48457639 48427754 48438999 48550162 48722185 48866443 48988962 49189579
11959 49189579 49498745 49821002 50089701 50377569 50775400 51241977 51672941 52064275 52500715
11950 52500715 53009444 53531230 54032415 54544492 55073680 55560089 55966493 56341411 56743650
11941 56743650 57142193 57434018 57542068 57469779 57278364 57031965 56748473 56386766 55895453
11932 55895453 55281904 54611004 53927144 53211299 52442145 51670253 50982927 50396648 49833031
$$ packed form
11997E5870255k54435j97808p8066m2031j29837k31207k57881k50292k79095l27775
11987E3821828l32955k95269k86155l47065m25126m33805l64419l02083l14734
11978E0720217l61371l54273k88183k41344k50669k61267k19801j46559q3160
11969D8513590l5809o875j3267k9885J1245J11163J72023J44258J22519K00617
11959D9189579L09166L22257K68699K87868L97831M66577M30964L91334M36440
11950E2500715N08729N21786N01185N12077N29188M86409M06404L74918M02239
11941E6743650L98543K91825J08050p2289j91415k46399k83492l61707m91313
11932E5895453o13549o70900o83860p15845p69154p71892o87326n86279n63617
$$ plain form
11923 49833031 49228149 48633151 48160040 47834994 47561796 47255702 46963054 46792613 46758922
11914 46758922 46772068 46783261 46853537 47041633 47302567 47565532 47856681 48257591 48768289 49303912
11904 49303912 49829952 50414098 51114558 51885133 52636306 53346767 54065353 54820056 55562028
11895 55562028 56199926 56678251 57027005 57330548 57628398 57853838 57903774 57767375 57540242
11886 57540242 57298277 57005562 56578599 56003886 55347078 54663881 53948163 53172529 52346632
11877 52346632 51514693 50703721 49893965 49055872 48211093 47428079 46743153 46118809 45511249
11868 45511249 44943568 44458110 44026328 43586197 43161021 42845794 42656356 42491742 42291949
11859 42291949 42133497 42092270 42101727 42057903 42004098 42078994 42301714 42540381 42708226 42871315
$$ packed form
11923D9833031o04882n94998m73111l25046k73198l06094k92648j70441l3691
11914D6758922J3146J1193P0276J88096K60934K62965K91149M00910N10698N35623
11904D9303912N26040N84146P00460P70575P51173P10461P18586P54703P41972
11895E5562028O37898M78325L48754L03543K97850K25440M9936j36399k27133
11886E7540242k41965k92715m26963n74713o56808o83197p15718p75634q25897
11877E2346632q31939q10972q09756q38093q44779p83014o84926o24344o07560
11868D5511249n67681m85458m31782m40131m25176l15227j89438j64614j99793
11859D2291949j58452m1227R457m3824n3805P4896K22720K38667J67845J63089
$$ plain form
11849 42871315 43122366 43449652 43786660 44108463 44411982 44662290 44826916 44922058 44968634 44942681
11839 44942681 44822430 44638979 44416117 44102994 43647834 43110881 42610576 42160487 41653264
11830 41653264 41025392 40347861 39711229 39101849 38460428 37804087 37201586 36652479 36083062
11821 36083062 35470862 34891255 34405289 33965220 33484961 32963133 32474021 32055970 31673556
11812 31673556 31291742 30925920 30597695 30291860 29989717 29706822 29460893 29232286 28996139
11803 28996139 28770293 28589712 28452659 28335562 28241520 28180975 28118136 28000584 27843415 27720060
11793 27720060 27659303 27615564 27556119 27503229 27457042 27354034 27159419 26937177 26758389 26590393
11783 26590393 26354092 26051356 25751167 25478514 25207533 24944881 24719009 24490860 24184755
$$ packed form
11849D2871315K51051L27286L37008L21803L03519K50308J64626R5142M6576k5953
11839D4942681j20251j83451k22862l13123m55160n36953n00305m50089n07223
11830D1653264o27872o77531o36632o09380o41421o56341o02501n49107n69417
11821C6083062o12200n79607m85966m40069m80259n21828m89112m18051l82414
11812C1673556l81814l65822l28225l05835l02143k82895k45929k28607k36147
11803B8996139k25846j80581j37053j17097r4042o0545o2839j17552j57169j23355
11793B7720060o0757m3739n9445n2890m6187j03008j94615k22242j78788j67996
11783B6590393k36301l02736l00189k72653k70981k62652k25872k28149l06105
$$ plain form
11774 24184755 23826745 23543281 23381398 23232889 22998587 22734871 22553146 22446027 22311767
11765 22311767 22107580 21882181 21679387 21498885 21343468 21224259 21118262 20989836 20855250
11756 20855250 20762070 20705149 20627545 20506267 20374097 20256931 20156395 20091577 20077487 20056761
11746 20056761 19946478 19777455 19689345 19740686 19815907 19785187 19671556 19576870 19516770 19434343
11736 19434343 19328166 19250438 19195519 19099671 18955406 18829204 18750697 18672689 18565322 18468692
11726 18468692 18417836 18385873 18340324 18294487 18262606 18221272 18160193 18118700 18119887 18113485 18043324
11715 18043324 17939664 17883756 17899455 17936682 17951234 17945079 17928528 17897050 17861301 17859074 17911094
11704 17911094 17984346 18022098 18007725 17986480 18017301 18105355 18197562 18255783 18310932 18411311 18538805
$$ packed form
11774B4184755l58010k83464j61883j48509k34302k63716j81725j07119j34260
11765B2311767k04187k25399k02794j80502j55417j19209j05997j28426j34586
11756B0855250r3180n6921p7604j21278j32170j17166j00536o4818j4090k0726
11746B0056761j10283j69023q8110N1341P5221l0720j13631r4686o0100q2427
11736A9434343j06177p7728n4919r5848j44265j26202p8507p8008j07367r6630
11726A8468692n0856l1963m5549m5837l1881m1334o1079m1493J187o402p0161
11715A8043324j03660n5908J5699L7227J4552o155j6551l1478l5749k227N2020
11704A7911094P3252L7752j4373k1245L0821Q8054R2207N8221N5149J00379J27494
$$ plain form
11693 18538805 18636196 18713710 18848859 19055097 19235749 19325656 19402443 19574636 19819712 20034072
11683 20034072 20199550 20380264 20574596 20706450 20778497 20897572 21100237 21282087 21378691 21500320
11673 21500320 21774166 22139385 22435787 22650085 22930042 23358805 23852329 24314787 24780703
11664 24780703 25339943 26002852 26713768 27452698 28258512 29174748 30222192 31409165 32726531
11655 32726531 34136591 35589186 37036303 38415805 39645621 40655076 41395804 41804576
11647 41804576 41804223 41390365 40679823 39804767 38775687 37523365 36072425 34581093 33174773
11638 33174773 31823122 30446026 29076451 27827261 26729973 25711532 24735290 23859815
11630 23859815 23115411 22414716 21667071 20925137 20319906 19869217 19451253 18983462 18532248
$$ packed form
11693A8538805R7391P7514J35149K06238J80652Q9907P6787J72193K45076K14360
11683B0034072J65478J80714J94332J31854P2047J19075K02665J81850R6604J21629
11673B1500320K73846L65219K96402K14298K79957M28763M93524M62458M65916
11664B4780703N59240O62909P10916P38930Q05814R16236J047444J186973J317366
11655C2726531J410060J452595J447117J379502J229816J009455P40728M08772
11647D1804576l53m13858p10542q75056j029080j252322j450940j491332j406320
11638C3174773j351651j377096j369575j249190j097288j018441r76242q75475
11630B3859815p44404p00695p47645p41934o05231m50689m17964m67791m51214
$$ plain form
11621 18532248 18191106 17921258 17597851 17187701 16794848 16516670 16324093 16122678 15884450
11612 15884450 15660893 15481184 15301120 15074666 14831165 14637125 14498208 14347513 14138045
11603 14138045 13904820 13712330 13572424 13447226 13312796 13181215 13066351 12962492 12857465
11594 12857465 12740393 12600855 12448585 12324641 12254616 12197309 12088825 11939605 11829383 11788698
11584 11788698 11746730 11632396 11472554 11340657 11252564 11173013 11094395 11042933 11018732 10988293
11574 10988293 10933412 10859269 10761005 10633033 10507891 10433934 10412052 10400257 10377827 10353444 10314456
11563 10314456 10233646 10135769 10089187 10107763 10124316 10092757 10055116 10065989 10108381 10137893 10160734
11552 10160734 10202707 10236279 10211945 10148055 10120320 10158740 10211613 10222225 10194724 10170927 10181496
$$ packed form
11621A8532248l41142k69848l23407m10150l92853k78178j92577k01415k38228
11612A5884450k23557j79709j80064k26454k43501j94040j38917j50695k09468
11603A4138045k33225j92490j39906j25198j34430j31581j14864j03859j05027
11594A2857465j17072j39538j52270j23944p0025n7307j08484j49220j10222m0685
11584A1788698m1968j14334j59842j31897q8093p9551p8618n1462k4201l0439
11574A0988293n4881p4143r8264j27972j25142p3957k1882j1795k2430k4383l8988
11563A0314456q0810r7877m6582J8576J6553l1559l7641J0873M2392K9512K2841
11552A0160734M1973L3572k4334o3890k7735L8420N2873J0612k7501k3797J0569
$$ plain form
11541 10181496 10235451 10323598 10413134 10465357 10478658 10493567 10534386 10561614 10509931 10373462 10228564
11530 10228564 10154677 10143799 10114723 10018841 9895198 9796531 9701614 9559500 9399316 9313127
11520 9313127 9315701 9305518 9208716 9087242 9039169 9053630 9047987 9004707 8974572 8965422 8928686 8857808
11508 8857808 8805121 8785954 8755930 8707211 8695845 8734129 8744353 8676687 8594251 8570085 8568253
11497 8568253 8513174 8422805 8372004 8354801 8291935 8171742 8077819 8055590 8047879 8004384 7969351
11486 7969351 7996024 8038222 8007982 7908945 7833424 7834320 7868507 7873404 7838405 7782499 7715931 7655189
11474 7655189 7633414 7657615 7685125 7679944 7666307 7684690 7718628 7718189 7682611 7659291 7662252 7657762
11462 7657762 7642736 7665030 7733508 7778028 7751004 7708284 7723323 7773400 7791875 7791063 7832976 7898162
$$ packed form
11541A0181496N3955Q8147Q9536N2223J3301J4909M0819K7228n1683j36469j44898
11530A0228564p3887j0878k9076r5882j23643r8667r4917j42114j60184q6189
11520I313127K574j0183r6802j21474m8073J4461n643m3280l0135r150l6736p0878
11508H857808n2687j9167l0024m8719j1366L8284J0224o7666q2436k4166j832
11497H568253n5079r0369n0801j7203o2866j20193r3923k2229p711m3495l5033
11486G969351K6673M2198l0240r9037p5521Q96L4187M897l4999n5906o6568o0742
11474G655189k1775K4201K7510n181j3637J8383L3938m39l5578k3320K961m490
11462G657762j5026K2294O8478M4520k7024m2720J5039N0077J8475q12M1913O5186
$$ plain form
11450 7898162 7895974 7815570 7758438 7786754 7837411 7837138 7813347 7821989 7840491 7817213 7775169 7776999
11438 7776999 7816756 7832211 7810960 7803900 7832312 7854256 7839586 7821632 7848568 7916707 7972527
11427 7972527 7967099 7905324 7848866 7857217 7918144 7964949 7973015 7989734 8041218 8074016 8047057 8019668
11415 8019668 8062963 8129442 8115259 8029841 7990633 8046651 8117379 8127798 8099784 8074291 8040932
11404 8040932 7994232 7974190 7995567 8011345 7999642 8011064 8069825 8104636 8053183 7969448 7943735
11393 7943735 7969910 7979353 7962490 7964583 7991869 8012665 8031322 8075607 8127258 8148065 8158240 8202214
11381 8202214 8252350 8244000 8200078 8213473 8293368 8338824 8298771 8254851 8291168 8369508 8401153
11370 8401153 8375600 8348217 8348393 8363499 8378243 8378292 8349775 8318225 8344855 8438055 8517479 8521539
$$ packed form
11450G898162k188q0404n7132K8316N0657k73k3791Q642J8502k3278m2044J830
11438G776999L9757J5455k1251p060K8412K1944j4670j7954K6936O8139N5820
11427G972527n428o1775n6458Q351O0927M6805Q066J6719N1484L2798k6959k7389
11415H019668M3295O6479j4183q5418l9208N6018P0728J0419k8014k5493l3359
11404H040932m6700k0042K1377J5778j1703J1422N8761L4811n1453q3735k5713
11393G943735K6175R443j6863K093K7286K0796J8657M4285N1651K0807J0175M3974
11381H202214N0136q350m3922J3395P9895M5456m0053m3920L6317P8340L1645
11370H401153k5553k7383J76J5106J4744M9k8517l1550K6630R3200P9424M060
$$ plain form
11358 8521539 8501346 8540760 8628379 8689478 8710575 8740469 8785977 8805343 8807563 8860722 8978781
11347 8978781 9088197 9142904 9192933 9291383 9405084 9479864 9537567 9635146 9765076 9872861
11337 9872861 9952301 10043554 10137607 10163589 10100131 10036726 10073671 10191111 10267294 10221626 10100240
11326 10100240 10009221 9990398 9987014 9924331 9797544 9667679 9588582 9562872 9564077 9569203 9557988
11315 9557988 9510604 9432883 9366639 9347277 9361163 9369615 9362493 9356678 9351877 9330002 9300933 9304900
11303 9304900 9352664 9400342 9407310 9388862 9384401 9398967 9407411 9397811 9379863 9364735 9365830 9403337
11291 9403337 9473432 9526476 9517385 9473308 9468723 9530342 9609006 9655717 9681620 9719398 9761677 9773612
11279 9773612 9751294 9737640 9780093 9883219 9998766 10062006 10052057 10016841 10020391 10068718 10114868
$$ packed form
11358H521539k0193L9414Q7619O1099K1097K9894M5508J9366K220N3159J18059
11347H978781J09416N4707N0029R8450J13701P4780N7703R7579J29930J07785
11337I872861P9440R1253R4053K5982o3458o3405L6945J17440P6183m5668j21386
11326A0100240r1019j8823l384o2683j26787j29865p9097k5710J205N126j1215
11315I557988m7384p7721o6244j9362J3886Q452p122n815m801k1875k9069L967
11303I304900M7764M7678O968j8448m461J4566Q444r600j7948j5128J095L7507
11291I403337P0095N3044r091m4077m585O1619P8664M6711K5903L7778M2279J1935
11279I773612k2318j3654M2453J03126J15547O3240r949l5216L550M8327M6150
$$ plain form
11268 10114868 10133869 10151436 10190124 10234617 10274063 10333735 10427750 10516328 10554280 10558751 10586301
11257 10586301 10658129 10745195 10814647 10858564 10889142 10930685 10997532 11060858 11073419 11052255 11080606
11246 11080606 11179131 11240756 11176415 11069811 11072431 11174886 11219854 11148639 11088733 11146644 11247647
11235 11247647 11266778 11211410 11168418 11151243 11117776 11087548 11118060 11187142 11213859 11194116 11208598
11224 11208598 11281360 11331131 11300703 11251565 11272935 11350450 11388206 11341399 11275644 11287022 11388825
11213 11388825 11497120 11531389 11510416 11518110 11581088 11634622 11630259 11615084 11654940 11732688 11789864
11202 11789864 11825658 11873352 11911751 11896056 11861786 11895420 11997639 12076817 12094530 12115348 12183004
11191 12183004 12251550 12286772 12335433 12428040 12503701 12513034 12519090 12603200 12730176 12805568 12824017
$$ packed form
11268A0114868J9001J7567L8688M4493L9446N9672R4015Q8578L7952M471K7550
11257A0586301P1828Q7066O9452M3917L0578M1543O6847O3326J2561k1164K8351
11246A1080606R8525O1625o4341j06604K620J02455M4968p1215n9906N7911J01003
11235A1247647J9131n5368m2992j7175l3467l0228L0512O9082K6717j9743J4482
11224A1208598P2762M9771l0428m9138K1370P7515L7756m6807o5755J1378J01803
11213A1388825J08295L4269k0973P694O2978N3534m363j5175L9856P7748N7176
11202A1789864L5794M7694L8399j5695l4270L3634J02219P9178J7713K0818O7656
11191A2183004O8546L5222M8661R2607P5661R333O056Q4110J26976P5392J8449
$$ plain form
11180 12824017 12861313 12947759 13047292 13145040 13258980 13370711 13438282 13481758 13566645 13691185
11170 13691185 13777816 13796740 13812398 13875562 13949186 13984639 14001876 14042245 14097685 14139790 14174628
11159 14174628 14219611 14266255 14312505 14389475 14502734 14587980 14590971 14562770 14603008 14722425 14836515
11148 14836515 14896236 14948107 15043089 15156735 15244161 15322278 15438451 15582737 15691536 15738932
11138 15738932 15775967 15863319 15998945 16135183 16244498 16339516 16437792 16537689 16633813 16730756
11128 16730756 16828149 16911303 16974629 17038964 17122557 17207277 17265948 17319875 17428092 17604096 17781515
11117 17781515 17895094 17968880 18079747 18245637 18403328 18507364 18599288 18743851 18932046 19097306
11107 19097306 19215336 19335075 19501371 19693580 19867935 20027198 20209871 20425586 20639658
$$ packed form
11180A2824017L7296Q6446R9533R7748J13940J11731O7571M3476Q4887J24540
11170A3691185Q6631J8924J5658O3164P3624L5453J7237M0369N5440M2105L4838
11159A4174628M4983M6644M6250P6970J13259Q5246K991k8201M0238J19417J14090
11148A4836515N9721N1871R4982J13646Q7426P8117J16173J44286J08799M7396
11138A5738932L7035Q7352J35626J36238J09315R5018R8276R9897R6124R6943
11128A6730756R7393Q3154O3326O4335Q3593Q4720N8671N3927J08217J76004J77419
11117A7781515J13579P3786J10867J65890J57691J04036R1924J44563J88195J65260
11107A9097306J18030J19739J66296J92209J74355J59263J82673K15715K14072
$$ plain form
11098 20639658 20821266 20976182 21126490 21283114 21447783 21623248 21809913 22000926 22184688
11089 22184688 22347751 22483466 22608640 22755888 22928610 23083125 23188763 23284747 23426941
11080 23426941 23593509 23714412 23797420 23939034 24177646 24420060 24573760 24681353 24845472
11071 24845472 25074766 25296603 25489339 25704665 25968996 26250841 26525966 26797340 27054355
11062 27054355 27292368 27565526 27926133 28311158 28598329 28793539 29043311 29417323 29799656
11053 29799656 30069313 30276948 30540616 30856969 31139716 31385113 31666612 31993478 32303424
11044 32303424 32593263 32937352 33355311 33763648 34095759 34392264 34735145 35153278 35624431
11035 35624431 36116720 36597334 37043454 37468314 37901926 38340504 38761580 39189745 39682370
$$ packed form
11098B0639658J81608J54916J50308J56624J64669J75465J86665J91013J83762
11089B2184688J63063J35715J25174J47248J72722J54515J05638R5984J42194
11080B3426941J66568J20903Q3008J41614K38612K42414J53700J07593J64119
11071B4845472K29294K21837J92736K15326K64331K81845K75125K71374K57015
11062B7054355K38013K73158L60607L85025K87171J95210K49772L74012L82333
11053B9799656K69657K07635K63668L16353K82747K45397K81499L26866L09946
11044C2303424K89839L44089M17959M08337L32111K96505L42881M18133M71153
11035C5624431M92289M80614M46120M24860M33612M38578M21076M28165M92625
$$ plain form
11026 39682370 40235498 40773496 41261230 41760165 42333040 42954268 43565384 44165057 44782512
11017 44782512 45403913 45996608 46585156 47233696 47954813 48693564 49408384 50118860 50859564
11008 50859564 51627685 52399556 53172425 53963362 54777862 55603655 56438412 57305269 58224629
10999 58224629 59177229 60120552 61050981 62022808 63082877 64211397 65362522 66542053 67795890
10990 67795890 69132419 70513907 71927420 73405520 74964792 76582359 78250833 79995922
10982 79995922 81817170 83679623 85599281 87663033 89909395 92261408 94654244 97167764
10974 97167764 99932769 102942925 106072788 109278111 112667772 116350254 120304384 124455793
10966 124455793 128816331 133484785 138541493 143996541 149833560 156062223 162706395 169736634
$$ packed form
11026C9682370N53128N37998M87734M98935N72875O21228O11116N99673O17455
11017D4782512O21401N92695N88548O48540P21117P38751P14820P10476P40704
11008E0859564P68121P71871P72869P90937Q14500Q25793Q34757Q66857R19360
10999E8224629R52600R43323R30429R71827J060069J128520J151125J179531J253837
10990F7795890J336529J381488J413513J478100J559272J617567J668474J745089
10982G9995922J821248J862453J919658K063752K246362K352013K392836K513520
10974I7167764K765005L010156L129863L205323L389661L682482L954130M151409
10966A24455793M360538M668454N056708N455048N837019O228663O644172P030239
$$ plain form
10958 169736634 177014428 184311841 191382217 197980267 203816114 208581647 212116423 214523893
10950 214523893 216038912 216790133 216779689 216089656 214987502 213775053 212619137 211591273
10942 211591273 210798730 210390998 210467980 211043621 212077043 213494945 215215044 217194434 219429547
10933 219429547 221880096 224448952 227090986 229882832 232903100 236086359 239295951 242522575
10925 242522575 245898328 249493113 253189140 256790984 260177254 263289781 266034364 268261340
10917 268261340 269827745 270647585 270713278 270105201 268952754 267344572 265288971 262785671
10909 262785671 259909274 256788202 253526463 250189477 246849697 243590711 240455841 237431824
10901 237431824 234502553 231697922 229077862 226690900 224571530 222773315 221386189 220511199
$$ packed form
10958A69736634P277794P297413P070376O598050N835847M765533L534776K407470
10950B14523893J515019P51221j0444o90033j102154j212449j155916j027864
10942B11591273p92543m07732P6982N75641J033422J417902J720099J979390K235113
10933B19429547K450549K568856K642034K791846L020268L183259L209592L226624
10925B42522575L375753L594785L696027L601844L386270L112527K744583K226976
10917B68261340J566405Q19840O5693o08077j152447j608182k055601k503300
10909B62785671k876397l121072l261739l336986l339780l258986l134870l024017
10901B37431824k929271k804631k620060k386962k119370j798215j387126q74990
$$ plain form
10893 220511199 220216373 220515195 221381804 222774151 224628491 226829384 229192384 231474162
10885 231474162 233392748 234658114 235034630 234411783 232810274 230307792 226974283 222891737
10877 222891737 218204271 213101099 207747827 202264919 196770748 191401798 186269676 181426297
10869 181426297 176892141 172692910 168842402 165314339 162071480 159113114 156452419 154048954
10861 154048954 151816047 149717681 147811213 146148672 144666038 143232791 141806511 140469922
10853 140469922 139292960 138228217 137201666 136254115 135496732 134932240 134423474 133881273 133395381
10844 133395381 133097889 132954769 132802373 132577023 132390554 132344334 132374234 132356759 132295547 132299613
10834 132299613 132405020 132519780 132551243 132499558 132396618 132223446 131930711 131493663 130908077
$$ packed form
10893B20511199k94826K98822Q66609J392347J854340K200893K363000K281778
10885B31474162J918586J265366L76516o22847j601509k502482l333509m082546
10877B22891737m687466n103172n353272n482908n494171n368950n132122m843379
10869A81426297m534156m199231l850508l528063l242859k958366k660695k403465
10861A54048954k232907k098366j906468j662541j482634j433247j426280j336589
10853A40469922j176962j064743j026551r47551p57383n64492n08766n42201m85892
10844A33395381k97492j43120j52396k25350j86469m6220K9900j7475o1212M066
10834A32299613J05407J14760L1463n1685j02940j73172k92735m37048n85586
$$ plain form
10825 130908077 130167548 129274953 128241886 127055408 125693827 124204027 122702315 121248720
10817 121248720 119778984 118227926 116663993 115209475 113866743 112535304 111187781 109907164
10809 109907164 108733912 107600759 106468825 105416329 104516043 103716186 102935645 102206689
10801 102206689 101617533 101159958 100746606 100360545 100078093 99935337 99865504 99790709 99699016 99603019
10791 99603019 99485903 99319109 99083665 98749332 98277913 97668967 96959861 96163219 95250075
10782 95250075 94214448 93106274 91972793 90808320 89588013 88311353 86986493 85613997
10774 85613997 84216408 82840936 81494333 80113151 78644956 77133023 75674571 74309740
10766 74309740 72990020 71646195 70257742 68866736 67548269 66353993 65265198 64217695
$$ packed form
10825A30908077p40529q92595j033067j186478j361581j489800j501712j453595
10817A21248720j469736j551058j563933j454518j342732j331439j347523j280617
10809A09907164j173252j133153j131934j052496r00286p99857p80541p28956
10801A02206689n89156m57575m13352l86061k82452j42756o9833p4795r1693r5997
10791I9603019j17116j66794k35444l34333m71419o08946p09106p96642r13144
10782I5250075j035627j108174j133481j164473j220307j276660j324860j372496
10774H5613997j397589j375472j346603j381182j468195j511933j458452j364831
10766G4309740j319720j343825j388453j391006j318467j194276j088795j047503
$$ plain form
10758 64217695 63182382 62186641 61242344 60309664 59375062 58510881 57788235 57163257 56525569
10749 56525569 55844257 55189688 54615549 54100599 53620098 53192653 52817162 52427670 51964250
10740 51964250 51450479 50951801 50482003 49995044 49453334 48861089 48233805 47571906 46874902
10731 46874902 46160882 45458676 44783741 44124606 43453673 42754549 42038823 41334075 40661633
10722 40661633 40031525 39446698 38896632 38356347 37811842 37281188 36790511 36333960 35878387
10713 35878387 35404078 34921610 34454333 34022645 33633302 33261434 32861708 32429853 32030877
10704 32030877 31718130 31442134 31104039 30695949 30313550 30013230 29734156 29401828 29040871
10695 29040871 28725645 28465916 28206769 27915373 27607845 27303953 27008235 26731386 26486142
$$ packed form
10758F4217695j035313r95741r44297r32680r34602q64181p22646o24978o37688
10749E6525569o81312o54569n74139n14950m80501m27445l75491l89492m63420
10740E1964250n13771m98678m69798m86959n41710n92245o27284o61899o97004
10731D6874902p14020p02206o74935o59135o70933o99124p15726p04748o72442
10722D0661633o30108n84827n50066n40285n44505n30654m90677m56551m55573
10713C5878387m74309m82468m67277m31688l89343l71868l99726m31855l98976
10704C2030877l12747k75996l38095m08090l82399l00320k79074l32328l60957
10695B9040871l15226k59729k59147k91396l07528l03892k95718k76849k45244
$$ plain form
10686 26486142 26259959 26022692 25762253 25493793 25240365 25015708 24808761 24579164 24302508
10677 24302508 24028952 23841636 23730503 23576079 23311562 23030835 22853163 22741028 22565597
10668 22565597 22319715 22130839 22052741 21976136 21795125 21553908 21358770 21228165 21110246 20989686
10658 20989686 20892903 20818498 20733446 20622791 20493062 20347295 20201641 20100648 20065458 20045274
10648 20045274 19967203 19821346 19660300 19534779 19464451 19442436 19424870 19347088 19201611 19070362
10638 19070362 19022238 19010747 18944998 18835280 18776910 18795164 18805247 18747685 18672276 18646988 18661690
10627 18661690 18674919 18690293 18722652 18737580 18695653 18630526 18618704 18682206 18771905 18840254 18886731
10616 18886731 18935289 19004274 19098117 19202692 19295550 19379777 19486570 19617722 19715686 19734763
$$ packed form
10686B6486142k26183k37267k60439k68460k53428k24657k06947k29597k76656
10677B4302508k73556j87316j11133j54424k64517k80727j77672j12135j75431
10668B2565597k45882j88876p8098p6605j81011k41217j95138j30605j17919j20560
10658B0989686r6783p4405q5052j10655j29729j45767j45654j00993l5190k0184
10648B0045274p8071j45857j61046j25521p0328k2015j7566p7782j45477j31249
10638A9070362m8124j1491o5749j09718n8370J8254J0083n7562p5409k5288J4702
10627A8661690J3229J5374L2359J4928m1927o5127j1822O3502Q9699O8349M6477
10616A8886731M8558O8985R3843J04575R2858Q4227J06793J31152R7964J9077
$$ plain form
10606 19734763 19717664 19743992 19812550 19836970 19765244 19646509 19559883 19524493 19505304 19470117 19413053
10595 19413053 19349007 19307610 19308846 19327598 19310565 19248037 19198882 19218273 19287122 19343468 19362793
10584 19362793 19374155 19410245 19472822 19540708 19587598 19600413 19601543 19639607 19732008 19829789 19871141
10573 19871141 19860614 19858913 19896267 19935520 19930662 19884974 19828714 19765592 19674009 19555442 19451437
10562 19451437 19396763 19366835 19295553 19156131 19004179 18911925 18870155 18800518 18672347 18551446
10552 18551446 18499730 18479773 18416774 18315618 18242460 18214446 18194965 18192039 18260355 18382262 18448546
10541 18448546 18412770 18377379 18448859 18577026 18634528 18609375 18607201 18675445 18736147 18713999 18638063
10530 18638063 18575717 18536445 18489817 18428621 18366622 18308857 18264485 18258802 18295156 18332907 18340840
$$ packed form
10606A9734763j7099K6328O8558K4420p1726j18735q6626l5390j9189l5187n7064
10595A9413053o4046m1397J236J8752j7033o2528m9155J9391O8849N6346J9325
10584A9362793J1362L6090O2577O7886M6890J2815J130L8064R2401R7781M1352
10573A9871141j0527j701L7354L9253m858m5688n6260o3122r1583j18567j04005
10562A9451437n4674k9928p1282j39422j51952r2254m1770o9637j28171j20901
10552A8551446n1716j9957o2999j01156p3158k8014j9481k926O8316J21907O6284
10541A8448546l5776l5391P1480J28167N7502k5153k174O8244O0702k2148p5936
10530A8638063o2346l9272m6628o1196o1999n7765m4372n683L6354L7751P933
$$ plain form
10519 18340840 18346626 18393411 18471843 18543530 18616038 18738540 18921050 19110708 19265652 19410112
10509 19410112 19591166 19815345 20061408 20330284 20638037 20966713 21268985 21534991 21816918
10500 21816918 22161690 22546936 22916134 23254842 23587337 23908025 24171477 24360759 24512876
10491 24512876 24653209 24755587 24802037 24831337 24877220 24903329 24866298 24807674 24800042 24822384 24787790
10480 24787790 24699764 24675845 24780836 24932694 25031136 25096256 25205107 25359934 25511470 25668471
10470 25668471 25887075 26171612 26475421 26791225 27154498 27556804 27942690 28307011 28712315
10461 28712315 29181873 29651233 30063760 30444541 30830134 31187569 31469762 31709022 31980224
10452 31980224 32285564 32541361 32681029 32719282 32707629 32672655 32614153 32527716 32407322 32248928
$$ packed form
10519A8340840N786M6785P8432P1687P2508J22502J82510J89658J54944J44460
10509A9410112J81054K24179K46063K68876L07753L28676L02272K66006K81927
10500B1816918L44772L85246L69198L38708L32495L20688K63452J89282J52117
10491B4512876J40333J02378M6450K9300M5883K6109l7031n8624p632K2342l4594
10480B4787790q8026k3919J04991J51858R8442O5120J08851J54827J51536J57001
10470B5668471K18604K84537L03809L15804L63273M02306L85886L64321M05304
10461B8712315M69558M69360M12527L80781L85593L57435K82193K39260K71202
10452C1980224L05340K55797J39668L8253j1653l4974n8502q6437j20394j58394
$$ plain form
10442 32248928 32069321 31900938 31749391 31576197 31350358 31104207 30903713 30763148 30626219
10433 30626219 30445992 30246061 30070955 29909270 29719726 29517945 29369067 29284100 29194580 29064942
10423 29064942 28963924 28964833 29025618 29046287 29019565 29041444 29174616 29378269 29586285 29787265
10413 29787265 30004418 30253589 30548236 30898370 31277938 31633080 31943260 32235037 32520255
10404 32520255 32766683 32947435 33069700 33133602 33116122 33021587 32891871 32735525 32507313 32198068
10394 32198068 31881616 31618736 31372339 31080284 30759231 30465077 30197518 29924439 29664039
10385 29664039 29457111 29285227 29104540 28939709 28850136 28814540 28748997 28641886 28569786 28564238
10375 28564238 28564543 28533163 28518074 28550895 28571601 28519608 28431429 28380629 28373436 28366520 28341222 28297222
$$ packed form
10442C2248928j79607j68383j51547j73194k25839k46151k00494j40565j36929
10433C0626219j80227j99931j75106j61685j89544k01781j48878q4967q9520j29638
10423B9064942j01018R09O0785K0669k6722K1879J33172K03653K08016K00980
10413B9787265K17153K49171K94647L50134L79568L55142L10180K91777K85218
10404C2520255K46428J80752J22265O3902j7480r4535j29716j56346k28212l09245
10394C2198068l16452k62880k46397k92055l21053k94154k67559k73079k60400
10385B9664039k06928j71884j80687j64831q9573l5596o5543j07111p2100n548
10375B8564238L05l1380j5089L2821K0706n1993q8179n0800p193o916k5298m4000
$$ plain form
10363 28297222 28215275 28094626 27995514 27974327 27994792 27968347 27872989 27772117 27716903 27683782 27617334
10352 27617334 27496001 27345815 27213087 27123876 27053876 26949830 26796700 26639776 26516645 26398850
10342 26398850 26237822 26039566 25848008 25678147 25516807 25369775 25250576 25135710 24994493
10333 24994493 24859325 24798365 24809126 24806626 24740849 24664980 24651841 24694275 24733857 24750228 24768494
10322 24768494 24794981 24795770 24744047 24657849 24578660 24522346 24456335 24328127 24124057 23895027 23706334
10311 23706334 23563031 23406189 23182819 22894044 22575000 22262764 21991114 21774493 21576752
10302 21576752 21335520 21045044 20775330 20573658 20390284 20156846 19903148 19719151 19612917
10293 19612917 19494660 19321125 19169317 19114959 19107037 19040383 18911935 18816253 18798322 18802692 18784335
$$ packed form
10363B8297222q1947j20649r9112k1187K0465k6445r5358j00872n5214l3121o6448
10352B7617334j21333j50186j32728q9211p0000j04046j53130j56924j23131j17795
10342B6398850j61028j98256j91558j69861j61340j47032j19199j14866j41217
10333B4994493j35168o0960J0761k500o5777p5869j3139M2434L9582J6371J8266
10322B4768494K6487P89n1723q6198p9189n6314o6011j28208k04070k29030j88693
10311B3706334j43303j56842k23370k88775l19044l12236k71650k16621j97741
10302B1576752k41232k90476k69714k01672j83374k33438k53698j83997j06234
10293A9612917j18257j73535j51808n4358p922o6654j28448r5682j7931M370j8357
$$ plain form
10282 18784335 18781491 18832995 18895041 18905759 18883210 18886523 18914853 18926370 18935650 18995525 19076909 19066632
10270 19066632 18920059 18726978 18570823 18402103 18129956 17779968 17465268 17229082 17009441
10261 17009441 16753474 16480054 16220295 15974123 15746018 15556304 15392845 15213664 15025128
10252 15025128 14896080 14856842 14840800 14775702 14688308 14660462 14707821 14759952 14753795 14702228 14667384
10241 14667384 14693232 14763417 14809818 14774040 14674417 14591621 14570322 14563515 14501892 14387274 14274062
10230 14274062 14179736 14067943 13917810 13758407 13620502 13493672 13352742 13200184 13058358
10221 13058358 12932881 12804719 12658325 12506633 12381504 12297254 12229910 12146748 12056273 12005545
10211 12005545 12015606 12043299 12031608 11981837 11946511 11958533 11998169 12031217 12051584 12075988 12116289
$$ packed form
10282A8784335k844N1504O2046J0718k2549L313K8330J1517R280N9875Q1384j0277
10270A9066632j46573j93081j56155j68720k72147l49988l14700k36186k19641
10261A7009441k55967k73420k59759k46172k28105j89714j63459j79181j88536
10252A5025128j29048l9238j6042o5098q7394k7846M7359N2131o157n1567l4844
10241A4667384K5848P0185M6401l5778r9623q2796k1299o807o1623j14618j13212
10230A4274062r4326j11793j50133j59403j37905j26830j40930j52558j41826
10221A3058358j25477j28162j46394j51692j25129q4250o7344q3162r0475n0728
10211A2005545J0061K7693j1691m9771l5326J2022L9636L3048K0367K4404M0301
$$ plain form
10200 12116289 12171551 12238862 12317865 12399876 12458938 12470502 12450803 12460207 12536489 12630951 12652197
10189 12652197 12580851 12496368 12472643 12495866 12515977 12527071 12546683 12559777 12549405 12554089 12622301
10178 12622301 12725246 12790012 12815715 12879165 13015677 13171420 13297512 13418706 13572872 13747475
10168 13747475 13922240 14119203 14355678 14589893 14772129 14922566 15103307 15329989 15559833
10159 15559833 15756035 15921155 16075051 16236939 16419922 16608668 16755108 16834233 16892636 16999016
10149 16999016 17152927 17288554 17370684 17439680 17547010 17686828 17816437 17918722 18018701 18150436
10139 18150436 18325415 18527433 18728800 18916729 19107488 19328117 19585250 19862799 20148794
10130 20148794 20449499 20775009 21125789 21498535 21893206 22308844 22743235 23203376 23707570
$$ packed form
10200A2116289N5262O7311P9003Q2011N9062J1564j9699R404P6282R4462K1246
10189A2652197p1346q4483k3725K3223K0111J1094J9612J3094j0372M684O8212
10178A2622301J02945O4766K5703O3450J36512J55743J26092J21194J54166J74603
10168A3747475J74765J96963K36475K34215J82236J50437J80741K26682K29844
10159A5559833J96202J65120J53896J61888J82983J88746J46440P9125N8403J06380
10149A6999016J53911J35627Q2130O8996J07330J39818J29609J02285R9979J31735
10139A8150436J74979K02018K01367J87929J90759K20629K57133K77549K85995
10130B0148794L00705L25510L50780L72746L94671M15638M34391M60141N04194
$$ plain form
10121 23707570 24267285 24867437 25470620 26047474 26608139 27200696 27869865 28619992 29431338
10112 29431338 30304640 31257189 32267533 33265341 34204863 35108393 35981966 36710469 37113365
10103 37113365 37124735 36859916 36471164 35987404 35344338 34531349 33634437 32736941 31846700
10094 31846700 30946449 30065153 29258573 28547274 27912825 27337245 26807546 26295628 25781101
10085 25781101 25293363 24882720 24539689 24192301 23805209 23431891 23133193 22891574 22657704
10076 22657704 22440906 22282476 22162752 22017272 21844581 21714272 21649084 21579903 21455191 21321835
10066 21321835 21243352 21198074 21123822 21018878 20927451 20853375 20758091 20627209 20471891 20274172
10056 20274172 20000220 19671647 19359880 19094450 18828650 18513122 18158136 17803599 17467110
$$ packed form
10121B3707570N59715O00152O03183N76854N60665N92557O69169P50127Q11346
10112B9431338Q73302R52549J010344R97808R39522R03530Q73573P28503M02896
10103C7113365J1370k64819l88752m83760o43066q12989q96912q97496q90241
10094C1846700r00251q81296q06580p11299o34449n75580n29699n11918n14527
10085B5781101m87738m10643l43031l47388l87092l73318k98698k41619k33870
10076B2657704k16798j58430j19724j45480j72691j30309o5188o9181j24712j33356
10066B1321835p8483m5278p4252j04944r1427p4076r5284j30882j55318j97719
10056B0274172k73952l28573l11767k65430k65800l15528l54986l54537l36489
$$ plain form
10047 17467110 17144474 16830995 16519505 16197464 15862146 15525398 15198513 14888167 14605314
10038 14605314 14356014 14124290 13885955 13636942 13387836 13140117 12893737 12666061 12471439
10029 12471439 12293234 12110121 11936191 11795366 11671081 11528082 11370437 11225607 11085601
10020 11085601 10927500 10782275 10707459 10688142 10643712 10545381 10446127 10375053 10291928 10182210
10010 10182210 10105183 10091529 10076665 10006554 9936216 9938776 9975377 9950413 9858989 9785291 9773121
9999 9773121 9784605 9780579 9763740 9739773 9703304 9669589 9664940 9681000 9685621 9677788 9685955 9716148
9987 9716148 9747290 9773135 9805014 9839940 9867785 9898273 9937732 9957732 9938789 9926807 9984238
9976 9984238 10094578 10178939 10206909 10232046 10313571 10453234 10609878 10732330 10789623 10816949 10909266
$$ packed form
10047A7467110l22636l13479l11490l22041l35318l36748l26885l10346k82853
10038A4605314k49300k31724k38335k49013k49106k47719k46380k27676j94622
10029A2471439j78205j83113j73930j40825j24285j42999j57645j44830j40006
10020A1085601j58101j45225p4816j9317m4430r8331r9254p1074q3125j09718
10010A0182210p7027j3654j4864p0111p0338K560L6601k4964r1424p3698j2170
9999I773121J1484m026j6839k3967l6469l3715m649J6060M621p833Q167L0193
9987I716148L1142K5845L1879L4926K7845L0488L9459K0000j8943j1982N7431
9976I984238J10340Q4361K7970K5137Q1525J39663J56644J22452N7293K7326R2317
$$ plain form
9965 10909266 11109149 11329527 11465019 11551391 11714897 11979959 12246552 12464784 12701336 12996608
9955 12996608 13285377 13526851 13801913 14193783 14659219 15110732 15557616 16071588 16666791
9946 16666791 17308745 18005074 18797415 19682155 20605952 21511114 22321496 22922785 23238694
9937 23238694 23307585 23214896 22973791 22543718 21940629 21244298 20505223 19722821 18914746 18133625
9927 18133625 17406501 16718754 16064749 15461671 14912877 14408825 13959862 13575683 13220972
9918 13220972 12848315 12466021 12115318 11797172 11492859 11239086 11088408 10992835 10830488 10575982
9908 10575982 10345897 10227392 10152282 10008919 9804117 9629527 9518473 9428157 9338145 9273347
9898 9273347 9226977 9144891 9015410 8911184 8895438 8924569 8897243 8786623 8668760 8610601 8585056
$$ packed form
9965A0909266J99883K20378J35492Q6372J63506K65062K66593K18232K36552K95272
9955A2996608K88769K41474K75062L91870M65436M51513M46884N13972N95203
9946A6666791O41954O96329P92341Q84740R23797R05162Q10382O01289L15909
9937B3238694O8891r2689k41105m30073o03089o96331p39075p82402q08075p81121
9927A8133625p27124o87747o54005o03078n48794n04052m48963l84179l54711
9918A3220972l72657l82294l50703l18146l04313k53773j50678r5573j62347k54506
9908A0575982k30085j18505p5110j43363k04802j74590j11054r0316r0012o4798
9898I273347m6370q2086j29481j04226j5746K9131k7326j10620j17863n8159k5545
$$ plain form
9887 8585056 8534787 8474035 8458324 8472805 8438309 8341947 8270324 8269532 8261405 8172756 8070020 8063100
9875 8063100 8129959 8156913 8126289 8137085 8238175 8361800 8440503 8477036 8473891 8409623 8322105
9864 8322105 8295764 8311763 8231032 8003018 7777284 7705302 7726624 7671881 7506736 7344586 7263122
9853 7263122 7237444 7231514 7233105 7205538 7119005 7031021 7026170 7069354 7034037 6899278 6800329 6832442
9841 6832442 6911024 6903692 6818445 6764728 6777791 6785688 6739669 6682790 6665801 6666387 6638143 6597506
9829 6597506 6603917 6662881 6703803 6671951 6600546 6559379 6564007 6579114 6587015 6596626 6598636 6577955
9817 6577955 6566960 6611101 6675350 6672201 6603323 6573943 6626423 6670669 6647581 6643025 6732201 6820470
9805 6820470 6786536 6701197 6726260 6842735 6876622 6790894 6747170 6833793 6927397 6910446 6854899
$$ packed form
9887H585056n0269o0752j5711J4481l4496r6362p1623p92q127q8649j02736o920
9875H063100O6859K6954l0624J0796J01090J23625P8703L6533l145o4268q7518
9864H322105k6341J5999q0731k28014k25734p1982K1322n4743j65145j62150q1464
9853G263122k5678n930J591k7567q6533q7984m851M3184l5317j34759r8949L2113
9841F832442P8582p332q5247n3717J3063P897m6019n6879j6989N86k8244m0637
9829F597506O411N8964M0922l1852p1405m1167M628J5107P901R611K010k0681
9817F577955j0995M4141O4249l149o8878k9380N2480M4246k3088m556Q9176Q8269
9805F820470l3934q5339K5063J16475L3887q5728m3724Q6623R3604j6951n5547
$$ plain form
9794 6854899 6872657 6925221 6919433 6881842 6888813 6904819 6848043 6766442 6785829 6894875 6936206 6837583
9782 6837583 6721929 6733096 6846906 6922213 6883545 6790696 6749950 6800886 6890902 6943124 6940781
9771 6940781 6934804 6969724 7032413 7089785 7140259 7195206 7241847 7265639 7283415 7312081 7330053 7315640
9759 7315640 7297982 7316065 7347074 7334485 7276825 7230116 7224989 7235793 7233156 7216465 7190736 7158915
9747 7158915 7142411 7165409 7213595 7249153 7268723 7303383 7357916 7396000 7395859 7379728 7375777 7386561
9735 7386561 7407034 7440765 7483949 7517965 7529062 7520308 7504339 7498224 7514459 7540266 7545814 7532437
9723 7532437 7539052 7570338 7565523 7492618 7427334 7459671 7553667 7592624 7548740 7506562 7514892 7521939
$$ packed form
9794F854899J7758N2564n788l7591O971J6006n6776q1601J9387J09046M1331r8623
9782F837583j15654J1167J13810P5307l8668r2849m0746N0936R0016N2222k343
9771F940781n977L4920O2689N7372N0474N4947M6641K3792J7776K8666J7972j4413
9759G315640j7658J8083L1009j2589n7660m6709n127J0804k637j6691k5729l1821
9747G158915j6504K2998M8186L5558J9570L4660N4533L8084j41j6131l951J0784
9735G386561K0473L3731M3184L4016J1097q754j5969o115J6235K5807N548j3377
9723G532437O615L1286m815p2905o5284L2337R3996L8957m3884m2178Q330P047
$$ [...]
##END NTUPLES=NMR SPECTRUM
##END=
