##TITLE=1H ikalashn
CA-9297-1
25.10.2024
##JCAMPDX= 6.0         $$ Bruker NMR JCAMP-DX V2.0
##DATA TYPE= NMR SPECTRUM
##DATA CLASS= NTUPLES
##ORIGIN= UXNMR, Bruker Analytische Messtechnik GmbH
##OWNER= root
$$ TOPSPIN		Version 1.3
$$ 2024-10-25 15:20:58.578 +0400  Irina@DPX200
$$ Compression mode = diff/dup
##.OBSERVE FREQUENCY= 200.131300845
##.OBSERVE NUCLEUS= ^1H
##.ACQUISITION MODE= SIMULTANEOUS
##.ACQUISITION SCHEME= undefined
##.AVERAGES= 8
##.DIGITISER RES= 18
##SPECTROMETER/DATA SYSTEM= spect
##.PULSE SEQUENCE= zg
##.SOLVENT NAME= DMSO
##.SHIFT REFERENCE= INTERNAL, DMSO, 1, 17.49637
##AUDIT TRAIL= $$ (NUMBER, WHEN, WHO, WHERE, WHAT)
$$ ##TITLE= Audit trail, TOPSPIN		Version 1.3
$$ ##JCAMPDX= 5.01
$$ ##ORIGIN= Bruker BioSpin GmbH
$$ ##OWNER= Irina
$$ $$ F:/spectra/data/iren/nmr/1H/4/pdata/1/auditp.txt
$$ ##AUDIT TRAIL=  $$ (NUMBER, WHEN, WHO, WHERE, VERSION, WHAT)
(   1,<2024-10-25 15:20:46.015 +0400>,<Irina>,<DPX200>,<TOPSPIN 1.3>,
      <created by zg
	started at 2024-10-25 15:20:08.703 +0400,
	POWCHK disabled, PULCHK disabled
       terminated by command 'halt'
       configuration hash MD5:
       BE 6D 3F 07 2A EA 11 49 91 17 2B D3 AF B3 58 0D
       data hash MD5: 16K
       91 53 41 B8 CB 7E 6D 80 6C FD CB 01 0F 4B 27 B4>)
(   2,<2024-10-25 15:20:46.078 +0400>,<Irina>,<DPX200>,<TOPSPIN 1.3>,
      <Start of raw data processing
       fp BC_mod = 2 FT_mod = 6 PKNL = 1 PHC0 = 325.9998 PHC1 = -3.698865 SI = 32K 
       data hash MD5: 32K
       D8 14 A5 BD D7 44 C0 58 5D 0A AE DC 47 B5 1B E6>)
(   3,<2024-10-25 15:20:48.609 +0400>,<Irina>,<DPX200>,<TOPSPIN 1.3>,
      <apk 
       data hash MD5: 32K
       36 E2 0F 38 DC C5 7E CF 43 EA F5 63 94 A9 85 45>)
(   4,<2024-10-25 15:20:50.968 +0400>,<Irina>,<DPX200>,<TOPSPIN 1.3>,
      <abs n ABSG = 5 
       data hash MD5: 32K
       60 E6 7E 7F 49 D3 31 9C 7E 7B 17 EA 6D 70 36 4A>)
$$ ##END=
$$ 
$$ $$ hash MD5
$$ $$ 66 A7 70 EB 88 19 05 15 06 DA D2 43 F8 D0 3D 68
##$RELAX= 
##$RELAX= 
##$RELAX= 
##$RELAX= 
##$RELAX= 
##$RELAX= 
##$RELAX= 
##$RELAX= 
##$RELAX= 
$$ Bruker specific parameters
$$ --------------------------
##$DU= <F:/spectra>
##$EXPNO= 4
##$NAME= <1H>
##$PROCNO= 1
##$TYPE= <nmr>
##$USER= <iren>
##$AMP= (0..31)
100 100 100 100 100 100 100 100 100 100 100 100 100 100 100 100 100 100 
100 100 100 100 100 100 100 100 100 100 100 100 100 100 
##$ANAVPT= -1
##$AQSEQ= 0
##$AQ_mod= 1
##$AUNM= <au_zg>
##$AUTOPOS= <>
##$BF1= 200.13
##$BF2= 200.13
##$BF3= 200.13
##$BF4= 200.13
##$BF5= 200.13
##$BF6= 200.13
##$BF7= 200.13
##$BF8= 200.13
##$BYTORDA= 1
##$CFDGTYP= 0
##$CFRGTYP= 5
##$CHEMSTR= <none>
##$CNST= (0..63)
1 1 145 1 1 1 1 1 1 1 1 1 1 1 1 1 1 1 1 1 1 1 1 1 1 1 1 1 1 1 1 1 1 1 
1 1 1 1 1 1 1 1 1 1 1 1 1 1 1 1 1 1 1 1 1 1 1 1 1 1 1 1 1 1 
##$CPDPRG= <>
##$CPDPRG1= <>
##$CPDPRG2= <>
##$CPDPRG3= <>
##$CPDPRG4= <mlev>
##$CPDPRG5= <mlev>
##$CPDPRG6= <mlev>
##$CPDPRG7= <mlev>
##$CPDPRG8= <mlev>
##$CPDPRGB= <>
##$CPDPRGT= <>
##$D= (0..63)
$$ [...]
##$SW_h= 4401.40845070422
##$TD= 16384
##$TD0= 1
##$TE= 300
##$TE2= 300
##$TE3= 300
##$TEG= 300
##$TL= (0..7)
0 120 120 120 120 120 120 120 
##$TP= (0..7)
150 150 150 150 150 150 150 150 
##$TP07= 0
##$TPNAME0= <>
##$TPNAME1= <>
##$TPNAME2= <>
##$TPNAME3= <>
##$TPNAME4= <>
##$TPNAME5= <>
##$TPNAME6= <>
##$TPNAME7= <>
##$TPOAL= (0..7)
0.5 0.5 0.5 0.5 0.5 0.5 0.5 0.5 
##$TPOFFS= (0..7)
0 0 0 0 0 0 0 0 
##$TUNHIN= 0
##$TUNHOUT= 0
##$TUNXOUT= 0
##$USERA1= <user>
##$USERA2= <user>
##$USERA3= <user>
##$USERA4= <user>
##$USERA5= <user>
##$V9= 5
##$VALIST= <valist>
##$VCLIST= <CCCCCCCCCCCCCCC>
##$VD= 0
##$VDLIST= <DDDDDDDDDDDDDDD>
##$VPLIST= <PPPPPPPPPPPPPPP>
##$VTLIST= <TTTTTTTTTTTTTTT>
##$WBST= 1024
##$WBSW= 25
##$XGAIN= (0..3)
0 0 0 0 
##$XL= 0
##$YL= 0
##$YMAX_a= 269359
##$YMIN_a= -459908
##$ZGOPTNS= <>
##$ZL1= 120
##$ZL2= 120
##$ZL3= 120
##$ZL4= 120
##$ABSF1= 17.49637
##$ABSF2= -4.496376
##$ABSG= 5
##$ABSL= 3
##$ALPHA= 0
##$AQORDER= 0
##$ASSFAC= 0
##$ASSFACI= 0
##$ASSFACX= 0
##$ASSWID= 0
##$AUNMP= <proc_1d>
##$AXLEFT= 0
##$AXRIGHT= 0
##$AXTYPE= 0
##$AXUNIT= <>
##$AZFE= 0.1
##$AZFW= 0.1
##$BCFW= 0
##$BC_mod= 2
##$BYTORDP= 0
##$COROFFS= 0
##$CY= 7568.61572265625
##$DATMOD= 1
##$DC= 0
##$DFILT= <>
##$DTYPP= 0
##$F1P= 17.9538593292236
##$F2P= -4.03888763876832
##$FCOR= 0.5
##$FTSIZE= 32768
##$FT_mod= 6
##$GAMMA= 0
##$GB= 0
##$INTBC= 0
##$INTSCL= 1.936888e-010
##$ISEN= 128
##$LB= 0
##$LEV0= 0
##$LPBIN= 0
##$MAXI= 945.577
##$MC2= 0
##$MEAN= 0
##$ME_mod= 0
##$MI= -402.1523
##$NCOEF= 0
##$NC_proc= -7
##$NLEV= 6
##$NOISF1= 8.587773
##$NOISF2= 6.764455
##$NSP= 0
##$NTH_PI= 0
##$NZP= 0
##$OFFSET= 17.49637
##$PC= 1
##$PHC0= 321.1108
##$PHC1= 0.02580595
##$PH_mod= 1
##$PKNL= yes
##$PPARMOD= 0
##$PPDIAG= 0
##$PPIPTYP= 0
##$PPMPNUM= 100
##$PPRESOL= 1
##$PSCAL= 0
##$PSIGN= 0
##$REVERSE= no
##$SF= 200.13
##$SI= 32768
##$SIGF1= 16.12182
##$SIGF2= -4.496377
##$SINO= 3.521527
##$SIOLD= 32768
##$SREGLST= <1H.CDCl3>
##$SSB= 0
##$STSI= 32768
##$STSR= 0
##$SW_p= 4401.40845070422
##$SYMM= 0
##$S_DEV= 0
##$TDeff= 16384
##$TDoff= 0
##$TI= <>
##$TILT= no
##$TM1= 0
##$TM2= 0
##$TOPLEV= 0
##$USERP1= <user>
##$USERP2= <user>
##$USERP3= <user>
##$USERP4= <user>
##$USERP5= <user>
##$WDW= 0
##$XDIM= 32768
##$YMAX_p= 442612432
##$YMIN_p= -815691
$$ End of Bruker specific parameters
$$ ---------------------------------
##NTUPLES= NMR SPECTRUM
##VAR_NAME=  FREQUENCY,     SPECTRUM/REAL,   SPECTRUM/IMAG
##SYMBOL=    X,             R,               I
##VAR_TYPE=  INDEPENDENT,   DEPENDENT,       DEPENDENT
##VAR_FORM=  AFFN,          ASDF,            ASDF
##VAR_DIM=   32768,         32768,           32768
##UNITS=     HZ,            ARBITRARY UNITS, ARBITRARY UNITS
##FACTOR=    0.134324425510551, 1,           1
##FIRST=     4401.40845070422, 142484,       -1151611
##LAST=      0,             -30460,          -1225388
##MIN=       0,             -815691,         0
##MAX=       4401.40845070422, 442612432,    0
$$ Real data points
##PAGE= N=1
##DATA TABLE= (X++(R..R)), XYDATA
$$ [...]
15063A470179R3762K88540J13015j57775j21686R0742Q2968j11753j23259Q5616
15053A710349J71909K0117j02103n0183r68m3920j2375J29475J41464n9032j91074
15042A713659o1383J14694R0972j6895O516Q8854M7842n6692n5264J2227K858
15031A887388m1763L266P6808M2385l4380L158J01084Q5448j6143l1270K9376
15020B105357j97j06355r5944M8288J13522J8205n7680K800O6362J5862l8420
15009B071800K2437R9377N4397m3049m3775K7365M3166J0980L3207Q2388K8982
14998B387275j06291j34659J0097J44028R9404k8803n1126Q534k5409j45119j25070
14987B032861J03940K71876J37216j28216j69974K5309J34481K1198p3187L3686
$$ y = [1470179, 1563941, 1852481, 1965496, 1807721, 1686035, 1776777, 1859745, 1747992, 1624733, 1710349, 1882258, 1902375, 1800272, 1750089, 1749121, 1705201, 1692826, 1822301, 1963765, 1904733, 1713659, 1652276, 1766970, 1857942, 1841047, 1847563, 1936417, 1984259, 1927567, 1872303, 1884530, 1887388, 1845625, 1848891, 1925699, 1968084, 1933704, 1936862, 2037946, 2123394, 2107251, 2075981, 2105357, 2105160, 1998805, 1902861, 1951149, 2064671, 2082876, 2025196, 2027996, 2094358, 2110220, 2071800, 2094237, 2193614, 2248011, 2204962, 2161187, 2188552, 2231718, 2242698, 2275905, 2358293, 2387275, 2280984, 2146325, 2156422, 2300450, 2399854, 2371051, 2319925, 2328459, 2303050, 2157931, 2032861, 2136801, 2408677, 2545893, 2417677, 2247703, 2273012, 2407493, 2428691, 2355504, 2389190]
14977B389190J51552N1522j35798j35260K5326Q7743n308n7573K1830R2089M9501
14966B534814k0236k2372J0971K8490L8066K9612k7952q2397m5829L7782M3198
14955B524147j0571J4365J06134R3957l9002q6902L2745J14866O19j51479j21289
14944B477590L0472Q8604J6201m6805k0885N9205J44987J76415Q1238q4718j20914
14933B801390L4748J51559L2445j55204j26158O9739J40804K7136m5860K0639
14923B951238O2939j2644o9054j7590J6065n3159q8936K1393J42503J04325j7601
14912C039479l6279M5847P1251n164o8074l4717N1337J07512Q5764j4948j18852
14901C123156j03871M0391J45033O9463q1466r0597N9154J67749J11435j1314
$$ y = [2389190, 2540742, 2592264, 2456466, 2321206, 2346532, 2434275, 2428967, 2371394, 2393224, 2485313, 2534814, 2514578, 2492206, 2503177, 2531667, 2569733, 2599345, 2571393, 2488996, 2443167, 2480949, 2524147, 2513576, 2527941, 2634075, 2728032, 2689030, 2602128, 2634873, 2749739, 2750358, 2598879, 2477590, 2508062, 2596666, 2612867, 2566062, 2545177, 2604382, 2749369, 2925784, 3007022, 2922304, 2801390, 2836138, 2987697, 3020142, 2864938, 2738780, 2808519, 2949323, 2976459, 2930599, 2951238, 3014177, 3001533, 2932479, 2914889, 2930954, 2877795, 2788859, 2810252, 2952755, 3057080, 3039479, 3003200, 3049047, 3120298, 3115134, 3047060, 3012343, 3063680, 3171192, 3256956, 3242008, 3123156, 3019285, 3059676, 3204709, 3274172, 3192706, 3102109, 3161263, 3329012, 3440447, 3429133]
14891C429133o3649m9159l5523k1763K2848O6696N5161k864n5094p2276m4114
14880C229396L6627J27264J32703K7391p2210m8775M4118O0541j3372m4571K8632
14869C507744J01504P6145N139j8264q796k6141m6251j2653M2034M7663K8068
14858C696192N5227J01250P1703k3882p3657m1135k169R427M3388Q9658N5179
14847C981181n6971j04536k4011O2235N4301L2845Q4339J24176N5518l0863l120
14836D175094P4926N6441k7703l9136N523j8915p6779q713J55256J85223J4230
14825D495447j34626q5317M3644O1010r472k0657M9088R7713P3838J9566j6580
14814D573654k0772l099P108p70K0347R7530J39118M5438r1321p6078P9215J43094
$$ y = [3429133, 3365484, 3316325, 3280802, 3259039, 3281887, 3348583, 3403744, 3400880, 3345786, 3273510, 3229396, 3266023, 3393287, 3525990, 3553381, 3481171, 3432396, 3476514, 3537055, 3523683, 3479112, 3507744, 3609248, 3685393, 3690532, 3672268, 3663472, 3637331, 3591080, 3578427, 3620461, 3668124, 3696192, 3751419, 3852669, 3924372, 3900490, 3826833, 3785698, 3783529, 3792956, 3836344, 3926002, 3981181, 3924210, 3819674, 3795663, 3857898, 3912199, 3945044, 4029383, 4153559, 4209077, 4178214, 4175094, 4250020, 4306461, 4278758, 4239622, 4245145, 4226230, 4149451, 4140738, 4295994, 4481217, 4495447, 4360821, 4275504, 4319148, 4380158, 4370686, 4350029, 4399117, 4496830, 4570668, 4590234, 4573654, 4552882, 4549783, 4556891, 4556121, 4576468, 4673998, 4813116, 4858554, 4767233, 4691155, 4770370, 4913464]
14802D913464K2590r1246m0592O4284P5587N3039Q8595R0760k5206j08404J145
14791E044016J57169J08260q4592j38579l498R0502L6923q012N6837J09170N3534
14780E421730n156L3387Q1754K3460q9641j21094l1264J05507J78559J03069q4542
14769E615769j85020m1031K03866K39079J8861j54579o4079J26913J51933K1208
14759E932920o0271j6147N3063O3738K5427k5129m1572K3035J24789J28320K59
14748F208432r7173k9199R9064J03460L657k9428M9188J14313Q3112J0151l1057
14737F484520k7538J3886P3255R1416L9642r584J4234N0832J0903m5008O618J16559
14725F819735J06386m0391j27899m3658Q0387R4172N1941P9572J46590J26446
$$ y = [4913464, 4936054, 4844808, 4804216, 4868500, 4944087, 4997126, 5085721, 5176481, 5151275, 5042871, 5044016, 5201185, 5309445, 5224853, 5086274, 5082776, 5173278, 5210201, 5202189, 5259026, 5368196, 5421730, 5416574, 5449961, 5531715, 5555175, 5465534, 5344440, 5313176, 5418683, 5597242, 5700311, 5615769, 5430749, 5389718, 5593584, 5832663, 5851524, 5696945, 5632866, 5759779, 5911712, 5932920, 5872649, 5856502, 5909565, 5973303, 5998730, 5973601, 5932029, 5955064, 6079853, 6208173, 6208432, 6111259, 6082060, 6181124, 6284584, 6288241, 6258813, 6308001, 6422314, 6505426, 6515577, 6484520, 6456982, 6470868, 6544123, 6635539, 6675181, 6665597, 6679831, 6730663, 6741566, 6696558, 6703176, 6819735, 6926121, 6885730, 6757831, 6714173, 6794560, 6888732, 6940673, 7020245, 7166835, 7293281]
14715G293281J4718o2851l7950K7909N8922N1583L1411Q028N07L7317R3320Q7266
14703G603461k769o9191k039J32918J50214P344j04588k0321J49679J71936L0089
14692H046733p2135l5085K1602J2705L1481J29055J63406M1020p2534J08J36013
14681H402369R9499o1242q7325O7762J79488J26606M4759N0829P0441K9125r133
14670H913178M003N409k5168l522P4475Q1491r358m3720N0447J28819R0311N0146
14658I316511R6588J05837k091n3586Q3451K08412R3080j01139o0949J50489J91576
14647A0028179J2536p9021N1757J66743Q7228k9831o930O5578M6810J273L4794
14636A0379116P8673L8972q549L4200R5459P5493M0313Q4554J33607Q2738J3192
$$ y = [7293281, 7307999, 7245148, 7207198, 7235107, 7294029, 7345612, 7377023, 7385051, 7385558, 7422875, 7516195, 7603461, 7600692, 7531501, 7529462, 7662380, 7812594, 7819938, 7715350, 7695029, 7844708, 8016644, 8046733, 7974598, 7939513, 7961115, 7973820, 8005301, 8134356, 8297762, 8338782, 8266248, 8266356, 8402369, 8501868, 8440626, 8353301, 8421063, 8600551, 8727157, 8771916, 8822745, 8893186, 8922311, 8913178, 8917181, 8922590, 8897422, 8893900, 8968375, 9049866, 9040508, 8996788, 9047235, 9176054, 9266365, 9316511, 9413099, 9518936, 9516845, 9463259, 9546710, 9755122, 9848202, 9747063, 9686114, 9836603, 10028179, 10040715, 9961694, 10013451, 10180194, 10267422, 10237591, 10230661, 10296239, 10343049, 10344322, 10379116, 10457789, 10496761, 10488212, 10522412, 10617871, 10693364, 10733677, 10818231, 10951838, 11034576, 11047768]
14625A1047768N4934J36526J01372n340p812R2107J27403O8623O0119J34085J40456
14614A1950241K6984m3605L9965J53070J44007O2443L8290O4007M9175J541P488
14603A2493606Q1759J52466J62668J07052J5101l7738K7037J65399K15151J13257
14593A3495758Q890M4518J31391J04163Q278K1694J33267J44098J4853l8552J04983
14582A4173341K51665J87020J4343j0601J28616K13748J44441N7325P3452J31316
14572A5364666J38133J18835J21410J09447N5675L2141R0773J46548J08776N1152
14562A6337556R9123K00536J87006N5452l058R8970K05236J72421R8987J39959
14552A7592188K21138J50944l6208q4416J01043K90235K53137P7883J1840J02878
$$ y = [11047768, 11102702, 11239228, 11340600, 11335260, 11327448, 11419555, 11546958, 11615581, 11675700, 11809785, 11950241, 11977225, 11933620, 11973585, 12126655, 12270662, 12333105, 12371395, 12435402, 12484577, 12486118, 12493606, 12575365, 12727831, 12890499, 12997551, 13012652, 12974914, 13001951, 13167350, 13382501, 13495758, 13504648, 13549166, 13680557, 13784720, 13792998, 13814692, 13947959, 14092057, 14106910, 14068358, 14173341, 14425006, 14612026, 14626369, 14615768, 14744384, 14958132, 15102573, 15159898, 15233350, 15364666, 15502799, 15621634, 15743044, 15852491, 15908166, 15940307, 16031080, 16177628, 16286404, 16337556, 16436679, 16637215, 16824221, 16879673, 16876615, 16975585, 17180821, 17353242, 17452229, 17592188, 17813326, 17964270, 17928062, 17843646, 17944689, 18234924, 18488061, 18565944, 18577784, 18680662]
14542A8680662J85735J71674J51533J92920K16382J50316P1115Q1671J43771J49250
14532B0195029J00317R6741J67485K32864K38800K20785K07795J63450P7135L1297
14522B1731698R6960K08863K32780J46786P5623J25496K47366L08097K61587J90460
14512B3625716J77279J93913J62856R5322R2617J92265K84852K48104J24717Q1782
14502B5279423J91469L32215L43434K22092J13668J32271K37787K98329K52918
14493B7403606J88189K27032L45590L70805K15497M4512Q5781L05876M33874L36406
14483B9957168J93899K10648L16226L18574K31149K31389L43694L94064L02731
14474C2499542K11242K43799L22057L27338K98880L31121L83425L53338K76715
$$ y = [18680662, 18866397, 19038071, 19189604, 19382524, 19598906, 19749222, 19820337, 19902008, 20045779, 20195029, 20295346, 20392087, 20559572, 20792436, 21031236, 21252021, 21459816, 21623266, 21700401, 21731698, 21828658, 22037521, 22270301, 22417087, 22492710, 22618206, 22865572, 23173669, 23435256, 23625716, 23802995, 23996908, 24159764, 24255086, 24347703, 24539968, 24824820, 25072924, 25197641, 25279423, 25470892, 25803107, 26146541, 26368633, 26482301, 26614572, 26852359, 27150688, 27403606, 27591795, 27818827, 28164417, 28535222, 28750719, 28795231, 28881012, 29186888, 29620762, 29957168, 30151067, 30361715, 30677941, 30996515, 31227664, 31459053, 31802747, 32196811, 32499542, 32710784, 32954583, 33276640, 33603978, 33902858, 34233979, 34617404, 34970742, 35247457]
14465C5247457K87437L90575M33038L34146K16102K35842L75422M83463M75253
14456C8478735M04451L51876L31081L29635L70416M64783N41168N08449L97695
14447D2178289L51551M30759N17330M87113M01795M11054N11989N56855M97402
14438D6344137M57408N15792N76130N43462M92753N34007O16525O18079N56408
14429E1254701N49628O05754O20314N76699N78832O55153O93476O37853O04434
14420E6776844O96956Q19464Q05284O68917N90793O65533P90168Q27476P79896
14411F3421331P46385P73544Q21928Q52798Q76224R05648R23138R20092R30444
14402G1171532R79440J027081J017241R70037R62521J015767J068637J078819
$$ y = [35247457, 35534894, 35925469, 36358507, 36692653, 36908755, 37144597, 37520019, 38003482, 38478735, 38883186, 39235062, 39566143, 39895778, 40266194, 40730977, 41272145, 41780594, 42178289, 42529840, 42960599, 43477929, 43965042, 44366837, 44777891, 45289880, 45846735, 46344137, 46801545, 47317337, 47893467, 48436929, 48929682, 49463689, 50080214, 50698293, 51254701, 51804329, 52410083, 53030397, 53607096, 54185928, 54841081, 55534557, 56172410, 56776844, 57473800, 58293264, 59098548, 59767465, 60358258, 61023791, 61813959, 62641435, 63421331, 64167716, 64941260, 65763188, 66615986, 67492210, 68397858, 69320996, 70241088, 71171532, 72150972, 73178053, 74195294, 75165331, 76127852, 77143619, 78212256, 79291075]
14394G9291075J078014J098286J120340J138950J197955J294788J332322J257949
14386H8809679J178940J223329J341137J381796J336908J346306J456327J538191
14378I9612613J499122J427291J443551J529585J602088J658506J734220J786828
14370A12293804J749180J664043J650416J740559J844666J885132J887418J918032
14362A26633250J990681K060728K082856K060131K047927K099573K194145K246199
14354A43415490K216292K177679K223296K330844K387103K346721K297678K338665
14346A61733768K445814K517267K523455K538194K604504K648048K594396K520258
14338A82125704K571556K732993K818082K742423K662363K729633K843892K826379
$$ y = [79291075, 80369089, 81467375, 82587715, 83726665, 84924620, 86219408, 87551730, 88809679, 89988619, 91211948, 92553085, 93934881, 95271789, 96618095, 98074422, 99612613, 101111735, 102539026, 103982577, 105512162, 107114250, 108772756, 110506976, 112293804, 114042984, 115707027, 117357443, 119098002, 120942668, 122827800, 124715218, 126633250, 128623931, 130684659, 132767515, 134827646, 136875573, 138975146, 141169291, 143415490, 145631782, 147809461, 150032757, 152363601, 154750704, 157097425, 159395103, 161733768, 164179582, 166696849, 169220304, 171758498, 174363002, 177011050, 179605446, 182125704, 184697260, 187430253, 190248335, 192990758, 195653121, 198382754, 201226646, 204053025]
14330B04053025K737675K785782K955871L002283K849452K729902K811374K936085
14322B26861449K903674K800818K825289K938500K945252K828360K756238K796856
14314B49656436K848608K844886K825718K802570K736141K660472K660718K715382
14306B71750931K717148K651902K597052K550772K444290K322450K309951K379213
14298B91723709K364121K240476K166860K188552K145496J973321J846427J876033
14290C08524995J903359J780828J639707J646709J684742J551872J335471J278543
14282C21346226J353777J297039J056752Q89872R44763J033453R42900P40619
14274C29605401O11907N70723N13074M37800M23381M39323L57199J57052j3155
$$ y = [204053025, 206790700, 209576482, 212532353, 215534636, 218384088, 221113990, 223925364, 226861449, 229765123, 232565941, 235391230, 238329730, 241274982, 244103342, 246859580, 249656436, 252505044, 255349930, 258175648, 260978218, 263714359, 266374831, 269035549, 271750931, 274468079, 277119981, 279717033, 282267805, 284712095, 287034545, 289344496, 291723709, 294087830, 296328306, 298495166, 300683718, 302829214, 304802535, 306648962, 308524995, 310428354, 312209182, 313848889, 315495598, 317180340, 318732212, 320067683, 321346226, 322700003, 323997042, 325053794, 325943666, 326888429, 327921882, 328864782, 329605401, 330217308, 330788031, 331301105, 331738905, 332162286, 332601609, 332958808, 333115860, 333102705]
14265C33102705k9874M1554L7593r0763k28093k65292k54712l31359n05665o31007
14255C30845087o07162n24093n32682o45066p58857q29515r04757j004862j080331
14246C23957762j100512j096135j099051j113496j154651j241464j342152j398160
14238C14412141j411928j443700j514822j581933j613802j628192j646693j673412
14230C01897659j716465j772004j801333j787842j788526j851356j921077j926820
14222B87332236j918954j989759k094383k107998k042681k027984k073379k054431
14214B71022667j970599j991317k158953k269402k185202k064726k102843k218247
14206B54061378k211694k102272k069919k143343k180635k127819k081273k095309
$$ y = [333102705, 333072831, 333114385, 333151978, 333061215, 332833122, 332567830, 332313118, 331981759, 331476094, 330845087, 330237925, 329713832, 329181150, 328536084, 327777227, 326947712, 326042955, 325038093, 323957762, 322857250, 321761115, 320662064, 319548568, 318393917, 317152453, 315810301, 314412141, 313000213, 311556513, 310041691, 308459758, 306845956, 305217764, 303571071, 301897659, 300181194, 298409190, 296607857, 294820015, 293031489, 291180133, 289259056, 287332236, 285413282, 283423523, 281329140, 279221142, 277178461, 275150477, 273077098, 271022667, 269052068, 267060751, 264901798, 262632396, 260447194, 258382468, 256279625, 254061378, 251849684, 249747412, 247677493, 245534150, 243353515, 241225696, 239144423, 237049114]
14198B37049114k117430k124962k154154k177335k113508j987446j928443j977839
14190B20467997k034444k025135j998468k007556k020797j997921j954649j909992
14182B04519035j855445j804449j791705j808834j817981j823108j841246j829110
14174A89947157j747745j667150j674610j715910j684996j630162j672860j749767
14166A76403957j680106j498686j445179j565022j617948j493579j407071j505403
14158A64190963j586655j461467j316578j400732j572650j527639j314319j232219
14150A52778704j313942j322144j224636j243096j391464j394255j182737j069248
14142A42637182j234458j400221j272778j019595r96489j203030j328928j229111
$$ y = [237049114, 234931684, 232806722, 230652568, 228475233, 226361725, 224374279, 222445836, 220467997, 218433553, 216408418, 214409950, 212402394, 210381597, 208383676, 206429027, 204519035, 202663590, 200859141, 199067436, 197258602, 195440621, 193617513, 191776267, 189947157, 188199412, 186532262, 184857652, 183141742, 181456746, 179826584, 178153724, 176403957, 174723851, 173225165, 171779986, 170214964, 168597016, 167103437, 165696366, 164190963, 162604308, 161142841, 159826263, 158425531, 156852881, 155325242, 154010923, 152778704, 151464762, 150142618, 148917982, 147674886, 146283422, 144889167, 143706430, 142637182, 141402724, 140002503, 138729725, 137710130, 136713641, 135510611, 134181683, 132952572]
14134A32952572j061994j002463j056015j143870j190352j138445j014437r40883
14126A24404113r75513j013897r69297r36644j020047j113509j053661r00029
14118A16421516q41285q87622q93036q43947q72430r81991j011588r11502q24160
14109A08353955q33827q52502q22588q21499q78385q85947p94737p12129p08739
14100A01043602p10545o86665p42104q87387r22155p35281n44695o13836q55315
14091I4345619r52090p96533n83953n08728n71852o75845p33060o84438n61179
14082H8277941n11950o27849p73706p49095n83459m94460n66232o55392o35000
14073H2680798n56278n23486n53353o06415o43006o21014n40843m90586n35765
$$ y = [132952572, 131890578, 130888115, 129832100, 128688230, 127497878, 126359433, 125344996, 124404113, 123428600, 122414703, 121445406, 120508762, 119488715, 118375206, 117321545, 116421516, 115580231, 114692609, 113799573, 112955626, 112083196, 111101205, 110089617, 109178115, 108353955, 107520128, 106667626, 105845038, 105023539, 104145154, 103259207, 102464470, 101752341, 101043602, 100333057, 99646392, 98904288, 98016901, 97094746, 96359465, 95814770, 95200934, 94345619, 93393529, 92596996, 92013043, 91504315, 90932463, 90256618, 89523558, 88839120, 88277941, 87765991, 87138142, 86364436, 85615341, 85031882, 84537422, 83971190, 83315798, 82680798, 82124520, 81601034, 81047681, 80441266, 79798260, 79177246, 78636403, 78145817, 77610052]
14064G7610052n93896n57119m91367n28549o04853n46462m05041m21441o06619
14055G2854705o68786m78532l00682l72389n30840n14574l98226m19359n44560
14046F8626757n46743m17794l66451m40027m70176m06738l98623m86978n05512
14037F4587715l86388l08433m01964n20623m73811l22951k69256l56311m52107
14028F1095871m61844m13551l65134l40639l44556l61788l60367l41850l50156
14019E7755986l88499l87870l15792k53510k88321l77492m05947l51474l03273
14010E4683808l18611l45714l20571k79037l08823m02121m29482l10166j58770
14001E1810513j60193l01225l64052k49145j52821k77858m90987m89136k53881
$$ y = [77610052, 77016156, 76459037, 75967670, 75439121, 74834268, 74287806, 73882765, 73461324, 72854705, 72185919, 71707387, 71406705, 71034316, 70503476, 69988902, 69590676, 69171317, 68626757, 68080014, 67662220, 67295769, 66855742, 66385566, 65978828, 65580205, 65093227, 64587715, 64201327, 63892894, 63490930, 62970307, 62496496, 62173545, 61904289, 61547978, 61095871, 60634027, 60220476, 59855342, 59514703, 59170147, 58808359, 58447992, 58106142, 57755986, 57367487, 56979617, 56663825, 56410315, 56121994, 55744502, 55338555, 54987081, 54683808, 54365197, 54019483, 53698912, 53419875, 53111052, 52708931, 52279449, 51969283, 51810513, 51650320, 51349095, 50985043, 50735898, 50583077, 50305219, 49814232, 49325096, 49071215]
13992D9071215q5131j55490k86892k71363j82020j97023k92404l19313k77130
13983D7004449k91613l66474l61316k29696j12585j42701k68442l35546k82015
13974D4614061j94879j86346k47793k61887j78514j17563k02838l39108l17905
13965D2567228j50755q6694k21630l23935k12906q5411k02808m20457l74083p1797
13955D0416752P6019j28708l82710l60043j75370j31934k32397k40725j15999
13946C8724885o7959j81201k69633j97050j12741k02207l57345l15100p2271P1457
13936C7020835o4351k82647l07269j76674j30615k00892j87513m6489q976j98991
13926C5416418l89744l35227j44389q6479j72521k03728j42614j37116k01833
$$ y = [49071215, 48986084, 48830594, 48543702, 48272339, 48090319, 47893296, 47600892, 47281579, 47004449, 46712836, 46346362, 45985046, 45755350, 45642765, 45500064, 45231622, 44896076, 44614061, 44419182, 44232836, 43985043, 43723156, 43544642, 43427079, 43224241, 42885133, 42567228, 42416473, 42329779, 42108149, 41784214, 41571308, 41485897, 41283089, 40862632, 40488549, 40416752, 40492771, 40364063, 39981353, 39621310, 39445940, 39314006, 39081609, 38840884, 38724885, 38656926, 38475725, 38206092, 38009042, 37896301, 37694094, 37336749, 37021649, 36949378, 37020835, 36956484, 36673837, 36366568, 36189894, 36059279, 35858387, 35670874, 35624385, 35615409, 35416418, 35026674, 34691447, 34547058, 34460579, 34288058, 34084330, 33941716, 33804600, 33602767]
13917C3602767j76066l9699M835j43203l09081l05880j80508q3873o3267r4792
13907C2211233j68805k32354j87778n4634L323q7804j95414k00325j72807k00655
13897C0713980k06252j05238j0070p6527k38596k94021k00840j05135r9286j19649
13887B9258366r0006l5707l1739j10112k19363k47931j41160j3822l7362j79888
13877B8151276k18081q3841M07j24193k71132k02040k7666l1799k05448k70992
13867B6716491j33899q81k1971r7252j11480j16978j78472k27221j82621q6395
13857B5559321l0663m8923j18342j79555j55354n4297j9716j40509k71057k18877
13847B4322028n2476J542p6542j03589m7808p5411k05698k34968r7597j132p2257
$$ y = [33602767, 33426701, 33387002, 33391837, 33248634, 32939553, 32633673, 32453165, 32369292, 32306025, 32211233, 32042428, 31810074, 31622296, 31567662, 31570985, 31483181, 31287767, 31087442, 30914635, 30713980, 30507728, 30402490, 30392420, 30315893, 30077297, 29783276, 29582436, 29477301, 29378015, 29258366, 29168360, 29132653, 29100914, 28990802, 28771439, 28523508, 28382348, 28368526, 28331164, 28151276, 27933195, 27849354, 27849761, 27725568, 27454436, 27252396, 27224730, 27192931, 26987483, 26716491, 26582592, 26581711, 26559740, 26462488, 26351008, 26234030, 26055558, 25828337, 25645716, 25559321, 25528658, 25479735, 25361393, 25181838, 25026484, 24972187, 24952471, 24811962, 24540905, 24322028, 24269552, 24271094, 24194552, 24090963, 24043155, 23967744, 23762046, 23527078, 23429481, 23428349, 23356092]
13836B3356092j54000j10986o2563j27642j91330j31815n1754p2345j11735q2586
13826B2259336r2907k15951k75009j23590N3269N539j78647k31818j27477m4100
13816B1028645l5285l4904p3458j85756k20627o0713Q9311j8697k29540k09460
13806B0049516j7042j36j74577k04525k6937K7742j50424k36721o6339N4938r1067
13795A9164428k25820p4525J22645J5076k54588k97698j08233J894n1445p5666
13785A8216068j6576j9404j02676j26709q2065r5169j55338j34009o0018p5970
13775A7348134j39451q7187J3924o3591k59765k39860M3446J95545k2052k98345
13765A6490798k46358K1810J17328l3914j71047j56425j12129j24308j15048m9880
$$ y = [23356092, 23202092, 23091106, 23028543, 22900901, 22709571, 22577756, 22526002, 22453657, 22341922, 22259336, 22166429, 21950478, 21675469, 21551879, 21605148, 21610687, 21432040, 21200222, 21072745, 21028645, 20993360, 20958456, 20884998, 20699242, 20478615, 20417902, 20507213, 20488516, 20258976, 20049516, 20032474, 20032338, 19857761, 19653236, 19626299, 19654041, 19503617, 19266896, 19200557, 19255495, 19164428, 18938608, 18864083, 18986728, 19001804, 18747216, 18449518, 18341285, 18343179, 18291734, 18216068, 18199492, 18180088, 18077412, 17950703, 17868638, 17773469, 17618131, 17484122, 17424104, 17348134, 17208683, 17121496, 17135420, 17071829, 16812064, 16572204, 16615650, 16811195, 16789143, 16490798, 16244440, 16266250, 16383578, 16349664, 16178617, 16022192, 15910063, 15785755, 15670707, 15620827]
13755A5620827k9238j01378j69625j56510j07629o9318q286P2923P7610l0679
13745A5098697j30360j11977n3150r1189j88902j86248o3895J5558l5562r4061
13735A4158911l6549M9458M420j41095k09169j42949o1665m5833m1141j3863k7567
13724A3492958r0379r3994j0937J1465j05150j93013r3242N4334J7518j36360
13714A2853200j44963j739K5604j36814k20377o1310J14332O0329r5076r3156
13704A2300030J2404k5040j92125k21993m4522Q7882j146j55237j57015m7083
13694A1556155m916n5603p9353l8175j8115o0377r4911o7198k4767l1977p1110
13683A1009653q3777o7260o6988q5979o6615J4139Q1510M6787o7992j50927j44387
$$ y = [15620827, 15591589, 15490211, 15320586, 15164076, 15056447, 14987129, 14978843, 15051766, 15129376, 15098697, 14968337, 14856360, 14803210, 14712021, 14523119, 14336871, 14272976, 14288534, 14252972, 14158911, 14122362, 14171820, 14176240, 14035145, 13825976, 13683027, 13621362, 13575529, 13534388, 13520525, 13492958, 13402579, 13308585, 13297648, 13309113, 13203963, 13010950, 12917708, 12972042, 12989560, 12853200, 12708237, 12706498, 12732102, 12595288, 12374911, 12313601, 12427933, 12488262, 12393186, 12300030, 12312434, 12287394, 12095269, 11873276, 11828754, 11916636, 11915490, 11760253, 11603238, 11556155, 11551239, 11495636, 11416283, 11378108, 11359993, 11299616, 11204705, 11137507, 11112740, 11080763, 11009653, 10925876, 10858616, 10791628, 10705649, 10639034, 10653173, 10734683, 10781470, 10713478, 10562551, 10418164]
13672A0418164j00621p6064m7074J8148O8843L1440p2719j45525j33369o6108
13662I895115P756N5376M3068l5153j11844j06891m2867k0998o6294q4730j4606
13651I517932O1979K7774j00032j82064j22855K5153J19359O5507q7332j81751
13641I143670j14016L4025P9132l2507j54773j44005m6172K99k3187k0645L3178
13630H754999M8201k4363j10749j33637j12556r0142n0222J6570M4695j4970r2278
13619H235548q8643l2565l2618r2996r9026k843R2940Q1841j1206r3657j19877
13608G836898q5273P928J05360J00850k6630j42827j25118l7571k2066p1024n8738
13597G481789K6853N5156k5010j00367q3645l6930k9903j9073L2685M9486k1107
$$ y = [10418164, 10317543, 10241479, 10194405, 10212553, 10281396, 10312836, 10240117, 10094592, 9961223, 9895115, 9902871, 9958247, 10001315, 9966162, 9854318, 9747427, 9704560, 9683562, 9617268, 9532538, 9517932, 9579911, 9607685, 9507653, 9325589, 9202734, 9227887, 9347246, 9412753, 9325421, 9143670, 9029654, 9063679, 9142811, 9110304, 8955531, 8811526, 8765354, 8765653, 8742466, 8721821, 8754999, 8803200, 8778837, 8668088, 8534451, 8421895, 8331753, 8281531, 8298101, 8342796, 8327826, 8235548, 8146905, 8114340, 8081722, 7988726, 7889700, 7886857, 7979797, 8061638, 8050432, 7956775, 7836898, 7751625, 7759553, 7864913, 7965763, 7939133, 7796306, 7671188, 7633617, 7611551, 7540527, 7481789, 7508642, 7563798, 7538788, 7438421, 7354776, 7317846, 7287943, 7268870, 7301555, 7351041, 7329934]
13586G329934q1276l6412K4483l0375j31076r7790N6768J23380J1990j22650j27999
13575F918977n4544k2337l1338j7448P722p144m3619m6427k2353j6948k7542j9654
13563F617345k025j1164m0853n2726m2585l8231m1343k2703K6941P6363Q1586
13552F550605J9673q4630j56399j32414m1116K2941J8182p418j3169j9277l0813
13541F126165k246O1846O5918k9867j10114o2670L7471L6919n4908q6211p531
13530E974772N9870K1047o5652j02685q1348m4754j3768K090p600k2260j2662
13519E707050o634m9802r8113n9537M1293O9476j0044o5782p795P3134O2089j1600
13507E643735o5453r9514j21931o4680P7833J42834J3713j54104j31186K9539
$$ y = [7329934, 7248658, 7212246, 7236729, 7206354, 7075278, 6977488, 7034256, 7157636, 7169626, 7046976, 6918977, 6864433, 6842096, 6810758, 6793310, 6801032, 6793888, 6750269, 6703842, 6681489, 6664541, 6636999, 6617345, 6615320, 6604156, 6563303, 6510577, 6467992, 6429761, 6388418, 6365715, 6392656, 6469019, 6550605, 6570278, 6485648, 6329249, 6196835, 6155719, 6178660, 6196842, 6189424, 6176255, 6156978, 6126165, 6123919, 6185765, 6251683, 6221816, 6111702, 6049032, 6086503, 6123422, 6068514, 5982303, 5974772, 6034642, 6055689, 5990037, 5887352, 5806004, 5761250, 5747482, 5749572, 5741972, 5719712, 5707050, 5700416, 5650614, 5552501, 5492964, 5534257, 5603733, 5593689, 5527907, 5520112, 5593246, 5655335, 5643735, 5578282, 5478768, 5356837, 5292157, 5369990, 5512824, 5526537, 5372433, 5241247, 5270786]
13497E270786P2645n1538j21607j9884R0579N6732l4473n2960m4823q5697r2321
13486D987439J8677J21910N6610q5522q2314N8562J05454k6693j46852q9781N1285
13475D968775R0634L29j06731j34415n7713Q5442J82424J20102n7129j60382j00578
13464D830758r125k1058o0772J2063J39494J34256k4339j49804j19015j9066K1967
13453D735359P445K631P113j2870m0219l9084k0446q430J1386M7411N3767m012
13441D740051p4546q4826m7447k6604k2841J6270P4840O0756m6824j31190q7188
13430D370451K0343L4077p5954j58746p8048J03360J95166J08721n1040j27142
13420D341188q1496O855O1210O6306L5081j4173m4952k6993J1286O838m3288o6036
$$ y = [5270786, 5343431, 5291893, 5170286, 5150402, 5240981, 5297713, 5263240, 5210280, 5165457, 5079760, 4987439, 5006116, 5128026, 5184636, 5099114, 5016800, 5075362, 5180816, 5154123, 5007271, 4917490, 4968775, 5059409, 5059738, 4953007, 4818592, 4760879, 4846321, 5028745, 5148847, 5091718, 4931336, 4830758, 4821633, 4800575, 4739803, 4751866, 4891360, 5025616, 5001277, 4851473, 4732458, 4713392, 4735359, 4742804, 4745435, 4752548, 4739678, 4699459, 4660375, 4639929, 4631499, 4642885, 4690296, 4744063, 4740051, 4665505, 4580679, 4533232, 4506628, 4483787, 4500057, 4574897, 4635653, 4588829, 4457639, 4370451, 4390794, 4424871, 4348917, 4190171, 4112123, 4215483, 4410649, 4519370, 4468330, 4341188, 4259692, 4266547, 4327757, 4394063, 4429144, 4414971, 4370019, 4343026, 4354312, 4361150, 4317862, 4251826]
13408D251826k0992L0981J6184m0309n5188j2543K0599n79m2833n5845l5491o047
13396D049763J6989K1042r327n9320p2302j2702O9648Q1848N101o8793m9825K5970
13384C998092L8784m3666j03125k7999J16510J60211N5459o6312q8003n3944n9737
13373C926270q5185m5445L7801M3608o0898j49239r8063N1134J48849J15492J0491
13362C894815n8621n1422j2290K955o457n776O236q079n1057o4568j6779L6434
13350C665391L1647o742k0140k0125n0184p8211l6299M7307P3438K8582p248j5155
13338C612261n4648j00335l4087J26221J69831m341j86737j36401O0938J26297
13328C578999P47j11922r0520l6035l2110p092P2708Q6363k7177j14654l7564
$$ y = [4251826, 4230834, 4261815, 4277999, 4237690, 4182502, 4169959, 4190558, 4189979, 4147146, 4091301, 4055810, 4049763, 4066752, 4087794, 4078467, 4019147, 3946845, 3934143, 4003791, 4085639, 4090740, 4021947, 3972122, 3998092, 4036876, 3993210, 3890085, 3862086, 3978596, 4138807, 4194266, 4127954, 4039951, 3986007, 3926270, 3841085, 3795640, 3833441, 3877049, 3816151, 3666912, 3568849, 3619983, 3768832, 3884324, 3894815, 3836194, 3784772, 3772482, 3775437, 3768980, 3763204, 3769440, 3761361, 3710304, 3645736, 3628957, 3665391, 3697038, 3690296, 3670156, 3650031, 3599847, 3521636, 3485337, 3532644, 3606082, 3634664, 3627416, 3612261, 3557613, 3457278, 3423191, 3549412, 3719243, 3714902, 3528165, 3391764, 3452702, 3578999, 3579746, 3467824, 3377304, 3341269, 3309159, 3302067, 3374775, 3461138, 3433961, 3319307, 3281743]
13317C281743Q3499M9168r1518j13957K3885J23786O6257k8835l4255j4471o4482
13306C280820j03022n461J41778J20548q9119k40650j43738Q1930J73879N9714
13296C276679r1168j08956l762J00362J18704N6105l6379j05400j17408p2411
13286C016366J370O8842R8014O6049j2651p4109o3762q304J7965K244R204O7725
13274C188953J06476N0318o4818j29642r0204O648P6889P0714K271n6269l4978
13263C126358M5680P9696P981r2961j07818l2225L8090M1761O931j4728p525P330
13251C098570j2461q6615j45578p1712J20290K25071R3103j29430j72811k0623
13241B897804Q4958K1012o0354k2464M0070J1649k2443M6828J16699L9576r3144
$$ y = [3281743, 3365242, 3414410, 3322892, 3208935, 3232820, 3356606, 3422863, 3394028, 3359773, 3345302, 3280820, 3177798, 3172337, 3314115, 3434663, 3345544, 3104894, 2961156, 3043086, 3216965, 3276679, 3185511, 3076555, 3072793, 3173155, 3291859, 3347964, 3311585, 3206185, 3088777, 3016366, 3017736, 3086578, 3184592, 3250641, 3237990, 3163881, 3100119, 3091815, 3109780, 3112024, 3121228, 3188953, 3295429, 3345747, 3280929, 3151287, 3061083, 3067731, 3144620, 3215334, 3217605, 3161336, 3126358, 3172038, 3251734, 3259715, 3166754, 3058936, 3026711, 3064801, 3106562, 3113493, 3098765, 3091240, 3098570, 3086109, 2999494, 2853916, 2782204, 2902494, 3127565, 3220668, 3091238, 2918427, 2897804, 2982762, 3003774, 2943420, 2920956, 2961026, 2972675, 2950232, 2997060, 3113759, 3153335, 3060191]
13230C060191q4552K5061K1856r9532j12041M0673J14376l3933j80725p8840J37028
13219B809562J49693n2096j68583m8906J14997J14950J6819m525M4780K4425q5351
13208B915765j49210q8881J1509M7397L3174L6446M8074N291q3859j26738o9684
13197B579284L0643Q9266R2911P4429L3976m4321j17300j09073k8145K0993j4443
13186B608220m8755R916R9204Q3047k7047o4037M2021J31510L7502j49487j87204
13175B534890k5241J18615O5867q1927j05261K9423J52065J29859N918r6680j10628
13164B616900n1356J7515L2093o009j9475L5049P8891J6756j00735j33411n6681
13153B429537K1928N3427R7446J49196R4593p7676j88954j19813K575J4746k4974
$$ y = [3060191, 2975639, 3000700, 3022556, 2923024, 2810983, 2851656, 2966032, 2932099, 2751374, 2672534, 2809562, 2959255, 2907159, 2738576, 2689670, 2804667, 2919617, 2936436, 2931911, 2976691, 3001116, 2915765, 2766555, 2677674, 2689183, 2736580, 2769754, 2806200, 2854274, 2859565, 2775706, 2648968, 2579284, 2609927, 2699193, 2792104, 2866533, 2900509, 2856188, 2738888, 2629815, 2601670, 2622663, 2608220, 2559465, 2569381, 2668585, 2751632, 2724585, 2660548, 2702569, 2834079, 2871581, 2722094, 2534890, 2509649, 2628264, 2694131, 2612204, 2506943, 2536366, 2688431, 2818290, 2824208, 2727528, 2616900, 2565544, 2583059, 2615152, 2609143, 2589668, 2624717, 2703608, 2720364, 2619629, 2486218, 2429537, 2451465, 2504892, 2602338, 2751534, 2846127, 2768451, 2579497, 2459684, 2462259, 2477005, 2452031]
13142B452031K5696J13812P6640n8786j01044n555O8467L2506j5341N006L4841
13131B628273K4530J8948K5512k5260j12024r9423K4933P9230k8206j30106o5427
13120B340980O1929P0246q153k7809N568j941o497Q8943J89002J07304j04881
13109B714691j91871p8158L1495k966n3272K4751J40016J19265k6645j36765j16540
13098B424001q524Q7771Q7128k1884j29746r9586M2635J13054K0487j06134j13966
13087B295236k3590O3463J23202J54098R2253o1975j41851k4976J33954R1661
13077B701475j05950j67622Q885J82017J25749o1391j39167o4569J5117J6900
13067B511444K33J7868L5144J8953L026K3156N1252L7383j4898n1294l4852J2949
$$ y = [2452031, 2477727, 2591539, 2668179, 2609393, 2508349, 2502794, 2571261, 2603767, 2588426, 2593432, 2628273, 2652803, 2671751, 2697263, 2672003, 2559979, 2460556, 2485489, 2564719, 2536513, 2406407, 2340980, 2402909, 2473155, 2465002, 2437193, 2442761, 2440820, 2434323, 2523266, 2712268, 2819572, 2714691, 2522820, 2444662, 2476157, 2473191, 2419919, 2444670, 2584686, 2703951, 2677306, 2540541, 2424001, 2415477, 2503248, 2590376, 2568492, 2438746, 2339160, 2381795, 2494849, 2515336, 2409202, 2295236, 2271646, 2335109, 2458311, 2612409, 2704662, 2642687, 2500836, 2475860, 2609814, 2701475, 2595525, 2427903, 2436788, 2618805, 2744554, 2683163, 2543996, 2479427, 2494544, 2511444, 2511677, 2529545, 2564689, 2583642, 2586668, 2609824, 2661076, 2698459, 2683561, 2632267, 2597415, 2610364]
13055B610364M3333L8605K2811J5443K836k4832l7374o977L0589J1338n9528r9927
13043B546681n5157L5254R1587P4595M6q1432j03382l2876P4864J17826O7629
13032B735635P65j2839P170J2776N167J746j0988l2060j6029M2265N9022j4506
13020B778124q3640l8016O4644P7325o650n5358j9900J3231P207L0931Q3048N3839
13008B904785n1864n8205P9704J26137p5397k78171j55976J68539K65522M0611
12998B965685j37745l0729J22969M6183j12363n4536J45883J59105n9019k02546
12988B842887j04458L7172J7912o3836j9979J05802J30571L1860m0798q224N1355
12977B980264N3849J3629k3042m2437l1229L0301J00835Q2136m6057j52193r7790
$$ y = [2610364, 2653697, 2692302, 2715113, 2730556, 2733392, 2708560, 2671186, 2664209, 2694798, 2706136, 2646608, 2546681, 2491524, 2526778, 2618365, 2692960, 2693006, 2611574, 2508192, 2475316, 2550180, 2668006, 2735635, 2736400, 2723561, 2730731, 2743507, 2748674, 2750420, 2739432, 2707372, 2691343, 2733608, 2792630, 2778124, 2694484, 2656468, 2721112, 2798437, 2791787, 2736429, 2716529, 2729760, 2736967, 2767898, 2850946, 2904785, 2852921, 2794716, 2874420, 3000557, 2925160, 2646989, 2491013, 2659552, 2925074, 2965685, 2827940, 2797211, 2920180, 2966363, 2854000, 2799464, 2945347, 3104452, 3045433, 2842887, 2738429, 2775601, 2793513, 2729677, 2709698, 2815500, 2946071, 2977931, 2937133, 2928909, 2980264, 3034113, 3047742, 3024700, 2982263, 2951034, 2981335, 3082170, 3164306, 3118249, 2966056, 2868266]
12966B868266O8502J55777Q0253k9732l1003K8177Q339p6977p5346M1955J02928
12955C141139l293j34037r1800Q5156J84154J16010l562n2268l2759N624M4441
12944C258805O2313K9074l1076n2355k2239J2137L0632M4635K8084m4218r8115
12933C217677l2789J02072J46165O4450j1225n848N134k3665j9399L6027L4607
12922C513206m7124n7437O9978J54053M4976j08067q2950O6781J28806P9680N4924
12911C816826N9910p398r3501m1225J02391J18835j5337p9559J8086J03778O3184
12900D045990K2839P5304R0935j9523r4068J2977J50245R8995o5324r6837L4221
12889D255754J33819J11479P0821P9556P0743O508m0925k1373K0223M4542P1744
$$ y = [2868266, 2936768, 3092545, 3172798, 3143066, 3112063, 3140240, 3148579, 3071602, 2996256, 3038211, 3141139, 3137846, 3003809, 2912009, 2997165, 3181319, 3297329, 3293767, 3241499, 3208740, 3214364, 3258805, 3321118, 3350192, 3319116, 3266761, 3244522, 3256659, 3287291, 3331926, 3360010, 3315792, 3217677, 3184888, 3286960, 3433125, 3497575, 3486350, 3480502, 3485636, 3461971, 3442572, 3478599, 3513206, 3466082, 3408645, 3478623, 3632676, 3677652, 3569585, 3486635, 3553416, 3682222, 3761902, 3816826, 3876736, 3869338, 3775837, 3734612, 3837003, 3955838, 3940501, 3860942, 3879028, 3982806, 4045990, 4068829, 4144133, 4235068, 4215545, 4121477, 4134454, 4284699, 4383694, 4318370, 4221533, 4255754, 4389573, 4501052, 4571873, 4651429, 4722172, 4728680, 4687755, 4666382, 4686605, 4731147, 4802891]
12878D802891J00736Q7213L7477J9925M6795M4815j3821m9611m543N2519K8747
12867E153143m1885m2417N0754J23955Q3985p202j9502N2273P5628j1852q3377
12856E333503n924J34127J38917N466o0247L1977J16205N3540l4177J8572J21488
12845E853447P0030r8142j38779J2790J31591M5272j13597j16035L9486J52976
12835E839039J06197j1097n4154p055L0072L74k8659K0580Q8237M3111r8671j51929
12823E776045k6476J17992J00964j2150m0111R596j5267j03440o9317J10428J95387
12812F043651L2045j92600k08288l2705R3178N7416j9940j6539K5889R483n6531
12801E735059p8801k4591L0675J5904k8124j3850M0603K2511q2712j28495k6329
$$ y = [4802891, 4903627, 4990840, 5028317, 5048242, 5095037, 5139852, 5126031, 5076420, 5071877, 5124396, 5153143, 5111258, 5068841, 5119595, 5243550, 5327535, 5320333, 5300831, 5353104, 5428732, 5416880, 5333503, 5327579, 5461706, 5600623, 5606089, 5545842, 5577819, 5694024, 5747564, 5713387, 5731959, 5853447, 5923477, 5825335, 5686556, 5699346, 5830937, 5876209, 5762612, 5646577, 5686063, 5839039, 5945236, 5934139, 5879985, 5872930, 5903002, 5903376, 5874717, 5895297, 5983534, 6026645, 5927974, 5776045, 5749569, 5867561, 5968525, 5956375, 5916264, 5925860, 5910593, 5807153, 5737836, 5848264, 6043651, 6075696, 5883096, 5674808, 5642103, 5735281, 5792697, 5772757, 5756218, 5782107, 5791590, 5735059, 5656258, 5631667, 5662342, 5678246, 5650122, 5636272, 5676875, 5699386, 5616674, 5488179, 5461850]
12790E461850Q4433L0399j17773j46087k7468N9984L6569J5037N4848N3686l3618
12779E471860q4600k9886J5896k5636m2571M2106Q4144m0926j77769j13971O1924
12768E160571R2432l3269p7875M2950J34495N1372q7140j10837m3284j0583l3577
12757E085255l5669J4039O8383Q2272N8845K7150O812o601k1101j5569L2270P3388
12745E369474J9209j08525j53645l6688J02651R3758j6019n1400J1980L6493l0326
12734E236962q0575l9584K6877M3134K9549L1868N1046P4387Q3078K6554j00752
12723E382544j71022n6880J45061J93132L3840j17797q8977L2547P9060M2269
12713E473777J3580J1295k308j6764j298K3787L0347L7414N6104N0038J1859l35
$$ y = [5461850, 5546283, 5576682, 5458909, 5312822, 5285354, 5345338, 5381907, 5396944, 5451792, 5505478, 5471860, 5387260, 5357374, 5373270, 5347634, 5305063, 5347169, 5431313, 5390387, 5212618, 5098647, 5160571, 5253003, 5219734, 5141859, 5184809, 5319304, 5370676, 5283536, 5172699, 5129415, 5118832, 5085255, 5049586, 5063625, 5132008, 5214280, 5273125, 5300275, 5307087, 5300486, 5279385, 5263816, 5296086, 5369474, 5388683, 5280158, 5126513, 5089825, 5192476, 5286234, 5270215, 5218815, 5230795, 5267288, 5236962, 5156387, 5116803, 5143680, 5186814, 5216363, 5248231, 5299277, 5373664, 5456742, 5483296, 5382544, 5211522, 5154642, 5299703, 5492835, 5526675, 5408878, 5319901, 5352448, 5431508, 5473777, 5487357, 5498652, 5496344, 5479580, 5478282, 5502069, 5532416, 5569830, 5625934, 5675972, 5687831, 5687496]
12701E687496L5495N2041M215n2301n6396k6340P547N3683Q5574L7462n6478n4866
12689E717132O6984J32966L0227q9046l4329J18118J43120Q172j06614q9527p010
12678E890193N3453P6917N7014o721m3511J4772R5178O3332n6954r7699j023R4510
12666F139461O9180j3386k6452L9879R3969P2016l921n7146k3745P3005J23946
12655F486806O3061l0799l6771L4291O7811K5607j6978r285J7973M3916Q8695
12644F734327J32796J15846M3362p059r813j8411m5797k9592M5904R9884P4884
12633G136331J5134j6518j4473R129N0636P4601M2206L12L2770J04864R2381m04
12621G526969j4745R9304J67411O1664p1545k7437J30330J66205L8550m9211K7111
$$ y = [5687496, 5722991, 5775032, 5779247, 5726946, 5670550, 5644210, 5651757, 5705440, 5791014, 5828476, 5771998, 5717132, 5784116, 5917082, 5947309, 5858263, 5823934, 5942052, 6085172, 6093344, 5986730, 5897203, 5890193, 5943646, 6020563, 6077577, 6070856, 6027345, 6042117, 6137295, 6200627, 6143673, 6045974, 6044951, 6139461, 6208641, 6195255, 6168803, 6208682, 6302651, 6374667, 6370746, 6313600, 6289855, 6362860, 6486806, 6549867, 6519068, 6482297, 6516588, 6584399, 6610006, 6593028, 6583743, 6601716, 6645632, 6734327, 6867123, 6982969, 7026331, 7019272, 7009459, 6991048, 6945251, 6915659, 6961563, 7061447, 7136331, 7151465, 7134947, 7120474, 7129603, 7180239, 7254840, 7297046, 7297358, 7330128, 7434992, 7527373, 7526969, 7512224, 7611528, 7778939, 7840603, 7769058, 7741621, 7871951, 8038156, 8076706, 8027495, 8054606]
12610H054606J36678J12702o204o2305j0493N7278P6857Q0824R4102O9583j1756
12599H591872n6387K2660J39672J23491j6204o4882P9232K21008J48543l1804
12589I157201m9429J15105K13253J19617j0356k4518K1044L5699N6554J10280
12579I744450J05846J4458j6449J01814K05968J17041n6727o8792R7632K26681
12569A0471922J91918Q1015J3094Q679M6369J02598J27870R7551P0786R6706J10383
12558A1418891M3630k3077K8718J44422J65187P4600N060K1555P3015J36353K20833
12547A2309187K44588J17064m8696l2543J46546K16720O2845q7242j5990J57413
12537A3069892J85365O8331J3738J04152K06188J93274J04709N9178J01694J66577
$$ y = [8054606, 8191284, 8303986, 8297782, 8235477, 8224984, 8282262, 8359119, 8439943, 8534045, 8603628, 8591872, 8535485, 8558145, 8697817, 8821308, 8805104, 8740222, 8819454, 9040462, 9189005, 9157201, 9107772, 9222877, 9436130, 9555747, 9545391, 9520873, 9541917, 9577616, 9634170, 9744450, 9850296, 9864754, 9848305, 9950119, 10156087, 10273128, 10216401, 10147609, 10245241, 10471922, 10663840, 10744855, 10757949, 10766628, 10812997, 10915595, 11043465, 11141016, 11211802, 11308508, 11418891, 11462521, 11439444, 11468162, 11612584, 11777771, 11852371, 11857431, 11878986, 11952001, 12088354, 12309187, 12553775, 12670839, 12622143, 12589600, 12736146, 12952866, 13015711, 12928469, 12912479, 13069892, 13255257, 13323588, 13337326, 13441478, 13647666, 13840940, 13945649, 14004827, 14106521, 14273098]
12527A4273098J61696Q3793L6329R3235J77689J67995R7215J06717J97003K01517
12517A5596287O4801l6319M1679J84108K04903J28905J16910J96644K46695K07626
12507A6952239J48349J30640J37599J41785J45889J52911J65977K00623K38572
12498A8414584K12879J10542L8073R6919K35445L13179K76625J90303J33025J42179
12488B0163753K15222K88431K69985J73436J42496K45130L36877K67606J36990
12479B2239926J59763L27195M13620L21305K08183K22680L02459L24843K99629
12470B4819603L00916L23803L22233L08222L15189L27223L28380L57671M30301
12461B7833541M66552L96452K89741K76868L63737M31986M24794M22862M95586
$$ y = [14273098, 14434794, 14518587, 14554916, 14648151, 14825840, 14993835, 15091050, 15197767, 15394770, 15596287, 15661088, 15624769, 15666448, 15850556, 16055459, 16184364, 16301274, 16497918, 16744613, 16952239, 17100588, 17231228, 17368827, 17510612, 17656501, 17809412, 17975389, 18176012, 18414584, 18627463, 18738005, 18776078, 18872997, 19108442, 19421621, 19698246, 19888549, 20021574, 20163753, 20378975, 20667406, 20937391, 21110827, 21253323, 21498453, 21835330, 22102936, 22239926, 22399689, 22726884, 23140504, 23461809, 23669992, 23892672, 24195131, 24519974, 24819603, 25120519, 25444322, 25766555, 26074777, 26389966, 26717189, 27045569, 27403240, 27833541, 28300093, 28696545, 28986286, 29263154, 29626891, 30058877, 30483671, 30906533, 31402119]
12452C1402119N71549N41007M35888M01857M90707N86301N83236N41354N68843
12443C6122861O27462N95678M95357M85285O02632O85960O33504N71636O40203
12434D1460578P53942P44941O37787N94636O51673P03987P18842P68740Q54716
12425D7889842Q83348Q41698Q25219Q60571Q63847Q16838Q26367R47617J084890
12416E5840237J128797J078022R88837R26425R84233J197604J411058J410898
12408F4966111J237398J166662J309643J453114J421148J360336J469394J644219
12400G6028025J649413J517307J501399J682460J873389J917894J869813J849313
12392H9889013J899748K021962K198720K349362K390425K370568K427004K587120
$$ y = [31402119, 31973668, 32514675, 32950563, 33352420, 33843127, 34429428, 35012664, 35554018, 36122861, 36750323, 37346001, 37841358, 38326643, 38929275, 39615235, 40248739, 40820375, 41460578, 42214520, 42959461, 43597248, 44191884, 44843557, 45547544, 46266386, 47035126, 47889842, 48773190, 49614888, 50440107, 51300678, 52164525, 52981363, 53807730, 54755347, 55840237, 56969034, 58047056, 59035893, 59962318, 60946551, 62144155, 63555213, 64966111, 66203509, 67370171, 68679814, 70132928, 71554076, 72914412, 74383806, 76028025, 77677438, 79194745, 80696144, 82378604, 84251993, 86169887, 88039700, 89889013, 91788761, 93810723, 96009443, 98358805, 100749230, 103119798, 105546802, 108133922]
12384A08133922K733280K789566K823104K919015L059828L181762L274929L381032
12376A32296438L536140L732386L905452L986164M012192M130704M407245M700823
12368A64707544M849717M915133N077648N336240N511095N546206N594028N749567
12360B07287178N907827N974307O024582O131599O205089O156377O084848O128062
12352B55899869O228455O228538O128851O069545O091620O092868O017463N927496
12344C04684705N863973N777183N632872N468240N299719N084428M827269M626392
12336C47264781M537377M466723M286780M014566L792956L709110L707623L695112
12328C79475028L665257L672634L712598L697988L585890L475543L501089L628941
$$ y = [108133922, 110867202, 113656768, 116479872, 119398887, 122458715, 125640477, 128915406, 132296438, 135832578, 139564964, 143470416, 147456580, 151468772, 155599476, 160006721, 164707544, 169557261, 174472394, 179550042, 184886282, 190397377, 195943583, 201537611, 207287178, 213195005, 219169312, 225193894, 231325493, 237530582, 243686959, 249771807, 255899869, 262128324, 268356862, 274485713, 280555258, 286646878, 292739746, 298757209, 304684705, 310548678, 316325861, 321958733, 327426973, 332726692, 337811120, 342638389, 347264781, 351802158, 356268881, 360555661, 364570227, 368363183, 372072293, 375779916, 379475028, 383140285, 386812919, 390525517, 394223505, 397809395, 401284938, 404786027, 408414968]
12320D08414968L654792L453533L155068K981528K956826K894040K664812K354035
12312D32529602K104092J919201J710706J456246J199853R30365N83651J78716
12304D42612432j58096l56894n12452p55962j068687j310726j420833j496187
12296D35532595j645288j835472j951220j968966j994051k111457k268985k361439
12288D19395717k391961k471338k652792k849840k964585l027300l126657l251857
12280C96659387l321895l357354l478257l692992l839559l828985l811279l960920
12272C67368146m210347m377336m476168m679291m999561n260671n416381n641601
12264C28306790o007461o312383o400448o434486o632793o894681o944890o755474
$$ y = [408414968, 412069760, 415523293, 418678361, 421659889, 424616715, 427510755, 430175567, 432529602, 434633694, 436552895, 438263601, 439719847, 440919700, 441850065, 442433716, 442612432, 442454336, 442097442, 441584990, 440829028, 439760341, 438449615, 437028782, 435532595, 433887307, 432051835, 430100615, 428131649, 426137598, 424026141, 421757156, 419395717, 417003756, 414532418, 411879626, 409029786, 406065201, 403037901, 399911244, 396659387, 393337492, 389980138, 386501881, 382808889, 378969330, 375140345, 371329066, 367368146, 363157799, 358780463, 354304295, 349625004, 344625443, 339364772, 333948391, 328306790, 322299329, 315986946, 309586498, 303152012, 296519219, 289624538, 282679648, 275924174]
12256B75924174o558785o477367o400138o241857o081629n975846n838650n607758
12248B26742144n370083n213608n075842m852223m571141m351399m226475m100932
12240A88980441l882232l608536l418837l383515l390144l273653l060666k946693
12232A62016165k972637k912091k635682k396293k486008k741399k732990k406454
12224A40732611k161258k237233k392953k336523k144092k042902k051081k068182
12216A23298387k102756k166640k126479j907739j697848j705890j843731j872555
12208A07874749j749038j603126j490099j399175j398609j523220j607099j479939
12200I5624444j256426j182071j260155j287691j201375j120190j087815j043668
$$ y = [275924174, 269365389, 262888022, 256487884, 250246027, 244164398, 238188552, 232349902, 226742144, 221372061, 216158453, 211082611, 206230388, 201659247, 197307848, 193081373, 188980441, 185098209, 181489673, 178070836, 174687321, 171297177, 168023524, 164962858, 162016165, 159043528, 156131437, 153495755, 151099462, 148613454, 145872055, 143139065, 140732611, 138571353, 136334120, 133941167, 131604644, 129460552, 127417650, 125366569, 123298387, 121195631, 119028991, 116902512, 114994773, 113296925, 111591035, 109747304, 107874749, 106125711, 104522585, 103032486, 101633311, 100234702, 98711482, 97104383, 95624444, 94368018, 93185947, 91925792, 90638101, 89436726, 88316536, 87228721, 86185053]
12192H6185053j019068j089718j157614j060679q81043q50214r59233r81453q87040
12183G7298991q80362r79997r44048p25550o23277p99245r89777r21808p17600
12174F9717327o36936o78036o98757p08140p63082p66633o43014n46455o24390
12165F3651884p27646o39758m58146m43565n90592o59801n79510n09924n26071
12156E8516871n25822m69866m53126m99549n12015m66724m53702m88356m77784
12147E4169927m11920l97895m57443m71689l85899l04647l19173l84688m28388
12138E0608185m45973m36656l70447k76623k49303l12535l81595l94925l80900
12129D7359228l66750l34615k98057l07012l45075l38109k94625l10290l92494
$$ y = [86185053, 85165985, 84076267, 82918653, 81857974, 80976931, 80126717, 79167484, 78186031, 77298991, 76418629, 75438632, 74494584, 73769034, 73145757, 72346512, 71356735, 70434927, 69717327, 69080391, 68402355, 67703598, 66995458, 66232376, 65465743, 64822729, 64276274, 63651884, 62924238, 62284480, 61826334, 61382769, 60792177, 60132376, 59552866, 59042942, 58516871, 57991049, 57521183, 57068057, 56568508, 56056493, 55589769, 55136067, 54647711, 54169927, 53758007, 53360112, 52902669, 52430980, 52045081, 51740434, 51421261, 51036573, 50608185, 50162212, 49725556, 49355109, 49078486, 48829183, 48516648, 48135053, 47740128, 47359228, 46992478, 46657863, 46359806, 46052794, 45707719, 45369610, 45074985, 44764695, 44372201]
12120D4372201m16812l24089k34280k73433l86255m22129l44706k61148k70380
12111D1438969l53280m14783m02530l66467l79105m05816l38077j94342j64072
12102C8420497l36663n04867m23145j83225j02578k64737m23002l92732k83619
12093C5505929k52090k59416k17236j80315k28266k98588k96965k58772k55451
12084C3258830k49895j93669j65058k46844l47923l18576j90524j32191j90614
12075C1223536k42330k05953j53000j68228k19040k27000j93031j79700j99189
12066B9436065j87098j08871m7609j15564k73420l34570k12960o6932p9108j85177
12056B7824756j94110j08849r8417j72465j54265k3844l230j81577l23397k26430
$$ y = [44372201, 43955389, 43631300, 43397020, 43123587, 42737332, 42315203, 41970497, 41709349, 41438969, 41085689, 40670906, 40268376, 39901909, 39522804, 39116988, 38778911, 38584569, 38420497, 38083834, 37578967, 37155822, 36972597, 36870019, 36605282, 36182280, 35789548, 35505929, 35253839, 34994423, 34777187, 34596872, 34368606, 34070018, 33773053, 33514281, 33258830, 33008935, 32815266, 32650208, 32403364, 32055441, 31736865, 31546341, 31414150, 31223536, 30981206, 30775253, 30622253, 30454025, 30234985, 30007985, 29814954, 29635254, 29436065, 29248967, 29140096, 29092487, 28976923, 28703503, 28368933, 28155973, 28089041, 28009933, 27824756, 27630646, 27521797, 27423380, 27250915, 27096650, 27072806, 27069576, 26887999, 26564602, 26338172]
12046B6338172l7359Q68q3827j15436r1692j22354j70623j22880l2077l6870j01762
12035B5424160q4805j1688l1927j35047j59818p4327q046p670M847K7654k9503
12024B4913830j31654j31540k5225L4602J0162K2830Q6279N6035q0676j27797
12014B4626846m863R9817L9646n9607m5871j829n9081j32338o9695N7556N2020
12003B4502601q8441j62368o3075Q8409J24947K7251q7766j06865l9266q750r1536
11992B4095141j79743j11191O7212J27480k895j20040o0813M7916J6936r1050
11982B3788953q4245L0198P1014j2421q1501n6034k2283n2109p9110l0520L2586
11971B3504528j644j27182k13437j66576n2394k0909j10070j87918j43549o3123
$$ y = [26338172, 26300813, 26301681, 26217854, 26102418, 26010726, 25888372, 25717749, 25594869, 25562792, 25525922, 25424160, 25339355, 25327667, 25295740, 25160693, 25000875, 24926548, 24918502, 24910832, 24915679, 24943333, 24913830, 24782176, 24650636, 24625411, 24660013, 24670175, 24693005, 24779284, 24835319, 24754643, 24626846, 24621983, 24721800, 24761446, 24701839, 24655968, 24654139, 24595058, 24462720, 24393025, 24450581, 24502601, 24414160, 24251792, 24188717, 24277126, 24402073, 24429324, 24341558, 24234693, 24195427, 24186677, 24095141, 23915398, 23804207, 23871419, 23998899, 23996004, 23875964, 23815151, 23863067, 23880003, 23788953, 23704708, 23734906, 23805920, 23793499, 23711998, 23655964, 23633681, 23581572, 23502462, 23471942, 23504528, 23502884, 23375702, 23162265, 22995689, 22943295, 22922386, 22812316, 22624398, 22480849, 22417726]
11961B2417726r7044k04214k05240q4566k8740j14055j78328j06854l0255q7862
11951B1280568j87793j81690j08807p4584m7101J5858l759j82514l22538k00247
11941A9987393N1307J01760r6920k82886k98257k31799j59402m7970N2021P110
11931A9082357j50849k36698k16870k38436l14894k81134j34234j02145k49341
11922A7157756l25485j77826k0732p8894k25309k29671j46530j69244k60990k32570
11912A5290505r3554m2122j40017k36698k13781j17235m4596m3772j12013j85355
11902A4061362j67921o3968p553o8535j37260j13336p3626j07389j31707n6059
11892A3134008J2580m9380j28197n8242N0872k5670k12745k18161k0511P7239
$$ y = [22417726, 22320682, 22116468, 21911228, 21826662, 21797922, 21683867, 21505539, 21398685, 21368430, 21280568, 21092775, 20911085, 20802278, 20727694, 20680593, 20696451, 20692692, 20510178, 20187640, 19987393, 20038700, 20140460, 20043540, 19760654, 19462397, 19230598, 19071196, 19023226, 19075247, 19082357, 18931508, 18694810, 18477940, 18239504, 17924610, 17643476, 17509242, 17407097, 17157756, 16832271, 16654445, 16633713, 16554819, 16329510, 16099839, 15953309, 15784065, 15523075, 15290505, 15196951, 15154829, 15014812, 14778114, 14564333, 14447098, 14402502, 14358730, 14246717, 14061362, 13893441, 13829473, 13821920, 13753385, 13616125, 13502789, 13429163, 13321774, 13190067, 13134008, 13146588, 13097208, 12969011, 12910769, 12961641, 12935971, 12723226, 12505065, 12484554, 12561793]
11882A2561793n8150j82152q7033P5792O8316p8044j76471j70605j15683k4352
11872A1813411Q3950J02753j7149j45028j47979q5964p3209o3174L5309J24695
11862A1627615L2635j79158k51859r5652Q5053R0687k1298p2432k0578K9998M039
11851A1229050n9554p7473j9519N8269O4094k3580j08006q2859J6456M7094l9077
11840A1004895j18812p5106L3340O8871K1523J711M5602N9809p386o3909k3084
11829A0947454M3617J9172n8786n4215L5928O9901L622k7163N4373J09191M012
11818A1147106j37972r6930R9697K00414R4360m5293l4704P3444J10074L4429
11808A1444625n0782n6792J3458J03257J46526J04131R315m5564l073R6685J60765
$$ y = [12561793, 12503643, 12321491, 12234458, 12310250, 12378566, 12300522, 12124051, 11953446, 11837763, 11813411, 11897361, 12000114, 11982965, 11837937, 11689958, 11603994, 11530785, 11467611, 11502920, 11627615, 11660250, 11481092, 11229233, 11133581, 11218634, 11309321, 11288023, 11215591, 11195013, 11225011, 11229050, 11169496, 11092023, 11072504, 11130773, 11194867, 11171287, 11063281, 10980422, 10996878, 11043972, 11004895, 10886083, 10810977, 10844317, 10913188, 10934711, 10936422, 10982024, 11041833, 11034447, 10970538, 10947454, 10991071, 11010243, 10951457, 10897242, 10933170, 11003071, 11006693, 10979530, 11033903, 11143094, 11147106, 11009134, 10912204, 11011901, 11212315, 11306675, 11261382, 11226678, 11300122, 11410196, 11444625, 11393843, 11337051, 11350509, 11453766, 11600292, 11704423, 11713738, 11668174, 11665101, 11761786, 11922551]
11797A1922551J28380K0113o3529k3384J04517J50377L5433p6185K716J74907
11787A2375896J83816K2629m8540O4097J38811M4515j7696J03856J83961p415
11777A3043930k39670j29372K21898L39894R9513j12588k9204J30917R7117k7393
11767A3395042k1614O3713N6404q169P905O3370L2431l4402o398O1534K2438o9073
11755A3563181k8418J23208J67338M4211o0453l1344J8299j7255o4712m1216j158
11744A3671681M222M0202J32591J57987L8507r0918p4126J9051J4301q1810j08633
11733A3723055k1468N3238L3351j4980j9328q804l0418o1677o0871l5469j9197
11722A3537432k6688n0347o7651n6618l7257o2673j20296j04634K4278J23890
$$ y = [11922551, 12050931, 12071044, 12007515, 11984131, 12088648, 12239025, 12274458, 12198273, 12200989, 12375896, 12559712, 12582341, 12533801, 12597898, 12736709, 12781224, 12763528, 12867384, 13051345, 13043930, 12804260, 12674888, 12896786, 13236680, 13336193, 13223605, 13194401, 13325318, 13422435, 13395042, 13373428, 13437141, 13493545, 13485376, 13493281, 13556651, 13589082, 13554680, 13548282, 13609816, 13632254, 13563181, 13534763, 13657971, 13825309, 13869520, 13809067, 13777723, 13796022, 13778767, 13714055, 13672839, 13671681, 13675903, 13716105, 13848696, 14006683, 14045190, 13954272, 13880146, 13899197, 13913498, 13831688, 13723055, 13701587, 13754825, 13788176, 13773196, 13753868, 13745064, 13714646, 13652969, 13592098, 13556629, 13537432, 13510744, 13460397, 13392746, 13336128, 13298871, 13236198, 13115902, 13011268, 13035546, 13159436]
11712A3159436M3487j32438j81241o7308J7721l5507j02570n6951L1708M3168
11702A2719505m533l7417o1941r0209o0319L0045M7061o1316j16443J6436J45930
11691A2526799K0092k23043k07554Q6673K44872L1457k53842k30195K4215J49098
11681A2168572L9856q2806o2811N767n881p2399r7629n1851K5437P8068O7096
11670A2011419J1375j4324K4276O3248M3669J1742K3671K0900o7031j49939p7216
11659A1901790J03980J76347P0383k8938K8736J33487J07212j1064m1141M8886
11649A2489678J11267O8066J9736N4975R8759N3385j0014N3163K08068K45748
11639A3392831Q5597p2058q016K00481K84071J59394K2088M0615J39201J69766
$$ y = [13159436, 13202923, 13070485, 12889244, 12821936, 12839657, 12804150, 12701580, 12644629, 12676337, 12719505, 12714972, 12677555, 12615614, 12525405, 12465086, 12495131, 12542192, 12480876, 12364433, 12380869, 12526799, 12546891, 12323848, 12116294, 12202967, 12447839, 12479296, 12225454, 11995259, 12019474, 12168572, 12208428, 12125622, 12062811, 12068578, 12062697, 11990298, 11892669, 11840818, 11866255, 11944323, 12011419, 12022794, 12008470, 12032746, 12095994, 12139663, 12151405, 12175076, 12195976, 12128945, 11979006, 11901790, 12005770, 12182117, 12252500, 12223562, 12252298, 12385785, 12492997, 12481933, 12440792, 12489678, 12600945, 12669011, 12688747, 12743722, 12842481, 12895866, 12885852, 12939015, 13147083, 13392831, 13478428, 13406370, 13398354, 13598835, 13882906, 14042300, 14064388, 14105003, 14244204, 14413970]
11629A4413970J41079J42876J57925J10011L2391L0909J10904J78753J91939J79851
11619A5690608J44828P9738N4978J32970K14699J46184k1837p4410L8730J23812
11609A6530300O1070j3582L4867J05523N7333k6758J2256J11287P6255p8917j28126
11598A6741508J5904J64791J37499L959n5700o578M6224M1181J8001J6556J8065
11587A7141410J943m290L1027P7929O8062o483n7005n949Q8886R0208k6771j23904
11575A7275063r1684p747j3391r3494j05401j0864N7669r76j06432j24052n9127
11564A6719564k6770p2002j23684j21802r3231p6317n7017k9709m3438j09553
11554A5966041j30694l6721N3806l2098k23867k41262m721J92822Q8685j53158
$$ y = [14413970, 14555049, 14697925, 14855850, 14965861, 14998252, 15029161, 15140065, 15318818, 15510757, 15690608, 15835436, 15915174, 15970152, 16103122, 16317821, 16464005, 16442168, 16367758, 16406488, 16530300, 16591370, 16577788, 16612655, 16718178, 16775511, 16748753, 16761009, 16872296, 16948551, 16869634, 16741508, 16757412, 16922203, 17059702, 17063661, 17007961, 17001383, 17047607, 17088788, 17106789, 17123345, 17141410, 17143353, 17139063, 17170090, 17248019, 17316081, 17309598, 17252593, 17246644, 17335530, 17425738, 17398967, 17275063, 17183379, 17175632, 17162241, 17068747, 16963346, 16952482, 17010151, 17009175, 16902743, 16778691, 16719564, 16692794, 16620792, 16497108, 16375306, 16282075, 16205758, 16148741, 16119032, 16075594, 15966041, 15835347, 15798626, 15852432, 15820334, 15596467, 15355205, 15350484, 15543306, 15631991, 15478833]
11544A5478833j91222k6873L5268r6088j75552p5966j1009j35293k38884r8506
11534A4464708J12879Q3337j33539k14188q7736j4934j31668k35426j28104P5658
11524A3790987J27581k0747j93753k16927q2114O3280O4385o0641j20781q427
11514A3342843J19853O0037j14418j48799J318J12309N1317m9438n1434j3061
11504A3310527j8732j0821O0311R1364k203j04522o0132Q2113J45622P3375m1417
11493A3525485j07427r1698J1985J47309J85129O8674p8119r4561J1987J04436
11483A3683200J07165N8933K0675K2223O0665Q4555L9017k4117J5373J35216J46722
11472A4349627q201j08470J9051J85815J08040j24398j54898Q9258K77726J77727
$$ y = [15478833, 15287611, 15260738, 15296006, 15199918, 15024366, 14948400, 14937391, 14802098, 14563214, 14464708, 14577587, 14660924, 14527385, 14313197, 14225461, 14210527, 14078859, 13843433, 13715329, 13790987, 13918568, 13897821, 13704068, 13487141, 13405027, 13468307, 13532692, 13472051, 13351270, 13342843, 13462696, 13522733, 13408315, 13259516, 13260834, 13373143, 13424460, 13375022, 13323588, 13310527, 13291795, 13280974, 13341285, 13432649, 13430446, 13325924, 13265792, 13347905, 13493527, 13566902, 13525485, 13418058, 13326360, 13338345, 13485654, 13670783, 13739457, 13661338, 13566777, 13578764, 13683200, 13790365, 13849298, 13869973, 13892196, 13952861, 14037416, 14076433, 14052316, 14067689, 14202905, 14349627, 14341426, 14232956, 14252007, 14437822, 14545862, 14421464, 14266566, 14355824, 14633550, 14811277]
11462A4811277k1239l1731J16746J87925J11129K6572K7753N6013N0408M8335
11452A5383188R5763J58054J75127J48057J16633Q2168J6868m7778j6035J33853
11442A6245898K62538K19486N9359j4993O2710J42351J15569Q5179J58860K31624
11432A7568581J57043K3251L7129J86768K49774J39223K1527M2054J27311J43736
11422A8696397R9980R0505J40468J94561J98360J40730O6029N5133J31890K04324
11412B0018377J83769J28385J50081K15134J94156R5132O5584J46836K13200J97320
11402B1607974J88807K43576K76357K29426J82036J96642K11932J86506J94021
11393B3517277K66900K96603K12767J24657J54877K52840K97592K74532K36822
$$ y = [14811277, 14790038, 14758307, 14875053, 15062978, 15174107, 15200679, 15228432, 15284445, 15334853, 15383188, 15478951, 15637005, 15812132, 15960189, 16076822, 16158990, 16175858, 16128080, 16112045, 16245898, 16508436, 16727922, 16787281, 16772288, 16834998, 16977349, 17092918, 17178097, 17336957, 17568581, 17725624, 17748875, 17786004, 17972772, 18222546, 18361769, 18383296, 18425350, 18552661, 18696397, 18796377, 18886882, 19027350, 19221911, 19420271, 19561001, 19627030, 19682163, 19814053, 20018377, 20202146, 20330531, 20480612, 20695746, 20889902, 20985034, 21050618, 21197454, 21410654, 21607974, 21796781, 22040357, 22316714, 22546140, 22728176, 22924818, 23136750, 23323256, 23517277, 23784177, 24080780, 24293547, 24418204, 24573081, 24825921, 25123513, 25398045, 25634867]
11384B5634867K04789K05532K84986L84852L62678K39174K33684M11653N15012
11375B8477227L49484J29780J68948L96606N01022M25649L77827M13879L84740
11366C1625162K93007L36897N30982O20186M87550L48111L91451N01356N05794
11357C5640496M67340N19515O07026O08283N68897N95415O34737N83099N24519
11348D0749327O18353P90496P89184N76660M31065N59318P94955Q37135O74575
11339D6821068N79201P02470Q71291Q59571P17676O85957Q44667J017704J036496
11330E4136101R46550Q89166R04521R46573R99322J071608J136775J169030J189722
11321F3389368J209950J199108J176608J233666J375349J459387J410513J368536
$$ y = [25634867, 25839656, 26045188, 26330174, 26715026, 27077704, 27316878, 27550562, 27962215, 28477227, 28826711, 28956491, 29125439, 29522045, 30023067, 30448716, 30826543, 31240422, 31625162, 31918169, 32255066, 32786048, 33406234, 33893784, 34241895, 34633346, 35134702, 35640496, 36107836, 36627351, 37234377, 37842660, 38411557, 39006972, 39641709, 40224808, 40749327, 41367680, 42158176, 42947360, 43524020, 43955085, 44514403, 45309358, 46146493, 46821068, 47400269, 48102739, 48974030, 49833601, 50551277, 51237234, 52081901, 53099605, 54136101, 55082651, 55971817, 56876338, 57822911, 58822233, 59893841, 61030616, 62199646, 63389368, 64599318, 65798426, 66975034, 68208700, 69584049, 71043436, 72453949, 73822485]
11313G3822485J470197J611049J618415J550977J597125J754836J859302J877375
11305H7161761J919989J994100K005677J994035K091469K253528K315260K319265
11297A04055084K468944K725764K809893K685977K674851K934036L195390L227704
11289A26777643L210390L379451L614787L698433L726817L918727M206000M363892
11281A56896140M409349M538257M771534M973532N134247N339149N538671N632754
11273A97233633N706989N902427O130181O206324O190182O276563O421355O415596
11265B46483250O293288O303686O468398O525891O371983O216150O210645O235346
11257B97108637O161520O050125N970471N869856N728972N612788N480563N191927
$$ y = [73822485, 75292682, 76903731, 78522146, 80073123, 81670248, 83425084, 85284386, 87161761, 89081750, 91075850, 93081527, 95075562, 97167031, 99420559, 101735819, 104055084, 106524028, 109249792, 112059685, 114745662, 117420513, 120354549, 123549939, 126777643, 129988033, 133367484, 136982271, 140680704, 144407521, 148326248, 152532248, 156896140, 161305489, 165843746, 170615280, 175588812, 180723059, 186062208, 191600879, 197233633, 202940622, 208843049, 214973230, 221179554, 227369736, 233646299, 240067654, 246483250, 252776538, 259080224, 265548622, 272074513, 278446496, 284662646, 290873291, 297108637, 303270157, 309320282, 315290753, 321160609, 326889581, 332502369, 337982932, 343174859]
11249C43174859M788514M506460M404395M249828L903952L548346L370173L278921
11241C75225448L120985K945612K860397K822615K765248K747724K803314K817648
11233C98108991K728614K657808K676166K649529K500354K390126K418883K382786
11225D18513257K104412J780128J672856J648426J392133R55494O80276O31535
11217D29378517N15348J85798j50692l31881n04463q41965j257645j567870j759772
11208D23665375j945360k175489k416982k626023k770496k851553k929626l051653
11200D02898193l169113l232175l316817l506656l700107l737046l687787l772814
11192C74775678l983305m055986l902949l790901l940115m180308m214366m055695
$$ y = [343174859, 347963373, 352469833, 356874228, 361124056, 365028008, 368576354, 371946527, 375225448, 378346433, 381292045, 384152442, 386975057, 389740305, 392488029, 395291343, 398108991, 400837605, 403495413, 406171579, 408821108, 411321462, 413711588, 416130471, 418513257, 420617669, 422397797, 424070653, 425719079, 427111212, 428066706, 428746982, 429378517, 429893865, 430079663, 429928971, 429597090, 429092627, 428250662, 426993017, 425425147, 423665375, 421720015, 419544526, 417127544, 414501521, 411731025, 408879472, 405949846, 402898193, 399729080, 396496905, 393180088, 389673432, 385973325, 382236279, 378548492, 374775678, 370792373, 366736387, 362833438, 359042537, 355102422, 350922114, 346707748, 342652053]
11184C42652053l969724m075090m232541m307573m344928m442400m591006m717990
11176C07970801m825999n008793n311144n616906n752966n723889n742119n940217
11168B64048768o156224o156751n993407n923160n999518n995194n779536n519739
11160B16525239n391451n316181n150197m943450m810447m689623m453904m168401
11152A77601585m014676m001223l953485l780810l570548l407198l264889l112253
11144A48496503k982608k892933k803479k699494k617503k554264k446074k288084
11136A27212064k185044k208797k265227k194043j986179j814196j812621j893353
11128A10852604j861308j694777j590806j673013j775091j662913j403425j301818
$$ y = [342652053, 338682329, 334607239, 330374698, 326067125, 321722197, 317279797, 312688791, 307970801, 303144802, 298136009, 292824865, 287207959, 281454993, 275731104, 269988985, 264048768, 257892544, 251735793, 245742386, 239819226, 233819708, 227824514, 222044978, 216525239, 211133788, 205817607, 200667410, 195723960, 190913513, 186223890, 181769986, 177601585, 173586909, 169585686, 165632201, 161851391, 158280843, 154873645, 151608756, 148496503, 145513895, 142620962, 139817483, 137117989, 134500486, 131946222, 129500148, 127212064, 125027020, 122818223, 120552996, 118358953, 116372774, 114558578, 112745957, 110852604, 108991296, 107296519, 105705713, 104032700, 102257609, 100594696, 99191271, 97889453]
11120I7889453j453314j585023j455784j213800j163078j305803j360679j200778
11112H7151194j028831j056164j201735j238481j122656j019799j032161j054360
11104G8397007r61809q33546q51134j002006j053990q92877p19992p60953r13605
11095G0407095r15493p78339p59058q99790r32573p40570n81878o66037q10354
11086F3323003p74970o71962p17318p96266o65177m41541m61707p04050p92040
11077E7297972o01653m40520n19906o48933o23913n60080o08409o49999n40072
11068E2104487m11801m53015n67703n44689m20954l94250m75379n03808m46774
11059D7886114m20819m48286m37795l96726m30280n17808n11302l92426l26416
$$ y = [97889453, 96436139, 94851116, 93395332, 92181532, 91018454, 89712651, 88351972, 87151194, 86122363, 85066199, 83864464, 82625983, 81503327, 80483528, 79451367, 78397007, 77435198, 76601652, 75750518, 74748512, 73694522, 72801645, 72081653, 71320700, 70407095, 69491602, 68713263, 67954205, 67054415, 66121842, 65381272, 64799394, 64133357, 63323003, 62548033, 61876071, 61158753, 60362487, 59697310, 59255769, 58794062, 58090012, 57297972, 56696319, 56255799, 55735893, 55086960, 54463047, 53902967, 53294558, 52644559, 52104487, 51692686, 51239671, 50671968, 50127279, 49706325, 49312075, 48836696, 48332888, 47886114, 47465295, 47017009, 46579214, 46182488, 45752208, 45234400, 44723098, 44330672, 44004256]
11050D4004256l99301m81348m34029l08436k48070k99119l95971m59374m50323
11041D0528285l83010l17875k97652k94706k78111k93933l81687m54356l99210
11032C7427745k73643k37739k96209k96981k14289k17750l73721m88606l94071
11023C4634736k12364j60426k31650k73380k70469l22193l98780l62320k25445
11014C2177709j64149k40224l14549k89730k45429k56510k61418k13840j95059
11005B9996801k51246k75038j93972j31675k09984l19631k88883j75443j62266
10996B7988663k39832k48286j92456k27373l25290k72307o9678j4558k29125m14526
10986B5755232k98208n9021k2154j51373j84710j15848j52944k76197k46608o7379
$$ y = [44004256, 43604955, 43123607, 42689578, 42381142, 42133072, 41833953, 41437982, 40978608, 40528285, 40145275, 39827400, 39529748, 39235042, 38956931, 38662998, 38281311, 37826955, 37427745, 37154102, 36916363, 36620154, 36323173, 36108884, 35891134, 35517413, 35028807, 34634736, 34422372, 34261946, 34030296, 33756916, 33486447, 33164254, 32765474, 32403154, 32177709, 32013560, 31773336, 31458787, 31169057, 30923628, 30667118, 30405700, 30191860, 29996801, 29745555, 29470517, 29276545, 29144870, 28934886, 28615255, 28326372, 28150929, 27988663, 27748831, 27500545, 27308089, 27080716, 26755426, 26483119, 26413441, 26398883, 26169758, 25755232, 25457024, 25398003, 25375849, 25224476, 25039766, 24923918, 24770974, 24494777, 24248169, 24180790]
10976B4180790l4008k32842l66880k40860p7157j26872k61979k31123r0669o9693
10966B2448707j61995j73333q9673q7555j99009k48244j51670m4529n3744j34890
10956B1104065j91571j99385j64924j02343q3287j68418k63818k04207k0209M9452
10946A9755355j09766l06553l09205j57148o1451q9615j20262p8855m9216j12166
10936A8361118k00107j95923j09537n9316r4231j32131j04010o7518j01188j59001
10926A7138156j45940r2263j05556j67489j55822q2707r9731k06691j99259l0371
10916A5852327M0208j35811k86531j30632J22527P4835k02034k69506m3352Q2160
10906A5104191r0520k50003j33690L8240k7645k08312k18296q5475k8899o1947
$$ y = [24180790, 24146782, 23913940, 23547060, 23306200, 23229043, 23102171, 22840192, 22609069, 22518400, 22448707, 22286712, 22113379, 22023706, 21936151, 21737142, 21488898, 21337228, 21292699, 21238955, 21104065, 20912494, 20713109, 20548185, 20445842, 20362555, 20194137, 19930319, 19726112, 19705903, 19755355, 19645589, 19339036, 19029831, 18872683, 18811232, 18721617, 18601355, 18522500, 18473284, 18361118, 18161011, 17965088, 17855551, 17796235, 17702004, 17569873, 17465863, 17398345, 17297157, 17138156, 16992216, 16899953, 16794397, 16626908, 16471086, 16388379, 16288648, 16081957, 15882698, 15852327, 15892535, 15756724, 15470193, 15339561, 15462088, 15536923, 15334889, 15065383, 15022031, 15104191, 15013671, 14763668, 14629978, 14668218, 14640573, 14432261, 14213965, 14128490, 14099591, 14037644]
10896A4037644n2346k3001p2770j25730o6510m348r1648k00323j17103M4833N913
10885A3334611j79369j95619k4719J1477j71899k50698m8233J51483P3317j24513
10875A2575838j65905r2606q3766r6507j5439M3802p0810k04645j12722Q7919
10865A1865159O7833j59490k35612m3015J09042O214j37813q0109L8987k7115
10855A1404081j75601j23408R1586J43527n7325k16631j21074M3946J2848j49887
10845A0852062j89435p2744j572n8867r6088j1093Q2034N8269j7049k4316K609
10834A0523810l9694j17096j02841M593O6803J3115p1543q9596m9594j0947j872
10823A0125138k0638m3935k4916L9783N5830m6758j54619r0045R5379J36978n6891
$$ y = [14037644, 13985298, 13962297, 13889527, 13763797, 13697287, 13692939, 13601291, 13400968, 13283865, 13328698, 13334611, 13155242, 12959623, 12934904, 12946381, 12774482, 12523784, 12475551, 12627034, 12700351, 12575838, 12409933, 12317327, 12233561, 12137054, 12121615, 12165417, 12094607, 11889962, 11777240, 11865159, 11932992, 11773502, 11537890, 11494875, 11603917, 11610131, 11472318, 11392209, 11431196, 11404081, 11228480, 11105072, 11196658, 11340185, 11282860, 11066229, 10945155, 10989101, 11001949, 10852062, 10662627, 10589883, 10588311, 10529444, 10433356, 10422263, 10504297, 10562566, 10545517, 10521201, 10523810, 10484116, 10367020, 10264179, 10268772, 10335575, 10348690, 10277147, 10187551, 10137957, 10127010, 10125138, 10104500, 10060565, 10035649, 10075432, 10131262, 10084504, 9929885, 9839840, 9935219, 10072197, 10015306]
10812A0015306k31301j42365Q1265J40493J1970o0220K1280P2181l8752j60688
10802I709169j02600O6134J30336M6346l5090k5273l36k6421l9681K0254P2287
10791I815125P451j18624j39043j7558Q9107N3277m7599n8138K9885Q7435M5828
10780I747146k8357n4579l4398o117J4289J9698N993J556L9946Q8765P5803J806
10768I871551n0203l8193r518o21J7532N4439N7720R313k8299j9432j2338k6657
10756I825294N510J00531J39646L9750r1766j04177j8709M3852O4480Q9140O8374
10745A0161925o1566j77449p9778J77479K93442J26511j04386j29021L0412J54593
10735A0392162J36828N1009r638k1263P541N1686O3324K4139j4600J340N1877
$$ y = [10015306, 9784005, 9641640, 9722905, 9863398, 9875368, 9815148, 9836428, 9908609, 9869857, 9709169, 9606569, 9672703, 9803039, 9849385, 9814295, 9789022, 9788686, 9762265, 9722584, 9742838, 9815125, 9822576, 9703952, 9564909, 9547351, 9636458, 9689735, 9642136, 9583998, 9613883, 9701318, 9747146, 9718789, 9664210, 9629812, 9623695, 9637984, 9657682, 9663675, 9665231, 9705177, 9793942, 9869745, 9871551, 9821348, 9783155, 9773637, 9773016, 9790548, 9844987, 9902707, 9912020, 9883721, 9864289, 9851951, 9825294, 9830804, 9931335, 10070981, 10110731, 10018965, 9914788, 9896079, 9939931, 10004411, 10093551, 10161925, 10100359, 9922910, 9843132, 10020611, 10314053, 10440564, 10336178, 10207157, 10237569, 10392162, 10528990, 10579999, 10570361, 10549098, 10556639, 10608325, 10671649, 10695788, 10681188, 10682528, 10734405]
10724A0734405Q1139P8053O8169N7213L1704p044m4175o4234m8390J723L1123
10713A0919686j4810r0440q5408R977O8896J2675o3195l2812O6100Q7887j2100
10702A0866456j26383j41707n7047M3281P7400L0181l2995l2556K2299L8379k4871
10691A0662437q6773o5821l114Q667l5255o9260p1816p0182o0750j9150K7503
10680A0216486L0140Q334J9747M5817Q947q4484j22516n0443L1348j591j21361
10669I980424j75918q2730O3848J00502j5783j61284j93412j07816j4610P840
10659I401061k7143p8849j16437r4830K695Q2801K4239j22422j58864l0973O1241
10648H942519l8719j92724j82237m1737K9282r218l5438k8021p6342j45198r3035
$$ y = [10734405, 10815544, 10893597, 10961766, 11018979, 11050683, 11043639, 10999464, 10935230, 10886840, 10888563, 10919686, 10904876, 10814436, 10729028, 10739005, 10807901, 10820576, 10757381, 10724569, 10790669, 10878556, 10866456, 10740073, 10598366, 10541319, 10584600, 10662000, 10692181, 10659186, 10626630, 10648929, 10687308, 10662437, 10575664, 10509843, 10506729, 10515396, 10480141, 10410881, 10339065, 10268883, 10208133, 10188983, 10216486, 10246626, 10254960, 10274707, 10320524, 10329471, 10244987, 10122471, 10072028, 10103376, 10101785, 9980424, 9804506, 9721776, 9785624, 9886126, 9870343, 9709059, 9515647, 9407831, 9393221, 9401061, 9373918, 9295069, 9178632, 9083802, 9086497, 9169298, 9193537, 9071115, 8912251, 8881278, 8942519, 8903800, 8711076, 8528839, 8487102, 8516384, 8507166, 8471728, 8443707, 8367365, 8222167, 8129132]
10637H129132M5119N2572j18888k38187j42347K5665N9098k6700r7519j18547
10627G569398j13487n4803M6269P0293l7259j46887j42539j00561j16995j11948
10617F861481L18R6098L0874q2044m4838P0810L8101j13543j24864M9913J51307
10606F933613L5558j13963j13372m6701n3086p6564j3068P0239N0897m0632r0984
10595F541937p6848l6145K0754N2891k3551j62178j58411M6068J97461P5752j47071
10584F330659j53416L2511J07923j4592j07299m1360K6662k1679n2495N1843J51470
10573F310227P4842r1237j42577o2572J0815K8361M6535O5727L8027j475J6677
10562F293350M4167j7715j15898r4183M4064J10019J7520q0872l7519O4911O1604
$$ y = [8129132, 8174251, 8226823, 8107935, 7869748, 7727401, 7753066, 7812164, 7785464, 7687945, 7569398, 7455911, 7401108, 7447377, 7517670, 7480411, 7333524, 7190985, 7090424, 6973429, 6861481, 6861799, 6957897, 6988771, 6906727, 6861889, 6932699, 6970800, 6857257, 6732393, 6782306, 6933613, 6969171, 6855208, 6741836, 6695135, 6642049, 6565485, 6552417, 6622656, 6673553, 6632921, 6541937, 6465089, 6428944, 6449698, 6502589, 6479038, 6316860, 6158449, 6204517, 6401978, 6477730, 6330659, 6177243, 6209754, 6317677, 6303085, 6195786, 6154426, 6181088, 6159409, 6106914, 6158757, 6310227, 6385069, 6293832, 6151255, 6088683, 6099498, 6127859, 6174394, 6240121, 6278148, 6276673, 6293350, 6337517, 6319802, 6203904, 6109721, 6153785, 6263804, 6281324, 6200452, 6162933, 6227844, 6289448]
10551F289448l3105o6456P886P8730O5529K5741L9478Q3954Q1629K0072l6001
10540F556905l4638P168M0835M8227M7420N2563N8584O7913R5810J28949J18016
10529G187752N1363j675J9224O4669M7383p018Q835R7530J32612O5462K0369R4446
10517G780952J86813J56289N2647L3643J13971J67886J50655J37868J46537J04755
10507I032016L1245N5571J91025K68833J99596J28459J93787K89361K46911J31672
10497A0768476J38628K64996L19938K47124K04932K82518L51849K98563K21087
10488A3098111K63758L79638M13018L42601K89947L14925L41272K98294K28056
10479A5969620K12006K59380L12162L25926L10820L03905L20866L38858L26939
$$ y = [6289448, 6256343, 6189887, 6197773, 6276503, 6342032, 6367773, 6407251, 6491205, 6572834, 6592906, 6556905, 6522267, 6529435, 6570270, 6618497, 6665917, 6718480, 6777064, 6844977, 6940787, 7069736, 7187752, 7239115, 7237440, 7256664, 7321333, 7368716, 7361698, 7370533, 7468063, 7600675, 7666137, 7686506, 7780952, 7967765, 8124054, 8176701, 8210344, 8324315, 8492201, 8642856, 8780724, 8927261, 9032016, 9063261, 9118832, 9309857, 9578690, 9778286, 9906745, 10100532, 10389893, 10636804, 10768476, 10907104, 11172100, 11492038, 11739162, 11944094, 12226612, 12578461, 12877024, 13098111, 13361869, 13741507, 14154525, 14497126, 14787073, 15101998, 15443270, 15741564, 15969620, 16181626, 16441006, 16753168, 17079094, 17389914, 17693819, 18014685, 18353543, 18680482]
10470A8680482K86808K47431K22406K00472J81854J87099K13813K21957J88095
10461B0630417J41207J14098R0777M1672j2616k0075K5063O1906K8085p0862j57330
10450B0872342j45853l4427O1263O480j90099l54046l35893j94531j24384k11989
10440A9348863l44186l78056l23459k94535l26619l33297k58013j85638k34094
10431A6670966l70815m31792l44096k37847k64142l71212l82154k72509k18948
10422A3777451l24461m39975l76356j95371j30800k53601l81361l49239k24739
10413A1101548j74972k27063k69113k34781j75230j54472j65097j71027j68669
10404I361124j67921j52973j06275n6092n9234j29705k10455k30222j75084r2879
$$ y = [18680482, 18967290, 19214721, 19437127, 19637599, 19819453, 20006552, 20220365, 20442322, 20630417, 20771624, 20885722, 20976499, 21018171, 21005555, 20985480, 21010543, 21072449, 21100534, 21029672, 20872342, 20726489, 20692062, 20753325, 20759805, 20569706, 20215660, 19879767, 19685236, 19560852, 19348863, 19004677, 18626621, 18303162, 18008627, 17682008, 17348711, 17090698, 16905060, 16670966, 16300151, 15868359, 15524263, 15286416, 15022274, 14651062, 14268908, 13996399, 13777451, 13452990, 13013015, 12636659, 12441288, 12310488, 12056887, 11675526, 11326287, 11101548, 10926576, 10699513, 10430400, 10195619, 10020389, 9865917, 9700820, 9529793, 9361124, 9193203, 9040230, 8933955, 8877863, 8818629, 8688924, 8478469, 8248247, 8073163, 7980284]
10394G980284m0451m0685p6635j06142r4078n5675n3250j13474j64809j16006
10384G119079N545O8797J3061p3109q9714n8557m8702m7253o533L6026O985o3099
10372F862526p7821m4005o2706j34433j24336J8560J45800J08670l5354j24718
10362F532183j15699q0545n0631q28M0692P630p4141r5359k8781K2726j3198o4641
10350F079408k9497O2052Q0640k6368j58365j76246o1887O4081Q5139K1757j4904
10339E925810J2826K4743l3082q8323o0363m166k5516r7821r5229L013P8052N7190
10327E697134R08k9266n5218q2413n2939K6128M2280l8176q1371l550O3404r971
10315E476950r9927k1673J23191P3284j42995j99605J6055J93555O5204j83605
$$ y = [7980284, 7939833, 7899148, 7822513, 7716371, 7622293, 7566618, 7513368, 7399894, 7235085, 7119079, 7124624, 7193421, 7206482, 7133373, 7043659, 6985102, 6936400, 6889147, 6882614, 6918640, 6925625, 6862526, 6784705, 6740700, 6677994, 6543561, 6419225, 6437785, 6583585, 6692255, 6656901, 6532183, 6416484, 6335939, 6285308, 6284480, 6325172, 6332802, 6258661, 6163302, 6134521, 6157247, 6144049, 6079408, 6049911, 6111963, 6192603, 6166235, 6007870, 5831624, 5769737, 5833818, 5918957, 5940714, 5925810, 5938636, 5963379, 5930297, 5841974, 5781611, 5777445, 5751929, 5654108, 5558879, 5561892, 5639944, 5697134, 5698042, 5668776, 5613558, 5531145, 5478206, 5504334, 5546614, 5508438, 5427067, 5423517, 5486921, 5476950, 5377023, 5355350, 5478541, 5551825, 5408830, 5209225, 5225280, 5418835, 5484039, 5300434]
10305E300434k10090k5191Q0434R275n6117j4902Q324n9407q8548L118O8521l2469
10293D983382j74388j38029N4056J70609J01913k6866p8966p3576p7316o8512
10283D672307o206N3002J9909p8656j19557n6618J5389M398m8286m8678o581j0302
10271D390121o1756o1087J1020K7604p7662j57629n5597J19764J21568n5723j49137
10260D051486k9226R7247J4994j61563j71487m093J08859M6424o8198r2961m2925
10249C748557Q45J4827R586j3134l3380k1719J012j2357m7250m9915l3339n3985
10237C509748q3243l0718Q2683J13219O879j05635r9078k5893j0813o3715r2275
10226C201159m2850M8712J07327P4084m1280j39146j24589l2643K5405L4159O5787
$$ y = [5300434, 5090344, 5065153, 5145587, 5154862, 5098745, 5083843, 5092167, 5032760, 4944212, 4947330, 5015851, 4983382, 4808994, 4670965, 4725021, 4895630, 4997543, 4970677, 4891711, 4818135, 4740819, 4672307, 4666101, 4719103, 4739012, 4660356, 4540799, 4484181, 4499570, 4503968, 4455682, 4407004, 4400423, 4390121, 4328365, 4267278, 4278298, 4305902, 4228240, 4070611, 4015014, 4134778, 4256346, 4200623, 4051486, 4022260, 4119507, 4134501, 3972938, 3801451, 3797358, 3906217, 3952641, 3884443, 3791482, 3748557, 3749402, 3764229, 3773815, 3760681, 3727301, 3705582, 3706594, 3694237, 3646987, 3597072, 3563733, 3509748, 3426505, 3395787, 3478470, 3591689, 3598568, 3492933, 3393855, 3367962, 3357149, 3293434, 3201159, 3158309, 3207021, 3314348, 3388432, 3347152, 3208006, 3083417, 3050774, 3076179, 3110338, 3176125]
10215C176125J00278L0994j11337j44623l0686L1796o0656j19752P079J34725
10205C013943L3568j53793j18417R9994J67260j622j22597k5370R0821K1923j12351
10194B893359r7551L0996Q0296M50r1581j07071o0043o33K5952Q59l1756j0879
10182B632398L5983K7166k4797k8624J1313q97n1065j3867R6462R6999n2599j44372
10170B584100n9214K7999m1348j23913l0682J27092J19601j9664p7370k2384o02
10159B483615l7814k7172K7143K0597k3346P013O6409J2217j04246q6890N4620
10148B392146R5968j8833q3295M256P3167J06p9462l5903K4261k4889r2043m6129
10136B209350M3304M3936l009J7046O9103M0458m6652p3159j8505L3361L9121
$$ y = [3176125, 3276403, 3307397, 3196060, 3051437, 3020751, 3052547, 2991891, 2872139, 2879218, 3013943, 3047511, 2893718, 2775301, 2875295, 3042555, 3040933, 2918336, 2892966, 2983787, 3005710, 2893359, 2795808, 2826804, 2907100, 2907550, 2815969, 2708898, 2648855, 2648222, 2674174, 2675033, 2643277, 2632398, 2668381, 2695547, 2670750, 2642126, 2653439, 2652542, 2601477, 2587610, 2684072, 2781071, 2728472, 2584100, 2524886, 2552885, 2511537, 2387624, 2356942, 2484034, 2603635, 2583971, 2506601, 2484217, 2483615, 2445801, 2418629, 2445772, 2466369, 2443023, 2450036, 2516445, 2528662, 2424416, 2337526, 2392146, 2488114, 2469281, 2385986, 2390242, 2463409, 2463515, 2384053, 2348150, 2372411, 2347522, 2255479, 2209350, 2252654, 2296590, 2293581, 2310627, 2379730, 2420188, 2373536, 2300377, 2281872, 2315233, 2354354]
10125B354354K2832q6k5426l0642j3538k635J0565N5784P8230o267j20463q6165
10113B236543O6957R5449n2278j08362O2108J86122K8481j73174q0698J62948
10103B424096J56297r4032j95571j9050J34676O2023p0981q4163l7292n649O1229
10092B331583J28979M7681j37881j67566N825J00236k1914j15131M885J33721
10082B310418O3507m2119J7721Q2315n5464k04378p9385J57814J36723q3331j14295
10071B189526Q4928J53388k6005j39066j5464Q9850j3021j09168N654J37140L8739
10060B396501j41617j09476Q3170J44374J9321p1874j8525N5580M6526l02l6207
10049B367471p8800j06923n8234L8949P7075L3428q584j2520k9266o9692p1744
$$ y = [2354354, 2377186, 2377100, 2351674, 2321032, 2307494, 2304859, 2315424, 2371208, 2449438, 2443171, 2322708, 2236543, 2303500, 2398949, 2346671, 2238309, 2300417, 2486539, 2515020, 2341846, 2261148, 2424096, 2580393, 2486361, 2290790, 2271740, 2406416, 2468439, 2397458, 2313295, 2276003, 2270354, 2331583, 2460562, 2508243, 2370362, 2202796, 2208621, 2308857, 2286943, 2171812, 2176697, 2310418, 2373925, 2331806, 2349527, 2431842, 2376378, 2172000, 2092615, 2250429, 2387152, 2303821, 2189526, 2274454, 2427842, 2401837, 2262771, 2247307, 2337157, 2324136, 2214968, 2220622, 2357762, 2396501, 2254884, 2145408, 2228578, 2372952, 2392273, 2320399, 2301874, 2357454, 2403980, 2403678, 2367471, 2288671, 2181748, 2123514, 2162463, 2239538, 2272966, 2264382, 2251862, 2222596, 2152904, 2081160]
10038B081160k3385O127o718J752N3634O9923j071q6890q9560j6629M5023M0481
10026B073847j1517n1705k9957M0603P2735J902j05782j18840k4289M9187K5360
10015A921544j0677K9225P1849n15j29590j32864J8846J26838L7538j28721j43193
10004A660280L158R3514J2181q7643l0521J02510J00176m5814j29213n1465M6003
9993A673166L4650r179J4954L3280m5092j12225k1917J25383J06697n4965j12156
9982A632596N545Q7002M941q6291m5172J8392k1900n9423L4322J34603O0714r2311
9970A673018j04976j5090l3411j31719o6540J60234K26238m640k28226j51526
9960A323362P3832J24650M724l2076O5543R5538j6382q8265m159Q1199o580j72209
$$ y = [2081160, 2057775, 2063902, 2057184, 2058936, 2112570, 2182493, 2181422, 2094532, 2004972, 1988343, 2033366, 2073847, 2062330, 2010625, 1980668, 2021271, 2094006, 2095908, 1990126, 1871286, 1846997, 1896184, 1921544, 1910867, 1940092, 2011941, 2011426, 1881836, 1748972, 1767818, 1894656, 1932194, 1803473, 1660280, 1663438, 1756952, 1769133, 1681490, 1650969, 1753479, 1853655, 1807841, 1678628, 1627163, 1673166, 1707816, 1698637, 1713591, 1746871, 1701779, 1589554, 1567637, 1693020, 1799717, 1744752, 1632596, 1638141, 1725143, 1730084, 1643793, 1598621, 1617013, 1595113, 1535690, 1570012, 1704615, 1765329, 1673018, 1568042, 1552952, 1519541, 1387822, 1321282, 1481516, 1707754, 1703114, 1474888, 1323362, 1397194, 1521844, 1526568, 1494492, 1560035, 1655573, 1639191, 1550926, 1546767, 1627966, 1621386, 1449177]
9948A449177j75514K9189K25111K04656J2100j27873q5962K8890L3102p2587j07514
9937A412775J1643J27667P1275p4233r1976L8735J16063K8483q7928p3071K8472
9926A507905O9543K1591l0514m7588o2747p4913l2175O5539J32143R6698p016
9915A638466q0181o7684j0137Q729l8996r1320p5500l588M7019L6383l274k8854
9903A331063k3622K2347R4994J18017K5732j07917j24979j1095N7887k3847j14643
9892A243937l7225J36865J84465N5831p7895q9000l0314J2088L9396O2329M2970
9881A543447j8821n2481l0166j0829k1406p289M2681M7150j7118m6050J3712N0992
9869A493822k0419r0250l2949N7083J7666q0173l1651J33165J55261l7167j88141
$$ y = [1449177, 1273663, 1302852, 1527963, 1732619, 1744719, 1616846, 1530884, 1559774, 1592876, 1520289, 1412775, 1424418, 1552085, 1623360, 1549127, 1457151, 1495886, 1611949, 1640432, 1552504, 1479433, 1507905, 1577448, 1599039, 1568525, 1520937, 1458190, 1383277, 1351102, 1416641, 1548784, 1645482, 1638466, 1558285, 1490601, 1480464, 1489193, 1450197, 1358877, 1283377, 1279789, 1326808, 1363191, 1359917, 1331063, 1307441, 1329788, 1424782, 1542799, 1568531, 1460614, 1335635, 1324540, 1382427, 1358580, 1243937, 1206712, 1343577, 1528042, 1583873, 1505978, 1416978, 1386664, 1398752, 1438148, 1500477, 1543447, 1524626, 1472145, 1441979, 1431150, 1409744, 1402455, 1445136, 1492286, 1475168, 1429118, 1442830, 1493822, 1473403, 1383153, 1350204, 1407287, 1424953, 1344780, 1313129, 1446294, 1601555, 1564388, 1376247]
9858A376247j00338P7540J11962L0565K081K7600q960q0741n9276K8426L0111
9847A435217m9476m0752Q2721J32047K0224p7905j0918J04929R0017j6831o7491
9836A601782n9889p8340q4363O995J11709P6488l9477k9709J10024J53352J1992
9825A780564j20247q5562J3930M0346M4399R5704R1961m7092j57423m9743J58872
9814A765709J89273J3438j29877j06073k2455J2330K7032M5035J9874k9029j1289
9803A773968M9143K0593q6387r0347N4290J44371M5797q9831q3858n514K392r735
9791A724882O5851J40250O7277o7758o8402K9911J7700j13306j43235j681J07616
9780A759105M1155p4488q2685l0494k4310l6437q833M486m1668n5286L0744Q8528
$$ y = [1376247, 1275909, 1353449, 1465411, 1495976, 1498057, 1525657, 1516697, 1435956, 1376680, 1405106, 1435217, 1385741, 1344989, 1427710, 1559757, 1579981, 1502076, 1491158, 1596087, 1686104, 1669273, 1601782, 1541893, 1463553, 1379190, 1386185, 1497894, 1574382, 1534905, 1505196, 1615220, 1768572, 1780564, 1660317, 1574755, 1588685, 1629031, 1673430, 1769134, 1861095, 1814003, 1656580, 1606837, 1765709, 1954982, 1968420, 1838543, 1732470, 1710015, 1722345, 1749377, 1794412, 1814286, 1785257, 1773968, 1823111, 1843704, 1757317, 1666970, 1721260, 1865631, 1911428, 1821597, 1737739, 1732225, 1734617, 1724882, 1790733, 1930983, 1998260, 1930502, 1862100, 1892011, 1909711, 1796405, 1653170, 1651489, 1759105, 1800260, 1725772, 1643087, 1612593, 1588283, 1551846, 1543013, 1547499, 1505831, 1450545, 1481289, 1569817]
9768A569817j8287j69424j31813P2165J74697O1384o8176k6244P7503L6115j05162
9757A472575j12840N7560J66076L5917j77322k02355k9844J06412Q4094K2078
9747A422351K4020Q392q7332j24772J6433J73159J00624j26360j88125q71J58297
9736A375816Q3024p3538q6048m17J1259l7849j8392M6298K3124o9499p2181M4056
9724A225653J17401M2637q2032j10898l6090L9463L9892j2385k7987M3787J22033
9713A361474P0136r2444j63081l5877J15257Q4563n1783p5685J0577J9460o5817
9702A176780o1566O5017J10407j1420j08265l9329N0755O263o1255Q069J12557
9691A248013N6437r9551j22828K1239J34834J01072Q203m3832o3037o8023l8234
$$ y = [1569817, 1551530, 1382106, 1250293, 1322458, 1497155, 1558539, 1490363, 1464119, 1541622, 1577737, 1472575, 1359735, 1417295, 1583371, 1619288, 1441966, 1239611, 1209767, 1316179, 1400273, 1422351, 1446371, 1454763, 1367431, 1242659, 1259092, 1432251, 1532875, 1406515, 1218390, 1217519, 1375816, 1458840, 1385302, 1299254, 1298837, 1310096, 1272247, 1253855, 1300153, 1323277, 1253778, 1181597, 1225653, 1343054, 1385691, 1303659, 1192761, 1156671, 1196134, 1236026, 1223641, 1195654, 1239441, 1361474, 1431610, 1339166, 1176085, 1140208, 1255465, 1340028, 1288245, 1212560, 1223137, 1242597, 1176780, 1115214, 1180231, 1290638, 1279218, 1170953, 1131624, 1182379, 1188642, 1127387, 1135456, 1248013, 1304450, 1204899, 1082071, 1103310, 1238144, 1339216, 1347419, 1303587, 1240550, 1172527, 1134293]
9680A134293Q912K4226J9161L1876K3911m7165q9516N537J29939O5820j51595
9669A155399k22814k1642J91758J44161o3172j39800l8446L0133m5258j29599
9659H60720p4481P3814J63279J30523M2060q484Q57J3828k0785o7448m4321M5846
9647A115408R2595K6564p6962j05418n6493j917L4754O6962O2501r312p5354l3670
9635A039658P1257Q3877k6317j02294l3386P8009Q1085Q77l3068r574k7772q7715
9623A034637o1303Q2860J77519P9714j09376j72662o4429O3189R3241O3423M4312
9612A231125L6461L1317M9521N8684k3220j62268j77914K169J79147J36751m1369
9601A320404j04995j5934M1810P26q859N3855N0664m7173n7204Q2090J47573M003
$$ y = [1134293, 1143205, 1167431, 1186592, 1218468, 1242379, 1195214, 1105698, 1111235, 1241174, 1306994, 1155399, 932585, 910943, 1102701, 1246862, 1183690, 1043890, 1005444, 1035577, 990319, 860720, 786239, 860053, 1023332, 1153855, 1195915, 1187431, 1188288, 1202116, 1181331, 1113883, 1069562, 1115408, 1208003, 1234567, 1157605, 1052187, 995694, 993777, 1028531, 1095493, 1157994, 1148682, 1073328, 1039658, 1110915, 1194792, 1168475, 1066181, 1032795, 1110804, 1191889, 1192766, 1159698, 1150124, 1122352, 1034637, 973334, 1056194, 1233713, 1313427, 1204051, 1031389, 966960, 1030149, 1123390, 1186813, 1231125, 1267586, 1298903, 1348424, 1407108, 1383888, 1221620, 1043706, 1045875, 1225022, 1361773, 1320404, 1215409, 1199475, 1241285, 1242011, 1233152, 1287007, 1337671, 1290498, 1233294, 1315384, 1462957, 1466960]
9589A466960j19242j29J57955L9438k17997k04924P5469J79769n5802k41029p0620
9578A009848J87003J48415p1985r9728O6563R4204r6102k07280o8546J05997Q4884
9567A153273m3145o8560J1604N2962J5366k2253k2029j3566l865K0159K9592p947
9555A101591n4143n0664j6417q491j3457K3681P4300M2226p3073j37122o2429
9544H26002N6063P2690R56j6346O9062J34132O7893o4647j15008m7598L9331N7638
9532A080168J3078m1606o3177l2654K0493K1657m9567q8711M379J44534J44226
$$ y = [1466960, 1347718, 1347589, 1505544, 1544982, 1326985, 1122061, 1197530, 1377299, 1321497, 1080468, 1009848, 1196851, 1345266, 1273281, 1173553, 1240116, 1334320, 1238218, 1030938, 962392, 1068389, 1153273, 1110128, 1041568, 1053172, 1106134, 1121500, 1099247, 1077218, 1063652, 1059787, 1079946, 1109538, 1101591, 1047448, 996784, 980367, 971876, 958419, 982100, 1056400, 1098626, 1025553, 888431, 826002, 882065, 954755, 955711, 939365, 1008427, 1142559, 1210452, 1145805, 1030797, 983199, 1022530, 1080168, 1093246, 1051640, 988463, 955809, 976302, 997959, 948392, 859681, 864060, 1008594, 1152820]
$$ [...]
##END NTUPLES=NMR SPECTRUM
##END=
