##TITLE=1H ikalashn
CA-9295
21.10.2024
##JCAMPDX= 6.0         $$ Bruker NMR JCAMP-DX V2.0
##DATA TYPE= NMR SPECTRUM
##DATA CLASS= NTUPLES
##ORIGIN= UXNMR, Bruker Analytische Messtechnik GmbH
##OWNER= root
$$ TOPSPIN		Version 1.3
$$ 2024-10-21 15:41:58.921 +0400  Irina@DPX200
$$ Compression mode = diff/dup
##.OBSERVE FREQUENCY= 200.13100065
##.OBSERVE NUCLEUS= ^1H
##.ACQUISITION MODE= SIMULTANEOUS
##.ACQUISITION SCHEME= undefined
##.AVERAGES= 32
##.DIGITISER RES= 18
##SPECTROMETER/DATA SYSTEM= spect
##.PULSE SEQUENCE= zg
##.SOLVENT NAME= DMSO
##.SHIFT REFERENCE= INTERNAL, DMSO, 1, 15.99637
##AUDIT TRAIL= $$ (NUMBER, WHEN, WHO, WHERE, WHAT)
$$ ##TITLE= Audit trail, TOPSPIN		Version 1.3
$$ ##JCAMPDX= 5.01
$$ ##ORIGIN= Bruker BioSpin GmbH
$$ ##OWNER= Irina
$$ $$ F:/spectra/data/iren/nmr/1H/4/pdata/1/auditp.txt
$$ ##AUDIT TRAIL=  $$ (NUMBER, WHEN, WHO, WHERE, VERSION, WHAT)
(   1,<2024-10-21 15:41:39.937 +0400>,<Irina>,<DPX200>,<TOPSPIN 1.3>,
      <created by zg
	started at 2024-10-21 15:39:32.015 +0400,
	POWCHK disabled, PULCHK disabled
       configuration hash MD5:
       BE 6D 3F 07 2A EA 11 49 91 17 2B D3 AF B3 58 0D
       data hash MD5: 16K
       EE 20 2C BB 85 D1 4E 4B D4 EE 10 01 73 E1 4C 3C>)
(   2,<2024-10-21 15:41:43.734 +0400>,<Irina>,<DPX200>,<TOPSPIN 1.3>,
      <Start of raw data processing
       efp BC_mod = 2 LB = 0.02 FT_mod = 6 PKNL = 1 PHC0 = -46.86282 PHC1 = 13.15948 SI = 32K 
       data hash MD5: 32K
       38 CB B6 EA 16 6A 0E C9 B4 79 AA 09 3C CF 57 3E>)
(   3,<2024-10-21 15:41:46.218 +0400>,<Irina>,<DPX200>,<TOPSPIN 1.3>,
      <apk 
       data hash MD5: 32K
       E7 95 74 25 CD 19 94 FF B3 5D 5E DB DA 00 34 87>)
(   4,<2024-10-21 15:41:49.421 +0400>,<Irina>,<DPX200>,<TOPSPIN 1.3>,
      <abs n ABSG = 5 
       data hash MD5: 32K
       12 23 B9 F2 15 04 03 68 86 3E 0A 99 C9 59 F1 CA>)
$$ ##END=
$$ 
$$ $$ hash MD5
$$ $$ F7 F6 DD D3 DE 31 98 DC 5A F1 6B A5 3C 57 19 8F
##$RELAX= 
##$RELAX= 
##$RELAX= 
##$RELAX= 
##$RELAX= 
##$RELAX= 
##$RELAX= 
##$RELAX= 
##$RELAX= 
$$ Bruker specific parameters
$$ --------------------------
##$DU= <F:/spectra>
##$EXPNO= 4
##$NAME= <1H>
##$PROCNO= 1
##$TYPE= <nmr>
##$USER= <iren>
##$AMP= (0..31)
100 100 100 100 100 100 100 100 100 100 100 100 100 100 100 100 100 100 
100 100 100 100 100 100 100 100 100 100 100 100 100 100 
##$ANAVPT= -1
##$AQSEQ= 0
##$AQ_mod= 1
##$AUNM= <au_zg>
##$AUTOPOS= <>
##$BF1= 200.13
##$BF2= 200.13
##$BF3= 200.13
##$BF4= 200.13
##$BF5= 200.13
##$BF6= 200.13
##$BF7= 200.13
##$BF8= 200.13
##$BYTORDA= 1
##$CFDGTYP= 0
##$CFRGTYP= 5
##$CHEMSTR= <none>
##$CNST= (0..63)
1 1 145 1 1 1 1 1 1 1 1 1 1 1 1 1 1 1 1 1 1 1 1 1 1 1 1 1 1 1 1 1 1 1 
1 1 1 1 1 1 1 1 1 1 1 1 1 1 1 1 1 1 1 1 1 1 1 1 1 1 1 1 1 1 
##$CPDPRG= <>
##$CPDPRG1= <>
##$CPDPRG2= <>
##$CPDPRG3= <>
##$CPDPRG4= <mlev>
##$CPDPRG5= <mlev>
##$CPDPRG6= <mlev>
##$CPDPRG7= <mlev>
##$CPDPRG8= <mlev>
##$CPDPRGB= <>
##$CPDPRGT= <>
##$D= (0..63)
0 2 0 0 0 0 0 0 0 0.06 0 0.03 0 0 0 0 0.0002 0 0 0 0 0 0 0 0 0 0 0 0 0 
$$ [...]
##$SW_h= 4401.40845070422
##$TD= 16384
##$TD0= 1
##$TE= 300
##$TE2= 300
##$TE3= 300
##$TEG= 300
##$TL= (0..7)
0 120 120 120 120 120 120 120 
##$TP= (0..7)
150 150 150 150 150 150 150 150 
##$TP07= 0
##$TPNAME0= <>
##$TPNAME1= <>
##$TPNAME2= <>
##$TPNAME3= <>
##$TPNAME4= <>
##$TPNAME5= <>
##$TPNAME6= <>
##$TPNAME7= <>
##$TPOAL= (0..7)
0.5 0.5 0.5 0.5 0.5 0.5 0.5 0.5 
##$TPOFFS= (0..7)
0 0 0 0 0 0 0 0 
##$TUNHIN= 0
##$TUNHOUT= 0
##$TUNXOUT= 0
##$USERA1= <user>
##$USERA2= <user>
##$USERA3= <user>
##$USERA4= <user>
##$USERA5= <user>
##$V9= 5
##$VALIST= <valist>
##$VCLIST= <CCCCCCCCCCCCCCC>
##$VD= 0
##$VDLIST= <DDDDDDDDDDDDDDD>
##$VPLIST= <PPPPPPPPPPPPPPP>
##$VTLIST= <TTTTTTTTTTTTTTT>
##$WBST= 1024
##$WBSW= 25
##$XGAIN= (0..3)
0 0 0 0 
##$XL= 0
##$YL= 0
##$YMAX_a= 440207
##$YMIN_a= -429454
##$ZGOPTNS= <>
##$ZL1= 120
##$ZL2= 120
##$ZL3= 120
##$ZL4= 120
##$ABSF1= 15.99637
##$ABSF2= -5.996376
##$ABSG= 5
##$ABSL= 3
##$ALPHA= 0
##$AQORDER= 0
##$ASSFAC= 0
##$ASSFACI= 0
##$ASSFACX= 0
##$ASSWID= 0
##$AUNMP= <proc_1d>
##$AXLEFT= 0
##$AXRIGHT= 0
##$AXTYPE= 0
##$AXUNIT= <>
##$AZFE= 0.1
##$AZFW= 0.1
##$BCFW= 0
##$BC_mod= 2
##$BYTORDP= 0
##$COROFFS= 0
##$CY= 7568.61572265625
##$DATMOD= 1
##$DC= 0
##$DFILT= <>
##$DTYPP= 0
##$F1P= 17.9538593292236
##$F2P= -4.03888763876832
##$FCOR= 0.5
##$FTSIZE= 32768
##$FT_mod= 6
##$GAMMA= 0
##$GB= 0
##$INTBC= 0
##$INTSCL= 1.936888e-010
##$ISEN= 128
##$LB= 0.02
##$LEV0= 0
##$LPBIN= 0
##$MAXI= 945.577
##$MC2= 0
##$MEAN= 0
##$ME_mod= 0
##$MI= -402.1523
##$NCOEF= 0
##$NC_proc= -5
##$NLEV= 6
##$NOISF1= 8.587773
##$NOISF2= 6.764455
##$NSP= 0
##$NTH_PI= 0
##$NZP= 0
##$OFFSET= 15.99637
##$PC= 1
##$PHC0= -46.43864
##$PHC1= 9.138254
##$PH_mod= 1
##$PKNL= yes
##$PPARMOD= 0
##$PPDIAG= 0
##$PPIPTYP= 0
##$PPMPNUM= 100
##$PPRESOL= 1
##$PSCAL= 0
##$PSIGN= 0
##$REVERSE= no
##$SF= 200.13
##$SI= 32768
##$SIGF1= 16.12182
##$SIGF2= -4.496377
##$SINO= 3.521527
##$SIOLD= 32768
##$SREGLST= <1H.CDCl3>
##$SSB= 0
##$STSI= 32768
##$STSR= 0
##$SW_p= 4401.40845070422
##$SYMM= 0
##$S_DEV= 0
##$TDeff= 16384
##$TDoff= 0
##$TI= <>
##$TILT= no
##$TM1= 0
##$TM2= 0
##$TOPLEV= 0
##$USERP1= <user>
##$USERP2= <user>
##$USERP3= <user>
##$USERP4= <user>
##$USERP5= <user>
##$WDW= 1
##$XDIM= 32768
##$YMAX_p= 497390358
##$YMIN_p= -319815
$$ End of Bruker specific parameters
$$ ---------------------------------
##NTUPLES= NMR SPECTRUM
##VAR_NAME=  FREQUENCY,     SPECTRUM/REAL,   SPECTRUM/IMAG
##SYMBOL=    X,             R,               I
##VAR_TYPE=  INDEPENDENT,   DEPENDENT,       DEPENDENT
##VAR_FORM=  AFFN,          ASDF,            ASDF
##VAR_DIM=   32768,         32768,           32768
##UNITS=     HZ,            ARBITRARY UNITS, ARBITRARY UNITS
##FACTOR=    0.134324425510551, 1,           1
##FIRST=     4401.40845070422, 38724,        17787
##LAST=      0,             -33078,          -71683
##MIN=       0,             -319815,         0
##MAX=       4401.40845070422, 497390358,    0
$$ Real data points
##PAGE= N=1
##DATA TABLE= (X++(R..R)), XYDATA
$$ [...]
$$ plain form
17263 63136 69968 36545 12118 16501 32886 48759 60948 59129 42369 39211 75990 131696
17251 131696 155238 125371 68980 24221 9953 27071 62771 92200 98772 94393 101142 117966
17239 117966 128729 135270 149184 153660 115748 47509 13298 51557 120800 151941 130922 100644
17227 100644 99547 127777 160968 170286 140483 93638 81053 121841 163791 143463 77169 45609
17215 45609 82273 126363 111215 58049 40229 78149 120173 127095 126007 156945 201481 204726
17203 204726 156509 108927 106331 133663 151880 153077 152258 149231 135249 121925 124772 129183 114629
17190 114629 102050 125531 162601 157062 117863 120429 183788 225406 186546 127817 130805 169223
17178 169223 166079 130673 135643 182885 200230 168827 149902 171691 188863 180590 193798 247654
$$ packed form
17263F3136O832l3423k4427M383J6385J5873J2189j819j6760l158L6779N5706
17251A31696K3542k9867n6391m4759j4268J7118L5700K9429O572m379O749J6824
17239A17966J0763O541J3914M476l7912o8239l4211L8259O9243L1141k1019l0278
17227A00644j097K8230L3191R318k9803m6845j2585M0788M1950k0328o6294l1560
17215D5609L6664M4090j5148n3166j7820L7920M2024O922j088L0938M4536L245
17203B04726m8217m7582k596K7332J8217J197q19l027j3982j3324K847M411j4554
17190A14629j2579K3481L7070n539l9199K566O3359M1618l8860n8729K988L8418
17178A69223l144l5406M970M7242J7345l1403j8925K1789J7172q273J3208N3856
$$ plain form
17166 247654 280549 245434 188006 175227 205398 240925 273337 301773 300660 265688 243809 262902
17154 262902 281043 261407 242461 267367 298624 282682 251396 268453 313416 319619 300598 327393
17142 327393 387753 385400 298032 226081 243853 296044 295918 250145 224762 243277 278690 307780
17130 307780 321523 311122 286602 284271 320547 362230 371130 352605 335907 336513 360742 411532
17118 411532 462415 464902 415602 377604 395496 427867 414347 375248 379242 429126 452691 415650
17106 415650 377766 405372 475297 510407 486388 454086 456821 473217 466312 453131 478504 532989
17094 532989 554780 525270 504760 540183 590673 595564 570828 572195 596718 597355 573292 563973
17082 563973 566924 549003 531715 567974 631901 638902 589780 577712 622735 630171 569664 557797
$$ packed form
17166B47654L2895l5115n7428j2779L0171L5527L2412K8436j113l4972k1879J9093
17154B62902J8141j9636j8946K4906L1257j5942l1286J7057M4963O203j9021K6795
17142C27393O0360k353q7368p1951J7772N2191j26m5773k5383J8515L5413K9090
17130C07780J3743j0401k4520k331L6276M1683Q900j8525j6698O06K4229N0790
17118D11532N0883K487m9300l7998J7892L2371j3520l9099L994M9884K3565l7041
17106D15650l7884K7606O9925L5110k4019l2302K735J6396o905j3181K5373N4485
17094E32989K1791k9510k0510L5423N0490M891k4736J367K4523O37k4063r319
17082E63973K951j7921j7288L6259O3927P001m9122j2068M5023P436o0507j1867
$$ plain form
17070 557797 668112 782207 756113 641133 599196 664170 731125 741704 737335 744600 738496
17059 738496 719792 718068 718438 684273 644137 657467 707313 728248 722364 739451 765200 750297
17047 750297 727473 762601 809048 768216 686262 709717 830558 873393 782352 715128 772790
17036 772790 843991 832307 833917 932539 1003585 917942 789270 801016 904880 921795 854170
17025 854170 854507 941571 1000975 1038968 1165515 1310660 1241106 941474 719632 794640 994099
17014 994099 1030899 908259 849201 937633 1042475 1055999 1021540 1015816 1042211 1067974 1075491
17003 1075491 1057858 1028086 1033284 1099960 1173197 1172437 1102444 1049221 1068050 1131551 1188445 1219014
16991 1219014 1225780 1218029 1218735 1249244 1294546 1313465 1294562 1277565 1306326 1374901 1431642 1434082
$$ packed form
17070E57797J10315J14095k6094j14980m1937O4974O6955J0579m369P265o104
17059G38496j8704j724L70l4165m0136J3330M9846K0935n884J7087K5749j4903
17047G50297k2824L5128M6447m0832q1954K3455J20841M2835r1041o7224N7662
17036G72790P1201j1684J610R8622P1046q5643j28672J1746J03864J6915o7625
17025H54170L37Q7064N9404L7993J26547J45145o9554k99632k21842P5008J99459
17014I94099L6800j22640n9058Q8432J04842J3524l4459n724K6395K5763P517
17003A075491j7633k9772N198O6676P3237p60o9993n3223J8829O3501N6894L0569
16991A219014O766p751P06L0509M5302J8919j8903j6997K8761O8575N6741K440
$$ plain form
16979 1434082 1396495 1377496 1413134 1473116 1504133 1504702 1519081 1559439 1584672 1572424 1562411 1596533
16967 1596533 1654394 1685183 1677808 1666905 1686978 1742290 1803429 1823081 1784278 1739529 1759786
16956 1759786 1836542 1891535 1898822 1922363 1995306 2044660 2004567 1936432 1949362 2047359 2145098
16945 2145098 2201420 2244301 2286173 2311519 2340685 2410921 2490094 2501171 2447553 2427443 2498504
16934 2498504 2606172 2676911 2711625 2750778 2808970 2881394 2962126 3023582 3030937 3009688 3044337
16923 3044337 3170390 3316063 3393035 3402535 3410236 3456260 3534671 3628454 3719605 3788594 3840725
16912 3840725 3909905 4007546 4098958 4161361 4228156 4335655 4460616 4558027 4633473 4728455 4854163
16901 4854163 4988046 5120186 5256048 5385584 5495028 5599692 5722306 5850191 5959656
$$ packed form
16979A434082l7587j8999L5638N9982L1017N69J4379M0358K5233j2248j0013L4122
16967A596533N7861L0789p375j0903K0073N5312O1139J9652l8803m4749K0257
16956A759786P6756N4993P287K3541P2943M9354m0093o8135J2930R7997R7739
16945B145098N6322M2881M1872K5346K9166P0236P9173J1077n3618k0110P1061
16934B498504J07668P0739L4714L9153N8192P2424Q0732O1456P355k1249L4649
16923C044337J26053J45673P6972R500P701M6024P8411R3783R1151O8989N2131
16912C840725O9180R7641R1412O2403O6795J07499J24961R7411P5446R4982J25708
16901D854163J33883J32140J35862J29536J09444J04664J22614J27885J09465
$$ plain form
16892 5959656 6072257 6233720 6437901 6625101 6764724 6890536 7038928 7197935 7340494
16883 7340494 7470211 7606246 7751040 7900546 8064050 8245561 8421657 8567303 8696439
16874 8696439 8850470 9046526 9258638 9454348 9632204 9814590 10017336 10240003 10478359
16865 10478359 10729136 10982579 11228987 11479388 11760434 12074501 12384814 12664472 12943211
16856 12943211 13270020 13638614 13995568 14327239 14688786 15123464 15595004 16035481 16432384
16847 16432384 16832451 17278964 17779722 18322666 18889645 19461844 20037426 20636466 21270612
16838 21270612 21925575 22595710 23311668 24100135 24935849 25773533 26615266 27505823 28469273
16829 28469273 29492844 30572952 31736607 33010097 34397317 35892426 37485080 39152745
$$ packed form
16892E959656J12601J61463K04181J87200J39623J25812J48392J59007J42559
16883G340494J29717J36035J44794J49506J63504J81511J76096J45646J29136
16874H696439J54031J96056K12112J95710J77856J82386K02746K22667K38356
16865A0478359K50777K53443K46408K50401K81046L14067L10313K79658K78739
16856A2943211L26809L68594L56954L31671L61547M34678M71540M40477L96903
16847A6432384M00067M46513N00758N42944N66979N72199N75582N99040O34146
16838B1270612O54963O70135P15958P88467Q35714Q37684Q41733Q90557R63450
16829B8469273J023571J080108J163655J273490J387220J495109J592654J667665
$$ plain form
16821 39152745 40879082 42683278 44604005 46654257 48819013 51092936 53487565 56004624
16813 56004624 58640356 61420121 64394027 67592861 71017966 74673249 78570754 82699101
16805 82699101 87009194 91409902 95726065 99676519 102976459 105495285 107271857 108365664
16797 108365664 108748798 108349343 107117203 105011044 102005376 98182893 93770457 89020382
16789 89020382 84096843 79128215 74298017 69779990 65611007 61727027 58115679 54839174
16781 54839174 51907310 49233843 46751204 44480309 42440726 40567538 38779185 37074700
16773 37074700 35500437 34057281 32701816 31413819 30203054 29063876 27978096 26954747
16765 26954747 26015350 25144208 24304678 23502371 22773029 22099148 21405809 20671449 19981814
$$ packed form
16821C9152745J726337J804196J920727K050252K164756K273923K394629K517059
16813E6004624K635732K779765K973906L198834L425105L655283L897505M128347
16805H2699101M310093M400708M316163L950454L299940K518826J776572J093807
16797A08365664L83134l99455j232140k106159l005668l822483m412436m750075
16789H9020382m923539m968628m830198m518027m168983l883980l611348l276505
16781E4839174k931864k673467k482639k270895k039583j873188j788353j704485
16773C7074700j574263j443156j355465j287997j210765j139178j085780j023349
16765B6954747r39397q71142q39530q02307p29342o73881o93339p34360o89635
$$ plain form
16756 19981814 19419467 18943361 18446119 17906215 17403963 16985144 16591108 16157335 15712921
16747 15712921 15325392 14991015 14646631 14270433 13904717 13578504 13267001 12942897 12619057
16738 12619057 12315960 12023485 11722684 11419666 11131697 10859601 10599622 10366663 10176108
16729 10176108 10007156 9811678 9568525 9314039 9103910 8946074 8787747 8583972 8366916
16720 8366916 8212922 8135270 8053598 7897990 7701668 7543759 7435342 7325799 7198787 7084778
16710 7084778 6984148 6859793 6716268 6605366 6533021 6442681 6319688 6224307 6177460 6104660
16700 6104660 5958061 5809316 5737563 5697592 5597455 5450449 5341979 5283627 5212355 5115368
16690 5115368 5045666 5015083 4971338 4888369 4792912 4697670 4591465 4495059 4439908 4395102 4310596
$$ packed form
16756A9981814n62347m76106m97242n39904n02252m18819l94036m33773m44414
16747A5712921l87529l34377l44384l76198l65716l26213l11503l24104l23840
16738A2619057l03097k92475l00801l03018k87969k72096k59979k32959j90555
16729A0176108j68952j95478k43153k54486k10129j57836j58327k03775k17056
16720H366916j53994p7652q1672j55608j96322j57909j08417j09543j27012j14009
16710G084778j00630j24355j43525j10902p2345r0340j22993r5381m6847p2800
16700F104660j46599j48745p1753l9971j00137j47006j08470n8352p1272r6987
16690E115368o9702l0583m3745q2969r5457r5242j06205r6406n5151m4806q4506
$$ plain form
16679 4310596 4227539 4230946 4284787 4246325 4081363 3932750 3910364 3935983 3884640 3772553 3695514
16668 3695514 3663412 3617290 3558512 3539736 3549266 3511147 3401282 3283702 3227216 3242889 3296989
16657 3296989 3335530 3309622 3222533 3133936 3080936 3030504 2952231 2885990 2873509 2873616 2827346 2766872
16645 2766872 2765775 2806930 2800279 2724288 2652096 2631124 2628137 2610005 2594169 2592303 2576437 2532872
16633 2532872 2492788 2481464 2482097 2467685 2429232 2367865 2302029 2276446 2310129 2344192 2305498 2215610
16621 2215610 2164064 2176831 2193770 2180810 2172367 2182792 2168556 2113847 2070233 2070063 2075302 2051407
16609 2051407 2017151 1982105 1915358 1824500 1784891 1831667 1895749 1906589 1885038 1871789 1844073
16598 1844073 1782724 1746467 1783578 1828936 1789561 1687040 1615956 1601034 1598858 1607657 1661914
$$ packed form
16679D310596q3057L407N3841l8462j64962j48613k2386K5619n1343j12087p7039
16668C695514l2102m6122n8778j8776R530l8119j09865j17580n6486J5673N4100
16657C296989L8541k5908q7089q8597n3000n0432p8273o6241j2481J07m6270o0474
16645B766872j097M1155o651p5991p2192k0972k987j8132j5836j866j5866m3565
16633B532872m0084j1324O33j4412l8453o1367o5836k5583L3683L4063l8694q9888
16621B215610n1546J2767J6939j2960q443J0425j4236n4709m3614j70N239k3895
16609B051407l4256l5046o6747r0858l9609M6776O4082J0840k1551j3249k7716
16598A844073o1349l6257L7111M5358l9375j02521p1084j4922k176Q799N4257
$$ plain form
16587 1661914 1732120 1740903 1683246 1635597 1639420 1662323 1677010 1690077 1687377 1641652 1585181 1584604
16575 1584604 1629445 1639171 1601432 1602833 1684086 1762333 1757163 1713873 1730414 1817931 1902598 1930026
16563 1930026 1911175 1889581 1905460 1971791 2059090 2126944 2180503 2256788 2350703 2413651 2437945
16552 2437945 2471154 2522851 2537359 2496765 2463942 2466508 2426331 2284460 2117108 2027278 1984081
16541 1984081 1884960 1733393 1626236 1581888 1514850 1395427 1309489 1316911 1354719 1338279 1275994
16530 1275994 1221330 1179812 1133476 1105215 1121759 1141932 1097006 997274 935378 969979 1048543
16519 1048543 1067335 987703 874018 819940 848930 898072 900180 860382 831989 837703 853354
16508 853354 859788 861327 848837 798783 727473 692883 712517 730687 707006 684400 711135 742642
$$ packed form
16587A661914P0206Q783n7657m7649L823K2903J4687J3067k700m5725n6471n77
16575A584604M4841R726l7739J401Q1253P8247n170m3290J6541Q7517Q4667K7428
16563A930026j8851k1594J5879O6331Q7299O7854N3559P6285R3915O2948K4294
16552B437945L3209N1697J4508m0594l2823K566m0177j41871j67352q9830m3197
16541A984081r9121j51567j07157m4348o7038j19423q5938P422L7808j6440o2285
16530A275994n4664m1518m6336k8261J6544K0173m4926r9732o1896L4601P8564
16519A048543J8792p9632j13685n4078K8990M9142K108l9798k8393N714J5651
16508H53354O434J539j2490n0054p1310l4590J9634J8170k3681k2606K6735L1507
$$ plain form
16496 742642 703428 622630 611595 697407 770898 737665 643961 596743 618630 651664 663549
16485 663549 669423 665229 622363 556426 527472 548780 560692 529164 508232 552606 619477 627127
16473 627127 580150 556853 580935 589536 545174 499396 503188 520439 492895 445886 453602 517399
16461 517399 556230 526197 480512 482231 514078 520573 501080 502338 532173 542084 508993 482015
16449 482015 511722 566421 568629 504693 445468 446905 478574 480122 449098 429042 436230 449522
16437 449522 460429 478956 491289 467565 420331 399343 411100 401035 343971 295631 312045
16426 312045 365991 393224 382063 364134 350359 332714 321565 324530 314628 277793 262670 314753
16414 314753 387774 400649 363719 357920 396582 409123 372085 350486 376532 386596 329226 251310
$$ packed form
16496G42642l9214q0798j1035Q5812P3491l3233r3704m7218K1887L3034J1885
16485F63549N874m194m2866o5937k8954K1308J1912l1528k0932M4374O6871P650
16473F27127m6977k3297K4082Q601m4362m5778L792J7251k7544m7009P716O3797
16461E17399L8831l0033m5685J719L1847O495j9493J258K9835R911l3091k6978
16449D82015K9707N4699K208o3936n9225J437L1669J548l1024k0056P188J3292
16437D49522J0907J8527J2333k3724m7234k0988J1757j0065n7064m8340J6414
16426C12045N3946K7233j1161j7929j3775j7645j1149K965r902l6835j5123N2083
16414C14753P3021J2875l6930n799L8662J2541l7038k1599K6046J0064n7370p7916
$$ plain form
16402 251310 220374 233345 256576 286682 316940 313238 279097 271594 297977 285048 217184 195276
16390 195276 261048 285661 183686 127701 335838 697121 851421 661993 374591 239776
16380 239776 208326 130428 48407 89950 202875 218812 125009 73077 131867 207875 220996
16369 220996 200429 177982 131967 83098 113250 224076 291851 240910 163690 177668 244787
16358 244787 241817 158262 106255 145457 204595 199807 152284 145609 207641 275855 271696 189846
16346 189846 108073 104028 166936 214983 203473 175529 182108 197543 165429 98018 63860 83485
16334 83485 103180 84448 60461 76585 121584 153925 164457 174012 185995 177931 138101 86274
16322 86274 54241 56164 77967 92745 90840 91398 112645 138593 139755 122743 122806 140157 128523
$$ packed form
16402B51310l0936J2971K3231L0106L0258l702l4141p503K6383j2929o7864k1908
16390A95276O5772K4613j01975n5985K08137L61283J54300j89428k87402j34815
16380B39776l1450p7898q2021M1543J12925J5937r3803n1932N8790P6008J3121
16369B20996k0567k2447m6015m8869L0152J10826O7775n0941p7220J3978O7119
16358B44787k970q3555n2007L9202N9138m788m7523o675O2032O8214m159q1850
16346A89846q1773m045O2908M8047j1510k7944O579J5435l2114o7411l4158J9625
16334H3485J9695j8732k3987J6124M4999L2341J0532R555J1983q064l9830n1827
16322H6274l2033J923K1803J4778j905N58K1247K5948J162j7012O3J7351j1634
$$ plain form
16309 128523 72888 36521 83901 180739 224774 172914 89249 57514 88625 135507 164976
16298 164976 180809 189843 181049 148438 115754 117725 154707 183228 167779 131567 128203 163651
16286 163651 184358 159802 135728 165922 220681 218998 144070 69602 60082 95031 116855 114071
16274 114071 120964 155154 190756 193436 164263 144011 172558 238504 278812 247364 175645 137979
16262 137979 162298 210740 246472 272481 292189 282870 239483 204992 217655 254792 267284 250593
16250 250593 243837 269720 309078 330878 323595 300573 288584 302664 326717 337629 347791 385548
16238 385548 428246 413023 341130 306356 367265 449740 449647 387513 372466 437009 503386 512442
16226 512442 494103 492938 504063 509928 513940 509975 477531 432383 424710 461267 485668 462248
$$ packed form
16309A28523n5635l6367M7380R6838M4035n1860q3665l1735L1111M6882K9469
16298A64976J5833R034q794l2611l2684J971L6982K8521j5449l6212l364L5448
16286A63651K0707k4556k4074L0194N4759j683p4928p4468r520L4949K1824k784
16274A14071O893L4190L5602K680k9173k0252K8547O5946M0308l1448p1719l7666
16262A37979K4319M8442L5732K6009J9708r319m3387l4491J2663L7137J2492j6691
16250B50593o756K5883L9358K1800p283k3022j1989J4080K4053J0912J0162L7757
16238C85548M2698j5223p1893l4774O0909Q2475r3o2134j5047O4543O6377R056
16226E12442j8339j165J1125N865M012l965l2444m5148p673L6557K4401k3420
$$ plain form
16214 462248 422301 398573 374251 333867 306606 313609 322248 300493 272838 273951 285985 271429
16202 271429 235749 210831 204300 206307 217836 234373 232016 205667 188384 200516 218270 222638
16190 222638 228107 227675 175869 79919 36002 98568 178940 167311 98785 86700 133942 142006
16178 142006 92754 81788 150396 211408 189043 128618 109203 128667 135887 116458 92448 81874
16166 81874 97046 141030 179395 163345 103169 66296 82652 110139 112899 106687 102347 78150
16154 78150 42075 46159 96732 124793 93731 60901 75959 95574 69173 36732 57538 101708
16142 101708 101833 64319 40392 30193 9003 9207 72285 145141 133613 51412 9921 53566
16130 53566 105930 98467 59532 43109 48113 48842 45558 46991 46292 40610 38134 33777 17415 8805
$$ packed form
16214D62248l9947k3728k4322m0384k7261P003Q639k1755k7655J113J2034j4556
16202B71429l5680k4918o531K007J1529J6537k357k6349j7283J2132J7754M368
16190B22638N469m32n1806r5950m3917O2566Q0372j1629o8526j2085M7242Q064
16178A42006m9252j0966O8608O1012k2365o0425j9415J9464P220j9429k4010j0574
16166H1874J5172M3984L8365j6050o0176l6873J6356K7487K760o212m340k4197
16154G8150l6075M084N0573K8061l1062l2830J5058J9615k6401l2441K0806M4170
16142A01708J25l7514k3927j0199k1190K04O3078P2856j1528q2201m1491M3645
16130E3566N2364p463l8935j6423N004P29l284J433o99n682k476m357j6362q610
$$ plain form
16116 8805 35840 77151 82382 52753 39630 55923 56803 24320 2267 21797 56083 76661
16104 76661 92993 106167 86155 31234 -9665 -12945 -19695 -56061 -75045 -32870 30192 49627
16092 49627 35490 42715 71372 67596 14223 -40916 -50975 -21005 11077 15029 -9321 -30512
16080 -30512 -15216 27299 50619 33974 8443 2910 4326 -693 9017 39776 42033 -23058 -104682
16067 -104682 -113334 -39866 31862 29040 -38475 -108310 -127572 -86323 -23529 1983 -27211 -63695
16055 -63695 -56740 -19313 -3453 -27509 -62122 -74001 -53565 -15840 1155 -34760 -96986 -114304
16043 -114304 -71353 -45017 -90565 -146085 -122634 -42842 -504 -15089 -26186 -14551 -21659 -49547
16031 -49547 -48416 -17632 -14990 -42845 -30407 35878 70277 26457 -22925 -9922 20477 6156
$$ packed form
16116H805K7035M1311N231k9629j3123J6293Q80l2483k2053J9530L4286K0578
16104G6661J6332J3174k0012n4921m0899l280o750l6366j8984M2175O3062J9435
16092D9627j4137P225K8657l776n3373n5139j0059K9970L2082L952k4350k1191
16080c0512J5296M2515K3320j6645k5531n533J416n019R710L0759K257o5091q1624
16067a04682q652P3468P1728k822o7515o9835j9262M1249O2794K5512k9194l6484
16055f3695O955L7427J5860k4056l4613j1879K0436L7725J6995l5915o2226j7318
16043a14304M2951K6336m5548n5520K3451P9792M2338j4585j1097J1635p108k7888
16031d9547J131L0784K642k7855J2438O6285L4399m3820m9382J3003L0399j4321
$$ plain form
16019 6156 -13737 24299 77725 56630 -22384 -50225 15113 96497 111200 60126 -7420 -53827
16007 -53827 -62579 -37943 -11104 -12649 -34748 -49011 -52012 -57294 -55974 -31018 -3108 -13206 -57392
15994 -57392 -82998 -57178 -4681 28421 20261 -18349 -54558 -55052 -21202 3735 -15437 -61772
15982 -61772 -93948 -96520 -75916 -36294 4119 6375 -32932 -54069 -19551 12285 -25774 -85789
15970 -85789 -66438 19865 56958 7497 -37466 -22533 -14339 -60808 -85199 -20012 50279 6670
15958 6670 -105034 -129080 -31171 57778 38985 -32907 -61797 -42307 -23308 -13975 6840 32343
15946 32343 39601 34429 36494 38770 23932 5597 11259 31721 27412 -12658 -51122 -50030 -15063
15933 -15063 17570 21821 802 -22761 -27327 -11379 4460 457 -17957 -29776 -31312 -41684
$$ packed form
16019F156j9893L8036N3426k1095p9014k7841O5338Q1384J4703n1074o7546m6407
16007e3827q752K4636K6839j545k2099j4263l001n282J320K4956K7910j0098m4186
15994e7392k5606K5820N2497L3102q160l8610l6209m94L3850K4937j9172m6335
15982f1772l2176k572K0604L9622M0413K256l9307k1137L4518L1836l8059o0015
15970h5789J9351Q6303L7093m9461m4963J4933Q194m6469k4391O5187P0291m3609
15958F670j11704k4046R7909Q8949j8793p1892k8890J9490J8999R333K0815K5503
15946C2343P258n172K065K276j4838j8335N662K0462m309m0070l8464J092L4967
15933a5063L2633M251k1019k3563m566J5948J5839m003j8414j1819j536j0372
$$ plain form
15921 -41684 -68119 -83860 -57820 3027 58428 77202 59077 20687 -18363 -36862 -25631 -7427
15909 -7427 -19270 -62119 -89967 -66128 -11186 25509 25196 7344 -7345 -14437 -15467 -16799 -32556
15896 -32556 -64009 -83798 -67781 -34908 -24904 -42349 -56671 -53349 -46820 -42850 -30368 -16076
15884 -16076 -22568 -40561 -28885 19468 57152 53259 38764 47246 52718 12267 -59063 -103916
15872 -103916 -96277 -60029 -29161 -24204 -50010 -81389 -71009 -10071 40178 20815 -42208 -77568
15860 -77568 -70086 -61999 -65996 -49692 -12208 -3014 -40767 -76836 -71871 -52754 -54678 -57419 -28008
15847 -28008 12716 20528 -1390 -15436 -15673 -26412 -42635 -27899 20800 54974 40389 4356
15835 4356 -5028 20225 50558 61023 46949 13866 -21325 -28600 7182 57448 75318 53031
$$ packed form
15921d1684k6435j5741K6040O0847N5401J8774j8125l8390l9050j8499J1231J8204
15909g427j1843m2849k7848K3839N4942L6695l13j7852j4689p092j030j332j5757
15896c2556l1453j9789J6017L2873J0004j7445j4322L322O529L970J2482J4292
15884a6076o492j7993J1676M8353L7684l893j4495Q482N472m0451p1330m4853
15872a03916P639L6248L0868M957k5806l1379J0380O0938N0249j9363o3023l5360
15860g7568P482Q087l997J6304L7484R194l7753l6069M965J9117j924k741K9411
15847b8008M0724P812k1918j4046k37j0739j6223J4736M8699L4174j4585l6033
15835D356r384K5253L0333J0465j4074l3083l5191p275L5782N0266J7870k2287
$$ plain form
15823 53031 27411 21770 16454 -2896 -4932 37135 80283 57062 -17120 -49631 -3479 42637
15811 42637 11479 -54451 -60165 -4152 28678 8288 1419 51157 98005 71784 2999 -23632
15799 -23632 4377 16887 -26033 -73470 -59330 3566 43666 27301 -8157 -23887 -39392 -88340
15787 -88340 -143115 -140377 -79952 -34766 -41554 -46701 -3092 42462 24169 -32560 -58358 -56951
15775 -56951 -77587 -98645 -54827 25206 35424 -33755 -68359 -19431 15243 -32545 -76008 -27437
15763 -27437 39371 12064 -67852 -84918 -52833 -72709 -130797 -116711 -35662 -18927 -92546 -112416
15751 -112416 3112 134416 150187 101512 107284 151380 133917 60286 34924 86491 125442
15740 125442 86554 14743 -16733 -1045 18946 13328 -14584 -40749 -38855 -5951 28038 32742
$$ packed form
15823E3031k5620n641n316j9350k036M2067M3148k3221p4182l2511M6152M6116
15811D2637l1158o5930n714N6013L2830k0390o869M9738M6848k6221o8785k6631
15799b3632K8009J2510m2920m7437J4140O2896M0100j6365l5458j5730j5505m8948
15787h8340n4775K738O0425M5186o788n147M3609M5554j8293n6729k5798J407
15775e6951k0636k1058M3818Q0033J0218o9179l4604M8928L4674m7788m3463M8571
15763b7437O6808k7307p9916j7066L2085j9876n8088J4086Q1049J6735p3619j9870
15751a12416J15528J31304J5771m8675N772M4096j7463p3631k5362N1567L8951
15740A25442l8888p1811l1476J5688J9991n618k7912k6165J894L2904L3989M704
$$ plain form
15728 32742 11656 -12214 -28229 -34511 -24002 -1638 5551 -14342 -32194 -21735 -5849 -20056
15716 -20056 -51053 -56917 -33904 -15574 -12611 -302 33408 67658 80567 70354 44877 17182
15704 17182 5553 11931 12533 -2824 -4124 28689 55635 30277 -16768 -13643 40712 71453 41728
15691 41728 748 -2647 11427 4434 -16101 -20738 -6424 11119 18565 -2195 -58766 -105977
15679 -105977 -75941 16977 64332 7586 -67050 -49240 30838 51963 -10679 -55484 -21207
15668 -21207 21056 -10820 -78574 -84681 -17007 44285 46055 16862 -690 -6904 -10989 3977
15656 3977 38483 38733 -37487 -132482 -136119 -34772 54050 32959 -48712 -78836 -45102 -28372
15644 -28372 -54170 -52305 15659 80933 68883 7250 -26182 -12939 11293 30945 52764 60292
$$ packed form
15728C2742k1086k3870j6015o282J0509K2364P189j9893j7852J0459J5886j4207
15716b0056l0997n864K3013J8330K963J2309L3710L4250J2909j0213k5477k7695
15704A7182j1629O378O02j5357j300L2813K6946k5358m7045L125N4355L0741k9725
15691D1728m0980l395J4074o993k0535m637J4314J7543P446k0760n6571m7211
15679a05977L0036R2918M7355n6746p4636J7810Q0078K1125o2642m4805L4277
15668b1207M2263l1876o7754o107O7674O1292J770k9193j7552o214m085J4966
15656C977L4506K50p6220r4995l637J01347Q8822k1091q1671l0124L3734J6730
15644b8372k5798J865O7964O5274j2050o1633l3432J3243K4232J9652K1819P528
$$ plain form
15632 60292 32998 -2934 -3603 21872 25544 -2756 -28031 -30339 -15150 24520 87894 115744
15620 115744 44327 -77690 -114633 -20631 90363 100783 40442 14476 44153 66402 54202
15609 54202 43434 47606 30828 -19865 -61887 -60109 -32522 -8649 17011 61779 112472 134910
15597 134910 115195 74112 42844 29797 13206 -24847 -59409 -45505 9543 37493 2656
15586 2656 -40899 -34759 -11710 -29947 -51118 7401 108647 113728 -5095 -97483 -49737 50441
15574 50441 63550 11508 9280 56139 53269 -1366 -2808 64865 82467 -6680 -95819 -84312
15562 -84312 -24636 -9427 -18789 10308 47343 24516 -27196 -23489 25680 35216 -5877 -22242
15550 -22242 13342 45273 43628 41770 50341 36537 10099 26894 79440 90329 50816 51890
$$ packed form
15632F0292k7294l5932o69K5475L672k8300k5275k308J5189L9670O3374K7850
15620A15744p1417j22017l6943R4002J10994J0420o0341k5966K9677K2249j2200
15609E4202j0768M172j6778n0693m2022J778K7587K3873K5660M4768N0693K2438
15597A34910j9715m1083l1268j3047j6591l8053l4562J3904N5048K7950l4837
15586B656m3555O140K3049j8237k1171N8519J01246N081j18823r2388M7746J00178
15574E0441J3109n2042k228M6859k870n4635j442O7673J7602q9147q9139J1507
15562h4312N9676J5209r362K9097L7035k2827n1712L707M9169R536m1093j6365
15550b2242L5584L1931j645j858Q571j3804k6438J6795N2546J0889l9513J074
$$ plain form
15538 51890 123487 161281 93968 12071 23694 76867 54368 -24801 -42733 18496 62442 51408
15526 51408 50024 81138 74046 -2309 -70613 -65011 -24184 -5552 9091 54024 94007 73702
15514 73702 9159 -35942 -35958 -12878 11926 28199 22543 -4873 -28076 -29902 -26191 -32750 -39839
15501 -39839 -41579 -50821 -59175 -29750 36466 77602 57511 25725 39791 76025 78104 51284
15489 51284 40079 48237 52782 66033 106035 132185 95356 33219 24133 56485 44736 -19456
15477 -19456 -40201 29236 107148 107552 57996 31935 34931 29136 17514 28087 47212 39019 14713
15464 14713 22369 72951 122214 125342 80412 24784 7797 49369 108675 120850 81714 56889
15452 56889 82613 108458 81288 35820 39648 84815 104608 77080 42321 28483 28063 42221
$$ packed form
15538E1890P1597L7794o7313q1897J1623N3173k2499p9169j7932O1229M3946j1034
15526E1408j384L1114p092p6355o8304N602M0827J8632J4643M4933L9983k0305
15514G3702o4543m5101j6K3080K4804J6273n656k7416k3203j826L711o559p089
15501c9839j740r242q354K9425O6216M1136k0091l1786J4066L6234K079k6820
15489E1284j1205Q158M545J3251M0002K6150l6829o2137r086L2352j1749o4192
15477a9456k0745O9437P7912M04m9556k6061K996n795j1622J0573J9125q193k4306
15464A4713P656N0582M9263L128m4930n5628j6987M1572N9306J2175l9136k4825
15452E6889K5724K5845k7170m5468L828M5167J9793k7528l4759j3838m20J4158
$$ plain form
15440 42221 82168 125288 131884 108275 94511 92452 73901 57678 94510 162040 167019 86739
15428 86739 19171 39896 92249 89073 49966 50459 91150 114784 115988 132672 149920 117774
15416 117774 60914 64967 138565 188654 160580 106934 79104 49306 -53 -4395 78235 163851
15404 163851 147464 62614 27188 60639 73856 34694 17636 60630 90058 47796 -3379
15393 -3379 18457 78225 81578 25785 -1791 39833 97036 114220 100359 84804 66959 38905
15381 38905 17787 27557 69393 121896 151715 127643 56519 1935 24333 97318 130104 86159
15369 86159 30682 37047 93568 137303 139507 115950 85354 64372 80148 138591 193731 195284
15357 195284 158609 142693 164841 186389 184584 184789 203711 209531 172654 123697 119965 166998
$$ packed form
15440D2221L9947M3120O596k3609j3764k059j8551j6223L6832O7530M979q0280
15428H6739o7568K0725N2353l176l9107M93M0691K3634J204J6684J7248l2146
15416A17774n6860M053P3598N0089k8074n3646k7830k9798m9359m342Q2630Q5616
15404A63851j6387q4850l5426L3451J3217l9162j7058M2994K9428m2262n1175
15393c379K1836N9768L353n5793k7576M1624N7203J7184j3861j5555j7845k8054
15381C8905k1118R770M1836N2503K9819k4072p1124n4584K2398P2985L2786m3945
15369H6159n5477O365N6521M3735K204k3557l0596k0982J5776N8443N5140J553
15357A95284l6675j5916K2148K1548j805K05J8922N820l6877m8957l732M7033
$$ plain form
15345 166998 210373 207339 177891 171941 203173 236270 238483 222589 222453 238041 233044 191160 145114
15332 145114 132474 147699 163545 178692 208838 242371 246247 218753 200091 219676 261736 295286
15320 295286 312052 319148 316165 298815 272686 248878 234993 238217 263867 301488 325965 324370
15308 324370 311725 309988 320690 328704 325833 320493 327422 354122 394464 430818 443623 423258
15296 423258 379611 346274 365017 442103 520192 529544 482042 471601 547011 629161 615350 534728
15284 534728 517485 613048 726535 759402 733140 730178 779175 853969 933152 1000544 1029708
15273 1029708 1032108 1084800 1237965 1418531 1505155 1494589 1513695 1647567 1824303 1909954 1874467
15262 1874467 1817269 1841911 1940198 2008758 1967631 1843917 1722254 1627513 1504802 1329895
$$ packed form
15345A66998M3375l034k9448n950L1232L3097K213j5894j36J5588m997m1884m6046
15332A45114j2640J5225J5846J5147L0146L3533L876k7494j8662J9585M2060L3550
15320B95286J6766P096k983j7350k6129k3808j3885L224K5650L7621K4477j595
15308C24370j2645j737J0702Q014k871n340O929K6700M0342L6354J2805k0365
15296D23258m3647l3337J8743P7086P8089R352m7502j0441P5410Q2150j3811q0622
15284E34728j7243R5563J13487L2867k6262k962M8997P4794P9183O7392K9164
15273A029708K400N2692J53165J80566Q6624j0566J9106J33872J76736Q5651l5487
15262A874467n7198K4642R8287O8560m1127j23714j21663r4741j22711j74907
$$ plain form
15252 1329895 1178061 1128137 1139867 1101545 983890 869220 824633 821963 804719 766423 726813
15241 726813 684077 633176 594128 583099 582814 572591 559993 553668 534931 491261 452270 452791
15229 452791 476833 477142 442006 407031 402366 419429 433990 436289 427493 403771 361425 316523
15217 316523 303176 334848 370345 347531 267664 215684 260310 356720 399231 359979 314869
15206 314869 327542 372255 392617 374817 329129 256498 179725 158726 217632 290272 295600 244187
15194 244187 213912 236266 264830 253881 216792 197124 216363 258142 283587 265161 221007
15183 221007 200878 220517 236724 214614 185628 195064 221507 206473 149651 113760 134586 181115
15171 181115 213103 229749 246452 261470 262575 243282 206148 168586 158865 182481 204602 194096
$$ packed form
15252A329895j51834m9924J1730l8322j17655j14670m4587k670j7244l8296l9610
15241G26813m2736n0901l9048j1029k85j0223j2598o325j8737m3670l8991N21
15229D52791K4042L09l5136l4975m665J7063J4561K299q796k3722m2346m4902
15217C16523j3347L1672L5497k2814p9867n1980M4626R6410M2511l9252m5110
15206C14869J2673M4713K0362j7800m5688p2631p6773k0999N8906P2640N328n1413
15194B44187l0275K2354K8564j0949l7089j9668J9239M1779K5445j8426m4154
15183B21007k0129J9639J6207k2110k8986R436K6443j5034n6822l5891K0826M6529
15171A81115L1988J6646J6703J5018J105j9293l7134l7562r721K3616K2121j0506
$$ plain form
15159 194096 168547 162235 170337 166650 155769 158955 167375 162270 160739 181887 191261 151705 107745
15146 107745 130550 191303 193297 133814 118174 185071 236755 197842 134519 139504 189661 205235
15134 205235 177490 148332 124871 104098 126243 207262 265654 220344 127929 114875 191021
15123 191021 239169 191242 112377 89675 122891 156309 156095 128226 103582 118624 175012 222822
15111 222822 222940 205933 216694 230160 196559 146183 154780 211419 224290 170707 135886 170114
15099 170114 208982 187852 145720 147796 177644 182560 172156 191393 227586 220624 157406 98011
15087 98011 103145 167910 229125 225608 161195 108510 126003 179085 188113 147458 129266 161082
15075 161082 182363 153693 125075 143249 167964 148764 119918 139424 183053 182455 135056 97522
$$ packed form
15159A94096k5549o312Q102l687j0881L186Q420n105j531K1148R374l9556m3960
15146A07745K2805O0753J994n9483j5640O6897N1684l8913o3323M985N0157J5574
15134B05235k7745k9158k3461k0773K2145Q1019N8392m5310r2415j3054P6146
15123A91021M8148m7927p8865k2702L3216L3418k14k7869k4644J5042N6388M7810
15111B22822J18j7007J0761J3466l3601n0376Q597N6639J2871n3583l4821L4228
15099A70114L8868k1130m2132K076K9848M916j0404J9237L6193o962o3218n9395
15087I8011N134O4765O1215l517o4413n2685J7493N3082R028m0655j8192L1816
15075A61082K1281k8670k8618J8174K4715j9200k8846J9506M3629n98m7399l7534
$$ plain form
15063 97522 94540 105912 122529 147159 159481 143427 127089 136344 140763 111052 90856 130650
15051 130650 186998 182715 139666 145673 203674 225902 178425 119857 87324 58388 44422 99926
15039 99926 201569 237015 168262 95648 97386 116273 84591 53709 95574 162694 164216 119604
15027 119604 117679 164635 188745 170674 159862 175119 189262 202905 237662 263908 231895 170719
15015 170719 158245 193440 202484 176155 184315 232119 228209 146913 100969 173038 277367 287301
15003 287301 218539 175321 178152 169889 154837 196070 276856 294380 219000 146437 146880 165832
14991 165832 139313 114002 160386 233087 228758 152885 116147 163013 210737 188567 142013 142363
14979 142363 168750 158054 123864 137283 204937 249348 222015 169700 163438 209698 260230 277280
$$ packed form
15063I7522k982J1372J6617K4630J2322j6054j6338R255M419k9711k0196L9794
15051A30650N6348m283m3049O007N8001K2228m7477n8568l2533k8936j3966N5504
15039I9926J01643L5446o8753p2614J738J8887l1682l0882M1865O7120J522m4612
15027A19604j925M6956K4110j8071j0812J5257J4143J3643L4757K6246l2013o1176
15015A70719j2474L5195R044k6329Q160M7804l910q1296m5944P2069J04329R934
15003B87301o8762m3218K831q263j5052M1233Q0786J7524p5380p2563M43J8952
14991A65832k6519k5311M6384P2701m329p5873l6738M6866M7724k2170m6554L50
14979A42363K6387j0696l4190J3419O7654M4411k7333n2315o262M6260N0532J7050
$$ plain form
14967 277280 263648 248600 258624 285344 282442 222024 149612 140224 196452 241015 223711 180252
14955 180252 161290 161971 160461 171627 211178 250341 259710 259272 270655 262329 208379 162132 189069
14942 189069 250894 246094 160381 89750 104794 170300 215890 216867 187266 155970 164682 228677
14930 228677 291003 281869 227236 218446 267264 289152 253340 238668 290796 332773 291612 218507
14918 218507 196567 213716 222860 248456 320661 370351 317406 217531 189238 226628 224715 175186
14906 175186 183811 276196 336709 292047 227059 246684 324771 367250 345754 294021 237232 196364
14894 196364 208049 272017 322940 313409 281225 279494 288897 263730 222566 221059 261074 294291
14882 294291 300166 300544 306442 302723 283117 262265 256309 273711 309102 330406 304392 253918 245605
$$ packed form
14967B77280j3632j5048J0024K6720k902o0418p2412r388N6228M4563j7304m3459
14955A80252j8962O81j510J1166L9551L9163R369m38J1383q326n3950m6247K6937
14942A89069O1825m800q5713p0631J5044O5506M5590R77k9601l1296Q712O3995
14930B28677O2326r134n4633q790M8818K1888l5812j4672N2128M1977m1161p3105
14918B18507k1940J7149R144K5596P2205M9690n2945r9875k8293L7390j913m9529
14906A75186Q625R2385O0513m4662o4988J9625P8087M2479k1496n1733n6789m0868
14894A96364J1685O3968N0923r531l2184j731R403k5167m1164j507M0015L3217
14882B94291N875L78N898l719j9606k0852n956J7402L5391K1304k6014n0474q313
$$ plain form
14869 245605 295500 341934 345427 347152 375981 373223 290708 199310 199283 268076 305313 295808 309336
14856 309336 354322 358843 306733 271275 285140 288029 244209 209891 231646 267250 266179 252649
14844 252649 268699 299342 311659 312138 314151 302388 275377 267554 286942 292899 277775 296841
14832 296841 363779 396948 341623 270250 274242 321787 321107 271796 247784 267957 289530 302794
14820 302794 328191 339947 298445 245537 260712 327807 352849 315677 293181 320992 345430
14809 345430 337365 342450 379469 392017 349989 307615 310650 330589 338633 357997 391155 385634
14797 385634 333489 314715 369825 417856 386338 337823 363366 421422 403192 312435 257810
14786 257810 288512 350543 396241 430515 447188 418433 359167 318999 303352 280202 262595
$$ packed form
14869B45605M9895M6434L493J725K8829k758q2515r1398k7O8793L7237r505J3528
14856C09336M4986M521n2110l5458J3865K889m3820l4318K1755L5604j071j3530
14844B52649J6050L0643J2317M79K013j1763k7011p823J9388N957j5124J9066
14832B96841O6938L3169n5325p1373L992M7545o80m9311k4012K0173K1573J3264
14820C02794K5397J1756m1502n2908J5175O7095K5042l7172k2496K7811K4438
14809C45430q065N085L7019J2548m2028m2374L035J9939Q044J9364L3158n521
14797C85634n2145j8774N5110M8031l1518m8515K5543N8056j8230r0757n4625
14786B57810L0702O2031M5698L4274J6673k8755n9266m0168j5647k3150j7607
$$ plain form
14775 262595 295390 356579 369476 330777 328230 398917 464947 457198 417014 414758 439875 441624
14763 441624 424107 427288 447617 444609 409366 374856 369087 394314 437733 473810 475061 445126
14751 445126 418600 409278 391812 356774 341435 371214 409919 409746 377071 346358 322915 299975
14739 299975 300690 345321 397892 406045 383457 393122 449483 493904 478097 425006 390409 399053
14727 399053 433708 460319 452427 413110 380536 392098 439265 477790 483440 473955 472001 472305 459286
14714 459286 440211 441621 473454 508562 508819 473710 449235 474088 528881 562009 555261 531892
14702 531892 509923 492201 497919 546211 601744 601269 550158 520359 528895 506982 435149 409198
14690 409198 491663 588772 583527 517321 510543 557801 551617 483964 464504 529503 585220 574234
$$ packed form
14775B62595L2795O1189J2897l8699k547P0687O6030p749m0184k256K5117J749
14763D41624j7517L181K0329l008l5243l4510n769K5227M3419L6077J251k9935
14751D45126k6526r322j7466l5038j5339K9779L8705j73l2675l0713k3443k2940
14739B99975P15M4631N2571Q153k2588R665N6361M4421j5807n3091l4597Q644
14727C99053L4655K6611p892l9317l2574J1562M7167L8525N650r485j954L04j3019
14714D59286j9075J410L1833L5108K57l5109k4475K4853N4793L3128o748k3369
14702E31892k1969j7722N718M8292N5533m75n1111k9799Q536k1913p1833k5951
14690D09198Q2465R7109n245o6206o778M7258o184o7653j9460O4999N5717j0986
$$ plain form
14678 574234 556447 576105 581661 541355 515739 541092 553838 512669 488079 537434 591805 573296
14666 573296 535827 571096 647182 665178 621593 590748 587488 569461 545123 560426 599204 608080
14654 608080 599676 622637 655604 647752 635694 685846 742843 691387 568244 540831 643502
14643 643502 710482 637373 542045 564859 655621 687043 662855 668715 700012 687780 645174 646947
14631 646947 690505 705683 687663 698487 740258 745567 706385 700687 760996 814171 795156 741230
14619 741230 723361 744438 756605 737885 706862 688654 699329 741591 791704 811730 793776
14608 793776 772484 780191 810916 839844 855431 859665 856911 854495 858704 864622 865829 872711 897907
14595 897907 925286 923991 897827 887753 912739 938476 925201 884984 867943 900833 957723 991321
$$ packed form
14678E74234j7787J9658N556m0306k5616K5353J2746m1169k4590M9355N4371j8509
14666E73296l7469L5269P6086J7996m3585l0845l260j8027k4338J5303L8778Q876
14654F08080q404K2961L2967p852j2058N0152N6997n1456j23143k7413J02671
14643F43502O6980p3109r5328K2814R0762L1422k4188N860L1297j2232m2606J773
14631F46947M3558J5178j8020J0824M1771N309l9182n698O0309N3175j9015n3926
14619G41230j7869K1077J2167j8720l1023j8208J0675M2262N0113K0026j7954
14608G93776k1292P707L0725K8928J5587M234k754k416M209N918J207O882K5196
14595H97907K7379j295k6164j0074K4986K5737j3275m0217j7041L2890N6890L3598
$$ plain form
14583 991321 984543 966717 975395 1006065 1017030 989383 956360 954796 974497 985807 992570 1015885
14571 1015885 1041787 1034112 994866 964881 963572 972617 981505 1002104 1030981 1044215 1040622 1044995
14559 1044995 1058000 1052440 1033664 1048537 1108894 1159592 1157770 1135504 1140685 1157410 1137173 1083252
14547 1083252 1053321 1087451 1168057 1243116 1268558 1244579 1223798 1255057 1308292 1301909 1224866
14536 1224866 1168741 1196856 1249807 1247778 1222612 1253882 1320768 1334547 1299419 1310952 1379311
14525 1379311 1386620 1275898 1166085 1189261 1298395 1345303 1298279 1264611 1311372 1379544 1399887
14514 1399887 1396061 1418251 1443966 1418745 1361478 1351312 1409514 1462703 1449236 1406861 1407331 1441965
14502 1441965 1440156 1391692 1372830 1426647 1489342 1488808 1461116 1494508 1589930 1662863 1675222 1675949
$$ packed form
14583I91321o778j7826Q678L0670J0965k7647l3023j564J9701J1310O763K3315
14571A015885K5902p675l9246k9985j309R045Q888K0599K8877J3234l593M373
14559A044995J3005n560j8776J4873O0357N0698j822k2266N181J6725k0237n3921
14547A083252k9931L4130Q0606P5059K5442k3979k0781L1259N3235o383p7043
14536A224866n6125K8115N2951k029k5166L1270O6886J3779l5128J1533O8359
14525A379311P309j10722j09813K3176J09134M6908m7024l3668M6761O8172K0343
14514A399887l826K2190K5715k5221n7267j0166N8202N3189j3467m2375M70L4634
14502A441965j809m8464j8862N3817O2695n34k7692L3392R5422P2933J2359P27
$$ plain form
14490 1675949 1696071 1692420 1636218 1581850 1588515 1629418 1643506 1635403 1654638 1704432 1743868 1766494
14478 1766494 1804781 1857067 1878606 1857025 1835570 1842001 1849718 1835765 1826836 1851824 1889439 1904683
14466 1904683 1907886 1933587 1980019 2014305 2028944 2049402 2083257 2101617 2085123 2058282 2057024 2079671
14454 2079671 2091907 2074008 2045530 2041836 2076091 2126959 2159269 2156861 2138911 2142460 2183743 2238489
14442 2238489 2268726 2269951 2279359 2327648 2392576 2419573 2389969 2349243 2355470 2413024 2474830 2503211
14430 2503211 2506091 2509438 2517444 2519741 2526685 2567888 2644981 2708448 2709032 2667395 2660617 2726987 2812980
14417 2812980 2841738 2812889 2794923 2827248 2878025 2907852 2924985 2948765 2961037 2939790 2915668
14406 2915668 2942490 3017645 3079130 3086818 3066615 3063763 3088027 3121281 3150559 3174114 3193997 3217647
$$ packed form
14490A675949K0122l651n6202n4368O665M0903J4088q103J9235M9794L9436K2626
14478A766494L8287N2286K1539k1581k1455O431P717j3953q929K4988L7615J5244
14466A904683L203K5701M6432L4286J4639K0458L3855J8360j6494k6841j258K2647
14454B079671J2236j7899k8478l694L4255N0868L2310k408j7950L549M1283N4746
14442B238489L0237J225R408M8289O4928K6997k9604m0726O227N7554O1806K8381
14430B503211K880L347Q006K297O944M1203P7093O3467N84m1637o778O6370Q5993
14417B812980K8758k8849j7966L2325N0777K9827J7133K3780J2272k1247k4122
14406B915668K6822P5155O1485P688k0203k852K4264L3254K9278K3555J9883K3650
$$ plain form
14394 3217647 3251480 3284426 3296890 3293495 3303499 3338498 3376053 3400218 3429589 3481264 3531612
14383 3531612 3544159 3522023 3503401 3515577 3560571 3634008 3723329 3791506 3800768 3762715 3736548
14372 3736548 3763944 3825466 3872077 3880444 3865183 3855408 3876081 3937316 4019938 4078168 4080179 4050131
14360 4050131 4051509 4118046 4213895 4277638 4297587 4320172 4380431 4452177 4488390 4490682 4504549 4552703
14348 4552703 4612360 4664438 4723846 4800308 4865427 4891469 4898494 4928042 4985658 5041830 5076733
14337 5076733 5093254 5100096 5114291 5163053 5244584 5306298 5311062 5307967 5374239 5494330 5572846 5576753
14325 5576753 5580151 5636339 5692427 5690875 5680273 5740038 5846021 5907566 5912707 5937821 6015403 6086997
14313 6086997 6105937 6103394 6120845 6149391 6176799 6231682 6329751 6423961 6462673 6464355 6484148 6533248
$$ packed form
14394C217647L3833L2946J2464l395J0004L4999L7555K4165K9371N1675N0348
14383C531612J2547k2136j8622J2176M4994P3437Q9321O8177R262l8053k6167
14372C736548K7396O1522M6611Q367j5261r775K0673O1235Q2622N8230K011l0048
14360D050131J378O6537R5849O3743J9949K2585O0259P1746L6213K292J3867M8154
14348D552703N9657N2078N9408P6462O5119K6042P025K9548N7616N6172L4903
14337E076733J6521O842J4195M8762Q1531O1714M764l095O6272J20091P8516L907
14325E576753L398N6188N6088j552j0602N9765J05983O1545N141K5114P7582P1594
14313F086997J8940k543J7451K8546K7408N4883R8069R4210L8712J682J9793M9100
$$ plain form
14301 6533248 6582194 6623426 6676320 6738186 6781472 6804002 6840613 6914303 7006195 7085283 7146218
14290 7146218 7206926 7280671 7356181 7403486 7408793 7407478 7459236 7573394 7684959 7734286 7748238
14279 7748238 7802941 7920376 8047209 8132605 8181809 8226932 8286078 8363602 8455934 8542736 8600203
14268 8600203 8633984 8673737 8731003 8793086 8861269 8955641 9072257 9176291 9252516 9322606 9397779
14257 9397779 9461337 9519462 9614636 9751625 9863351 9903782 9931702 10037043 10211858 10363643
14247 10363643 10444380 10500064 10592721 10732009 10889174 11028869 11124726 11189692 11285494 11448997
14237 11448997 11619644 11709883 11744272 11841106 12039050 12238705 12359724 12459719 12622770 12811106
14227 12811106 12929895 12990353 13097223 13290319 13501478 13672781 13823883 13983840 14140371
$$ packed form
14301F533248M8946M1232N2894O1866M3286K2530L6611P3690R1892P9088O0935
14290G146218O0708P3745P5510M7305N307j315N1758J14158J11565M9327J3952
14279G748238N4703J17435J26833Q5396M9204M5123N9146P7524R2332Q6802N7467
14268H600203L3781L9753N7266O2083O8183R4372J16616J04034P6225P0090P5173
14257I397779O3558N8125R5174J36989J11726M0431K7920J05341J74815J51785
14247A0363643Q0737N5684R2657J39288J57165J39695R5857O4966R5802J63503
14237A1448997J70647R0239L4389R6834J97944J99655J21019R9995J63051J88336
14227A2811106J18789O0458J06870J93096K11159J71303J51102J59957J56531
$$ plain form
14218 14140371 14286754 14447357 14623532 14780092 14920651 15107656 15358925 15589959 15726874
14209 15726874 15827107 16007960 16283315 16554148 16754205 16925599 17137012 17395663 17668503
14200 17668503 17939174 18210243 18482271 18757375 19038545 19309975 19549914 19779257 20058111
14191 20058111 20406448 20765192 21074032 21358100 21691460 22093259 22509069 22888197 23232649
14182 23232649 23569014 23917744 24299165 24727224 25180601 25616297 26031023 26474876 26979866
14173 26979866 27507108 27998403 28456865 28936929 29464723 30008432 30533286 31055629 31625453
14164 31625453 32265958 32942891 33597869 34213507 34837572 35527501 36276967 37026202 37747600
14155 37747600 38480583 39262842 40071799 40873336 41690259 42566295 43485096 44388669 45268822
$$ packed form
14218A4140371J46383J60603J76175J56560J40559J87005K51269K31034J36915
14209A5726874J00233J80853K75355K70833K00057J71394K11413K58651K72840
14200A7668503K70671K71069K72028K75104K81170K71430K39939K29343K78854
14191B0058111L48337L58744L08840K84068L33360M01799M15810L79128L44452
14182B3232649L36365L48730L81421M28059M53377M35696M14726M43853N04990
14173B6979866N27242M91295M58462M80064N27794N43709N24854N22343N69824
14164C1625453O40505O76933O54978O15638O24065O89929P49466P49235P21398
14155C7747600P32983P82259Q08957Q01537Q16923Q76036R18801R03573Q80153
$$ plain form
14146 45268822 46176236 47134855 48110815 49080259 50065960 51083305 52108639 53132026 54185406
14137 54185406 55280833 56375606 57446416 58547464 59736022 60981369 62213340 63429644
14129 63429644 64684359 65993541 67330110 68700961 70144848 71647227 73140926 74616656
14121 74616656 76157437 77824495 79575283 81345856 83157641 85074398 87089136 89132536
14113 89132536 91188328 93326609 95600061 97964632 100347857 102763423 105299690 107994279
14105 107994279 110778014 113577603 116431732 119444110 122636200 125922077 129246532 132672207
14097 132672207 136283227 140068073 143966578 147982486 152166010 156519894 161017100 165692849
14089 165692849 170618026 175785264 181127053 186654634 192464997 198587881 204952039 211551306
$$ packed form
14146D5268822R07414R58619R75960R69444R85701J017345J025334J023387J053380
14137E4185406J095427J094773J070810J101048J188558J245347J231971J216304
14129F3429644J254715J309182J336569J370851J443887J502379J493699J475730
14121G4616656J540781J667058J750788J770573J811785J916757K014738K043400
14113H9132536K055792K138281K273452K364571K383225K415566K536267K694589
14105A07994279K783735K799589K854129L012378L192090L285877L324455L425675
14097A32672207L611020L784846L898505M015908M183524M353884M497206M675749
14089A65692849M925177N167238N341789N527581N810363O122884O364158O599267
$$ plain form
14081 211551306 218512458 225916799 233677371 241703997 250081302 258941950 268246932 277859679
14073 277859679 287795829 298222528 309205973 320619322 332330414 344337357 356670047
14066 356670047 369282289 382097116 395042832 407975630 420667467 432942908 444733899
14059 444733899 455920196 466208822 475273100 482940974 489142191 493734813 496516871 497390358
14051 497390358 496394773 493576266 488933843 482522768 474523118 465162557 454626965 443079808
14043 443079808 430721010 417787334 404515214 391115741 377754200 364536085 351534833
14036 351534833 338840063 326551943 314723670 303344795 292399068 281913400 271929262
14029 271929262 262441523 253387592 244699160 236358733 228401713 220860889 213718016 206925110
$$ packed form
14081B11551306O961152P404341P760572Q026626Q377305Q860648R304982R612747
14073B77859679R936150J0426699J0983445J1413349J1711092J2006943J2332690
14066C56670047J2612242J2814827J2945716J2932798J2691837J2275441J1790991
14059D44733899J1186297J0288626R064278P667874O201217M592622K782058Q73487
14051D97390358r95585k818507m642423o411075p999650r360561j0535592j1547157
14043D43079808j2358798j2933676j3272120j3399473j3361541j3218115j3001252
14036C51534833j2694770j2288120j1828273j1378875j0945727j0485668r984138
14029B71929262r487739r053931q688432q340427p957020p540824p142873o792906
$$ plain form
14021 206925110 200459145 194314631 188443139 182763502 177262808 172024960 167102520 162413039
14013 162413039 157839752 153396960 149198691 145274630 141519039 137837833 134250880 130813569
14005 130813569 127523331 124356121 121323287 118427913 115618599 112853170 110167326 107613351
13997 107613351 105163978 102749354 100368327 98084960 95916075 93798651 91689825 89635772
13989 89635772 87701963 85875449 84081206 82278480 80501622 78805889 77203531 75665242
13981 75665242 74163640 72692244 71248470 69827991 68447401 67144583 65929756 64755916
13973 64755916 63572729 62395311 61276382 60220533 59182086 58148498 57157509 56212193
13965 56212193 55253182 54258683 53303081 52451760 51654206 50821178 49964621 49165351 48424813
$$ packed form
14021B06925110o465965o144514n871492n679637n500694n237848m922440m689481
14013A62413039m573287m442792m198269l924061l755591l681206l586953l437311
14005A30813569l290238l167210l032834k895374k809314k765429k685844k553975
13997A07613351k449373k414624k381027k283367k168885k117424k108826k054053
13989H9635772j933809j826514j794243j802726j776858j695733j602358j538289
13981G5665242j501602j471396j443774j420479j380590j302818j214827j173840
13973F4755916j183187j177418j118929j055849j038447j033588r90989r45316
13965E6212193r59011r94499r55602q51321p97554q33028q56557p99270p40538
$$ plain form
13956 48424813 47657607 46840360 46063197 45393910 44776214 44117720 43413907 42723681 42070737
13947 42070737 41435669 40816055 40229221 39666271 39097206 38520083 37962768 37435953 36920695
13938 36920695 36404229 35896011 35403717 34920220 34440702 33971849 33518081 33074656 32639631
13929 32639631 32221050 31826945 31451561 31071864 30663147 30231000 29821319 29470294 29144364
13920 29144364 28773463 28359637 27996582 27736334 27488308 27127420 26675979 26283777 26020595
13911 26020595 25786454 25471927 25121316 24854020 24672923 24452182 24116978 23747760 23466635
13902 23466635 23276565 23071083 22783457 22466590 22208762 22013904 21809772 21561133 21317814
13893 21317814 21127338 20949415 20711904 20426595 20180208 20009003 19852332 19651098 19423896
$$ packed form
13956D8424813p67206q17247p77163o69287o17696o58494p03813o90226o52944
13947D2070737o35068o19614n86834n62950n69065n77123n57315n26815n15258
13938C6920695n16466n08218m92294m83497m79518m68853m53768m43425m35025
13929C2639631m18581l94105l75384l79697m08717m32147m09681l51025l25930
13920B9144364l70901m13826l63055k60248k48026l60888m51441l92202k63182
13911B6020595k34141l14527l50611k67296j81097k20741l35204l69218k81125
13902B3466635j90070k05482k87626l16867k57828j94858k04132k48639k43319
13893B1317814j90476j77923k37511k85309k46387j71205j56671k01234k27202
$$ plain form
13884 19423896 19208376 18993518 18765610 18562227 18407969 18244344 18009158 17749901 17560238
13875 17560238 17426720 17251008 17019524 16823492 16687383 16513709 16257799 16026176 15904919
13866 15904919 15803494 15597296 15340790 15186482 15137368 15041472 14829275 14603170 14459315 14355184
13856 14355184 14211317 14036628 13882868 13753245 13621607 13483241 13334323 13155263 12957789
13847 12957789 12792678 12672295 12546287 12390084 12245177 12128701 11986937 11799757 11646063
13838 11646063 11584355 11545515 11439493 11299255 11207969 11140564 11006081 10814460 10667816 10594657
13828 10594657 10520193 10407317 10303645 10228211 10129330 9989787 9867729 9791940 9713783 9607059
13818 9607059 9521936 9489350 9458731 9384200 9290994 9202815 9087235 8935593 8815794 8772901 8748816
$$ packed form
13884A9423896k15520k14858k27908k03383j54258j63625k35186k59257j89663
13875A7560238j33518j75712k31484j96032j36109j73674k55910k31623j21257
13866A5904919j01425k06198k56506j54308m9114r5896k12197k26105j43855j04131
13856A4355184j43867j74689j53760j29623j31638j38366j48918j79060j97474
13847A2957789j65111j20383j26008j56203j44907j16476j41764j87180j53694
13838A1646063o1708l8840j06022j40238r1286o7405j34483j91621j46644p3159
13828A0594657p4464j12876j03672p5434r8881j39543j22058p5789p8157j06724
13818I607059q5123l2586l0619p4531r3206q8179j15580j51642j19799m2893k4085
$$ plain form
13807 8748816 8675891 8582559 8524912 8477030 8381352 8258439 8172261 8122138 8058906 7979810 7920291
13796 7920291 7872893 7796689 7692800 7599294 7528622 7472810 7440204 7420367 7354358 7219956 7100561
13785 7100561 7073031 7072222 6984026 6837537 6765106 6782397 6759851 6634325 6502377 6454853 6450489
13774 6450489 6419026 6374416 6349151 6312911 6236172 6156048 6107440 6061675 5998066 5959038 5966025
13763 5966025 5959480 5897152 5833765 5820852 5805675 5725243 5629933 5606319 5635298 5639476 5621914 5636165
13751 5636165 5655311 5602590 5497688 5441564 5449915 5426747 5328087 5236885 5230776 5268543 5261182 5189578
13739 5189578 5105441 5061311 5067745 5082139 5034759 4912512 4806378 4808704 4875066 4875320 4779072 4685783
13727 4685783 4656167 4632425 4569766 4528611 4559297 4593485 4546131 4452682 4403356 4393579 4345783
$$ packed form
13807H748816p2925r3332n7647m7882r5678j22913q6178n0123o3232p9096n9519
13796G920291m7398p6204j03889r3506p0672n5812l2606j9837o6009j34402j19395
13785G100561k7530q09q8196j46489p2431J7291k2546j25526j31948m7524m364
13774F450489l1463m4610k5265l6240p6739q0124m8608m5765o3609l9028O987
13763E966025o545o2328o3387j2913j5177q0432r5310k3614K8979M178j7562J4251
13751E636165J9146n2721j04902n6124Q351k3168r8660r1202o109L7767p361p1604
13739E189578q4137m4130O434J4394m7380j22247j06134K326O6362K54r6248r3289
13727D685783k9616k3742o2659m1155L0686L4188m7354r3449m9326r777m7796
$$ plain form
13716 4345783 4251055 4185542 4188290 4209003 4190403 4138652 4095125 4081391 4084373 4071349 4022133 3961372
13704 3961372 3935881 3942086 3918278 3841809 3780939 3795154 3835196 3818033 3761056 3748300 3782961
13693 3782961 3775891 3688506 3592650 3561341 3578190 3588418 3573293 3539057 3490144 3448127 3444657 3463241
13681 3463241 3441463 3365389 3305718 3317432 3357910 3357201 3320018 3294811 3282190 3248288 3204585 3195342
13669 3195342 3211902 3196543 3141227 3109477 3133856 3156168 3111980 3026273 2973536 2973652 2981751 2965765
13657 2965765 2938590 2913513 2882025 2852416 2862179 2918679 2961686 2927717 2833616 2753744 2725071
13646 2725071 2722085 2722126 2737211 2764013 2760483 2710782 2667132 2676116 2698182 2661585 2576228 2526628
13634 2526628 2554178 2610065 2632753 2611320 2558094 2483400 2425954 2445352 2536868 2601488 2556181
$$ packed form
13716D345783r4728o5513K748K0713j8600n1751m3527j3734K982j3024m9216o0761
13704C961372k5491O205k3808p6469o0870J4215M0042j7163n6977j2756L4661
13693C782961p070q7385r5856l1309J6849J0228j5125l4236m8913m2017l470J8584
13681C463241k1778p6074n9671J1714M0478p09l7183k5207j2621l3902m3703r243
13669C195342J6560j5359n5316l1750K4379K2312m4188q5707n2737J16Q099j5986
13657B965765k7175k5077l1488k9609R763N6500M3007l3969r4101p9872k8673
13646B725071k986M1J5085K6802l530m9701m3650Q984K2066l6597q5357m9600
13634B526628K7550N5887K2688k1433n3226p4694n7446J9398R1516O4620m5307
$$ plain form
13623 2556181 2443006 2375392 2398842 2457734 2483406 2459377 2405439 2351569 2332742 2362941 2404342
13612 2404342 2400840 2350329 2306281 2299880 2302578 2282097 2254549 2252704 2271658 2277241 2252389 2211098
13600 2211098 2177362 2166049 2171234 2163097 2118137 2064958 2068011 2138934 2196062 2156202 2047434 1977514
13588 1977514 1994201 2034808 2029121 1995274 1994632 2031607 2051556 2023986 1978346 1953253 1948298 1938508
13576 1938508 1910732 1873534 1847720 1852050 1880994 1896558 1865742 1807164 1771217 1770262 1766003 1738001
13564 1738001 1719388 1735589 1750716 1720821 1669418 1655527 1684664 1708772 1706808 1706275 1721024 1724469
13552 1724469 1698822 1663211 1638609 1628026 1639638 1678539 1705654 1666853 1584156 1551295 1604425
13541 1604425 1665130 1659005 1621757 1622224 1643721 1627851 1589523 1590554 1625242 1632135 1607873 1607159 1627574
$$ packed form
13623B556181j13175o7614K3450N8892K5672k4029n3938n3870j8827L0199M1401
13612B404342l502n0511m4048o401K698k0481k7548j845J8954N583k4852m1291
13600B211098l3736j1313N185q137m4960n3179L053P0923N7128l9860j08768o9920
13588A977514J6687M0607n687l3847o42L6975J9949k7570m5640k5093m955r790
13576A938508k7776l7198k5814M330K8944J5564l0816n8578l5947r55m259k8002
13564A738001j8613J6201J5127k9895n1403j3891K9137K4108j964n33J4749L445
13552A724469k5647l5611k4602j0583J1612L8901K7115l8801q2697l2861N3130
13541A604425O0705o125l7248M67K1497j5870l8328J031L4688O893k4262p14K0415
$$ plain form
13528 1627574 1600955 1521002 1475201 1507726 1545333 1517315 1464656 1456453 1467984 1431767 1365240
13517 1365240 1352407 1413501 1476664 1482353 1447377 1413972 1393820 1383328 1389359 1411794 1426217 1408577
13505 1408577 1367470 1337944 1344532 1373792 1386041 1360548 1323744 1315223 1330725 1329391 1299554 1276490
13493 1276490 1281438 1288564 1277551 1271492 1284455 1277367 1218654 1152056 1142316 1178144 1193706 1170050
13481 1170050 1146928 1140888 1124044 1092629 1088680 1131531 1182984 1205716 1209997 1217374 1219408 1200623
13469 1200623 1170976 1150793 1146522 1155975 1173803 1184680 1179664 1181729 1218102 1264337 1261705 1200013
13457 1200013 1134392 1105258 1094761 1084284 1095876 1137877 1162371 1129435 1076763 1070319 1108472
13446 1108472 1126375 1084505 1011675 966107 981455 1039700 1077899 1045467 975360 961522 1033225
$$ packed form
13528A627574k6619p9953m5801L2525L7607k8018n2659q203J1531l6217o6527
13517A365240j2833O1094O3163N689l4976l3405k0152j0492O031K2435J4423j7640
13505A408577m1107k9526O588K9260J2249k5493l6804q521J5502j334k9837k3064
13493A276490M948P126j1013o059J2963p088n8713o6598r740L5828J5562k3656
13481A170050k3122o040j6844l1415l949M2851N1453K2732M281P377K034j8785
13469A200623k9647k0183m271R453J7828J0877n016K065L6373M6235k632o1692
13457A200013o5621k9134j0497j0477J1592M2001K4494l2936n2672o444L8153
13446A108472J7903m1870p2830m5568J5348N8245L8199l2432p0107j3838P1703
$$ plain form
13435 1033225 1096024 1051354 939038 889154 946342 1018799 1013193 951869 921659 951995 989716
13424 989716 980771 938909 920648 946982 975543 963959 936307 945726 981863 977623 920971 888838
13412 888838 930906 988551 989381 959422 960767 969553 917453 826272 791298 833832 875666 872069
13400 872069 867254 891017 899959 866477 839326 859580 887539 872383 835809 827341 844174 850605
13388 850605 837127 812948 780323 759479 792898 876385 931129 897689 817912 771834 774683 791493
13376 791493 810562 837004 847803 821781 790194 795124 820416 822689 804348 794525 786881 764227
13364 764227 755777 793492 836412 822559 777327 778220 821958 827911 779358 755758 797785 839175
13352 839175 817040 765154 743788 747325 740193 728532 736483 751790 748358 732885 725640 721305 704909
$$ packed form
13435A033225O2799m4670j12316m9884N7188P2457n606o1324l0210L0336L7721
13424I89716q945m1862j8261K6334K8561j1584k7652R419L6137m240n6652l2133
13412H88838M2068N7645Q30k9959J345Q786n2100r1181l4974M2534M1834l597
13400H72069m815K3763Q942l3482k7151K0254K7959j5156l6574q468J6833O431
13388H50605j3478k4179l2625k0844L3419Q3487N4744l3440p9777m6078K849J6810
13376G91493J9069K6442J0799k6022l1587M930K5292K273j8341r823p644k2654
13364G64227q450L7715M2920j3853m5232Q93M3738N953m8553k3600M2027M1390
13352H39175k2135n1886k1366L537p132j1661P951J5307l432j5473p245m335j6396
$$ plain form
13339 704909 683314 673630 683202 715590 764064 791243 761555 704226 686693 711280 709045 661346
13327 661346 642609 692723 732252 681547 595827 588189 662730 719864 703366 652667 619983 615903
13315 615903 634088 660311 660421 621604 595383 634202 698620 702011 639608 591475 595416 603479
13303 603479 581397 566248 591343 626151 633233 627497 636534 649065 643179 627909 621432 619762 614625
13290 614625 610935 605577 585029 562955 577136 625808 654234 635536 617457 647773 695106 694458
13278 694458 642974 599184 602235 636627 669614 686013 686670 679224 672307 666980 658922 650381 642215
13265 642215 617384 566099 527646 557509 638901 684259 653876 612760 623592 643964 601668
13254 601668 528170 526093 614817 696219 690315 633844 612183 645075 680444 673795 636633 612202
$$ packed form
13339G04909k1595r684R572L2388M8474K7179k9688n7329j7533K4587k235m7699
13327F61346j8737N0114L9529n0705q5720p638P4541N7134j6498n0699l2684m080
13315F15903J8185K6223J10l8817k6221L8819O4418L391o2403m8133L941Q063
13303F03479k2082j5149K5095L4808P082n736R037J2531n886j5270o477j670n137
13290F14625l690n358k0548k2074J4181M8672K8426j8698j8079L0316M7333o48
13278F94458n1484m3790L051L4392L2987J6399O57p446o917n327q058q541q166
13265F42215k4831n1285l8453K9863Q1392M5358l0383m1116J0832K0372m2296
13254F01668p3498k077Q8724Q1402n904n6471k1661L2892L5369o649l7162k4431
$$ plain form
13242 612202 624495 654930 666012 645871 620969 621684 649704 686444 714722 721325 700922 672564
13230 672564 668276 688774 698145 680425 666817 682122 703281 704434 702786 718510 729949 718401
13218 718401 717676 760535 811696 818677 795905 788464 786918 759484 736551 767325 815939 808182 768143
13205 768143 788175 862242 882312 822670 787369 827168 851328 796565 747750 787128 843773
13194 843773 819323 764442 787219 860477 872470 819019 790449 798953 777769 739054 767353 843778
13182 843778 842990 745260 690913 756099 824398 777757 683750 669748 713386 701117 630186 603108
13170 603108 646737 676996 649373 620776 633414 643235 610884 579917 605194 661641 684361 661644
13158 661644 632685 618415 608579 604239 619868 641145 628204 576355 534798 539372 557601 537940
$$ packed form
13242F12202J2293L0435J1082k0141k4902P15K8020L6740K8278O603k0403k8358
13230F72564m288K0498R371j7720j3608J5305K1159J153j648J5724J1439j1548
13218G18401p25M2859N1161O981k2772p441j546k7434k2933L0774M8614p757m0039
13205G68143K0032P4067K0070n9642l5301L9799K4160n4763m8815L9378N6645
13194H43773k4450n4881K2777P3258J1993n3451k8570Q504k1184l8715K8299P6425
13182H43778p88r7730n4347O5186O8299m6641r4007j4002M3638j2269p0931k7078
13170F03108M3629L0259k7623k8597J2638R821l2351l0967K5277N6447K2720k2717
13158F61644k8959j4270r836m340J5629K1277j2941n1849m1557M574J8229j9661
$$ plain form
13146 537940 493837 487694 530011 552016 507077 448569 454058 506095 518877 473034 444961 484873
13134 484873 540319 541437 500638 472451 462192 440449 416297 423961 451683 455283 439850 456885
13122 456885 511102 541080 516168 485589 493301 504501 470728 421311 422983 472932 500402 470429
13110 470429 424164 406756 410513 412630 424790 469490 530442 560694 535811 480891 446975 466605
13098 466605 523276 561163 539714 482624 453305 475956 506705 496261 453055 422122 427390 462995
13086 462995 516055 560649 552462 480263 411568 429071 517668 572703 535643 463462 436618 457191
13074 457191 482162 504559 538469 558671 528279 473738 462078 500489 523121 492366 453855
13063 453855 463179 506210 528362 509738 475014 450623 445954 463980 499776 531114 533077 506929
$$ packed form
13146E37940m4103o143M2317K2005m4939n8508N489N2037J2782m5843k8073L9912
13134D84873N5446J118m0799k8187j0259k1743k4152P664K7722L600j5433J7035
13122D56885N4217K9978k4912l0579P712J1200l3773m9417J672M9949K7470k9973
13110D70429m6265j7408L757K117J2160M4700O0952L0252k4883n4920l3916J9630
13098D66605N6671L7887k1449n7090k9319K2651L0749j0444m3206l0933N268L5605
13086D62995N3060M4594q187p2199o8695J7503Q8597N5035l7060p2181k6844K0573
13074D57191K4971K2397L3910K0202l0392n4541j1660L8411K2632l0755l8511
13063D53855R324M3031K2152j8624l4724k4391m669J8026L5796L1338J963k6148
$$ plain form
13051 506929 485423 503989 561304 606957 585120 504934 445051 458643 498387 485231 433112
13040 433112 431519 498914 540458 491581 424456 442123 523705 561423 522334 482015 498081 534025
13028 534025 532860 502519 491427 518837 562976 594984 599547 577676 547990 537205 559084 604620
13016 604620 647856 655659 610480 542391 516027 554237 596683 577989 527683 531923 601005 647472
13004 647472 614993 558517 554289 587879 591781 558358 546664 584440 624568 615122 572290 557652
12992 557652 599869 660992 681588 648777 608881 609501 643469 668180 669560 674786 699643 719523
12980 719523 708323 675253 642498 614500 594335 603329 650706 701875 712731 686228 663415 666494
12968 666494 683182 701562 723877 743250 741907 722956 714611 729768 747882 752268 757809 777257
$$ packed form
13051E06929k1506J8566N7315M5653k1837q0186n9883J3592L9744j3156n2119
13040D33112j593O7395M1544m8877o7125J7667Q1582L7718l9089m0319J6066L5944
13028E34025j165l0341j1092K7410M4139L2008M563k1871k9686j0785K1879M5536
13016F04620M3236P803m5179o8089k6364L8210M2446j8694n0306M240O9082M6467
13004F47472l2479n6476m228L3590L902l3423j1694L7776M0128r446m2832j4638
12992E57652M2217O1123K0596l2811l9896O20L3968K4711J380N226K4857J9880
12980G19523j1200l3070l2755k7998k0165Q994M7377N1169J0856k6503k2813L079
12968F66494J6688J8380K2315J9373j343j8951q345J5157J8114M386N541J9448
$$ plain form
12956 777257 784494 749049 696670 690473 743260 791998 784978 755093 762280 792802 781533 727128
12944 727128 705536 746120 775641 738913 701191 745824 824940 823225 746247 719072 785430 837565
12932 837565 796074 740671 776050 860784 879505 826523 800114 840199 884936 890150 890395 916916
12920 916916 935847 906321 847496 813649 832806 885891 921933 894800 815820 760694 785683
12909 785683 851990 882255 873465 886974 935873 962540 937805 903400 894273 894519 898617 938330
12897 938330 1007520 1035249 988390 936060 951913 1011682 1053310 1080528 1125914 1158497 1123595
12886 1123595 1050335 1025006 1064524 1105105 1117957 1145376 1204224 1240408 1214959 1163690 1131210
12875 1131210 1110231 1091081 1107252 1170815 1216250 1184743 1129931 1155541 1261455 1339046 1327421
$$ packed form
12956G77257P237l5445n2379o197N2787M8738p020k9885P187L0522j1269n4405
12944G27128k1592M0584K9521l6728l7722M4633P9116j715p6978k7175O6358N2135
12932H37565m1491n5403L5379Q4734J8721n2982k6409M0085M4737N214K45K6521
12920I16916J8931k9526n8825l3847J9157N3085L6042k7133p8980n5126K4989
12909G85683O6307L0265q790J3509M8899K6667k4735l4405r127K46M098L9713
12897I38330O9190K7729m6859n2330J5853N9769M1628K7218M5386L2583l4902
12886A123595p3260k5329L9518M0581J2852K7419N8848L6184k5449n1269l2480
12875A131210k0979j9150J6171O3563M5435l1507n4812K5610J05914P7591j1625
$$ plain form
12864 1327421 1287408 1289469 1311246 1304875 1297087 1337250 1388002 1369425 1302690 1302440 1401584 1485682
12852 1485682 1457837 1381508 1377208 1443960 1486393 1479996 1493992 1555938 1605807 1605786 1596995 1612590
12840 1612590 1623928 1616705 1635397 1695963 1733464 1705904 1680602 1735540 1831645 1874996 1865235 1884307
12828 1884307 1959983 2037667 2082096 2116040 2152392 2171965 2181855 2218250 2274065 2297860 2285134
12817 2285134 2296257 2356466 2413415 2432753 2462045 2544204 2630929 2654344 2642782 2686493 2804716
12806 2804716 2920709 2974046 2995054 3044170 3123369 3187260 3222947 3274581 3375465 3487429 3546604
12795 3546604 3563587 3627256 3783940 3958329 4043785 4041451 4048139 4121190 4225101 4314280 4396891
12784 4396891 4495660 4606722 4725060 4858751 4992652 5090463 5159009 5254051 5391054 5511806
$$ packed form
12864A327421m0013K061K1777o371p788M0163N0752j8577o6735k50R9144Q4098
12852A485682k7845p6329m300O6752M2433o397J3996O1946M9869k1q791J5595
12840A612590J1338p223J8692O0566L7501k7560k5302N4938R6105M3351r761J9072
12828A884307P5676P7684M4429L3944L6352J9573R890L6395N5815K3795j2726
12817B285134J1123O0209N6949J9338K9292Q2159Q6725K3415j1562M3711J18223
12806B804716J15993N3337K1008M9116P9199O3891L5687N1634J00884J11964N9175
12795C546604J6983O3669J56684J74389Q5456k334O688P3051J03911Q9179Q2611
12784D396891R8769J11062J18338J33691J33901R7811O8546R5042J37003J20752
$$ plain form
12774 5511806 5582452 5662557 5818358 6020139 6192873 6325697 6458039 6592374 6703670 6816865
12764 6816865 6989472 7216207 7426502 7586677 7736375 7908649 8080902 8234205 8404928
12755 8404928 8635385 8906480 9158623 9365603 9562051 9803715 10114316 10468898 10824736
12746 10824736 11165516 11504401 11847681 12188346 12546003 12965660 13444592 13912086 14336952
12737 14336952 14805534 15411542 16104170 16750975 17342215 18013130 18838092 19723118 20565808
12728 20565808 21417396 22389491 23470544 24546396 25570331 26604645 27695506 28802638
12720 28802638 29876657 30933629 32019073 33147288 34306587 35486791 36673472 37844540
12712 37844540 38997748 40157045 41328557 42473315 43549966 44566356 45558655 46528782
$$ packed form
12774E511806P0646Q0105J55801K01781J72734J32824J32342J34335J11296J13195
12764F816865J72607K26735K10295J60175J49698J72274J72253J53303J70723
12755H404928K30457K71095K52143K06980J96448K41664L10601L54582L55838
12746A0824736L40780L38885L43280L40665L57657M19657M78932M67494M24866
12737A4336952M68582O06008O92628O46805N91240O70915Q24962Q85026Q42690
12728B0565808Q51588R72095J081053J075852J023935J034314J090861J107132
12720B8802638J074019J056972J085444J128215J159299J180204J186681J171068
12712C7844540J153208J159297J171512J144758J076651J016390R92299R70127
$$ plain form
12704 46528782 47434700 48246871 48990195 49718489 50459673 51193356 51870731 52446833 52901775
12695 52901775 53243044 53488252 53644843 53712680 53701808 53621518 53438259 53077010 52506558 51809564
12685 51809564 51115080 50456441 49750559 48935056 48061708 47209074 46360368 45442358 44453722
12676 44453722 43466628 42499654 41472007 40312952 39055141 37783267 36538761 35317086
12668 35317086 34121669 32968714 31851512 30742682 29634813 28552002 27513376 26500356
12660 26500356 25473059 24420242 23381338 22400984 21467251 20531618 19600192 18751160 18022067
12651 18022067 17335206 16605782 15881140 15276419 14794125 14322691 13819140 13366052 13008083
12642 13008083 12658970 12246437 11839280 11528861 11271276 10965029 10622294 10334567 10106057
$$ packed form
12704D6528782R05918Q12171P43324P28294P41184P33683O77375N76102M54942
12695E2901775L41269K45208J56591O7837j0872q0290j83259l61249n70452o96994
12685E1809564o94484o58639p05882q15503q73348q52634q48706r18010r88636
12676D4453722r87094r66974j027647j159055j257811j271874j244506j221675
12668C5317086j195417j152955j117202j108830j107869j082811j038626j013020
12660B6500356j027297j052817j038904r80354r33733r35633r31426q49032p29093
12651A8022067o86861p29424p24642o04721m82294m71434n03551m53088l57969
12642A3008083l49113m12533m07157l10419k57585l06247l42735k87727k28510
$$ plain form
12633 10106057 9855519 9573770 9346812 9201364 9043571 8794591 8497665 8243666 8060353
12624 8060353 7918440 7786746 7638407 7453196 7254568 7102796 7015876 6934269 6795113 6606803
12614 6606803 6422567 6274609 6162298 6074352 5994084 5903745 5800882 5691215 5565415 5418357
12604 5418357 5288200 5222458 5197041 5131245 5004013 4889708 4844215 4821409 4752704 4650586
12594 4650586 4569901 4513108 4445010 4368060 4308718 4251405 4163288 4073647 4046683 4069457 4048459
12583 4048459 3943864 3833746 3800322 3812832 3785151 3708870 3652855 3641900 3615925 3533509 3448751
12572 3448751 3431973 3455319 3427042 3328376 3241825 3225510 3229075 3179354 3094749 3049868 3058983 3066468
12560 3066468 3040726 3006178 2978481 2936352 2875856 2833388 2828019 2828837 2807236 2781362 2781828 2806284
$$ packed form
12633A0106057k50538k81749k26958j45448j57793k48980k96926k53999j83313
12624H060353j41913j31694j48339j85211j98628j51772q6920q1607j39156j88310
12614F606803j84236j47958j12311q7946q0268r0339j02863j09667j25800j47058
12604E418357j30157o5742k5417o5796j27232j14305m5493k2806o8705j02118
12594D650586q0685n6793o8098p6950n9342n7313q8117q9641k6964K2774k0998
12583D048459j04595j10118l3424J2510k7681p6281n6015j0955k5975q2416q4758
12572C448751j6778K3346k8277r8666q6551j6315L565m9721q4605m4881R115P485
12560C066468k5742l4548k7697m2129o0496m2468n369Q18k1601k5874M66K4456
$$ plain form
12548 2806284 2829077 2826340 2781164 2701954 2642681 2654954 2707038 2706702 2623868 2529486 2487408 2477273
12536 2477273 2464149 2471400 2523025 2574181 2571125 2536172 2522778 2524058 2498367 2455203 2441579 2463158
12524 2463158 2486714 2502525 2519253 2516557 2471806 2419691 2417435 2461598 2503993 2535765 2584717 2640070
12512 2640070 2658669 2649091 2675267 2762785 2863651 2928197 2959322 2985059 3023148 3077239 3129468
12501 3129468 3145498 3125680 3125367 3174008 3211687 3175000 3103904 3072213 3050482 2953565 2802354
12490 2802354 2705589 2679310 2622271 2493546 2377414 2330989 2300035 2239920 2190819 2167541 2102889
12479 2102889 1980079 1896479 1901459 1891924 1780827 1656087 1639664 1685811 1668187 1592269 1561436
12468 1561436 1580829 1557445 1474664 1413712 1401746 1377492 1320433 1289464 1311975 1341726 1345783
$$ packed form
12548B806284K2793k737m5176p9210n9273J2273N2084l36q2834r4382m2078j0135
12536B477273j3124P251N1625N1156l056l4953j3394J280k5691m3164j3624K1579
12524B463158K3556J5811J6728k696m4751n2115k256M4163M2395L1772M8952N5353
12512B640070J8599r578K6176Q7518J00866O4546L1125K5737L8089N4091N2229
12501C129468J6030j9818l13M8641L7679l6687p1096l1691k1731r6917j51211
12490B802354r6765k6279n7039j28725j16132m6425l0954o0115m9101k3278o4652
12479B102889j22810q3600M980r535j11097j24740j6423M6147j7624p5918l0833
12468A561436J9393k3384q2781o0952j1966k4254n7059l0969K2511K9751M057
$$ plain form
12457 1345783 1337848 1316091 1264464 1219904 1234016 1261942 1203346 1070972 999035 1050667 1133343
12446 1133343 1152040 1133203 1133274 1128362 1078373 1021843 1018769 1051528 1059689 1034334 1011626 1004284 997622
12433 997622 989772 988414 986249 973035 951372 920369 873527 827701 815340 833970 847366 847119
12421 847119 859155 879299 869658 837121 839741 886186 908798 876058 848538 870539 890099 855635
12409 855635 813904 826745 855821 827708 767146 762030 818680 850352 809566 750470 745034 792643
12397 792643 828669 796536 713534 672792 746680 878293 928851 857423 775405 778876 820251
12386 820251 819199 804158 837013 879611 865148 839633 889100 971947 979368 934475 962486 1067430
12374 1067430 1117103 1074329 1061388 1137877 1191320 1139260 1079186 1115894 1174497 1130174 1023628
$$ packed form
12457A345783p935k1757n1627m4560J4112K7926n8596j32374p1937N1632Q2676
12446A133343J8697j8837P1m912m9989n6530l074L2759Q161k5355k2708p342o662
12433I97622p850j358k165j3214k1663l1003m6842m5826j2361J8630J3396k47
12421H47119J2036K0144r641l2537K620M6445K2612l2740k7520K2001J9560l4464
12409H55635m1731J2841K9076k8113o0562n116N6650L1672m0786n9096n436M7609
12397G92643L6026l2133q3002m0742P3888J31613N0558p1428q2018L471M1375
12386H20251j052j5041L2855M2598j4463k5515M9467Q2847P421m4893K8011J04944
12374A067430M9673m2774j2941P6489N3443n2060o0074L6708N8603m4323j06546
$$ plain form
12363 1023628 990311 1037426 1045997 966361 870275 813703 774672 740598 744864 784792 793587 736222
12351 736222 668437 657995 690967 695400 636128 557438 533034 580065 631618 616715 562659 565950
12339 565950 643837 685294 604641 480162 453681 531214 583804 535044 446776 405575 416752
12328 416752 443181 471505 496342 497899 478475 474460 495037 494615 444695 387862 374774 387847
12316 387847 381962 370085 403532 476798 515477 471826 385917 330916 330376 353660 370856 383330
12304 383330 405428 438459 468683 481732 475142 459918 448179 434951 399497 338755 293667 313309
12292 313309 381974 415277 360789 277455 267374 340798 407487 405486 371278 357600 350777 320164
12280 320164 293693 316351 368851 397433 400286 411791 417254 364791 264401 196018 200842 233958
$$ packed form
12363A023628l3317M7115Q571p9636r6086n6572l9031l4074M266L9928Q795n7365
12351G36222o7785j0442L2972M433n9272p8690k4404M7031N1553j4903n4056L291
12339E65950P7887M1457q0653j24479k6481P7533N2590m8760q8268m1201J1177
12328D16752K6429K8324K4837J557j9424m015K0577m22m9920n6833j3088J3073
12316C87847n885j1877L3447P3266L8679m3651q5909n5001n40K3284J7196J2474
12304C83330K2098L3031L0224J3049o590j5224j1739j3228l5454o0742m5088J9642
12292C13309O8665L3303n4488q3334j0081P3424O6689k001l4208j3678o823l0613
12280C20164k6471K2658N2500K8582K853J1505N463n2463j00390o8383M824L3116
$$ plain form
12268 233958 248696 261901 301757 348409 367376 358679 337613 306048 272393 257873 255132 229722
12256 229722 193939 218248 319609 399346 364748 267222 233898 288258 332805 308499 277490
12245 277490 317631 406146 453709 415354 332026 282995 313997 392567 430963 380061 295710
12234 295710 272596 318536 351898 329826 307099 334569 367627 336509 262535 232700 276650
12223 276650 334929 349552 330547 320652 336072 359961 368903 353153 326294 317439 339900 373512
12211 373512 393712 403064 410045 398370 357463 326153 352115 412778 436686 409945 396672 435005
12199 435005 481601 493659 496166 515184 511535 455573 412771 460016 550908 571156 515919 496278
12187 496278 554875 595019 542394 469731 481065 552230 580526 541612 501918 502752 520393 530024
$$ packed form
12268B33958J4738J3205L9856M6652J8967q697k1066l1565l3655j4520k741k5410
12256B29722l5783K4309J01361P9737l4598r7526l3324N4360M4547k4306l1009
12245B77490M0141Q8515M7563l8355q3328m9031L1002P8570L8396n0902q4351
12234B95710k3114M5940L3362k2072k2727K7470L3058l1118p3974k9835M3950
12223B76650N8279J4623j9005r895J5420K3889Q942j5750k6859q855K2461L3612
12211C73512K0200R352O981j1675m0907l1310K5962O0663K3908k6741j3273L8333
12199D35005M6596J2058K507J9018l649n5962m2802M7245R0892K0248n5237j9641
12187D96278N8597M0144n2625p2663J1334P1165K8296l8914l9694Q34J7641R631
$$ plain form
12175 530024 531594 515034 467589 415836 401725 420915 440342 462788 507279 540695 512743 456419
12163 456419 460232 526597 555275 498750 435745 439179 464478 441250 396044 395365 426236 428439
12151 428439 403904 397615 397662 354165 287441 278367 340693 390260 364590 300684 266571 276605
12139 276605 303204 320994 312629 275754 246375 271426 338164 375708 346898 292176 261324 253388
12127 253388 252924 271781 312512 335603 312327 276422 275480 300475 312460 311943 326032 345142 332483
12114 332483 291294 266365 274788 286119 280183 275948 287816 299469 304138 327940 379370 410539
12102 410539 374088 300659 271081 311937 363699 366327 336142 327839 349568 360951 346734 341782
12090 341782 368426 394086 384236 363764 379157 418316 423169 381662 350878 370675 404688 399888
$$ packed form
12175E30024J570j6560m7445n1753j4111J9190J9427K2446M4491L3416k7952n6324
12163D56419L813O6365K8678n6525o3005L434K5299k3228m5206o79L0871K203
12151D28439k4535o289M7m3497o6724r074O2326M9567k5670o3906l4113J0034
12139B76605K6599J7790q365l6875k9379K5051O6738L7544k8810n4722l0852p936
12127B53388m64J8857M0731K3091k3276l5905r42K4995J1985n17J4089J9110j2659
12114C32483m1189k4929Q423J1331n936m235J1868J1653M669K3802N1430L1169
12102D10539l6451p3429k9578M0856N1762K628l0185q303K1729J1383j4217m952
12090C41782K6644K5660r850k0472J5393L9159M853m1507l0784J9797L4013m800
$$ plain form
12078 399888 365389 348770 358388 356864 325838 296228 306317 354658 402339 409802 372980 332803
12066 332803 339744 396524 449493 451914 416773 385149 366425 346088 333034 347833 368272 344421
12054 344421 283235 263164 329720 418824 432053 363555 299027 296348 323872 331167 327723 350016
12042 350016 382016 366835 298862 249395 271878 321718 317268 259633 233217 282930 349011 351364
12030 351364 291965 232062 201933 185245 174912 187667 220862 242424 235928 220188 213827 213245
12018 213245 215531 228967 247170 246844 229006 228490 258154 275807 240445 177827 150003 170144
12006 170144 187751 162169 118652 116670 177477 254774 274935 207858 102279 43505 67558
11995 67558 125621 144107 108169 67075 64844 91845 110524 106370 96316 96638 102515 103668 105457
$$ packed form
12078C99888l4499j6619R618j524l1026k9610J0089M8341M7681P463l6822m0177
12066C32803O941N6780N2969K421l5141l1624j8724k0337j3054J4799K0439k3851
12054C44421o1186k0071O6556Q9104J3229o8498o4528k679K7524P295l444K2293
12042C50016L2000j5181o7973m9467K2483M9840m450n7635k6416M9713O6081K353
12030C51364n9399n9903l0129j6688j0333J2755L3195K1562o496j5740o361n82
12018B13245K286J3436J8203l26j7838n16K9664J7653l5362o2618k7824K0141
12006A70144J7607k5582m3517j982O0807P7297K0161o7077j05579n8774K4053
11995F7558N8063J8486l5938m1094k231K7001J8679m154j0054L22N877J153J789
$$ plain form
11982 105457 119139 135357 128516 96109 72599 83686 104156 92657 58258 52081 91448 136586
11970 136586 154337 158744 166052 157572 124047 103641 127345 161781 160899 142615 149171 159939 126369
11957 126369 78919 99122 174812 191810 111781 52115 112819 214024 211687 113316 53463
11946 53463 81560 107915 73371 44972 90730 160924 169191 123061 95195 108911 127184 128678
11934 128678 125797 120307 99556 69765 46569 25419 6079 23284 94177 156252 133340 57163
11922 57163 37365 98174 138253 92528 42319 89550 188905 204787 107917 15232 25952 102600
11910 102600 147441 133930 113590 127154 159375 175063 163747 141145 125562 123231 130502 142054
11898 142054 154711 166188 174295 177433 174233 166548 164916 179143 193846 172130 107255 51927
$$ packed form
11982A05457J3682J6218o841l2407k3510J1087K0470j1499l4399o177L9367M5138
11970A36586J7751M407P308q480l3525k0406K3704L4436q82j8284O556J0768l3570
11957A26369m7450K0203P5690J6998q0029n9666O0704J01205k337r8371n9853
11946E3463K8097K6355l4544k8399M5758P0194Q267m6130k7866J3716J8273J494
11934A28678k881n490k0751k9791k3196k1150j9340J7205P0893O2075k2912p6177
11922E7163j9798O0809M0079m5725n0209M7231R9355J5882r6870r2685J0720P6648
11910A02600M4841j3511k0340J3564L2221J5688j1316k2602j5583k331P271J1552
11898A42054J2657J1477Q107L138l200p685j632J4227J4703k1716o4875n5328
$$ plain form
11886 51927 58124 102197 122283 121531 160291 233281 243029 142266 22932 -4847 45027 91863
11874 91863 120801 156968 163188 91019 5658 22324 120518 161186 104315 61968 94650 109466
11862 109466 38075 -28603 5843 75679 70977 27833 54225 133885 158618 116791 96398 116871
11850 116871 107429 56688 40234 76794 90602 52193 31575 65565 91914 73879 76254 141750
11838 141750 193344 151610 68629 46611 84254 104247 89155 87601 108930 109608 81667 70951
11826 70951 97539 125130 123004 103951 86770 67807 46593 42065 62657 83614 72756 31375
11814 31375 1170 25988 97225 143874 105191 15605 -22311 35558 119150 141546 106761 79500
11802 79500 86024 97581 89790 67731 42252 20749 13624 23354 42037 74587 128811 165873
$$ packed form
11886E1927O197M4073K0086p52L8760P2990R748j00763j19334k7779M9874M6836
11874I1863K8938L6167O220p2169q5361J6666R8194M0668n6871m2347L2682J4816
11862A09466p1391o6678L4446O9836m702m3144K6392P9660K4733m1827k0393K0473
11850A16871r442n0741j6454L6560J3808l8409k0618L3990K6349j8035K375O5496
11838A41750N1594m1734q2981k2018L7643J9993j5092j554K1329O78k7941j0716
11826G0951K6588K7591k126j9053j7181j8963k1214m528K0592K0957j0858m1381
11814C1375l0205K4818P1237M6649l8683q9586l7916N7869Q3592K2396l4785k7261
11802G9500O524J1557p791k2059k5479k1503p125R730J8683L2550N4224L7062
$$ plain form
11790 165873 122308 21046 -13690 77122 177683 154153 59974 52302 138642 167485 82402
11779 82402 17458 75951 162645 140877 44046 4400 45061 75428 55235 35264 42948 43012
11767 43012 26212 37617 86232 108450 62145 -5449 -25119 8886 59809 108741 148044 151759
11755 151759 107509 58603 61066 104870 126627 101746 73584 77552 87426 69898 50314 73431
11743 73431 122159 134118 95007 56479 50678 47141 22072 12829 55729 112833 119053 76157
11731 76157 42238 45508 66235 90295 117433 122141 74096 4207 -14363 34855 91753 113311
11719 113311 122808 142842 146513 113018 74126 62029 59533 43904 33594 47862 64437 62178
11707 62178 62083 80286 87157 64502 54643 91387 128663 108989 62115 55477 80333 77361 53250
$$ packed form
11790A65873m3565j01262l4736R0812J00561k3530r4179p672Q6340K8843q5083
11779H2402o4944N8493Q6694k1768r6831l9646M0661L0367k0193j9971P684O4
11767D3012j6800J1405M8615K2218m6305o7594j9670L4005N0923M8932L9303L715
11755A51759m4250m8906K463M3804K1757k4881k8162L968R874j7528j9584K3117
11743G3431M8728J1959l9111l8528n801l537k5069r243M2900N7104O220m2896
11731G6157l3919L270K0727K4060K7138M708m8045o9889j8570M9218N6898K1558
11719A13311R497K0034L671l3495l8892j2097k496j5629j0310J4268J6575k259
11707F2178r5J8203O871k2655r859L6744L7276j9674m6874o638K4856k972k4111
$$ plain form
11694 53250 72293 135007 164563 129839 91535 98836 121400 118409 101882 90871 67965 27499
11682 27499 11840 50792 108525 136094 138818 148935 167004 174373 173540 172903 157368 116920 82702
11669 82702 91010 125720 137890 115583 97124 114244 151222 168245 150214 124065 126086 151623
11657 151623 152678 104056 53303 66663 135494 186056 182125 160913 157399 156562 144571 143692 159912
11644 159912 154956 114561 88947 114346 147211 135123 103989 108167 137843 150325 155625 187843
11632 187843 219475 194646 134022 115553 152517 179551 166566 157714 180252 201689 204942 223386
11620 223386 264620 277197 239384 211274 245440 305786 330631 321999 313231 298776 264941 250530
11608 250530 300149 377420 397093 339914 276867 277662 341852 420619 465870 458859 425911 422807
$$ packed form
11694E3250J9043O2714K9556l4724l8304P301K2564k991j6527j1011k2906m0466
11682B7499j5659L8952N7733K7569K724J0117J8069P369q33o37j5535m0448l4218
11669H2702Q308L4710J2170k2307j8459J7120L6978J7023j8031k6149K021K5537
11657A51623J055m8622n0753J3360O8831N0562l931k1212l514q37j1991q79J6220
11644A59912m956m0395k5614K5399L2865j2088l1134M178K9676J2482N300L2218
11632A87843L1632k4829o0624j8469L6964K7034j2985q852K2538K1437L253J8444
11620B23386M1234J2577l7813k8110L4166O0346K4845q632q768j4455l3835j4411
11608B50530M9619P7271J9673n7179o3047P95O4190P8767M5251p011l2948l104
$$ plain form
11596 422807 474353 541038 574346 581548 595945 611804 606088 602743 644310 706672 718154 670493
11584 670493 634097 644562 653648 627614 614585 656557 701416 678614 617257 604871 651130 676803
11572 676803 637750 583719 576674 611849 644808 649996 627464 589646 564965 581467 624706 641812
11560 641812 607755 557921 535369 538734 546021 553910 559987 538931 479215 419512 402688 411047
11548 411047 395636 356452 337946 347972 341845 300050 265254 275216 304992 309331 286753 266256
11536 266256 258795 258165 267662 288603 297811 272818 230587 209584 220313 242223 261563 280758
11524 280758 293399 281459 242638 198492 171100 166132 176855 191324 201006 212646 237829 260476
11512 260476 242930 188332 162189 208107 270817 263201 194662 162007 210007 274972 288120 263852
$$ packed form
11596D22807N1546O6685L3308P202J4397J5859n716l345M1567O2362J1482m7661
11584F70493l6396J0465R086k6034j3029M1972M4859k2802o1357j2386M6259K5673
11572F76803l9053n4031p045L5175L2959N188k2532l7818k4681J6502M3239J7106
11560F41812l4057m9834k2552L365P287P889O077k1056n9716n9703j6824Q359
11548D11047j5411l9184j8506J0026o127m1795l4796R962K9776M339k2578k0497
11536B66256p461o30R497K0941R208k4993m2231k1003J0729K1910J9340J9195
11524B80758J2641j1940l8821m4146k7392m968J0723J4469R682J1640K5183K2647
11512B60476j7546n4598k6143M5918O2710p616o8539l2655M8000O4965J3148k4268
$$ plain form
11500 263852 246472 232258 200356 174847 190631 222686 213247 161649 130607 158180 209372 227872
11488 227872 202435 167326 159206 186370 227558 252773 250711 235696 225071 219102 209616 195834
11476 195834 182662 176078 185999 214245 234251 213437 169471 165913 224089 278071 259398 193561
11464 193561 158455 170836 178775 158445 148938 179319 222874 247323 259156 269108 257409 208391
11452 208391 148174 115020 115416 134915 166019 197256 201488 170073 139161 146919 180343 200571
11440 200571 205568 222551 245097 233061 189100 181042 248827 326751 315356 219410 152291 187572
11428 187572 264157 280242 235637 214646 249127 280303 267303 251770 274649 300683 288203
11417 288203 276055 319516 379000 368251 297177 264483 301838 330869 305789 293557 350982
$$ packed form
11500B63852j7380j4214l1902k5509J5784L2055r439n1598l1042K7573N1192J8500
11488B27872k5437l5109q120K7164M1188K5215k062j5015j0625n969r486j3782
11476A95834j3172o584R921K8246K0006k0814m3966l558N8176N3982j8673o5837
11464A93561l5106J2381P939k0330r507L0381M3555K4449J1833R952j1699m9018
11452B08391o0217l3154L96J9499L1104L1237M232l1415l0912P758L3424K0228
11440B00571M997J6983K2546j2036m3961q058O7785P7924j1395r5946o7119L5281
11428A87572P6585J6085m4605k0991L4481L1176j3000j5533K2879K6034j2480
11417B88203j2148M3461N9484j0749p1074l2694L7355K9031k5080j2232N7425
$$ plain form
11406 350982 413513 395139 334923 340658 418913 465738 423938 354819 333537 352805 366931 370156
11394 370156 383373 399652 389740 348381 303858 286876 306463 347696 381136 385257 370468 370100
11382 370100 397801 425878 418769 379991 352028 370541 427153 478251 485128 443312 377917 321163
11370 321163 298727 322795 377341 415915 402462 359471 346181 377409 396629 351602 265923
11359 265923 204822 196361 223025 266917 316166 341147 317729 274487 269139 312699 360991 386363
11347 386363 407319 432122 426412 369962 305565 291669 331209 382530 419843 445637 457316 442172
11335 442172 406569 378806 374138 375993 360514 329150 309649 326506 371757 408655 410551 390615
11323 390615 378679 374177 348427 298126 264489 278424 310838 306935 258299 211479 206230 230436
$$ packed form
11406C50982O2531j8374o0216N735P8255M6825m1800o9119k1282J9268J4126L225
11394C70156J3217J6279r912m1359m4523j6982J9587M1233L3440M121j4789l68
11382C70100K7701K8077p109l8778k7963J8513N6612N1098O877m1816o5395n6754
11370C21163k2436K4068N4546L8574j3453m2991j3290L1228J9220m5027q5679
11359B65923o1101q461K6664M3892M9249K4981k3418m3242n348M3560M8292K5372
11347C86363K0956K4803n710n6450o4397j3896L9540N1321L7313K5794J1679j5144
11335D42172l5603k7763m668J855j5479l1364j9501J6857M5251L6898J896j9936
11323C90615j1936m502k5750n0301l3637J3935L2414l903m8636m6820n249K4206
$$ plain form
11311 230436 243689 229147 209539 214795 242661 259979 246018 223042 228287 261888 285601 274747
11299 274747 246387 227918 222688 220856 222167 230202 241962 259604 293714 336918 355017 328009
11287 328009 281835 252554 235484 202660 159818 147282 181380 227464 241250 214595 172027
11276 172027 140878 132990 140691 143739 131064 116952 122784 143967 152810 136626 114673 111499 129008
11263 129008 150572 157906 139071 97153 59032 57715 93935 131162 142186 142719 158354 176240
11251 176240 164022 130337 122849 153772 171906 141248 108118 134591 188547 177059 95893 59027
11239 59027 134057 226347 208564 112781 85999 169825 241841 203077 116602 96861 142247 161606
11227 161606 120229 73086 69382 97336 125283 141641 145639 137654 126737 123308 125080 126047 126777
$$ packed form
11311B30436J3253j4542j9608N256K7866J7318j3961k2976N245L3601K3713j0854
11299B74747k8360j8469n230j832J311Q035J1760J7642L4110M3204J8099k7008
11287C28009m6174k9281j7070l2824m2842j2536L4098M6084J3786k6655m2568
11276A72027l1149p888P701L048j2675j4112N832K1183Q843j6184k1953l174J7509
11263A29008K1564P334j8835m1918l8121j317L6220L7227J1024N33J5635J7886
11251A76240j2218l3685p488L0923J8134l0658l3130K6473N3956j1488q1166l6866
11239E9027P5030R2290j7783r5783k6782Q3826P2016l8764q6475j9741M5386J9359
11227A61606m1377m7143l704K7954K7947J6358L998p985j0917l429J772R67P30
$$ plain form
11214 126777 121749 100968 80076 92005 125740 122505 69018 36594 72503 114300 91000 52174
11202 52174 90583 175392 188652 116680 71330 104530 135777 106530 77306 101225 116517 59210
11190 59210 -8737 7833 80343 102994 57487 25651 55260 107991 138979 147933 144185 125361
11178 125361 100806 89034 88504 86710 88635 100269 102219 79663 57000 61082 76497 81846 95620
11165 95620 130438 139866 82844 10527 6118 57996 82022 60711 62996 116700 157839 136167
11153 136167 89325 74161 89342 101030 91132 55492 8907 7120 95614 215467 237648 126911
11141 126911 -2611 -37835 2196 37983 55316 84492 113280 107085 82893 85658 111980 124294
11129 124294 121895 133334 153145 148538 119815 97894 90892 86291 93817 127994 157132 133776
$$ packed form
11214A26777n028k0781k0892J1929L3735l235n3487l2424L5909M1797k3300l8826
11202E2174L8409Q4809J3260p1972m5350L3200L1247k9247k9224K3919J5292n7307
11190E9210o7947J6570P2510K2651m5507l1836K9609N2731L0988Q954l748j8824
11178A25361k4555j1772n30j794J925J1634J950k2556k2663M082J5415N349J3774
11165I5620L4818R428n7022p2317m409N1878K4026k1311K285N3704M1139k1672
11153A36167m6842j5164J5181J1688r898l5640m6585j787Q8494J19853K2181j10737
11141A26911j29522l5224M0031L5787J7333K9176K8788o195k4192K765K6322J2314
11129A24294k399J1439J9811m607k8723k1921p002m601P526L4177K9138k3356
$$ plain form
11117 133776 77029 59820 101022 131053 91803 21491 2352 53984 117484 135679 117727
11106 117727 115557 150465 182617 163321 101743 51259 36170 34123 36257 69048 129684 156473
11094 156473 111412 46852 33819 62075 74846 70178 92411 139493 155763 117430 60598 22259
11082 22259 10304 28269 70578 98068 79767 51942 69615 110246 104183 54136 32806 56934
11070 56934 63426 29702 14617 45859 68475 50593 40646 65885 75189 46774 47143 101935 116203
11057 116203 29494 -50139 240 112017 125199 40166 3158 64191 119468 103423 75585
11046 75585 81505 76756 43651 48788 114807 153012 102998 37482 44815 97617 124973 132008 152824
11033 152824 158190 114569 76543 110983 172663 167650 110933 103523 161997 189051 131277 61042
$$ packed form
11117A33776n6747j7209M1202L0031l9250p0312j9139N1632O3500J8195j7952
11106A17727k170L4908L2152j9296o1578n0484j5089k047K134L2791O0636K6789
11094A56473m5061o4560j3033K8256J2771m668K2233M7082J6270l8333n6832l8339
11082B2259j1955J7965M2309K7490j8301k7825J7673M0631o063n0047k1330K4128
11070E6934O492l3724j5085L1242K2616j7882r947K5239R304k8415L69N4792J4268
11057A16203q6709p9633N0379J11777J3182q5033l7008O1033N5277j6045k7838
11046G5585N920m749l3105N137O6019L8205n0014o5516P333N2802K7356P035K0816
11033A52824N366m3621l8026L4440O1680n013n6717p410N8474K7054n7774p0235
$$ plain form
11021 61042 61530 111282 132777 102181 64832 71830 130828 199586 216789 162274 88757 66899
11009 66899 103153 143703 149996 130225 105059 88030 93450 117188 119734 80669 54032 100439
10997 100439 174803 168827 73709 6647 45432 126607 154578 129517 106734 100081 94723 99034
10985 99034 115261 107634 65152 46566 94486 156093 165798 154323 184147 223649 196395 127108
10973 127108 115924 170680 187913 121304 53575 60788 107441 129919 136676 162940 195813 207665
10961 207665 208922 211909 194313 152761 140733 193059 257153 261030 212973 173732 163430 158693
10949 158693 155537 170513 193729 197527 183997 178522 186379 194780 203906 220601 238581 254623 277990
10936 277990 296616 275223 221762 202018 239704 265082 231123 211891 286248 381845 364371
$$ packed form
11021F1042M88M9752K1495l0596l7349O998N8998O8758J7203n4515p3517k1858
11009F6899L6254M0550O293j9771k5166j7029N420K3738K546l9065k6637M6407
10997A00439P4364n976r5118o7062L8785Q1175K7971k5061k2783o653n358M311
10985I9034J6227p627m2482j8586M7920O1607R705j1475K9824L9502k7254o9287
10973A27108j1184N4756J7233o6609o7729P213M6653K2478O757K6264L2873J1852
10961B07665J257K987j7596m1552j2028N2326O4094L877m8057l9241j0302m737
10949A58693l156J4976K3216L798j3530n475P857Q401R126J6695J7980J6042K3367
10936B77990J8626k1393n3461j9744L7686K5378l3959j9232P4357R5597j7474
$$ plain form
10925 364371 253352 204906 274630 343046 314390 252684 251739 285544 278706 241318 236781 268763
10913 268763 287634 277264 264913 268576 289168 330823 383989 414136 403240 373029 343160 311367
10901 311367 296692 336104 402551 405224 327838 285678 366595 489421 517924 454339 407748
10890 407748 415634 421724 408863 424223 467634 475571 439981 436052 497129 556556 556719 533952 545685
10877 545685 579703 587660 561609 533847 532916 564757 607381 616800 577001 539637 561268 611435
10865 611435 615706 584284 604082 689144 741719 701218 637073 639181 698149 753016 783289 792678
10853 792678 770963 733723 733954 777007 797563 779536 806944 914846 989626 933153 839250 861471
10841 861471 966461 986754 894660 845859 929415 1039868 1056313 1010399 996788 1025816 1055147
$$ packed form
10925C64371j11019m8446O9724O8416k8656o1706r45L3805o838l7388m537L1982
10913B68763J8871j0370j2351L663K0592M1655N3166L0147j0896l0211k9869l1793
10901C11367j4675L9412O6447K673p7386m2160Q0917J22826K8503o3585m6591
10890D07748P886O090j2861J5360M3411P937l5590l929O1077N9427J63k2767J1733
10877E45685L4018P957k6051k7762r31L1841M2624R419l9799l7364K1631N0167
10865F11435M271l1422J9798Q5062N2575m0501o4145K108N8968N4867L0273R389
10853G92678k1715l7240K31M3053K0556j8027K7408J07902P4780n6473r3903K2221
10841H61471J04990K0293r2094m8801Q3556J10453J6445m5914j3611K9028K9331
$$ plain form
10830 1055147 1087548 1146329 1205937 1225855 1217328 1213878 1210819 1192076 1184009 1223315 1294285 1349797
$$ packed form
10830A055147L2401N8781N9608J9918q527l450l059j8743q067L9306P0970N5512
$$ [...]
##END NTUPLES=NMR SPECTRUM
##END=
