##TITLE=1H ikalashn
CA-9295-3
15.11.2024
##JCAMPDX= 6.0         $$ Bruker NMR JCAMP-DX V2.0
##DATA TYPE= NMR SPECTRUM
##DATA CLASS= NTUPLES
##ORIGIN= UXNMR, Bruker Analytische Messtechnik GmbH
##OWNER= root
$$ TOPSPIN		Version 1.3
$$ 2024-11-15 13:46:24.640 +0400  Irina@DPX200
$$ Compression mode = diff/dup
##.OBSERVE FREQUENCY= 200.131300845
##.OBSERVE NUCLEUS= ^1H
##.ACQUISITION MODE= SIMULTANEOUS
##.ACQUISITION SCHEME= undefined
##.AVERAGES= 16
##.DIGITISER RES= 18
##SPECTROMETER/DATA SYSTEM= spect
##.PULSE SEQUENCE= zg
##.SOLVENT NAME= CD3CN
##.SHIFT REFERENCE= INTERNAL, CD3CN, 1, 17.49637
##AUDIT TRAIL= $$ (NUMBER, WHEN, WHO, WHERE, WHAT)
$$ ##TITLE= Audit trail, TOPSPIN		Version 1.3
$$ ##JCAMPDX= 5.01
$$ ##ORIGIN= Bruker BioSpin GmbH
$$ ##OWNER= Irina
$$ $$ F:/spectra/data/iren/nmr/1H/4/pdata/1/auditp.txt
$$ ##AUDIT TRAIL=  $$ (NUMBER, WHEN, WHO, WHERE, VERSION, WHAT)
(   1,<2024-11-15 13:45:49.718 +0400>,<Irina>,<DPX200>,<TOPSPIN 1.3>,
      <created by zg
	started at 2024-11-15 13:44:41.796 +0400,
	POWCHK disabled, PULCHK disabled
       configuration hash MD5:
       BE 6D 3F 07 2A EA 11 49 91 17 2B D3 AF B3 58 0D
       data hash MD5: 16K
       34 72 5A 8A EE 3A 1F DF 90 4C B0 F9 0E E4 FA F1>)
(   2,<2024-11-15 13:45:55.031 +0400>,<Irina>,<DPX200>,<TOPSPIN 1.3>,
      <Start of raw data processing
       efp BC_mod = 2 LB = 0.02 FT_mod = 6 PKNL = 1 PHC0 = 126.2075 PHC1 = -7.57399 SI = 32K 
       data hash MD5: 32K
       CC 5D 0E 3A 63 06 F7 AB B2 63 70 42 74 CD 97 B9>)
(   3,<2024-11-15 13:45:57.093 +0400>,<Irina>,<DPX200>,<TOPSPIN 1.3>,
      <apk 
       data hash MD5: 32K
       1A D8 60 D2 FE 9B D3 95 2E 48 D1 65 F8 0A 59 E6>)
(   4,<2024-11-15 13:46:10.109 +0400>,<Irina>,<DPX200>,<TOPSPIN 1.3>,
      <pk fgphup PHC0 = -24.25593 PHC1 = 39.2 
       data hash MD5: 32K
       6A 77 73 1C BA 59 F7 3F EC 2B 9D D9 CD 10 E7 FA>)
(   5,<2024-11-15 13:46:13.078 +0400>,<Irina>,<DPX200>,<TOPSPIN 1.3>,
      <abs n ABSG = 5 
       data hash MD5: 32K
       6D F9 4D D5 DF CC 92 8F FA 93 8A 4B 8B D8 1A 30>)
$$ ##END=
$$ 
$$ $$ hash MD5
$$ $$ C3 DC 4C 78 74 C1 4C 3B 02 40 5D EB 75 3F 19 C1
##$RELAX= 
##$RELAX= 
##$RELAX= 
##$RELAX= 
##$RELAX= 
##$RELAX= 
##$RELAX= 
##$RELAX= 
##$RELAX= 
$$ Bruker specific parameters
$$ --------------------------
##$DU= <F:/spectra>
##$EXPNO= 4
##$NAME= <1H>
##$PROCNO= 1
##$TYPE= <nmr>
##$USER= <iren>
##$AMP= (0..31)
100 100 100 100 100 100 100 100 100 100 100 100 100 100 100 100 100 100 
100 100 100 100 100 100 100 100 100 100 100 100 100 100 
##$ANAVPT= -1
##$AQSEQ= 0
##$AQ_mod= 1
##$AUNM= <au_zg>
##$AUTOPOS= <>
##$BF1= 200.13
##$BF2= 200.13
##$BF3= 200.13
##$BF4= 200.13
##$BF5= 200.13
##$BF6= 200.13
##$BF7= 200.13
##$BF8= 200.13
##$BYTORDA= 1
##$CFDGTYP= 0
##$CFRGTYP= 5
##$CHEMSTR= <none>
##$CNST= (0..63)
1 1 145 1 1 1 1 1 1 1 1 1 1 1 1 1 1 1 1 1 1 1 1 1 1 1 1 1 1 1 1 1 1 1 
1 1 1 1 1 1 1 1 1 1 1 1 1 1 1 1 1 1 1 1 1 1 1 1 1 1 1 1 1 1 
##$CPDPRG= <>
##$CPDPRG1= <>
##$CPDPRG2= <>
##$CPDPRG3= <>
$$ [...]
##$SW_h= 4401.40845070422
##$TD= 16384
##$TD0= 1
##$TE= 300
##$TE2= 300
##$TE3= 300
##$TEG= 300
##$TL= (0..7)
0 120 120 120 120 120 120 120 
##$TP= (0..7)
150 150 150 150 150 150 150 150 
##$TP07= 0
##$TPNAME0= <>
##$TPNAME1= <>
##$TPNAME2= <>
##$TPNAME3= <>
##$TPNAME4= <>
##$TPNAME5= <>
##$TPNAME6= <>
##$TPNAME7= <>
##$TPOAL= (0..7)
0.5 0.5 0.5 0.5 0.5 0.5 0.5 0.5 
##$TPOFFS= (0..7)
0 0 0 0 0 0 0 0 
##$TUNHIN= 0
##$TUNHOUT= 0
##$TUNXOUT= 0
##$USERA1= <user>
##$USERA2= <user>
##$USERA3= <user>
##$USERA4= <user>
##$USERA5= <user>
##$V9= 5
##$VALIST= <valist>
##$VCLIST= <CCCCCCCCCCCCCCC>
##$VD= 0
##$VDLIST= <DDDDDDDDDDDDDDD>
##$VPLIST= <PPPPPPPPPPPPPPP>
##$VTLIST= <TTTTTTTTTTTTTTT>
##$WBST= 1024
##$WBSW= 25
##$XGAIN= (0..3)
0 0 0 0 
##$XL= 0
##$YL= 0
##$YMAX_a= 469584
##$YMIN_a= -788882
##$ZGOPTNS= <>
##$ZL1= 120
##$ZL2= 120
##$ZL3= 120
##$ZL4= 120
##$ABSF1= 17.49637
##$ABSF2= -4.496376
##$ABSG= 5
##$ABSL= 3
##$ALPHA= 0
##$AQORDER= 0
##$ASSFAC= 0
##$ASSFACI= 0
##$ASSFACX= 0
##$ASSWID= 0
##$AUNMP= <proc_1d>
##$AXLEFT= 0
##$AXRIGHT= 0
##$AXTYPE= 0
##$AXUNIT= <>
##$AZFE= 0.1
##$AZFW= 0.1
##$BCFW= 0
##$BC_mod= 2
##$BYTORDP= 0
##$COROFFS= 0
##$CY= 7568.61572265625
##$DATMOD= 1
##$DC= 0
##$DFILT= <>
##$DTYPP= 0
##$F1P= 17.9538593292236
##$F2P= -4.03888763876832
##$FCOR= 0.5
##$FTSIZE= 32768
##$FT_mod= 6
##$GAMMA= 0
##$GB= 0
##$INTBC= 0
##$INTSCL= 1.367314e-010
##$ISEN= 128
##$LB= 0.02
##$LEV0= 0
##$LPBIN= 0
##$MAXI= 945.577
##$MC2= 0
##$MEAN= 0
##$ME_mod= 0
##$MI= -402.1523
##$NCOEF= 0
##$NC_proc= -5
##$NLEV= 6
##$NOISF1= 8.587773
##$NOISF2= 6.764455
##$NSP= 0
##$NTH_PI= 0
##$NZP= 0
##$OFFSET= 17.49637
##$PC= 1
##$PHC0= 312.5706
##$PHC1= 14.67796
##$PH_mod= 1
##$PKNL= yes
##$PPARMOD= 0
##$PPDIAG= 0
##$PPIPTYP= 0
##$PPMPNUM= 100
##$PPRESOL= 1
##$PSCAL= 0
##$PSIGN= 0
##$REVERSE= no
##$SF= 200.13
##$SI= 32768
##$SIGF1= 16.12182
##$SIGF2= -4.496377
##$SINO= 3.521527
##$SIOLD= 32768
##$SREGLST= <1H.CDCl3>
##$SSB= 0
##$STSI= 32768
##$STSR= 0
##$SW_p= 4401.40845070422
##$SYMM= 0
##$S_DEV= 0
##$TDeff= 16384
##$TDoff= 0
##$TI= <>
##$TILT= no
##$TM1= 0
##$TM2= 0
##$TOPLEV= 0
##$USERP1= <user>
##$USERP2= <user>
##$USERP3= <user>
##$USERP4= <user>
##$USERP5= <user>
##$WDW= 1
##$XDIM= 32768
##$YMAX_p= 417180652
##$YMIN_p= -226669
$$ End of Bruker specific parameters
$$ ---------------------------------
##NTUPLES= NMR SPECTRUM
##VAR_NAME=  FREQUENCY,     SPECTRUM/REAL,   SPECTRUM/IMAG
##SYMBOL=    X,             R,               I
##VAR_TYPE=  INDEPENDENT,   DEPENDENT,       DEPENDENT
##VAR_FORM=  AFFN,          ASDF,            ASDF
##VAR_DIM=   32768,         32768,           32768
##UNITS=     HZ,            ARBITRARY UNITS, ARBITRARY UNITS
##FACTOR=    0.134324425510551, 1,           1
##FIRST=     4401.40845070422, -50588,       -392687
##LAST=      0,             -30637,          -602777
##MIN=       0,             -226669,         0
##MAX=       4401.40845070422, 417180652,    0
$$ Real data points
##PAGE= N=1
##DATA TABLE= (X++(R..R)), XYDATA
$$ [...]
13732a08063j8481K0274L2077K8868J8060O836l026k3303m7226l5621J8775N2570
13720e8260J8826l0297k3483J1521J990l6125k7999J9501K5350k0885l9254K315
13708a56800M0062K9309P115R306J4948O529N728J9059J9487M117O18M267j6480
13695a2735m6068l7413m308m259k6695o217M5446M3343j5818l5599J0156K9609
13683f0558j6423m2838n832J1518l2436l7439N4416J20377M8455o1358n5905J7853
13671f0170Q905o5399n2717N9465J10499K4835p7919p7096p717L4259K7276N877
13659f9902o341K087L1677M7980J5823l4824m2488j1412k91j7952j4429K1342
13647g8730M0131J7740j6066l9311n3948m3935L174M1711K2375j2728R763N5324
$$ y = [-108063, -126544, -106270, -74193, -45325, -27265, -20429, -23455, -46758, -93984, -129605, -110830, -58260, -39434, -69731, -93214, -81693, -79703, -115828, -143827, -124326, -98976, -119861, -159115, -156800, -116738, -87429, -80314, -71008, -56060, -49531, -43803, -24744, -5257, -1140, -522, 3745, -12735, -58803, -96216, -100524, -104783, -131478, -137695, -92249, -48906, -64724, -100323, -90167, -60558, -76981, -119819, -125651, -114133, -146569, -184008, -129592, -9215, 39240, -22118, -78023, -60170, -51265, -116664, -169381, -109916, 583, 25418, -52501, -129597, -137314, -103055, -75779, -69902, -76243, -74156, -42479, 5501, 21324, -13500, -55988, -67400, -67691, -85643, -100072, -78730, -38599, -20859, -36925, -76236, -130184, -174119, -170945, -129234, -106859, -119587, -109824, -54500]
13635e4500K5852n9616p0983K1487Q8026M3967k5091j8751K1613Q137m0934m9508
13623a10301j4510J0257J2177J6638K3042J4753K331K038K344p092j0035J451
13611e6907J0232J3575K5417K7325j0824n1877k7476L1906K0558n8042o9926K7334
13599a18705R2734K6732o0781l6167L9250L4465j9820o900N0582L5074m3106n9033
13587f5675Q997N3598K8217l355j1917l6129n9754j5744O5653O9952j0714n4228
13575c1099j2082K0849j1124l1454J0438L9425m74l8779j1671K2715M143j2173
13563e1286K9177N8681j97p5935n0017M7338P8874N108p3962o8580O680Q0019
13551a4100Q8687J5243q0893r8500j7609N8992M8006N049J9903O0906L5389m2586
$$ y = [-54500, -28648, -88264, -159247, -137760, -49734, -5767, -30858, -49609, -27996, -19859, -60793, -110301, -124811, -114554, -102377, -85739, -62697, -47944, -45613, -43575, -41231, -48323, -58358, -56907, -46675, -33100, -7683, 19642, 8818, -43059, -70535, -38629, -18071, -76113, -146039, -118705, -25971, 761, -60020, -96187, -56937, -22472, -42292, -49192, 1390, 36464, -6642, -65675, -56678, -3080, 25137, 21782, 9865, -26264, -86018, -101762, -36109, 33843, 23129, -31099, -43181, -22332, -33456, -64910, -54472, -15047, -15521, -54300, -65971, -43256, -39113, -51286, -22109, 36572, 36375, -39560, -89577, -42239, 36635, 41743, -32219, -100799, -94119, -14100, 74587, 89830, 8937, -89563, -107172, -48180, -174, 4875, 24778, 85684, 121073, 78487]
13539G8487p0146k0985K5697J8991p027j4802o831J6272N3727O1852K965o6303
13527G1897n2791K5574N4051m632n7662l1666K7481M5572K1485p404k4160j6573
13515E1172K4721N8883K3874n5286p5993j5154K3773k1123o1158l991Q3976P6704
13503A10398j4139o4848k8966J9029J9889j60n233l353l957M301J4891N085j1491
13490D1446L835M0058L9054r585m2775k0430J4615J0140j7154k2979j0972j4051
13478A1202k8828k2303Q712L2010L1483K4614K4617J8863l430k7386l3195k5251
13466A1108k2123k4457j3680J3640L0744J7032n188J497K9616L1308q039m1258
13454B0200k9015J412O414q5K0268M6267J8632n3509q2069k2100N6952O1970o426
$$ y = [78487, 8341, -12644, 13053, 32044, 25017, 10215, 3384, 19656, 73383, 135235, 138200, 71897, 19106, 44680, 98731, 94099, 36437, 4771, 32252, 77824, 99309, 91905, 67745, 51172, 75893, 134776, 158650, 103364, 27371, 12217, 35990, 14867, -46291, -50282, 33694, 110398, 96259, 31411, 2445, 21474, 41363, 41203, 35970, 32617, 28660, 32961, 47852, 52937, 41446, 45281, 85339, 124393, 114808, 72033, 51603, 66218, 76358, 59204, 36225, 25253, 11202, -17626, -39929, -31217, 793, 32276, 56890, 81507, 100370, 96940, 69554, 36359, 11108, -11015, -35472, -49152, -35512, -4768, 12264, 7076, 8573, 38189, 69497, 61458, 20200, -8815, -7403, -989, -1074, 19194, 65461, 84093, 30584, -51485, -73585, -16633, 45337, 38911]
13441C8911o9680p2439k6944K1556L7777J9343J39J2489L4447J2100m8258o5939
13429a06498k955O3776M9581j0549k3419J3509K4485l733o763K6478K5370k7890
13417B1392m9134N428N1799J2155n3236m5791J0470K0423j7548k0685K5268M5034
13405E575J0947j3381P966K2780r739m5955l4563M090K6415L2876L6309J7922
13393F1242k9808o1762l7770J2736L3434J7478l701j5593j9610q186J5019K1815
13381a4706P091R595L9983L9760k4528p8879m0145M3256N3105j5718m9720n16
13369c1422M4717J3868l6228k0923L8832N9685J8751l6901o6506o0339j9284L4200
13357f1550N1502J6776j5780L755L7979J6486m7203o7371j4965L8927L0597p242
$$ y = [38911, -30769, -103208, -130152, -108596, -70819, -51476, -51337, -38848, -4401, 7699, -40559, -106498, -109453, -45677, 3904, -6645, -30064, -16555, 7930, 4197, -2566, 23912, 49282, 21392, -27742, -22314, 29485, 41640, -11596, -57387, -46917, -26494, -44042, -64727, -39459, 5575, 16522, 3141, 11107, 33887, 24148, -21807, -56370, -52280, -25865, 7011, 43320, 61242, 31434, -30328, -68098, -55362, -21928, -4450, -8151, -23744, -43354, -51540, -36521, -14706, -7615, 1980, 41963, 81723, 57195, -21684, -61829, -18573, 34532, 18814, -30906, -31422, 13295, 27163, -9065, -29988, 8844, 68529, 87280, 50379, -16127, -76466, -95750, -61550, -10048, 6728, -9052, -5297, 32682, 49168, 1965, -65406, -80371, -41444, -10847, -18089]
13345a8089m744L7326N0702N90o0505n7098J1097O3066L5895l2815n2225p64M3722
13332A6158J3831n2107o6133j2219M3094N0638L0867J8109Q321j0313j7894N134
13320B7486L0654J2221m3113p2544l7855K2444M2967J4932r862M403K9283J7402
13308C8418k5966m6394j2298M2845N8702J4053n1562p3363k1299O1932R0095K4539
13296I9702o7797p9990N756R0417P6374j8528r0442o9876J4869Q0483P1088N048
13284A17104m7090l8146L061J4798r488j9236M549J8979R93p261J9659K8830k1491
13271F5261o6877k4006O2821P1091j2058o5709k0976L9456K0782l8099l7687K4794
13259A8793O0500K4620l3395n3106l2686l926J5056K3104K1254J3778R999J2825
$$ y = [-18089, -22833, 14493, 65195, 65785, 5280, -51818, -40721, 22345, 58240, 25425, -26800, -27564, 16158, 29989, -22118, -88251, -100470, -57376, -6738, 24129, 42238, 50559, 40246, 22352, 27486, 58140, 70361, 27248, -45296, -83151, -60707, -17740, -2808, -12670, -8267, 21016, 38418, 12452, -33942, -46240, -3395, 55307, 69360, 17798, -55565, -76864, -14932, 75163, 99702, 31905, -48085, -42329, 48088, 124462, 105934, 15492, -54384, -39515, 40968, 112056, 117104, 70014, 31868, 34929, 49727, 40239, 21003, 25552, 44531, 45524, 38263, 57922, 86752, 65261, -1616, -25622, 37199, 108290, 96232, 30523, 9547, 49003, 69785, 31686, -6001, 18793, 79293, 103913, 70518, 17412, -15274, -19200, -4144, 18960, 40214, 53992, 63991, 76816]
13247G6816J2308j790k3400l2044j5896R551J7279O116L727K0967K7587j663l9034
13234F0524l7677J283L4479L7789K1595k883k6116k2239J6850M1261K382n6759
13222G0489n0428J0870K7166k6539n2049Q257O8776M0151k4525k5290J8469J7300
13210H2647k3647k0316L0452L8329k2775o3316j9253N2262O5005J7233l4239n5451
13198D6931m4713n380M5698P0591M6524m795m1521m1234j2509J4177J0786j2514
13186G2041j1319K6300M5491J595n9255n8517M28M7768N5589M8401K5196k8966
13174A64752o3836j3734O7262N2379m8541p4844K9674J03490J6416j10614q8143
13163C4261M4483Q7891n196p8304l0289N1041N6325R096j5143j3666k2000l0079
$$ y = [76816, 89124, 87334, 63934, 31890, 15994, 25545, 42824, 48940, 52667, 73634, 101221, 99558, 60524, 22847, 24130, 58609, 96398, 117993, 115110, 88994, 66755, 83605, 124866, 127248, 70489, 20061, 30931, 58097, 31558, -20491, -12234, 56542, 96693, 72168, 46878, 65347, 82647, 59000, 38684, 69136, 107465, 84690, 21374, 2121, 54383, 119388, 136621, 102382, 46931, 2218, -3162, 42536, 113127, 159651, 154856, 113335, 72101, 59592, 73769, 84555, 72041, 60722, 87022, 132513, 134108, 74853, 16336, 16764, 64532, 120121, 168522, 193718, 164752, 100916, 87182, 154444, 206823, 158282, 83438, 113112, 216602, 233018, 122404, 34261, 78744, 166635, 161439, 83135, 52846, 103887, 160212, 169308, 154165, 140499, 118499, 88420]
13151H8420p881K9655M1652J9013j3109k7831j2297K2919M1571J9445j6329k2923
13139A62305p723q792k1645j0990J1503R1l1567j9477L1964L8494k2032n7683
13127F4448r665M5943K4417k3958l84P0590P3072j7232r1189n8438L9952R3980
13115B11536M8733m9571j00821m6238O0903J00707K8845o4538p5730j7709K7752
13104A23869L6408L9610L5764n49m0755k9869J5115K6375k4n737J5759J1260j8959
13091B08267j2836K8936K8872k2828l5099K0001M0691k7850p7819j0180Q9509
13080B29664Q2561j692k9668R969R944m8903o3194N262O0092L2350j6384j0958
13068B59043K2722K4792o09j8324k6702l1947j4930K4973M3679J6333j9181k2661
$$ y = [88420, 80539, 110194, 151846, 170859, 157750, 129919, 117622, 140541, 182112, 201557, 185228, 162305, 154582, 145790, 124145, 113155, 124658, 124749, 93182, 73705, 105669, 144163, 122131, 64448, 54783, 100726, 125143, 101185, 100801, 171391, 244463, 227231, 136042, 77604, 117556, 211536, 260269, 210698, 109877, 63639, 124542, 225249, 254094, 189556, 113826, 96117, 123869, 160277, 199887, 235651, 235102, 194347, 164478, 179593, 205968, 205944, 200207, 215966, 227226, 208267, 195431, 224367, 253239, 230411, 195312, 215313, 256004, 228154, 150335, 140155, 229664, 312225, 310533, 280865, 290834, 300778, 251875, 188681, 193943, 254035, 286385, 270001, 259043, 281765, 306557, 305948, 287624, 260922, 228975, 214045, 239018, 282697, 299030, 279849, 257188]
13056B57188p944k020J734J1754J0864j492O850L6592L6540q296l3540L124M2908
13043C54262J8934l1416l1147P984J6451o522J444M6160O0903J7366l1759l6933
13031C85727q524K4765N0380N1350J3015l3726l3737J0772L5532R624j9937n042
13019D80199L2119L9086R567j4559j326L2954L9293r017p0931p0036O290P4371
13007E48010O0520J864j6997R220K1134Q474J3698L2582J5535k4378j1921N7751
12995G15492R2984N0304K887J4627M5096M2731L8228O7855Q7726N2486J0445K9690
12983A250551Q6267J14034J12538J14169R3979J2839q5674j22066j00250q6100
12973A390287q9200o3160j0010J2801j1426m0859n2076n6145m5188m278L1443
$$ y = [257188, 249244, 247224, 248958, 260712, 271576, 270084, 276934, 313526, 350066, 341770, 308230, 311354, 354262, 373196, 341780, 310633, 318617, 335068, 328546, 329990, 376150, 437053, 454419, 422660, 385727, 377203, 401968, 452348, 503698, 516713, 482987, 449250, 460022, 495554, 505178, 485241, 480199, 512318, 551404, 560971, 546412, 545086, 578040, 617333, 608316, 537385, 467349, 473639, 548010, 608530, 610394, 593397, 602617, 623751, 632225, 645923, 678505, 694040, 669662, 657741, 715492, 808476, 858780, 861667, 876294, 921390, 964121, 1002349, 1070204, 1157930, 1210416, 1220861, 1250551, 1336818, 1450852, 1563390, 1677559, 1771538, 1784377, 1698703, 1576637, 1476387, 1390287, 1301087, 1237927, 1227917, 1240718, 1229292, 1188433, 1136357, 1080212, 1035024, 1030746, 1062189]
12962A062189J6698j5517L080N1861M3620k4922n6520r494L9944L0778R314L3222
12950A184253P2472P0973L8088J7288J9185L7244P5973J16290J09394N4205K4818
12939A820183O8422J31018J43145J27024J47918J96180J93484J03722k2787j15079
12929B793230j49964j54447j64831j82806j70361j08353n0008o5538j31484j44487
12919A470951o7797J0708R242l2909l4326k789n395m5564n7447j4155L2604L0818
12907A293941n586k4245J017M3837N3654J2876l6182m0120l345K6469L3531M2352
12895A398199N4035M1869J8655L1662P3123Q0238M9882N6531J15842J36629O9526
12884B126191n243j9077l4470j17700j92649j53440m6845j597l1094m8194l3244
$$ y = [1062189, 1078887, 1063370, 1066450, 1118311, 1161931, 1137009, 1080489, 1070995, 1110939, 1141717, 1151031, 1184253, 1256725, 1327698, 1365786, 1383074, 1402259, 1439503, 1515476, 1631766, 1741160, 1795365, 1820183, 1888605, 2019623, 2162768, 2289792, 2437710, 2633890, 2827374, 2931096, 2908309, 2793230, 2643266, 2488819, 2323988, 2141182, 1970821, 1862468, 1812460, 1746922, 1615438, 1470951, 1403154, 1413862, 1423104, 1390195, 1355869, 1353080, 1347685, 1302121, 1244674, 1230519, 1263123, 1293941, 1288355, 1264110, 1265127, 1308964, 1362618, 1375494, 1339312, 1299192, 1295847, 1322316, 1355847, 1398199, 1452234, 1494103, 1512758, 1544420, 1617543, 1697781, 1747663, 1804194, 1920036, 2056665, 2126191, 2120948, 2101871, 2067401, 1949701, 1757052, 1603612, 1556767, 1555170, 1524076, 1475882, 1442638]
12873A442638m0024o1111l6209J4197O142n4660p1859j9520K4345J7067N4l941
12861A217119j9118l0571M798N0567K6226l8842l2693L9724M8303l2913o5799
12850A166801J2194O7189m773r2412m9649O8735J07205M9936M281R323J2509m58
12838A350881R361L5275K7416j1515k6887k760K5022L5806L8556L4794K2573J6275
12826A554797J9563J3573O298L5140Q0296N7624m0652r0724j0895R8348R8710
12815A822078K0430o018L6082M9834O540j9077Q304L6553L0997J7829J3243N625
12803B022420J0334M9473Q2385N2675l814m72N8333Q6825O5496O0378Q7881Q5558
12791B657472M1354K8774P3780J01007O2762J7733K4896N3079N6429N3905O9031
$$ y = [1442638, 1402614, 1341503, 1305294, 1319491, 1325633, 1270973, 1199114, 1179594, 1203939, 1221006, 1221060, 1217119, 1198001, 1167430, 1172228, 1222795, 1249021, 1210179, 1177486, 1217210, 1265513, 1232600, 1166801, 1178995, 1246184, 1241411, 1148999, 1099350, 1168085, 1275290, 1325226, 1329507, 1338830, 1351339, 1350881, 1360242, 1395517, 1422933, 1411418, 1384531, 1381771, 1406793, 1442599, 1481155, 1515949, 1538522, 1554797, 1574360, 1587933, 1594231, 1629371, 1709667, 1767291, 1726639, 1635915, 1625020, 1723368, 1822078, 1842508, 1836490, 1872572, 1922406, 1928946, 1909869, 1918173, 1954726, 1985723, 2003552, 2016795, 2022420, 2032754, 2082227, 2164612, 2217287, 2213473, 2213001, 2271334, 2358159, 2423655, 2484033, 2571914, 2657472, 2698826, 2727600, 2801380, 2902387, 2965149, 2982882, 3007778, 3060857, 3117286, 3171191, 3240222]
12780C240222O7889K7199j289L2653Q8192R2497N1863L4168O1585Q4859O3501
12769C843339K2786J3659L8668M5531N656k6173J9748J04397J05813N12p6668
12758D097268k5704O2420N2942j6587j5638M8108N5459L902J3490R5464J13111
12747D484235J9488n3168j4092M8268L9085Q304K3115L4115j0863m4291K630O4320
12735D601146M8767r994k7540j3205k0477l1552q366J2660j0223l0025L938L8914
12723D554043Q752m1724l8633j1926k3726l7326P453N4056R622q4615j09063n4175
12711D232738j3109j9082k8289l6686p5235j08894p3175M057L8951K5648J5218
12700C962142n02n1684q0637j9279O0429L6063n4878o8919K4K1991k7964l4558
$$ y = [3240222, 3308111, 3335310, 3334021, 3366674, 3454866, 3547363, 3599226, 3633394, 3694979, 3779838, 3843339, 3866125, 3879784, 3918452, 3963983, 3969639, 3943466, 3963214, 4067611, 4173424, 4173936, 4097268, 4071564, 4133984, 4186926, 4170339, 4154701, 4202809, 4258268, 4262170, 4275660, 4371124, 4484235, 4503723, 4450555, 4436463, 4484731, 4523816, 4532120, 4555235, 4589350, 4578487, 4534196, 4536826, 4601146, 4649913, 4639919, 4612379, 4599174, 4578697, 4547145, 4538779, 4551439, 4541216, 4511191, 4515129, 4554043, 4562795, 4521071, 4482438, 4470512, 4446786, 4409460, 4416913, 4470969, 4480591, 4395976, 4286913, 4232738, 4219629, 4200547, 4172258, 4135572, 4060337, 3951443, 3878268, 3882325, 3921276, 3946924, 3962142, 3961640, 3909956, 3829319, 3810040, 3870469, 3906532, 3851654, 3782735, 3782759, 3804750, 3776786, 3742228]
12688C742228K8627M1741l7289q8554m2904N089j6328l0757K2353N9682R736m3531
12676C650093k958P1301O5861j624l0020mK3859J1705n554j68K4488M2386J6309
12663C865674n0460p5718K891R9394P4497l9381o8665J9927N9546k7911q7969
12652C771825K343J18029R4848o495k9020J7400J7932k1349r320L7982L3187m151
12640D023211J2535N7813L4355l5601l6924L1640N1079r897m3463J4312R0618
12629D189678J02538O1582J8712k006O792L5643M4054J3531n410K8954O5763M3430
12617D603261M213K0325N8380M2154K398K3172P6253O1764r183k9985J3881L2141
12605D898774N097J0794O3652Q3820N1665M1056O9688O5216J4744N81M5982O8608
$$ y = [3742228, 3770855, 3812596, 3775307, 3686753, 3643849, 3648938, 3632610, 3601853, 3624206, 3683888, 3693624, 3650093, 3647135, 3718436, 3784297, 3782673, 3752653, 3752649, 3776508, 3788213, 3782659, 3782491, 3806979, 3849365, 3865674, 3815214, 3739496, 3742387, 3841781, 3916278, 3876897, 3808232, 3828159, 3887705, 3859794, 3771825, 3774168, 3892197, 3987045, 3980550, 3951530, 3968930, 3986862, 3965513, 3956193, 3994175, 4027362, 4023211, 4035746, 4093559, 4127914, 4092313, 4055389, 4087029, 4138108, 4128211, 4084748, 4099060, 4189678, 4292216, 4353798, 4372510, 4370504, 4377296, 4412939, 4456993, 4470524, 4465114, 4494068, 4559831, 4603261, 4607474, 4627799, 4686179, 4728333, 4730731, 4753903, 4830156, 4891920, 4882737, 4852752, 4866633, 4898774, 4903871, 4914665, 4978317, 5062137, 5113802, 5154858, 5224546, 5289762, 5304506, 5305087, 5351069, 5419677]
12593E419677L3278J1462L9417N3535J9894l513J3754K2480J0402L6953J01116
12582E758455J14386O1149L9814Q1654Q5094J0644k0720O8441J59431J19419J1745
12571F489512j5043M8325R4151P2857K4672r744j3812K0287O2267O0616L4941
12560F869029O1273J24315J10497R033k8799P6439J89932J72838R1151P5830J09257
12549G860795J08946J04253J56892K03663J54039O5049N0864R2005R8467Q6515
12539H981488J21816J59311J18919N6600P8303J43222J38371R0465J07348J62132
12529A0157975J44879Q5496J04064J71304J52941P5732R9052K14546K37089J35078
12519A1578156J03259K27759L35416K91462K10514K25981K59762J94340J02850
$$ y = [5419677, 5452955, 5464417, 5503834, 5557369, 5577263, 5573750, 5587504, 5609984, 5620386, 5657339, 5758455, 5872841, 5933990, 5973804, 6055458, 6140552, 6151196, 6130476, 6198917, 6358348, 6477767, 6489512, 6474469, 6522794, 6616945, 6689802, 6714474, 6704730, 6690918, 6711205, 6773472, 6834088, 6869029, 6930302, 7054617, 7165114, 7174147, 7145348, 7221787, 7411719, 7584557, 7675708, 7751538, 7860795, 7969741, 8073994, 8230886, 8434549, 8588588, 8653637, 8704501, 8796506, 8894973, 8981488, 9103304, 9262615, 9381534, 9438134, 9516437, 9659659, 9798030, 9888495, 9995843, 10157975, 10302854, 10388350, 10492414, 10663718, 10816659, 10892391, 10991443, 11205989, 11443078, 11578156, 11681415, 11909174, 12244590, 12536052, 12746566, 12972547, 13232309, 13426649, 13529499]
12510A3529499J20410K10818K41486K03191J92555K36218K73033K71135K52306
12501A5530651K34693K31700K62733L04728K97239K48770K51820L31731L83023
12492A8077088L35417K76635L08898L80942L82777L29872L22887L74543M03245
12483B1192304L76614L53128L83479M48142M93858M87128M44977M34645N04440
12474B5118715O04036O40439O24308O61855P72573Q37401P87218P13951P05542
12465C1466038O96967O05411N03487N11496N95444O25775N88821N89588O65845
12456C6848872P38552P50924P42260P67107Q25901Q89886R36064R56610R73278
12447D4429454J023063J099970J154346J179164J230505J325937J409897J468780
$$ y = [13529499, 13649909, 13860727, 14102213, 14305404, 14497959, 14734177, 15007210, 15278345, 15530651, 15765344, 15997044, 16259777, 16564505, 16861744, 17110514, 17362334, 17694065, 18077088, 18412505, 18689140, 18998038, 19378980, 19761757, 20091629, 20414516, 20789059, 21192304, 21568918, 21922046, 22305525, 22753667, 23247525, 23734653, 24179630, 24614275, 25118715, 25722751, 26363190, 26987498, 27649353, 28421926, 29259327, 30046545, 30760496, 31466038, 32163005, 32768416, 33271903, 33783399, 34378843, 35004618, 35593439, 36183027, 36848872, 37587424, 38338348, 39080608, 39847715, 40673616, 41563502, 42499566, 43456176, 44429454, 45452517, 46552487, 47706833, 48885997, 50116502, 51442439, 52852336, 54321116]
12439E4321116J572413J731522J840423J864148J948754K201853K488841K631289
12431G0600359K702321K898771L187777L348856L370767L530026L993135M592677
12423I8224689N142669N749854O585646P518330Q303747R122925J0551012J2768263
12415A63967135J5016370J6113816J5380458J2747390Q157962J595340n964340
12408B27014131j2274844j5328344j5109862j3297177j1303351r294001p128975
12401A43277577n285170m270077l774331l137736k312547j714089j380950r62656
12393A20440021m04119J2056K65143O38620J158803J552962J797934K170637K708174
12384A30340231L151422L475141L924550M467868M805480N019406N588597O623497
$$ y = [54321116, 55893529, 57625051, 59465474, 61329622, 63278376, 65480229, 67969070, 70600359, 73302680, 76201451, 79389228, 82738084, 86108851, 89638877, 93632012, 98224689, 103367358, 109117212, 115702858, 123221188, 131524935, 140647860, 151198872, 163967135, 178983505, 195097321, 210477779, 223225169, 231383131, 232978471, 227014131, 214739287, 199410943, 184301081, 171003904, 159700553, 150406552, 143277577, 137992407, 133722330, 129947999, 126810263, 124497716, 122783627, 121402677, 120440021, 120035902, 120047958, 120313101, 120951721, 122110524, 123663486, 125461420, 127632057, 130340231, 133491653, 136966794, 140891344, 145359212, 150164692, 155184098, 160772695, 167396192]
12376A67396192P744630Q878535J0416575J2342631J4095007J5754320J8424502
12369B55052392K2632802K7050959K9640310K9398174K6017559J8638235O667772
12362D15098203q037963k1292688k9605963l2471094l1496100k8324331k4016294
12355B39853770j9554493j5809760j3027293j0907733r181985p800678o715973
12348A56855855n832232n119413m550738m011349l433946k906945k506103k155282
12340A26339847j777611j425648j133775q00660l47745J45726N70356R16674J214076
12331A23701240J495662J872780K476589L289839M191670N136883O105082P007977
12323A55277722P969977R520636J1950570J4478543J5643905J4599768J1420977
$$ y = [167396192, 175140822, 184019357, 194435932, 206778563, 220873570, 236627890, 255052392, 277685194, 304736153, 334376463, 363774637, 389792196, 408430431, 415098203, 407060240, 385767552, 356161589, 323690495, 292194395, 263870064, 239853770, 220299277, 204489517, 191462224, 180554491, 171372506, 163571828, 156855855, 151023623, 145904210, 141353472, 137342123, 133908177, 131001232, 128495129, 126339847, 124562236, 123136588, 122002813, 121202153, 120854408, 121000134, 121570490, 122487164, 123701240, 125196902, 127069682, 129546271, 132836110, 137027780, 142164663, 148269745, 155277722, 163247699, 172768335, 184718905, 199197448, 214841353, 229441121, 240862098]
12316B40862098O175528j223059r708363j6629274j9734640j9255811j7210288
12309A63276191j5025418j2774682j0417157q494234p319850o462102n506614
12302I7276134m673684m261109m046200l690459l287522l069066k926957k651460
12294F8669677k356112k261241k279185k186193k019458j949765j913248j718081
12286E1986394j416559j250115j277358j327116j284417j192911j104298j023332
12278D2110288r73427r58025r05298p87112p11035p52645q01220p35171o40284
12269C4846071o64319p54800p51612o61620o19974o34078n94955n14532n20461
12260B9129720o09805o27450n24440m39553m68065n23292m99661m27991l88862
$$ y = [240862098, 247037626, 245814567, 236106204, 219476930, 199742290, 180486479, 163276191, 148250773, 135476091, 125058934, 116564700, 109244850, 102782748, 97276134, 92602450, 88341341, 84295141, 80604682, 77317160, 74248094, 71321137, 68669677, 66313565, 64052324, 61773139, 59586946, 57567488, 55617723, 53704475, 51986394, 50569835, 49319720, 48042362, 46715246, 45430829, 44237918, 43133620, 42110288, 41136861, 40178836, 39273538, 38486426, 37775391, 37022746, 36221526, 35486355, 34846071, 34181752, 33426952, 32675340, 32013720, 31393746, 30759668, 30164713, 29650181, 29129720, 28519915, 27892465, 27368025, 26928472, 26460407, 25937115, 25437454, 25009463, 24620601]
12251B4620601l85872l82589l80052l91381m01365l98001l94823l96302l88749
12242B1101467l75961l73537l68253l37806l03925l04961l24055l08638k55470
12233A8148861k14945k15237k34911k41316k14251j56435j17117j56362k42380
12224A6355907k58008j73102j17163j84801k71114k37376j47304j60237k53655
12215A4553147k60267j58696j06789j63878j97209j28416p2410j31074k18682
12206A3115726k14550j55781j50270j97806k19753j95348j64234j48250j51832
12197A1517902j85877k27169k16547j52386j11850j27318j32101r0251p5731j38436
12187A0060236j94434j55942q1851q0025j32588j44489j09327r7393j17341j15864
$$ y = [24620601, 24234729, 23852140, 23472088, 23080707, 22679342, 22281341, 21886518, 21490216, 21101467, 20725506, 20351969, 19983716, 19645910, 19341985, 19037024, 18712969, 18404331, 18148861, 17933916, 17718679, 17483768, 17242452, 17028201, 16871766, 16754649, 16598287, 16355907, 16097899, 15924797, 15807634, 15622833, 15351719, 15114343, 14967039, 14806802, 14553147, 14292880, 14134184, 14027395, 13863517, 13666308, 13537892, 13465482, 13334408, 13115726, 12901176, 12745395, 12595125, 12397319, 12177566, 11982218, 11817984, 11669734, 11517902, 11332025, 11104856, 10888309, 10735923, 10624073, 10496755, 10364654, 10274403, 10198672, 10060236, 9865802, 9709860, 9628009, 9547984, 9415396, 9270907, 9161580, 9064187, 8946846, 8830982]
12177H830982r0454q4163q5824m9577j447j3493p6118j05862q3044p3933j05285
12166H061782j22477r5481o9714p9736r6481r4449r7462j22879j43180j35211
12156G004712j15304j02668r5850r7262j10336j10081p5732m8673q3378j42265
12146F023163j30548m7272M88l6803p9483o2649m2357q0361j21352q9361l1129
12135E302336m3136j03858j07135m2549j2386n9399j01996p8021m0883m9788n9906
12124D603279j0337M7567J8764p1281r7763k9226J4163n6984j55966j42468k9780
12113D089968L7377p060p3241o7263j8230k177k1523l3026l6850n5578o3622k4234
12101C724541K5615J5160m4053o9860m0001k0694m7260o6606l6126J98j3536n7406
$$ y = [8830982, 8740528, 8656365, 8570541, 8520964, 8519517, 8506024, 8429906, 8324044, 8241000, 8167067, 8061782, 7939305, 7843824, 7774110, 7694374, 7597893, 7503444, 7405982, 7283103, 7139923, 7004712, 6889408, 6786740, 6690890, 6593628, 6483292, 6373211, 6297479, 6248806, 6165428, 6023163, 5892615, 5845343, 5845831, 5809028, 5729545, 5666896, 5624539, 5544178, 5422826, 5333465, 5302336, 5259200, 5155342, 5048207, 5005658, 4993272, 4933873, 4831877, 4753856, 4712973, 4663185, 4603279, 4592942, 4640509, 4659273, 4587992, 4490229, 4461003, 4475166, 4418182, 4262216, 4119748, 4089968, 4127345, 4120285, 4047044, 3979781, 3961551, 3959374, 3937851, 3904825, 3867975, 3812397, 3748775, 3724541, 3750156, 3765316, 3721263, 3651403, 3611402, 3590708, 3543448, 3476842, 3440716, 3440914, 3427378, 3369972]
12089C369972p7279o5196m7672l5890l2905m9274p0706n6488j1347k632n3916
12078B866667q4285k4826O3158P5523K2504o725k455l3455r5275r3622q892M7343
12066B725660o37p4910p1024j5917l591l6343l9563l541J976m2222o2198j0717
12054B366973N1232M5341p629k7170Q68R504l5640p5929m9466P126Q232m7254
12042B246188o5891j123O5542L6519n8845j05559o3051m409M765j1976n191K1142
12030B058111L1492J4261j8243m8821n0955p844M2179L1306l7246p3566k7854
12019A912820K9419J3101m9280p2215m7329l3931m4618l6908p299J594j1148k218
12007A651988K1840K406n8597p8626k2634L7244L6222P849N150J0203q902k0798
$$ y = [3369972, 3292693, 3227497, 3179825, 3143935, 3111030, 3061756, 2991050, 2934562, 2923215, 2920583, 2866667, 2782382, 2757556, 2820714, 2896237, 2918741, 2912016, 2909561, 2876106, 2780831, 2687209, 2678317, 2725660, 2725023, 2650113, 2579089, 2563172, 2559581, 2523238, 2483675, 2480134, 2482110, 2439888, 2377690, 2366973, 2418205, 2463546, 2455917, 2428747, 2429615, 2439119, 2403479, 2327550, 2278084, 2285210, 2293442, 2246188, 2180297, 2179174, 2244716, 2281235, 2222390, 2116831, 2053780, 2049371, 2054136, 2042160, 2036969, 2058111, 2089603, 2103864, 2085621, 2036800, 1985845, 1978001, 2020180, 2051486, 2014240, 1940674, 1912820, 1942239, 1955340, 1906060, 1833845, 1786516, 1752585, 1707967, 1671059, 1663760, 1665354, 1654206, 1651988, 1673828, 1676234, 1617637, 1539011, 1516377, 1553621, 1589843, 1597692, 1602842, 1613045, 1604143, 1583345]
11995A583345R176L7581P379m8447n5405j7611L79j0400K33L6516M1828j650m1871
11982A541053m2288k3600l830K7121N1357K1628m8317o9436m212O1008L4206m8205
11970A496485q0833m3313j0901k7283n0406l4785J914J9966J3745l246l0525o3541
11958A187277p1134k7920M0653P7068N5680N829k8624l1300j2613Q480J2007j0767
11946A204636l6689k5169K4111N3164K0769k8299k2312K4110K7861k7278n8744
11935A156160j9817K3263Q038j5851J7418N9388K7806l5536k4002M3020M1216
11924A281103m1408p0625P877O9554J9737m7296j6172M7258J1927q7025j01280
11913A073650j1314N1736K1387k2356j1178J0867n025k0683N515L2632R041l3408
$$ y = [1583345, 1592521, 1630102, 1637481, 1589034, 1533629, 1516018, 1516397, 1505997, 1506230, 1542746, 1584574, 1582924, 1541053, 1498765, 1475165, 1471335, 1498456, 1549813, 1571441, 1523124, 1453688, 1449476, 1510484, 1544690, 1496485, 1415652, 1372339, 1361438, 1334155, 1283749, 1248964, 1250878, 1270844, 1284589, 1281343, 1250818, 1187277, 1116143, 1088223, 1128876, 1205944, 1261624, 1267453, 1238829, 1207529, 1194916, 1203396, 1215403, 1204636, 1167947, 1142778, 1166889, 1220053, 1240822, 1212523, 1190211, 1214321, 1242182, 1214904, 1156160, 1136343, 1159606, 1167644, 1151793, 1169211, 1228599, 1256405, 1220869, 1196867, 1239887, 1281103, 1239695, 1169070, 1176947, 1246501, 1266238, 1218942, 1202770, 1250028, 1261955, 1174930, 1073650, 1062336, 1114072, 1135459, 1113103, 1101925, 1112792, 1107767, 1087084, 1092599, 1125231, 1134272, 1100864]
11901A100864l0721R790K6250n85k7994k3802q651j4138k9633j5385L4519O7100
11889A087614L4133k9950m0659J5689N3742J7670k7690j006N7655M9046j9322
11878A196922m1703J5758O5980M2409j3008l7841l3220j7754J7628N9898N6675
11867A311744K194l1245l797K1370j6427o6459m3919L3195P0337L2758k1566l3386
11855A254799l999K9429L4652P011j9286j521M8417O7595L4392O888L0785O5626
11843A554788N7132K9103L5251O4232O8915N6622O9854R7991Q7177K9719k6884
11832B123900n6688p7755r9079j02662q2098n3689k8748q817J138K595N818N98
11820A624513l5610p6211n5034K2289N5259o68m8889o917M6798O818o2115k5101
$$ y = [1100864, 1070143, 1079933, 1106183, 1105598, 1077604, 1053802, 1045151, 1031013, 1001380, 985995, 1020514, 1087614, 1121747, 1091797, 1051138, 1066827, 1120569, 1138239, 1110549, 1109543, 1167198, 1216244, 1196922, 1155219, 1170977, 1236957, 1279366, 1266358, 1228517, 1195297, 1177543, 1195171, 1255069, 1311744, 1313938, 1282693, 1278896, 1300266, 1283839, 1217380, 1173461, 1206656, 1276993, 1309751, 1288185, 1254799, 1250800, 1280229, 1314881, 1321892, 1302606, 1301085, 1349502, 1417097, 1451489, 1458377, 1489162, 1554788, 1611920, 1641023, 1676274, 1740506, 1809421, 1866043, 1935897, 2033888, 2121065, 2150784, 2123900, 2067212, 1989457, 1890378, 1787716, 1705618, 1651929, 1623181, 1614364, 1615502, 1618097, 1623915, 1624513, 1588903, 1512692, 1457658, 1479947, 1535206, 1534538, 1485649, 1478732, 1525530, 1532348, 1470233, 1445132]
11808A445132P9884Q7657j8291p1133R497R8891Q0938J5122M472L6282N1179N7991
11796A877621Q4269J04683J03403J23556J79785K06314J62223J01060O7611K0031
11786C030556p2044j50106j67167j66504j78890j50773o8765l6943j12157j77442
11776A749765j17829j4637o968n8958m6899M264k1579r1615o5283M0280N3742
11765A424283n8591j24041m4403N6225M9452j0055j9811P30p624j6844J4267L9811
11753A303399J2778j5462J3025N2806M2317K3719O2640J14841R4436K7527J5229
11742A747255O9935J02897O4009q192p2051j23438j47171j16425n6277l3978o6042
11731A360522r4520p3276k6948o769k8148o4799p4783l2228L6774O0865M455p2667
$$ y = [1445132, 1525016, 1612673, 1594382, 1523249, 1532746, 1631637, 1712575, 1727697, 1732169, 1768451, 1819630, 1877621, 1961890, 2066573, 2169976, 2293532, 2473317, 2679631, 2841854, 2942914, 3010525, 3030556, 2958512, 2808406, 2641239, 2474735, 2295845, 2145072, 2076307, 2039364, 1927207, 1749765, 1631936, 1617299, 1610331, 1551373, 1504474, 1508738, 1487159, 1395544, 1330261, 1370541, 1424283, 1365692, 1241651, 1197248, 1253473, 1302925, 1292870, 1273059, 1273789, 1266165, 1249321, 1263588, 1303399, 1316177, 1300715, 1313740, 1366546, 1408863, 1432582, 1495222, 1610063, 1704499, 1732026, 1747255, 1817190, 1920087, 1984096, 1975904, 1903853, 1780415, 1633244, 1516819, 1460542, 1426564, 1360522, 1266002, 1192726, 1165778, 1159009, 1130861, 1066062, 991279, 959051, 995825, 1056690, 1061145, 988478]
11719I88478q5496m0200j8589m9047o6268k1094L8089L8420j1951m5511l3807
11708F93024q903J020K968L182q204j9870L388N3032N4666k8314j05407o0130
11696E80452O7321J05532o973j18129p8310M0438O3609j7974n6871l54L9291q092
11684F09940n7173k7932K1756J6041n180K0327M8488J2308m3055l2565J8564K1285
11672F02804k2555l5108l908J2230J267N279J9429j980m1624l4353J1298J9747
11660E32526j6696k6007O344J0818k8309l4523J6497L7652k0033p3201m2203J9758
11648C82623K6443J081J5016N1671M2421o374k9197j6096j1615j7451N351M2148
11636D86021K9055l5270o8232k3157L8327L4055k6190o0755k6235L1434L8590
$$ y = [988478, 902982, 862782, 844193, 795146, 728878, 707784, 745873, 784293, 772342, 726831, 693024, 684121, 685141, 688109, 691291, 683087, 663217, 666605, 719637, 774303, 745989, 640582, 580452, 647773, 753305, 746332, 628203, 549893, 590331, 653940, 635966, 579095, 578741, 618032, 609940, 552767, 524835, 546591, 562632, 557452, 577779, 626267, 638575, 595520, 562955, 581519, 602804, 580249, 545141, 541233, 553463, 554730, 560009, 579438, 577458, 535834, 501481, 512779, 532526, 515830, 489823, 496167, 506985, 478676, 444153, 460650, 498302, 478269, 405068, 362865, 382623, 409066, 410147, 425163, 476834, 519255, 512881, 483684, 467588, 455973, 438522, 443873, 486021, 515076, 479806, 411574, 388417, 426744, 460799, 434609, 373854, 347619, 379053, 417643]
11625D17643j3225n4398k5873L8436N4377P296k8004n457K1049o592m4497j4217
11613C46538O0794P8723J2773m9174l7186O602N755l6238n0691m453N8520P1597
11601D63560J8819m7649o0903j4274K9528J9557j6329k0273L462K467k6736k8756
11589C22473Q919K1068k6795o4173j6232P0050Q3106Q639n2193l1250K1848L2165
11577C77625O058m675N297J781j6410j6227L755N597j9690k8823N075M3057L4735
11564C97155n792j8496J8415N8783M8094r245n2803l2168L3219O7914K6042m6697
11552D84421o4194r843M4774L9648k382k7467k5806j7783p199O627N938j0606
11540D16128p157K8022M5527J5705q034J7910L2149k8721q7376k7415R1561Q9713
$$ y = [417643, 404418, 350020, 324147, 362583, 416960, 424256, 396252, 390795, 411844, 405252, 360755, 346538, 407332, 486055, 498828, 449654, 412468, 419070, 424825, 388587, 337896, 333443, 391963, 463560, 482379, 434730, 373827, 359553, 389081, 408638, 392309, 372036, 375498, 377965, 351229, 322473, 331392, 352460, 325665, 261492, 245260, 315310, 398416, 407055, 354862, 323612, 345460, 377625, 383683, 379008, 384305, 386086, 369676, 353449, 357204, 362801, 343111, 314288, 319363, 362420, 397155, 391363, 372867, 391282, 450065, 498159, 488914, 436111, 403943, 437162, 505076, 531118, 484421, 420227, 410384, 455158, 494806, 492424, 464957, 439151, 421368, 414169, 420796, 426734, 416128, 408971, 436993, 482520, 498225, 490191, 508101, 540250, 511529, 424153, 396738, 488299, 578012]
11528E78012n0537j36092n2412P0049P1728o082l0137J0079L6023L4574L8053
11517E63258K2420l7745p4118j9882N5043M1857k4566k7256L1120M5560J270j4668
11505E62293J4306J4093k1100j1967M3468N0676o749l1551P316K0049k4379k8348
11493E88107M8559R3653K9973m4969k4733L1630J9027l1228k6006K1014L2019
11482G37046P687M76N367n488l08M4483N9482j1534q5163n2445L8903O1293J6520
11469H16319R320M5972L1824l6039m7076K8366Q2004M7088o930j0692K684q929
11457I53911j5443P728J9064p633k6954n476J8526J2542P149K3004K1917j1624
11445I96711k0777K5985O2412K3103m8903o8103k7481J7910M1070M6793K7943
$$ y = [578012, 527475, 391383, 338971, 409020, 480748, 474666, 444529, 454608, 490631, 525205, 563258, 585678, 547933, 473815, 453933, 508976, 550833, 526267, 499011, 530131, 575691, 576961, 562293, 576599, 590692, 569592, 557625, 601093, 651769, 645020, 613469, 620785, 640834, 616455, 588107, 636666, 730319, 760292, 715323, 690590, 722220, 741247, 710019, 684013, 705027, 737046, 744733, 745209, 750576, 745088, 744780, 789263, 848745, 837211, 752048, 699603, 738506, 799799, 816319, 825639, 871611, 903435, 867396, 820320, 848686, 930690, 977778, 970848, 960156, 962840, 953911, 938468, 946196, 965260, 957627, 930673, 925197, 943723, 956265, 963414, 986418, 1008335, 996711, 975934, 1001919, 1064331, 1087434, 1038531, 970428, 942947, 960857, 1001927, 1048720, 1076663]
11434A076663j2017k8698L940L6602J2951l5715l4248J9828N5419L5100k782j3398
11422A113645j917L249m054o888N651J8429L143m0206o6801m1009M683J1029j5159
11409I83795j3628K0914K3380k5651n4873j7839K8261J9720j2175q756J1700j469
11397I53379l3948l6163j0376P835J6196K2268l85n4571o8990K899Q0694N8501
11385I37339k9258n8403n836L2855Q352k3820j9695o541n478K364J0889j3432
11373H29336n1501m5019l138O185j8009q053L2156J7548n3806o9042R513O5531
11361G11701J9620l9789j8418K2911n014m9718k1176L0752O306n0960k7306M4097
11349F23006K7509p0904r6031k555O4631P666p1548m6374M0287O7750K7387K081
$$ y = [1076663, 1064646, 1035948, 1039888, 1076490, 1089441, 1053726, 1019478, 1039306, 1094725, 1129825, 1127043, 1113645, 1111728, 1114977, 1110923, 1104035, 1109686, 1128115, 1131258, 1091052, 1024251, 983242, 987925, 998954, 983795, 970167, 991081, 1014461, 988810, 933937, 916098, 944359, 964079, 951904, 943148, 954848, 953379, 919431, 883268, 872892, 880727, 896923, 919191, 918806, 864235, 795245, 798144, 878838, 937339, 908081, 849678, 843842, 876697, 885049, 861229, 841534, 834993, 829515, 831879, 842768, 829336, 777835, 732816, 729678, 735863, 717854, 709801, 741957, 759505, 705699, 636657, 646170, 711701, 731321, 691532, 673114, 696025, 691011, 641293, 620117, 650869, 657175, 606215, 578909, 623006, 650515, 579611, 483580, 481025, 545656, 553322, 481774, 435400, 475687, 543437, 570824, 572905]
11337E72905J4117Q168l4471o0311l0239K2363L8884P453k8819k6625L262J0339
11325D97026j9264l2623Q815N3427K9277l4367m1674J7870N0594R918l5039k2250
11313D81710R592Q199j986J1722J4407j9597l0306K8313P8832K6779p2506q3610
11301D51549j788M3844j771m8042k4016J7256J6010J0365M4497O7400J8776n2248
11289E41832n5323j823K1156m757j2469K4094M4606R133l1154j5802L0779M1959
11277E92231R829j4734q430m591k7412m5376j9514L0980M9928K1565j1881j5040
11265E57555m439r544k1091j0919J6311K8813J7061K592r6K037L806P563N565
11252E95214j0911k5298j4160R096J0475m335L004K9337K3753k3764n1686k0881
$$ y = [572905, 587022, 595190, 560719, 500408, 470169, 492532, 531416, 538869, 510050, 483425, 486687, 497026, 477762, 445139, 453954, 507381, 536658, 502291, 460617, 478487, 529081, 538999, 503960, 481710, 491302, 499501, 497515, 509237, 523644, 504047, 473741, 502054, 580886, 607665, 535159, 451549, 449761, 493605, 491834, 443792, 419776, 437032, 453042, 463407, 507904, 575304, 594080, 541832, 486509, 484686, 505842, 501085, 488616, 512710, 557316, 566449, 535295, 519493, 550272, 592231, 602060, 587326, 578896, 574305, 546893, 501517, 482003, 512983, 562911, 584476, 572595, 557555, 553116, 543572, 522481, 511562, 527873, 556686, 573747, 576339, 576243, 578280, 582086, 589649, 595214, 584303, 559005, 544845, 553941, 564416, 560081, 563085, 592422, 616175, 592411, 540725, 519844]
11240E19844K3024K9606K5052M9150O6199K3515l9185l6837J9727L2370k6012
11229F86453o3351j3494N9901O2247M256k9486p425K3345K2644O764O685J9668
11217G78207K0431J591j4177m489J7097J3353j8676k7988J9770P4573N8831j4506
11205I04017m7154N261O6543N1116j4766l9423K945N0630N2157K8935L0584O4373
11193A155218Q8541O6087J3898j1411J6933N9760P1417P2361J11336J69018J72657
11182A985815J13801O8193P0317N6341j7438q6514q3571n5455q0235j27573j10968
11171A732713l9672l509k6003m6815m3408n4441p4991m6446K3733M4946j2454
11160A453653n9757k9231K5052L0023J0193K3252N0744M1451J3354K1823N5720
$$ y = [519844, 542868, 572474, 597526, 646676, 712875, 736390, 697205, 660368, 680095, 712465, 686453, 623102, 609608, 669509, 731756, 736012, 706526, 699101, 722446, 745090, 751854, 758539, 778207, 798638, 800229, 786052, 781563, 798660, 812013, 793337, 765349, 785119, 859692, 918523, 904017, 856863, 862124, 928667, 979783, 965017, 925594, 928539, 979169, 1031326, 1060261, 1090845, 1155218, 1243759, 1309846, 1323744, 1312333, 1329266, 1389026, 1460443, 1532804, 1644140, 1813158, 1985815, 2099616, 2167809, 2238126, 2294467, 2277029, 2190515, 2106944, 2051489, 1971254, 1843681, 1732713, 1693041, 1689532, 1663529, 1616714, 1573306, 1518865, 1443874, 1397428, 1421161, 1466107, 1453653, 1393896, 1364665, 1389717, 1419740, 1429933, 1453185, 1503929, 1545380, 1558734, 1580557, 1636277]
11149A636277N1595J559k8596L763N9913P5407M1201J3482M9960J36989J90515
11138B232065J55792R3056J08994K01407K47675J75456O2854J2621J865n8801
11128C232984j67120k28070j93888j19312p5468p6782r9079j13388r4430m1360
11118B024087N417N330k7775m6902l6783j9503q880j015J780j724N221K6850K8629
11105A954732j1082m6756k1963L6576M7408p811n9425m7836J0497O3180P7897
11094A995417N1714J0401K937N3818J20444J38893J05595O9325N5087M8890M4386
11083B696907M2692J7011n3086j18713j09563m5060j5394m3083n3415p619K6984
11072B337661j1281p3232p0353k494M8706L0331k5011m6485p362L9830K1703m9747
$$ y = [1636277, 1687872, 1689431, 1660835, 1664598, 1724511, 1799918, 1841119, 1854601, 1904561, 2041550, 2232065, 2387857, 2480913, 2589907, 2791314, 3038989, 3214445, 3277299, 3289920, 3291785, 3232984, 3065864, 2837794, 2643906, 2524594, 2449126, 2372344, 2273265, 2159877, 2065447, 2024087, 2029504, 2034834, 2007059, 1960157, 1923374, 1903871, 1894991, 1893976, 1895756, 1894032, 1899253, 1926103, 1954732, 1943650, 1896894, 1874931, 1911507, 1958915, 1951104, 1891679, 1843843, 1854340, 1917520, 1995417, 2047131, 2057532, 2060469, 2114287, 2234731, 2373624, 2479219, 2548544, 2603631, 2652521, 2696907, 2739599, 2756610, 2703524, 2584811, 2475248, 2430188, 2414794, 2371711, 2318296, 2310677, 2337661, 2326380, 2253148, 2182795, 2180301, 2229007, 2259338, 2234327, 2187842, 2180480, 2220310, 2242013, 2192266]
11060B192266p0814Q424Q6939M8029n4225o7769J9801O6568J1431l9988j4940
11049B185722O353m0064o5986R068Q8851M3245p0493q9844N909Q6654Q0144M3563
11037B283122L3122L2531K3239K1461L0251L2260K9847K8401M386m1206m2302
11026B435112L2669R4488N5743j5047K836P0895M9836n1108p2545K6211Q9908
11015B718998K3706n3731j6813O2045M8272l0282m4969J8946N6381J9812k5812
11004B776553k2010J1148L1572K8258O659k3669l9927k5253M068K2115L1419M4479
10992B845412M6281J7021j9994j7685K7326O3256M8506M186j3242J6800N1551
10981C069418M0975J328l176L7319M7553j7307p8118l3546P6372J10453K9302
$$ y = [2192266, 2121452, 2129876, 2216815, 2264844, 2210619, 2142850, 2162651, 2229219, 2240650, 2200662, 2185722, 2192075, 2152011, 2086025, 2095093, 2183944, 2227189, 2156696, 2066852, 2072761, 2159415, 2239559, 2283122, 2316244, 2348775, 2372014, 2393475, 2423726, 2455986, 2485833, 2514234, 2518620, 2477414, 2435112, 2467781, 2562269, 2618012, 2602965, 2605801, 2676696, 2726532, 2675424, 2602879, 2629090, 2718998, 2742704, 2688973, 2672160, 2734205, 2782477, 2752195, 2707226, 2726172, 2782553, 2802365, 2776553, 2754543, 2765691, 2797263, 2825521, 2832180, 2808511, 2768584, 2743331, 2747399, 2769514, 2800933, 2845412, 2891693, 2908714, 2888720, 2871035, 2898361, 2961617, 3010123, 3014309, 3001067, 3017867, 3069418, 3110393, 3111721, 3108545, 3145864, 3193417, 3176110, 3097992, 3064446, 3140818, 3251271, 3280573]
10970C280573m8612k1999O0796R5053O3763K4217R276P401N934L496K295J5439
10958C497632N1513P8703N1705j1621l8073j667M4370N6405M9490L5688l102m6671
10946C764372k9977M5843Q2653K6021m3632k8695M8606R7024Q0794K7852k6054
10935D044807m3730j247N3894L6138m0693n8209J9898P8593M6228J7969P1726
10924D225374J06863K3144p0641k1091R8871J02163J721k2134O3264J01860L2170
10913D641564k0497K0881O8337N1277K7311L9302L4197j719P999O9135P0739j3727
10901D994799m6359M8250J36420Q4639k6307m1577L0750P5703P1592P9101R7202
10890E504213P8756M6100N7275Q8488P0391J6219K551M0323O5635M7116J5083
$$ y = [3280573, 3231961, 3209962, 3270758, 3365811, 3429574, 3453791, 3463067, 3470468, 3476402, 3479898, 3482193, 3497632, 3549145, 3627848, 3679553, 3667932, 3629859, 3628192, 3672562, 3728967, 3778457, 3814145, 3811043, 3764372, 3734395, 3780238, 3862891, 3888912, 3845280, 3816585, 3865191, 3962215, 4043009, 4070861, 4044807, 4001077, 3999830, 4053724, 4089862, 4049169, 3990960, 4010858, 4089451, 4135679, 4153648, 4225374, 4332237, 4355381, 4284740, 4263649, 4362520, 4464683, 4466404, 4444270, 4507534, 4609394, 4641564, 4621067, 4641948, 4710285, 4761562, 4788873, 4828175, 4862372, 4860653, 4868652, 4937787, 5008526, 4994799, 4948440, 4996690, 5133110, 5217749, 5191442, 5149865, 5180615, 5256318, 5327910, 5407011, 5504213, 5582969, 5629069, 5686344, 5774832, 5845223, 5861442, 5863993, 5904316, 5969951, 6017067, 6032150]
10879F032150m888j1681L150L9705O2346M9181M1009P9423J28242J21780O1847
10868F602264N395j3521P334O7419J38835J53726Q4400J048j4149K7066O0431
10857G120248P0312P8602P6621M6880J8783K7744M9880M7052M1307P2031J14712
10846G764172J18232R2350Q5292J03766J22705J40510J59062J49423J05329Q4261
10836H925102J23004J64182J45664J06181J12132J37193J18234P9516Q8031J26974
10826A0126213J30883J12602J34170J77016J65717J07893Q8691J27552J53849
10817A1324586J31738J07952J23913J62615J88988J82809J47762J35687K10475
10808A2716525L33071L66650K72279J88981K15339K47802J83964J34121K21943
$$ y = [6032150, 6027262, 6015581, 6018731, 6058436, 6120782, 6169963, 6210972, 6290395, 6418637, 6540417, 6602264, 6607659, 6594138, 6601472, 6668891, 6807726, 6961452, 7045852, 7046900, 7032751, 7059817, 7120248, 7190560, 7269162, 7345783, 7392663, 7411446, 7439190, 7489070, 7536122, 7577429, 7649460, 7764172, 7882404, 7974754, 8060046, 8163812, 8286517, 8427027, 8586089, 8735512, 8840841, 8925102, 9048106, 9212288, 9357952, 9464133, 9576265, 9713458, 9831692, 9911208, 9999239, 10126213, 10257096, 10369698, 10503868, 10680884, 10846601, 10954494, 11043185, 11170737, 11324586, 11456324, 11564276, 11688189, 11850804, 12039792, 12222601, 12370363, 12506050, 12716525, 13049596, 13416246, 13688525, 13877506, 14092845, 14340647, 14524611, 14658732, 14880675]
10799A4880675L17254K35679R2586J40144L20124L39462J80340J43260L20056
10790A6969580M26049L00331J87918L03234M55457L91686K32534K43532L82764
10781A9893085M13757L27210L15852M07234M35075L54183L09512L76436M58415
10772B3290759M73383M59827M66284M79670M87771N04900N31600N68648O40511
10763B7903353P33316P73563P46439P45353Q12512Q41960P54766O48141O33013
10754C4592416O48503N97861N46554O01275O98788P10594O67406O85397P53737
10745D0502531P89021Q15777Q96840R73175R73011R81971J093400J200433J171949
10736D9398108J118077J214153J374774J404637J373408J502270J748694J869058
$$ y = [14880675, 15197929, 15433608, 15526194, 15666338, 15986462, 16325924, 16506264, 16649524, 16969580, 17395629, 17695960, 17883878, 18187112, 18642569, 19034255, 19266789, 19510321, 19893085, 20306842, 20634052, 20949904, 21357138, 21792213, 22146396, 22455908, 22832344, 23290759, 23764142, 24223969, 24690253, 25169923, 25657694, 26162594, 26694194, 27262842, 27903353, 28636669, 29410232, 30156671, 30902024, 31714536, 32556496, 33311262, 33959403, 34592416, 35240919, 35838780, 36385334, 36986609, 37685397, 38395991, 39063397, 39748794, 40502531, 41291552, 42107329, 43004169, 43977344, 44950355, 45932326, 47025726, 48226159, 49398108, 50516185, 51730338, 53105112, 54509749, 55883157, 57385427, 59134121, 61003179]
10728F1003179J861137J967555K236056K453383K548372K689971K934049L135264
10720H0828966L265142L456370L687507L813559L956406M434481N234799O013837
10712A14691067O699562P575151Q676094R741952J0951618J2934690J5606244
10705A86876378J7670415J7836483J5905348J2075546O035939k083924j0296798
10698B44019387j5704165j7129925j5916573j3950496j1869546r555668p337417
10691A52555597n813099m953684m190553l266104k432173j871481j410366q59777
10683A27758360k92480J31868M18299P11656J107758J553404J930680K229354
10675A35548899K580722L066078L571805L948639M237424M594924N086716N731813
$$ y = [61003179, 62864316, 64831871, 67067927, 69521310, 72069682, 74759653, 77693702, 80828966, 84094108, 87550478, 91237985, 95051544, 99007950, 103442431, 108677230, 114691067, 121390629, 128965780, 137641874, 147383826, 158335444, 171270134, 186876378, 204546793, 222383276, 238288624, 250364170, 256400109, 254316185, 244019387, 228315222, 211185297, 195268724, 181318228, 169448682, 159893014, 152555597, 146742498, 141788814, 137598261, 134332157, 131899984, 130028503, 128618137, 127758360, 127465880, 127597748, 128016047, 128727703, 129835461, 131388865, 133319545, 135548899, 138129621, 141195699, 144767504, 148716143, 152953567, 157548491, 162635207, 168367020]
10667A68367020O650616P942580R496736J1152585J2962837J5089398J7608215
10660B49269987K0646375K4341344K8107323L0171907K8561367K2588671J2918362
10653D16605336N75316j3002840k5026715l2122748l3069824k9983316k5950471
10646B58024738k2198441j8379370j4644529j1895731j0274011q897903p312911
10639A64421842o051201n463467n032197m280081l496838l066361k786742k368729
10631A31876226j997367j878712j747585j330780q42522n40362k31469K90393
10623A23597822P55766R04258J056258J626315K427992L068966L689811M631153
10615A41758341N689717O515386P525295R460175J1993663J3699462J3580648
$$ y = [168367020, 175017636, 182960216, 192456952, 203609537, 216572374, 231661772, 249269987, 269916362, 294257706, 322365029, 352536936, 381098303, 403686974, 416605336, 417180652, 404177812, 379151097, 347028349, 313958525, 283975209, 258024738, 235826297, 217446927, 202802398, 190906667, 180632656, 171734753, 164421842, 158370641, 152907174, 147874977, 143594896, 140098058, 137031697, 134244955, 131876226, 129878859, 128000147, 126252562, 124921782, 124079260, 123538898, 123307429, 123597822, 124353588, 125257846, 126314104, 127940419, 130368411, 133437377, 137127188, 141758341, 147448058, 153963444, 161488739, 170948914, 182942577, 196642039, 210222687]
10608B10222687J1743359Q310339K796331m601720j1855757j6390013j7420654
10601A82804572j6276440j4537293j2685671j0640357q673470p221305o253518
10594A06516518n407067m582745l984697l655423l363373k980775k657455k520266
10586G7364717k442350k258407k037082j957699k010300k005970j858211j676985
10578F1117713j557787j441316j262210j103290j075739j126664j106093r89481
10570E1455133q93017q69316q29757p11457n96025n82415o30724o29047n62160
10561D5151215n14082n24978n41769n18419m81561m64969m45420l95517l55885
10552D0908615l86338m58170m67301l73918k65442k36586k60131k45847j91083
$$ y = [210222687, 221966046, 230276385, 233072716, 228470996, 216615239, 200225226, 182804572, 166528132, 151990839, 139305168, 128664811, 119991341, 112770036, 106516518, 101109451, 96526706, 92542009, 88886586, 85523213, 82542438, 79884983, 77364717, 74922367, 72663960, 70626878, 68669179, 66658879, 64652909, 62794698, 61117713, 59559926, 58118610, 56856400, 55753110, 54677371, 53550707, 52444614, 51455133, 50562116, 49692800, 48863043, 48151586, 47555561, 46973146, 46342422, 45713375, 45151215, 44637133, 44112155, 43570386, 43051967, 42570406, 42105437, 41660017, 41264500, 40908615, 40522277, 40064107, 39596806, 39222888, 38957446, 38720860, 38460729, 38214882, 38023799]
10543C8023799j77226k20500k34640j76589j25758j50493j85933j40986n8187
10534C6553487m7405r8540r3017o92O5725K7887l9756k9425M8747J08425J20455
10523C6615891J27595J57574J90782K07130K15595K33544K63656K92544L01534
10514C8605845K86899K72946K88391L28744L63498L77929L80904L78588L77410
10505D1661154M04532M76496N51987N75226N68322O09673P06638P70420P51547
10496D7075995P20117P57500Q40208R00184R40185J007898J098422J168531J222224
10487E5731264J300198J401121J493012J591009J739257J915628K041923K107236
10479F9320648K200640K386840K615179K795364K915297L040794L231093L488073
$$ y = [38023799, 37846573, 37626073, 37391433, 37214844, 37089086, 36938593, 36752660, 36611674, 36553487, 36506082, 36407542, 36314525, 36313833, 36379558, 36407445, 36367689, 36338264, 36387011, 36495436, 36615891, 36743486, 36901060, 37091842, 37298972, 37514567, 37748111, 38011767, 38304311, 38605845, 38892744, 39165690, 39454081, 39782825, 40146323, 40524252, 40905156, 41283744, 41661154, 42065686, 42542182, 43094169, 43669395, 44237717, 44847390, 45554028, 46324448, 47075995, 47796112, 48553612, 49393820, 50294004, 51234189, 52242087, 53340509, 54509040, 55731264, 57031462, 58432583, 59925595, 61516604, 63255861, 65171489, 67213412, 69320648, 71521288, 73908128, 76523307, 79318671, 82233968, 85274762, 88505855, 91993928]
10471I1993928L761730L980028M101280M157656M214953M269591M224725L993884
10463A24697775L583912L038908K350866J488228M87219n51474j549848k476840
10455A31068746l288645l914484m326716m573443m709790m737017m643107m466123
10447I6409421m269973m075741l861421l621225l382820l165448k960924k765252
10439F8306617k594812k456075k327274k189182k053341j940366j846500j751591
10431E1147476j649392j551429j466862j393306j324614j258469j198790j152506
10423D0152108j116787j073678j013931r60208r37379r21329q59953p57084o86040
10414C1825719o90435p19351p04915o59997o39253o38112o06130n45888n18319
$$ y = [91993928, 95755658, 99735686, 103836966, 107994622, 112209575, 116479166, 120703891, 124697775, 128281687, 131320595, 133671461, 135159689, 135646908, 135095434, 133545586, 131068746, 127780101, 123865617, 119538901, 114965458, 110255668, 105518651, 100875544, 96409421, 92139448, 88063707, 84202286, 80581061, 77198241, 74032793, 71071869, 68306617, 65711805, 63255730, 60928456, 58739274, 56685933, 54745567, 52899067, 51147476, 49498084, 47946655, 46479793, 45086487, 43761873, 42503404, 41304614, 40152108, 39035321, 37961643, 36947712, 35987504, 35050125, 34128796, 33268843, 32511759, 31825719, 31135284, 30415933, 29711018, 29051021, 28411768, 27773656, 27167526, 26621638, 26103319]
10405B6103319n43042n65994n45097n04923m81388m68103m46944m24349m08219
10396B1715260l90089l74458l83259m07655m01280l49160k98261k89492l04169
10387A8517437l09456l09661l15041l06575k75773k57018k73687k91723k75010
10378A5903493k47813k48972k60798k42886k07290j98090k16189k22486k01675
10369A3857294j72417j48493j33565j35539j47778j44862j32971j57839k16295
10360A2467535k23229j38041n8243q9373j77909j93113j33383j11617j54260j68244
10350A1020123j19444r1306j27509j58127j36031j13859j22396j03332l9330k2014
10340I986775r6383j58986j20798n8335p7256j30068j15277o8863r1204j48082
$$ y = [26103319, 25560277, 24994283, 24449186, 23944263, 23462875, 22994772, 22547828, 22123479, 21715260, 21325171, 20950713, 20567454, 20159799, 19758519, 19409359, 19111098, 18821606, 18517437, 18207981, 17898320, 17583279, 17276704, 17000931, 16743913, 16470226, 16178503, 15903493, 15655680, 15406708, 15145910, 14903024, 14695734, 14497644, 14281455, 14058969, 13857294, 13684877, 13536384, 13402819, 13267280, 13119502, 12974640, 12841669, 12683830, 12467535, 12244306, 12106265, 12048022, 11958649, 11780740, 11587627, 11454244, 11342627, 11188367, 11020123, 10900679, 10809373, 10681864, 10523737, 10387706, 10273847, 10151451, 10048119, 10008789, 9986775, 9890392, 9731406, 9610608, 9552273, 9475017, 9344949, 9229672, 9160809, 9069605, 8921523]
10330H921523j24124l9073k6292j01929j38310q7541n3216r2765j18125o6938
10320H073210j9605n0344r3716o9014k5004l9732p0770l9004J1147j9974j04296
10309G552898j20490n5550k6099q6213j50631j46408j16843j14900j03071m2805
10299F589888L151l9013j17186j17753m2620q778o4344j15132p6985p255r758
10288E994215p2608r4584m5343j386j6598m8118m4795l1617m9294o8316l6959
10277E484597J7667J6016n2277j06041q5478k6693K087r923k4626k0196j0469
10266E184664j3660k9429m3179m0527k3088j2103k3749m3333m5489l6904m7250
10255D825953p4624q0004n1219l1297n3827q4680o8781j3360K0866M599k8068
$$ y = [8921523, 8797399, 8758326, 8732034, 8630105, 8491795, 8404254, 8351038, 8258273, 8140148, 8073210, 8053605, 8003261, 7909545, 7840531, 7815527, 7775795, 7705025, 7666021, 7677168, 7657194, 7552898, 7432408, 7376858, 7350759, 7264546, 7113915, 6967507, 6850664, 6735764, 6632693, 6589888, 6593039, 6554026, 6436840, 6319087, 6276467, 6267689, 6203345, 6088213, 6011228, 6003973, 5994215, 5921607, 5827023, 5781680, 5780294, 5763696, 5715578, 5670783, 5639166, 5589872, 5521556, 5484597, 5502264, 5518280, 5466003, 5359962, 5274484, 5247791, 5249878, 5239955, 5215329, 5195133, 5184664, 5171004, 5141575, 5098396, 5057869, 5034781, 5022678, 4998929, 4955596, 4910107, 4873203, 4825953, 4751329, 4671325, 4620106, 4588809, 4534982, 4450302, 4381521, 4368161, 4389027, 4393626, 4365558]
10244D365558l9123l7620m7815n4505k0214M4189O7796Q308p2949p5769K74M5676
10232D183806j639n7099j4758Q2591J01236K3902k2579L2735J01303R1567N5458
10221D576523Q0081J21566P6142l1923p5073k7450n998p6888j47814j19359m3512
10210D326295l8444j06578j39652q5322j5821j4502o2201p5815k6185K6449J5523
10199C803747m3655p3404l5253K1337L0706P70r711J4013K6926O044j2816l287
10187C725417K993k2762m2682m199P1547J10965Q6737M3514K8914M8067Q8052
10176D136563J37750J73152J68412J36358J14919R7786L0248r5603j94890j92615
10166D512080j33242j19923j66014j86318j37962q5073r1022j20928j07507n8751
$$ y = [4365558, 4326435, 4288815, 4241000, 4186495, 4166281, 4210470, 4278266, 4286574, 4213625, 4137856, 4138130, 4183806, 4182167, 4125068, 4110310, 4192901, 4294137, 4318039, 4295460, 4328195, 4429498, 4521065, 4576523, 4656604, 4778170, 4854312, 4822389, 4747316, 4719866, 4713868, 4636980, 4489166, 4369807, 4326295, 4287851, 4181273, 4041621, 3956299, 3940478, 3925976, 3863775, 3787960, 3761775, 3788224, 3803747, 3760092, 3686688, 3651435, 3672772, 3703478, 3704248, 3694537, 3708550, 3735476, 3741520, 3728704, 3725417, 3728410, 3705648, 3662966, 3658767, 3730314, 3841279, 3928016, 3971530, 4000444, 4048511, 4136563, 4274313, 4447465, 4615877, 4752235, 4867154, 4964940, 4995188, 4899585, 4704695, 4512080, 4378838, 4258915, 4092901, 3906583, 3768621, 3683548, 3592526, 3471598, 3364091, 3305340]
10156C305340l1536l4983l4866l2033n5392q2510n3324K1964N1951m756p1252
10145B978603o2889l747K3828m084m6207o5422m7725R090O8062N8224k6281p9391
10133B802061j8087Q1468Q7686J7989P698Q2611J14509L9295l0841O749P5299
10122C266437M6036n9391j20944j12449j08986j32825j23676o5427k6543m7148
10112B515084p8011o7846l8662l3699m6360m3845k4797j4431k0941k4589o506
10101B115397K1259J8507l4471q9094o8737K0307O8526K155j05183j28586o0363
10090A759717L359J6701K1559L6962K2498k5898m6243j4728J0398q277k6286p438
10078A742324Q917j1811l1140j3900K250j5781k3607J4555L7961j5761q7463p7305
$$ y = [3305340, 3273804, 3238821, 3203955, 3171922, 3116530, 3034020, 2980696, 3002660, 3054611, 3049855, 2978603, 2915714, 2911967, 2935795, 2931711, 2885504, 2820082, 2772357, 2781447, 2849509, 2907733, 2881452, 2802061, 2783974, 2865442, 2953128, 2971117, 2978815, 3061426, 3175935, 3215230, 3184389, 3191138, 3266437, 3312473, 3253082, 3132138, 3019689, 2910703, 2777878, 2654202, 2588775, 2562232, 2515084, 2437073, 2369227, 2330565, 2296866, 2250506, 2206661, 2181864, 2167433, 2146492, 2121903, 2115397, 2136656, 2155163, 2120692, 2031598, 1962861, 1983168, 2051694, 2053849, 1948666, 1820080, 1759717, 1763076, 1779777, 1801336, 1838298, 1860796, 1834898, 1788655, 1773927, 1784325, 1776048, 1749762, 1742324, 1751241, 1739430, 1708290, 1694390, 1696640, 1680859, 1657252, 1671807, 1709768, 1694007, 1606544, 1529239]
10066A529239m900K6171m649k2437J243J4150l352n852J7123J6116j5970k0041
10054A526841J4635J4388m9189q9311l3124N6011O4320j5225q4683o8648J5818
10043A351833R1756Q7544Q68p8251n5705L4263N4937l9150j21810p4322M0550
10032A292513P9464K6376j6709n532O093r159r717J6989K1363j3223l2993p862
10020A347603J6349J61k5376k0832l857n686j3219k120J3095O738j2626k2481
10008A277749k2975k1059q228J5800K7431J5982M927Q886M438k4307m6001k6101
9996A206542J7332L9510K7988L307j6415k1307m641J9131J7377j3138l2854k0037
9984A222795m701r258l690L2708N3731J4086m4671m9349q029J0476q568j4775
$$ y = [1529239, 1524339, 1550510, 1545861, 1523424, 1524667, 1538817, 1535465, 1529613, 1546736, 1562852, 1546882, 1526841, 1541476, 1555864, 1506675, 1417364, 1384240, 1440251, 1504571, 1489346, 1404663, 1336015, 1351833, 1443589, 1531133, 1532001, 1453750, 1398045, 1432308, 1487245, 1448095, 1326285, 1251963, 1292513, 1371977, 1398353, 1381644, 1376112, 1382205, 1373046, 1363329, 1380318, 1401681, 1388458, 1355465, 1347603, 1363952, 1364113, 1338737, 1317905, 1314048, 1308362, 1295143, 1293023, 1306118, 1312856, 1300230, 1277749, 1254774, 1233715, 1225487, 1241287, 1268718, 1284700, 1289627, 1298513, 1302951, 1278644, 1232643, 1206542, 1223874, 1263384, 1291372, 1294679, 1278264, 1256957, 1252316, 1271447, 1288824, 1275686, 1242832, 1222795, 1218094, 1208836, 1205146, 1237854, 1291585, 1305671, 1261000, 1211651, 1203622, 1214098, 1205530, 1190755]
9972A190755R315K3015Q248k187P365J0431k68M345K3651J3513l1970n1466p916
9959A196831M8606N2103O567l8937n6460m2199K094M8736M5919j5005o7271m8184
9947A132800J5040M0405n591p2351q2169q555Q6962J02305J3987o9800l9830N0284
9935A163487N3689l7816p2172J2102P4319O640p6703l4659N0638J5793q7535p0335
9923I97448O3163J11241J2736n8430J718O4085J5744m3577k534N0023m436q0792
9911A126389l2936P7838P6172l0322p0529l156L0328l3616p4193m465Q0034O4300
9899A205844r906l4437k694J4609n860k9592l4004j8548J8369N8710N9306J2481
9887A234278k8684k5975r787j5284j7682J5636N4998N0444R949j9874k3745j8783
$$ y = [1190755, 1200070, 1223085, 1231333, 1229146, 1236511, 1246942, 1246674, 1251019, 1274670, 1288183, 1256213, 1204747, 1196831, 1245437, 1297540, 1304107, 1265170, 1208710, 1166511, 1168605, 1217341, 1263260, 1248255, 1180984, 1132800, 1147840, 1188245, 1182654, 1110303, 1028134, 1019579, 1106541, 1208846, 1222833, 1153033, 1113203, 1163487, 1217176, 1179360, 1107188, 1119290, 1193609, 1200249, 1123546, 1088887, 1139525, 1155318, 1067783, 997448, 1060611, 1171852, 1184588, 1126158, 1127876, 1191961, 1207705, 1164128, 1161594, 1211617, 1207181, 1126389, 1093453, 1171291, 1247463, 1217141, 1146612, 1143456, 1173784, 1140168, 1065975, 1061510, 1141544, 1205844, 1195938, 1161501, 1158807, 1173416, 1167556, 1137964, 1103960, 1085412, 1103781, 1162491, 1221797, 1234278, 1205594, 1179619, 1169832, 1154548, 1136866, 1152502, 1207500, 1257944, 1267893, 1248019, 1224274, 1205491]
9875A205491j1931k226l03n625N928L4432L5606q456m3900k4213J1893O183k0724
9862A182155j3114J7446K1192R896K9175N2892J5566n5130n7841J4786N0701l82
9850A267342m2144N693P0816M8472k8671n1508p994J9788K136p372J6768L1104
9838A324430R237j4134r145N422Q359J0305J8568J7098M236N726K7340L5699J0802
9825A453943j7884j2677K2481N1901M4701n403o6936p7346o931Q0542Q6854J0649
9813A563894m5900k4511J3333L864r203L7362R6104P4734m226k7420L1774P5996
9801A785801M3002q396j2060O984P474J6095N9146Q2635L2950l4447k6918L5822
9789A988088M9017r224m3931M673P2180P5708L1568J0769L0673N1836N1487M3796
$$ y = [1205491, 1193560, 1191334, 1191031, 1185406, 1191334, 1225766, 1261372, 1252916, 1209016, 1184803, 1196696, 1202879, 1182155, 1169041, 1186487, 1207679, 1217575, 1246750, 1299642, 1315208, 1260078, 1202237, 1217023, 1267724, 1267342, 1225198, 1230891, 1301707, 1350179, 1321508, 1270000, 1262006, 1281794, 1283930, 1276558, 1293326, 1324430, 1333667, 1319533, 1310388, 1315810, 1324169, 1334474, 1353042, 1370140, 1374376, 1380102, 1407442, 1443141, 1453943, 1436059, 1423382, 1445863, 1497764, 1542465, 1537062, 1470126, 1392780, 1385849, 1466391, 1553245, 1563894, 1517994, 1493483, 1506816, 1510680, 1501477, 1538839, 1634943, 1709677, 1705451, 1678031, 1709805, 1785801, 1828803, 1820407, 1808347, 1815331, 1822805, 1838900, 1898046, 1980681, 2013631, 1979184, 1952266, 1988088, 2037105, 2027881, 1983950, 1988623, 2060803, 2136511, 2168079, 2178848, 2209521, 2261357, 2312844, 2356640]
9777B356640L9953L2741J8793O803M692J5211L6687N6411N7750M5678M6883P1341
9765B789583R4683R2890P1216M4373J7240L470K7143P6506R2795M6910m329J0391
9753C362871P2642J01058P0851M1711O0658R7798J00110O3138K4570J8780N4353
9742D068540J07311J27981Q9659L6457L8754R2082J16917Q0862N4695R8969J55418
9731E067645J28005L7954P576Q7669J85018J94065J36852J17427J70291K17525
9721F350027J82863J00730P6319J50737K46508K65096K09694J71456K02348K52294
9711H208072K51020K08949J99216K62986L69555M59190M97711N00973N28618O35066
9701A2121356Q00585R34090R72287R39960Q67333O96334L59355o2337l64209m31812
$$ y = [2356640, 2396593, 2429334, 2448127, 2454930, 2459622, 2474833, 2511520, 2567931, 2625681, 2671359, 2718242, 2789583, 2884266, 2977156, 3048372, 3092745, 3109985, 3113455, 3140598, 3217104, 3309899, 3356809, 3352480, 3362871, 3435513, 3536571, 3607422, 3649133, 3709791, 3807589, 3907699, 3970837, 3995407, 4014187, 4068540, 4175851, 4303832, 4393491, 4429948, 4468702, 4560784, 4677701, 4758563, 4813258, 4912227, 5067645, 5195650, 5233604, 5241180, 5328849, 5513867, 5707932, 5844784, 5962211, 6132502, 6350027, 6532890, 6633620, 6709939, 6860676, 7107184, 7372280, 7581974, 7753430, 7955778, 8208072, 8459092, 8668041, 8867257, 9130243, 9499798, 9958988, 10456699, 10957672, 11486290, 12121356, 12921941, 13856031, 14828318, 15768278, 16635611, 17331945, 17691300, 17628963, 17264754, 16832942]
9691A6832942l42617k17080o3534J52720L69991M87449N40414O88723R94489J311343
9681B0754840J458691J427717J316639J105866O42940r2364q16300j163702j066093
9672B3568234p90641n82379m00072r2342K92801N60017O93302R15912J351116
9663B5515948J794767J952286J770426J370989P63621j31949j173932j951127
9655B9911029k167782j935336j569121j221437q59359m98681k45025j00342Q4958
9646B1398904L97213P23009R02633R10493P84157M70231j03715q20806j386076
9637B3276043j596768j514576j327520j130388r11611o79782m87900l44798j98933
9628A5083767k7539J27514K28751K79393K64759J27369j49223m79127p47108r07794
$$ y = [16832942, 16490325, 16273245, 16209711, 16362431, 16732422, 17219871, 17760285, 18449008, 19443497, 20754840, 22213531, 23641248, 24957887, 26063753, 26706693, 26614329, 25798029, 24634327, 23568234, 22777593, 22195214, 21795142, 21702800, 21995601, 22555618, 23248920, 24164832, 25515948, 27310715, 29263001, 31033427, 32404416, 33168037, 33036088, 31862156, 29911029, 27743247, 25807911, 24238790, 23017353, 22157994, 21659313, 21414288, 21313946, 21398904, 21796117, 22519126, 23421759, 24332252, 25116409, 25586640, 25482925, 24662119, 23276043, 21679275, 20164699, 18837179, 17706791, 16795180, 16115398, 15627498, 15282700, 15083767, 15056228, 15183742, 15412493, 15691886, 15956645, 16084014, 15934791, 15455664, 14708556, 13800762]
9618A3800762r70289r32653p99842o37224n28024m80198m37508l78046l34619
9609H302359l16099k83969k27952j95931k14839k41111k29637j99810j87078j75949
9599F029984j37292r7396j06788j56699j84826j60147j12695p9131o5419o9692
9589D859899r7336j34918j43366j03756n2487m5353q9841j32813j23696p7166
9579C859167n2150o8296p6468l7555K500k8936j11115j40382p6271m151j1482
9568C254861o5880p7829l6838j0501l2991o8644q0884p2982n6757l4593j9590
9557B697372k8866n0529n3856l3456j1529l335j2574m4147q2389p9966j9561L6279
9545B313443J8567m4202o6013l2445q887k4916l8968k6907j6968j8269k196K0980
$$ y = [13800762, 12830473, 11897820, 11097978, 10460754, 9932730, 9452532, 9015024, 8636978, 8302359, 7986260, 7702291, 7474339, 7278408, 7063569, 6822458, 6592821, 6393011, 6205933, 6029984, 5892692, 5795296, 5688508, 5531809, 5346983, 5186836, 5074141, 4995010, 4929591, 4859899, 4762563, 4627645, 4484279, 4380523, 4328036, 4282683, 4192842, 4060029, 3936333, 3859167, 3807017, 3738721, 3662253, 3624698, 3627198, 3598262, 3487147, 3346765, 3270494, 3266343, 3254861, 3188981, 3111152, 3074314, 3063813, 3030822, 2962178, 2881294, 2808312, 2751555, 2716962, 2697372, 2668506, 2617977, 2564121, 2530665, 2519136, 2515801, 2503227, 2459080, 2376691, 2296725, 2277164, 2313443, 2332010, 2287808, 2221795, 2189350, 2180463, 2155547, 2116579, 2089672, 2072704, 2054435, 2052239, 2073219]
9533B073219k332o4235p8913j5850M0895K1254l0150m5658m2080n9583o8885k7997
9521A699685K6125K8995j2353m5313n1033l3499J3055N9336L4119o0094j04785
9510A554238l3193M6290J2816o7771n5519K4606L4114l3687n4437n742J516n7677
9498A365554p1118j997L9111L93j9070L1472M5177m1974j12202o1527J8788P122
9486A199729m0023j3533L5071l478p2793l6390P0442Q3044k0975r3018o0748j4756
9474A032572k1491k6676O734K3024l129q831K6348K4622m0583o7057J0319Q8310
9462A044162M4551o6559r3657j4789M2792j270p5773p4513M30N6256L3676k9253
9450H66053n6430k8824M394M158r482o774k123j4988j8101J3089L4420n039o1288
$$ y = [2073219, 2070887, 2006652, 1927739, 1911889, 1952784, 1974038, 1943888, 1898230, 1856150, 1796567, 1727682, 1699685, 1725810, 1754805, 1742452, 1697139, 1646106, 1612607, 1625662, 1684998, 1719117, 1659023, 1554238, 1521045, 1567335, 1580151, 1512380, 1456861, 1481467, 1515581, 1481894, 1427457, 1421715, 1423231, 1365554, 1294436, 1292439, 1331550, 1331943, 1312873, 1344345, 1389522, 1347548, 1235346, 1173819, 1192607, 1199729, 1159706, 1146173, 1181244, 1177766, 1104973, 1068583, 1139025, 1222069, 1201094, 1108076, 1047328, 1032572, 1011081, 984405, 991139, 1014163, 1011034, 1002203, 1028551, 1053173, 1012590, 945533, 955852, 1044162, 1088713, 1022154, 928497, 913708, 956500, 955230, 879457, 804944, 805374, 861630, 895306, 866053, 809623, 780799, 785193, 789351, 779869, 773095, 770972, 755984, 737883, 750972, 785392, 780353, 719065]
9437G19065m8730J9194M7213J4357l616J7248O608n2862o6479J1855P8617L6402
9425G78872m8111n3525O341K4885j6262l5427L67L0648J0385k8652m0707k2799
9413F06015M309K2826J9930k000k1578k7382k9635k6829l041K2398N931l0909
9401E40035p879P0358Q0744k7463j18105o3059M7772M5984m3245n3516L9554Q9122
9389F00302L2513k2958n600J5542r036j8067J4167N102o8412q8201M394P5911
9377E35657J0041q5352n0372N6000N4396n1860q4441J2686Q9472M0133m2627l8507
9365D45226J8696K8008j2303l1254j4947q821k0915j2158K2387L5840N968k5949
9353D29778j7993R403R132j5207j3462K7022N0414J4559l6096l0232K2847M8716
$$ y = [719065, 670335, 689529, 736742, 751099, 747483, 764731, 771339, 718477, 651998, 663853, 742470, 778872, 730761, 677236, 683577, 708462, 692200, 656773, 657140, 687788, 698173, 669521, 628814, 606015, 610324, 633150, 653080, 651080, 629502, 602120, 572485, 545656, 542615, 565013, 570944, 540035, 532156, 602514, 683258, 655795, 537690, 474631, 522403, 568387, 525142, 471626, 511180, 600302, 632815, 609857, 604257, 619799, 610763, 592696, 606863, 611965, 543553, 455352, 459746, 535657, 545698, 460346, 409974, 465974, 520370, 468510, 384069, 396755, 486227, 526360, 483733, 445226, 463922, 491930, 479627, 448373, 433426, 424605, 403690, 391532, 413919, 449759, 455727, 429778, 411785, 421188, 430320, 415113, 401651, 428673, 479087, 493646, 457550, 427318, 450165, 498881]
9341D98881K0595j4996k7783l8822m8768j8703M1303N3536l518m1435k647L5108
9329D52751r492o9358l4455N2939N7149k5834o0598M106N9107K1803m0599l9760
9317C67759q40J0594J936R738J7185j973j7521M08J2755k0789n4543k3953L7453
9304C38209M0827j7797n1801j7441L1182L5362P935r992j0890o407O576K9472
9292C75235L8497J2659k7294l8083j0927J5114N879k0709k1777M690J5046r376
9280C38954k6464K90L5765K4721j6594k6012R99J0614p316n368J7605p54n9838
9267B86602n9668L6286J03463K9448r4669r2915L0827R9503L0772n5932m0702
9256B73015K6007L3274j2873k4239J5981L7359K400m0878l5539R641L9859K1257
$$ y = [498881, 519476, 504480, 476697, 437875, 389107, 370404, 411707, 465243, 461725, 420290, 417643, 452751, 443259, 373901, 339446, 392385, 449534, 423700, 363102, 367208, 426315, 448118, 407519, 367759, 366919, 377513, 379449, 389187, 406372, 404399, 386878, 387286, 400041, 379252, 324709, 300756, 338209, 379036, 361239, 309438, 291997, 323179, 358541, 366476, 356484, 345594, 339187, 345763, 375235, 413732, 426391, 399097, 361014, 350087, 365201, 371080, 350371, 328594, 333284, 348330, 338954, 312490, 312780, 348545, 373266, 356672, 330660, 331659, 342273, 334957, 329589, 347194, 346440, 286602, 226934, 263220, 366683, 396131, 301462, 208547, 239374, 338877, 369649, 313717, 273015, 299022, 332296, 319423, 295184, 311165, 348524, 350924, 310046, 274507, 284148, 324007, 345264]
9244C45264k4417m4325j3373L4245M5926J6404j4742k5385k8417k5248L762M5299
9232C14993M7898K586k8670q690R602k5038o0800k0060N8857O3133j7918o8827
9220B67066k4539L5527K2874k4723k2634J7878K4692k361j749K4866J0590m4140
9208B83347m9233K4412P4544J7406p4201p3867J2977O9192M3274J59l994M699
9196C28715o643j7332p201N25p831m101J9471K0588j1523j3832M4999Q2633J6701
9183D45169q8422r7187l413O1212K6775k3354j290M8803L6316k5870m7025p14
9171C31000M4254L2663q361k8396k7747l5293m2501r976N6123Q1570J7093p1706
9159C38723o9268L0401J00502N4215l0647l0622L7237N1926j4681n8809j7785
$$ y = [345264, 320847, 276522, 263149, 297394, 343320, 359724, 344982, 319597, 291180, 265932, 269694, 314993, 362891, 365477, 336807, 328117, 337719, 312681, 251881, 231821, 290678, 353811, 335893, 267066, 242527, 278054, 300928, 276205, 253571, 271449, 296141, 293780, 292031, 316897, 327487, 283347, 234114, 258526, 333070, 350476, 276275, 202408, 215385, 284577, 327851, 328010, 324016, 328715, 322072, 304740, 297539, 298064, 290233, 286132, 305603, 326191, 314668, 300836, 345835, 428468, 445169, 356747, 259560, 256147, 317359, 344134, 320780, 319490, 368293, 404609, 378739, 331714, 331000, 375254, 407917, 399556, 371160, 343413, 308120, 265619, 255643, 311766, 393336, 410429, 338723, 269455, 299856, 400358, 454573, 423926, 393304, 430541, 482467, 467786, 408977, 391192]
9148C91192L4609J5552m0308n1068j2929J8456K0678R328r993l2406l2750q519
9136C01842k235k7114k4055L9269Q5587L5344n3594o4496n613J2121l1437l7186
9124B28433K7865O2191M659n4563k6509K4951j835o3959m1829N6477R9751L6708
9112C52340l6214l5194k251p218l0005j2926L1809M4952J6466j2402k5157m0362
9100B43838n0636j9482M4954P2282K0959n3770o6050j0654L6750K3342k0457l4310
9088A86766p512J8344J0901j3055j3657J6120L4220J227n7200o8137n835O3479
9076A65661O4966J6266o642J1944J3175k6369m9396j6530K2051Q847k6497k3533
9064A53943N633R158l389J6094M8659K6263m0869n7454P847O2157K6409m8389
$$ y = [391192, 425801, 441353, 401045, 349977, 337048, 355504, 376182, 385510, 375517, 343111, 310361, 301842, 299607, 272493, 248438, 287707, 373294, 408638, 355044, 290548, 284935, 297056, 265619, 228433, 256298, 318489, 323148, 268585, 242076, 267027, 265192, 201233, 159404, 215881, 315632, 352340, 316126, 280932, 278681, 271463, 241458, 228532, 260341, 305293, 321759, 309357, 284200, 243838, 193202, 173720, 218674, 290956, 311915, 258145, 192095, 181441, 218191, 241533, 221076, 186766, 179254, 197598, 208499, 195444, 181787, 197907, 232127, 233354, 176154, 108017, 102182, 165661, 230627, 246893, 240251, 252195, 265370, 239001, 189605, 173075, 195126, 203973, 177476, 153943, 159576, 168734, 165345, 181439, 230098, 256361, 215492, 158038, 165885, 228042, 254451, 206062]
9052B06062o7604l0139l810j0252j4412k119Q566K0482M9691O8886L0993m1585
9040B14759o2543l765N0798J8794n9236p3314J004O7714M2551l6098o8024k8606
9028F4034J2267L752j7134J029L5102K7851j2577k2085J5417M2710K2761o473
9016A66654j245J9590J6981k777j2799j9480l8685m6114j0573L8845M0448n640
9004A45205k9128R920O1196N2721j1807n7425l1282L3473N6582O133o1640p0467
8992A03481j7133L3212L8071J9900J0160K945j0669j1927N584J0703j0247k0664
8980A53416k356j673m4766o6152q081O1624M2108k6845j7384O9925R2456l624
8968B48648q9069n4076K9436M1522l434k0569r419j8997k5795K0082P1807M4359
$$ y = [206062, 138458, 108319, 104509, 94257, 79845, 77726, 86292, 106774, 156465, 225351, 256344, 214759, 152216, 148451, 199249, 218043, 158807, 85493, 86497, 154211, 196762, 160664, 92640, 64034, 76301, 80053, 62919, 63948, 99050, 126901, 114324, 92239, 107656, 150366, 173127, 166654, 165409, 184999, 201980, 199203, 186404, 166924, 128239, 82125, 71552, 110397, 150845, 145205, 116077, 125997, 187193, 239914, 228107, 170682, 139400, 172873, 229455, 235588, 173948, 103481, 86348, 119560, 157631, 177531, 187691, 190636, 179967, 168040, 173624, 184327, 174080, 153416, 151060, 149387, 104621, 38469, 30388, 92012, 134120, 107275, 89891, 159816, 252272, 248648, 159579, 105503, 134939, 176461, 173027, 152458, 143039, 124042, 98247, 118329, 190136, 234495]
8956B34495k9794l9690J9565M0852p901l4971K854K2158k8918o5646j1778O0081
8944A61307M5672j7569k0489L1782L9136j4559l8096N501L9493P515m0095m2072
8932A57526j9600j6978k1708o081R733m63j1564N499K1646P80k5336o638L1407
8919A18223K4837j6942k3753J5252L4129L910k4352j5171k655j1985q123K7193
8907A20563M2250K133l6832j2647L6834L4631j2057l5196k0767j0245q229J7051
8895A17489M8699L1872k4104m5826j3740Q246j5430l7670j9958N719Q833J4645
8883G8775L5601K5944l1170o2066o836P1022O7243q838n3774k4149J9043J9993
8871A30788q73m621L013k680j8501k2220p601Q501P073q930j2057J3958L6946
$$ y = [234495, 204701, 165011, 184576, 225428, 217527, 182556, 185410, 207568, 178650, 113004, 101226, 161307, 206979, 189410, 168921, 200703, 239839, 225280, 187184, 192685, 232178, 239693, 199598, 157526, 137926, 120948, 99240, 93159, 102892, 102429, 90865, 96364, 118010, 118790, 93454, 86816, 118223, 143060, 126118, 102365, 117617, 151746, 155656, 131304, 116133, 113478, 101493, 93370, 120563, 162813, 164946, 128114, 115467, 152301, 186932, 174875, 139679, 118912, 108667, 100438, 117489, 166188, 198060, 173956, 128130, 114390, 122636, 107206, 69536, 49578, 55297, 64130, 78775, 114376, 140320, 109150, 47084, 40248, 111270, 178513, 169675, 115901, 91752, 110795, 130788, 129915, 125294, 128307, 125627, 107126, 84906, 77305, 85806, 92879, 83949, 71892, 85850, 122796]
8858A22796J0041m6975n1847K1605Q4336M8713m0614o7766j0380M1324K5281j7034
8846A19480k4778o303p198l5006n3215l1179K0506N7798M6919O559j2032K335
8834H3886O072j8153k1046K4746N7265K1299k5288j373M8387K0720n7093n5201
8822H4221L5455O9698j5887r0800l8695O0405O8240j629l9444k2558r791r513
8810H9702J4221L9105J4067k9576j5552M0361M6896j1312n2704l6650j0536j884
8798H6138K3723O4572N2420k7495q1614l8740M1651O1276J9632j3740j2762m752
8786A70309j317P874J2771j549j2444Q326L4326J7375k8371m1609j4936r194m6447
8773I5114n9820K691P9855P2406r412n1338M990P9572O7742j7103p0378l8443
$$ y = [122796, 132837, 85862, 34015, 55620, 139956, 188669, 148055, 80289, 69909, 111233, 136514, 119480, 94702, 88399, 81201, 46195, -7020, -38199, -17693, 40105, 87024, 93583, 81551, 83886, 89958, 71805, 50759, 75505, 132770, 154069, 128781, 127408, 175795, 196515, 139422, 84221, 119676, 189374, 173487, 82687, 43992, 104397, 172637, 171008, 131564, 109006, 99215, 89702, 103923, 143028, 157095, 127519, 111967, 152328, 199224, 187912, 135208, 98558, 88022, 86138, 109861, 174433, 226853, 199358, 117744, 79004, 120655, 181931, 201563, 187823, 175061, 170309, 168992, 176866, 189637, 188088, 175644, 183970, 218296, 235671, 207300, 165691, 150755, 141561, 95114, 35294, 37985, 117840, 190246, 180834, 129496, 134486, 214058, 281800, 264697, 194319, 155876]
8761A55876K7333N4737L2775l567k5034k2188O9J9790J2444j7148l7638l1964
8749A65485r392K1646N3794N6018N003n1881l6942L2381M3793l8414r5995l1285
8737A14211O7623N3597m6765o9983L1898J22519Q9370q731n5182l3366m014P39
8725B61916o357j0402l541J3977J6550j8946n5586k9960M0345O1803P010l5737
8713B41072k198M7105L3377j4162k2551M25j25j7850p877J6660P448k2025j5989
8700B43310K0762L1151J0531J1001L7671L3193j6125m5877j6903K2245J6938j2335
8688C35562j6984N48N049o845q643O032J5730Q970J205J0515L1244L8070J5822
8675D36275j7278k6070k063K5124K8941J7425Q698J356o626K592L3840M9460J5005
$$ y = [155876, 183209, 237946, 270721, 267154, 242120, 219932, 220001, 239791, 252235, 235087, 197449, 165485, 156093, 177739, 231533, 287551, 292554, 240673, 203731, 236112, 279905, 241491, 145496, 114211, 181834, 235431, 188666, 118683, 150581, 273100, 362470, 353739, 298557, 265191, 261177, 261916, 255559, 245157, 241616, 255593, 272143, 253197, 197611, 167651, 207996, 269799, 276809, 241072, 238874, 285979, 319356, 305194, 282643, 283068, 282943, 265093, 257216, 273876, 281324, 259299, 243310, 264072, 295223, 305754, 316755, 354426, 387619, 371494, 325617, 308714, 330959, 347897, 335562, 318578, 319126, 324175, 317330, 308687, 314719, 330449, 339419, 340624, 351139, 382383, 420453, 436275, 418997, 392927, 390864, 415988, 444929, 462354, 471052, 472408, 465782, 468374, 502214, 551674, 566679]
8662E66679m0225n1394j390N9175P1319K2508m5936o7589j2662N9881N5292k3946
8650E91712o1139P799Q6350O2042j3768j4866M3030L2499n1341o3531M5356J27021
8638G91164O4093m3327l7504N9145J01569M7888j0657j4493l437j8401l7726l2287
8626H66027j4046q329k0540l9352m6176k8644m299o571k8511k3235J3192J8754
8614F78270l0615o1931j6825M2720K8747k6551k5446K9954M4850o850m6171k5542
8602E84610O577L401j3605j8423k5437l6147j9524K0047L1640Q394Q492M5932
8590E95957M8085k0865p9788n0793J3907J7845k3407j7333M6311Q2308N2181J5399
8578F79807J8926K7936O034j1953J5720N3776L6710k6034n6062j5932M1352M9136
$$ y = [566679, 526454, 475060, 473670, 532845, 604164, 626672, 580736, 513147, 500485, 560366, 615658, 591712, 530573, 538372, 624722, 686764, 672996, 658130, 701160, 733659, 682318, 618787, 664143, 791164, 855257, 811930, 774426, 833571, 935140, 983028, 972371, 957878, 954441, 936040, 898314, 866027, 851981, 843652, 823112, 783760, 737584, 708940, 704641, 698070, 669559, 646324, 659516, 678270, 647655, 585724, 568899, 611619, 640366, 613815, 588369, 618323, 663173, 656323, 610152, 584610, 591187, 594588, 580983, 562560, 537123, 500976, 481452, 501499, 533139, 541533, 550025, 595957, 644042, 623177, 543389, 492596, 506503, 524348, 500941, 483608, 529919, 612227, 664408, 679807, 698733, 726669, 732703, 720750, 736470, 790246, 826956, 800922, 744860, 728928, 770280, 819416]
8566H19416J2182j4692p389O834L548l321O568K1974J7581p143k9402l2427j3975
8553G79754K1063N3837N2048O541m3603n4119l2690j6855q189K0327N5385M6107
8541H79606p336l2644R718N7357L6501k1813k6809L1684O6819K7249k7274k0246
8529I72812K6473L1758j5957l9751N123N7063L8845k3618m2284o548M658l6854
8517I71720n0809J5536P8592L6071o5512r4262l5110k197m6030q0474m1899K903
8505F88529j9289n8694l1912L4140N0781J0553k0785k4049l7858o3886n6842j3161
8493D57527J3349k643k5370k4621j4101j0315q959j4267l9014o3696m8087K742
8481B22545L4038J8509r275j1833L506J3916J5384Q095j3215l4853k6678J1181
$$ y = [819416, 831598, 816906, 809517, 816351, 819899, 816578, 823146, 845120, 862701, 855558, 826156, 793729, 779754, 800817, 854654, 906702, 913243, 869640, 815521, 782831, 765976, 757787, 778114, 833499, 879606, 872270, 839626, 849344, 906701, 943202, 921389, 894580, 926264, 993083, 1020332, 993058, 972812, 999285, 1031043, 1015086, 975335, 980458, 1037521, 1076366, 1052748, 1010464, 1003916, 1008574, 971720, 920911, 936447, 1015039, 1051110, 985598, 891336, 856226, 854029, 807999, 727525, 685626, 688529, 669240, 610546, 578634, 612774, 663555, 674108, 653323, 629274, 591416, 527530, 470688, 457527, 470876, 468233, 442863, 418242, 404141, 393826, 384867, 370600, 331586, 267890, 219803, 222545, 256583, 275092, 265817, 253984, 257490, 271406, 286790, 294885, 281670, 246817, 220139, 231320]
8469B31320L7204K2972j0623k7689k0331l402Q555Q304N66J591J3487J0564j8105
8456B54413l3572k394L3994J1477m8091o0697j2330K3184J2579R870M0854M3783
8444B73070j5950o6101l9672J3582J4974j3675o095K1441Q667k4326p557M5135
8432B03493M8794q804m6516k4826J532j0531k8010j6128M830J2717K1040K9823
8420A87414R137l3598l9562Q831M7853K7833j5084k7827j7576j0279M245K8507
8408A69894K1532k6477m4526J4564P4908L8519n5933q4949k9531P727j8564k5667
8396D1497M4269J09168O5677m7101r5159l1769N1163N5209o819m9039k8688J2190
8384A20598J4996j5514k3343J2504M0823J1626m3782n2439n586L1155J6906j2773
$$ y = [231320, 268524, 291496, 280873, 253184, 232853, 229451, 238006, 246310, 246876, 248467, 261954, 272518, 254413, 220841, 218447, 252441, 263918, 215827, 155130, 142800, 165984, 178563, 188433, 229287, 273070, 257120, 191019, 151347, 164929, 179903, 166228, 160133, 181574, 190241, 165915, 158358, 203493, 252287, 243483, 196967, 172141, 173673, 163142, 135132, 119004, 123834, 136551, 157591, 187414, 196551, 162953, 123391, 132222, 180075, 207908, 192824, 164997, 147421, 137142, 141387, 169894, 191426, 164949, 120423, 134987, 209895, 248414, 192481, 107532, 78001, 85728, 67164, 41497, 85766, 194934, 260611, 213510, 118351, 86582, 137745, 192954, 186135, 137096, 108408, 120598, 135594, 120080, 96737, 109241, 150064, 161690, 117908, 65469, 59883, 91038, 107944, 95171]
8372I5171j2142R956K2029K1337J7322J886k4751l1581j141L1926K7291k787k1838
8359A32678k6212k7996j2650K9248N4330J7579m4436n2211L05L9149K1609j7503
8347A13890l7534l6906j5248L1944O4068K4965n1519n6754L0183R0752L8963m9185
8335A47619o0768j2875R182N678K9980N5708J4747n9221o5886r515O896l2974
8323B8571k8873M6180P7719J41q0503m9941L8012N8107L038l7461k6942j631J8475
8310D4892L6505K9832j2028l2663J4232O5179K7739o1726p5613J1073P8954L9854
8298A66230m6548p2833k2861L6093M7039J0105l0959k9143J2890L5111J040l6834
8286F9330j1371M5341M5490j1292l7873o346J3392j4405l0614L101L1513R591
$$ y = [95171, 83029, 92985, 115014, 136351, 153673, 155559, 130808, 99227, 98086, 130012, 157303, 154516, 132678, 106466, 78470, 65820, 95068, 149398, 166977, 122541, 70330, 70635, 109784, 131393, 113890, 76356, 39450, 24202, 56146, 120214, 145179, 93660, 36906, 67089, 157841, 196804, 147619, 86851, 73976, 83158, 88836, 118816, 174524, 189271, 130050, 64164, 54649, 61545, 28571, -302, 45878, 123597, 123738, 43235, -6706, 31306, 89413, 92451, 54990, 28048, 26417, 44892, 81397, 111229, 99201, 66538, 80770, 145949, 173688, 111962, 36349, 47422, 126376, 166230, 119682, 46849, 23988, 60081, 107120, 117225, 86266, 57123, 70013, 105124, 106164, 69330, 57959, 103300, 148790, 137498, 99625, 93279, 106671, 92266, 61652, 64753, 96266, 105857]
8274A05857j3989J0739M0815J8819k3832k6252k621k291j5409m074J5117N320
8262A08199j1053P591L6571K6287k993O74J6968j1187n7591l8883L9708P5067
8250A89358K2317l9674l1984J9782M4055J9017k6558n5229l9776J1598M0971P416
8238A61293l6679j1444N3316M7664l8568q2731j9017N6742M3133j3333j6181J8761
8226A62956J2997k6094k7754Q137J7630m008K152M1162M7693J181l6187k0934
8214A78931J1650J6401j317k0293l5908l3025J1452P0804P4240N827n7192m5593
8202A75977J0075L3593R432j4582o379J4927J4900j4690m7379m6064q460J6546
8190A37896r169m2511q482P4289R4643R137p9198o4303J2298L9414Q367j76K8936
$$ y = [105857, 91868, 102607, 143422, 162241, 138409, 112157, 109536, 107245, 91836, 87762, 102879, 108199, 97146, 104737, 141308, 167595, 164602, 165276, 182244, 171057, 113466, 74583, 114291, 189358, 211675, 172001, 140017, 159799, 203854, 222871, 196313, 141084, 101308, 112906, 153877, 161293, 124614, 113170, 166486, 214150, 175582, 92851, 73834, 130576, 173709, 160376, 144195, 162956, 175953, 149859, 122105, 130242, 147872, 143864, 146016, 187178, 234871, 236052, 199865, 178931, 190581, 206982, 205665, 185372, 149464, 116439, 127891, 198695, 272935, 278762, 221570, 175977, 186052, 219645, 229077, 214495, 208116, 223043, 237943, 223253, 175874, 129810, 121350, 137896, 128727, 86216, 77734, 152023, 246666, 255803, 176605, 112302, 124600, 164014, 172381, 172205, 201141]
8177B01141K4969k9216n4013n289M9279L9080m926j6117K978Q795j624n223q631
8164B01203k3104k0242J8735M4345P081m4798k6377M0807N0257j7700n5210L384
8152A78381P2268M3220n2179r4770m6307K0413L9414K0498O55p932p915p01N307
8139A70352J21q102k868J3019K3326K5837K8627K7219J2101r389k3474l0109k9498
8126A97162j0039K0857K3194j6563m4650j3476L4325K6527j8138j8760K8269M1618
8114B50326j093k2610J3562L3225j3570n0987k887O4637M0490m7837p2595k596
8102A88065O0963M7414K314j2979r308j7701k6303j4242O691K0468L1009L2590
8090C08981M953l7986m6643j0062K0510J1643m050N297J3888m886k0530k958J1622
$$ y = [201141, 226110, 196894, 142881, 137592, 186871, 225951, 221025, 204908, 207886, 216681, 215057, 209834, 201203, 178099, 157857, 176592, 220937, 228018, 183220, 156843, 197650, 247907, 230207, 174997, 178381, 250649, 293869, 241690, 146920, 100613, 121026, 160440, 180938, 181593, 173661, 165746, 165045, 170352, 170473, 162371, 159503, 172522, 195848, 221685, 250312, 277531, 289632, 280243, 256769, 226660, 197162, 187123, 207980, 231174, 214611, 169961, 156485, 190810, 217337, 199199, 180439, 208708, 250326, 249233, 226623, 240185, 273410, 259840, 208853, 205966, 270603, 311093, 263256, 190661, 188065, 249028, 296442, 298756, 285777, 276469, 258768, 232465, 218223, 224914, 245382, 276391, 308981, 313934, 275948, 229305, 219243, 239753, 251396, 247346, 252643, 266531, 261645, 241115, 238157, 249779]
8077B49779j7095m6047p418O8613Q2435J4834m4515l7033j2086k2099k7010K3507
8065B25865P6031L9118o1919r8068j7656P5930O9029j1551n5587k7705R552J0337
8053B33376K77P180R884j1876l1673k0678K040M181o384l430R981J7057K4751
8040B34686M0930L8834m273n3199n6236k4638q508p139K1386O3522N1446j8610
8028B78201n7711j7030L1093P160m8090m0700K7193O4706L1426j5608j9940J108
8016B41808L755j4382k4275j3484J984J864j5316k9265j8958R412K6977K1263
8004A91383J0705Q555J08k3268l7786k4992p066q609j1803P237K5124P853k0276
7991A17165o681L9572N2748Q912m0612m5711j4362J9143L3202J5040l1615o3639
$$ y = [249779, 232684, 186637, 179219, 247832, 330267, 345101, 300586, 263553, 251467, 229368, 202358, 225865, 301896, 341014, 279095, 181027, 163371, 239301, 308330, 296779, 241192, 213487, 223039, 233376, 233653, 240833, 250717, 238841, 207168, 186490, 188530, 192711, 186327, 182897, 192878, 209935, 234686, 275616, 314450, 310177, 256978, 200742, 176104, 167596, 160457, 181843, 245365, 296811, 278201, 220490, 203460, 234553, 241713, 193623, 152923, 180116, 244822, 276248, 260640, 240700, 241808, 245563, 231181, 206906, 193422, 195406, 197270, 181954, 152689, 133731, 143143, 170120, 191383, 202088, 210643, 210751, 187483, 149697, 124705, 117639, 109030, 97227, 104464, 129588, 137441, 117165, 110484, 150056, 202804, 211716, 171104, 125393, 111031, 130174, 163376, 178416, 146801, 83162]
7979H3162l6516K2295L7038k918k2461J6647M8248J0653m5170l3253K8062M3509
7967A49296j1284n7115l3500K0991L6465N554k3860j7811J0758K4019p14m3689
7955E9110n4725q432N5686P1104K2627l6926n1845k1983J0855J4647m877j6098
7943C9143L301L5485L4394j5167o2092m3211L0012P6869M9118j0864l6244k5032
7931G5712k3868m2897l8455J1422N8393M1974k4551o3291k8133L8647O2023K5775
7919I2751j7416k0135N427J6456o82k0164j6705M023J6237M058k2049l4561j6619
7906i379J6677L0526Q865k6869m3408l1290o340J4091K3142K0206J0182L863N696
7893A5962N144n971j4319l350J3711P126j9177k3861P915L0053J36m5482l3354
$$ y = [83162, 46646, 68941, 105979, 103061, 80600, 97247, 145495, 156148, 110978, 77725, 105787, 149296, 138012, 80897, 47397, 68388, 104853, 110407, 86547, 68736, 79494, 103513, 102799, 59110, 4385, -4047, 51639, 122743, 145370, 108444, 56599, 34616, 45471, 60118, 55241, 39143, 42444, 77929, 112323, 97156, 35064, -8147, 21865, 98734, 147852, 136988, 100744, 75712, 51844, 8947, -29508, -18086, 40307, 82281, 57730, -5561, -33694, 4953, 66976, 92751, 75335, 55200, 60627, 77083, 76401, 56237, 39532, 43555, 59792, 63850, 41801, 7240, -9379, 7298, 37824, 46689, 19820, -23588, -54878, -61218, -47127, -23985, -3779, 6403, 10266, 15962, 21106, 15135, 816, -2534, 11177, 18303, -874, -24735, -16820, 13233, 13369, -32113, -65467]
7880f5467L3965O7585J8506m3832k9848L5977N2207n570n2205k6975K2668K9523
7868C6534N052q025j8511m7128n3770M696P4298O2445j3839m3677N761M3450J0321
7855E7607l0272j3995J5446j483k6133J208L7394L317o6730o3001K4553Q4003
7843B1914M6735k6365n1781k9793m754J0338K2770K3706P296o201R34J6644K1638
7830E3081J5632P355J040p04k297j7969m1991l4881J7411N4763J7725m7424m2889
7817b1148K5690M9636q862n3075j0339N0634L7641j7814k7351N300Q854k2138
7805A7028k6738N815K0011l626j9334k218J3798M383m616R898K7806K3471L694
7792F9372j1422j3771l741Q554r80l7856n9049k2021M0596N1971J752l5781j1277
$$ y = [-65467, -31502, 36083, 54589, 10757, -19091, 16886, 69093, 63523, 11318, -15657, 7011, 36534, 41586, 33561, 15050, -32078, -85848, -81152, -6854, 55591, 41752, -1925, 3836, 47286, 57607, 27335, 13340, 28786, 27303, 1170, 2378, 39772, 43089, -23641, -86642, -62089, 21914, 68649, 42284, -9497, -39290, -44044, -33706, -10936, 12770, 20066, 13865, 14799, 31443, 53081, 68713, 76068, 77108, 76404, 74107, 56138, 14147, -20734, -3323, 51440, 69165, 21741, -21148, 4542, 54178, 45316, -7759, -18098, 32536, 70177, 52363, 25012, 30312, 39166, 17028, -9710, -3895, 16116, 12490, -6844, -9062, 4736, 9119, 4503, 14401, 42207, 65678, 69372, 57950, 44179, 40438, 48992, 48012, 10156, -48893, -70914, -30318, 21653, 23405, -12376, -23653]
7779b3653L3158L7654J0364l388K494k217k6022m2626k9778M529L0803K3782q145
7766F955j9402J9503O5507M4564l7600q1555k6337N5854N4137k6124p3708k8124
7754d6330M5293N4842L65m4354l3309Q666L3494K5364K317j5801k5191k8731k2722
7741d6097j844K5834L9452K6931J170j2248l158J2333J1801m896j3692J187J9071
7728E5844M476l9353o1259k5771L1233M1081q181n4772m3097J0535M9659M9267
7716I662K8937J0334m863j4510n368K0967L2487L173m1828m7361k415L5933J4987
7703D0135m0029n8631j7843L7676O2855N4397K4409j6408l8758j4346K5257J1443
7691G0157n1391p0334l917O1582M4957n72J1513M3328O029o0369l9139M7999N2957
$$ y = [-23653, 9505, 47159, 57523, 54135, 56629, 54412, 28390, -14236, -44014, -39485, -8682, 15100, 6955, -12447, 7056, 72563, 117127, 79527, -2028, -28365, 27489, 81626, 55502, -18206, -46330, -1037, 53805, 54170, 9816, -23493, -14827, 18667, 44031, 46348, 30547, 5356, -23375, -46097, -47941, -22107, 17345, 44276, 45446, 33198, 30040, 42373, 54174, 49278, 35586, 36773, 55844, 60320, 20967, -40292, -66063, -34830, 6251, -1930, -56702, -99799, -89264, -39605, 9662, 38599, 48933, 44070, 29560, 24192, 45159, 77646, 80819, 38991, -8370, -10785, 25148, 40135, 106, -58525, -76368, -38692, 24163, 78560, 102969, 86561, 47803, 33457, 58714, 70157, 18766, -51568, -55485, 6097, 51054, 50482, 61995, 105323, 111352, 50983, 11844, 59843, 112800]
7678A12800m8265r6782q721P9986L5015n9746n0885L4732N5986j803k7637Q959
7666C3639K3378j3482k8087P622K2370j7080l9668O88L8402J0429l2870j4574
7654i233L7988L9479j5678m9131j9753K5661L0804K335j7307j3290n863r113j1033
7641a4134m37Q537M7r264O838L2176K4484r922j4371K3519M0170m40l9875k2805
7627B4523O332j2033l3412J5164Q4359N8983m8239r6998k9619M9891M4411r047
7615E4315l3652k6424j3841J2344M6878M0737j4035m4846r050L1590J4593k1502
7603C7107j4882J2237Q001j0959k612J4373L002j4618m915M682j5574k4937J0203
7590A108K9314k2682o8912m934J12542J27529J9631p0550n8693j5812j9181l7156
$$ y = [112800, 64535, -32247, -40968, 39018, 74033, 14287, -36598, -1866, 54120, 52317, 24680, 33639, 57017, 43535, 15448, 23070, 45440, 28360, -11308, -10620, 27782, 38211, 5341, -9233, 28755, 68234, 52556, 3425, -16328, 9333, 40137, 42472, 25165, 11875, 6012, -3101, -14134, -14571, -6034, -5987, -15251, -8413, 23763, 48247, 38325, 23954, 47473, 87643, 87203, 47328, 24523, 30855, 18822, -14590, 574, 84933, 143916, 95677, -1321, -30940, 18951, 63362, 54315, 20663, -5761, -19602, -7258, 39620, 80357, 66322, 21476, 12426, 44016, 58609, 37107, 22225, 34462, 42463, 31504, 28892, 43265, 46267, 31649, 26734, 31416, 15842, -9095, 1108, 30422, 7740, -61172, -66106, 46436, 173965, 193596, 123046, 64353, 48541, 29360, -7796]
7578g796j7496J6256J9339m63j3880j3840K999L7529N4196J4494m6079n3358j1956
7565b0055O139m099K6600R2147Q5917k0551j00695n5449L7043M8253j6854o3802
7553A4594n9536l5009K014N3904P9146M4693p081k3326k4256m2839m1689J4907
7541b4478O4030K9233m3141m8060J2838M7622K7626L710r017l5918m7135P534
7529a5156P2235L8504o3035p8371K7020R8819L2743o7318o5268M420K9405J0043
7517B4041K0938N2564L1328l6967o9584l9956j895J2810K4392L3439R977l6290
7505B4797n3104k5020J0172K9095M1048L8300J867l6980k0221L6463M8543o043
7493H8917m5302j4666K4646J835m3682l2282K1300L9027J1241l723M387j0831
$$ y = [-7796, -25292, -9036, 10303, 9840, -4040, -17880, -14881, 22648, 76844, 91338, 45259, -8099, -20055, -13916, -18015, 8585, 100732, 186649, 166098, 65403, 9954, 46997, 95250, 78396, 14594, -44942, -79951, -77937, -24033, 55113, 99806, 92725, 69399, 45143, 2304, -39385, -24478, 39552, 68785, 25644, -22416, -9578, 38044, 65670, 69380, 60363, 24445, -22690, -15156, 57079, 95583, 32548, -45823, -18803, 80016, 112759, 45441, -19827, -15407, 13998, 24041, 44979, 97543, 128871, 91904, 22320, -17636, -19531, -6721, 17671, 51110, 61087, 24797, -28307, -53327, -43155, -14060, 26988, 65288, 67155, 30175, 9954, 46417, 94960, 88917, 43615, 28949, 53595, 55430, 11748, -20534, 766, 39793, 51034, 47311, 51698, 40867]
7481D0867m0796j6281N4853O0342m0062j17211n3147O6271P3209k0439m5735M3689
7469E560R2224L08j02893o1425N7942P4037k4413p6887j4374M7852J4276m4677
7457c2470k4735M6471O8417K0597l3007m8485l3967n646K2969K7768K594j7668
7445g162m631J7808J4798l830j1916j4922k1604p869L2994M5711q447o4728l5111
7432f8909M7229O4973m226n3914j7742L3158J4180l9481l8814J7485M8876J5053
$$ y = [40867, 71, -16210, 38643, 98985, 58923, -58288, -111435, -45164, 28045, 7606, -38129, 5560, 97784, 98092, -4801, -66226, -8284, 65753, 41340, -35547, -49921, -2069, 12207, -32470, -57205, -10734, 57683, 78280, 45273, -3212, -37179, -42825, -19856, 7912, 10506, -7162, -11793, 6015, 20813, 16983, 5067, -9855, -31459, -39328, -6334, 39377, 30930, -33798, -68909, -21680, 43293, 39067, -14847, -32589, 569, 14749, -24732, -63546, -46061, 2815, 17868]
$$ [...]
##END NTUPLES=NMR SPECTRUM
##END=
