##TITLE=1H ikalashn
CA-9295-1
15.10.2024
##JCAMPDX= 6.0         $$ Bruker NMR JCAMP-DX V2.0
##DATA TYPE= NMR SPECTRUM
##DATA CLASS= NTUPLES
##ORIGIN= UXNMR, Bruker Analytische Messtechnik GmbH
##OWNER= root
$$ TOPSPIN		Version 1.3
$$ 2024-10-15 09:25:08.437 +0400  Irina@DPX200
$$ Compression mode = diff/dup
##.OBSERVE FREQUENCY= 200.131392401
##.OBSERVE NUCLEUS= ^1H
##.ACQUISITION MODE= SIMULTANEOUS
##.ACQUISITION SCHEME= undefined
##.AVERAGES= 16
##.DIGITISER RES= 18
##SPECTROMETER/DATA SYSTEM= spect
##.PULSE SEQUENCE= zg
##.SOLVENT NAME= CDCl3
##.SHIFT REFERENCE= INTERNAL, CDCl3, 1, 17.95386
##AUDIT TRAIL= $$ (NUMBER, WHEN, WHO, WHERE, WHAT)
$$ ##TITLE= Audit trail, TOPSPIN		Version 1.3
$$ ##JCAMPDX= 5.01
$$ ##ORIGIN= Bruker BioSpin GmbH
$$ ##OWNER= Irina
$$ $$ F:/spectra/data/iren/nmr/1H/4/pdata/1/auditp.txt
$$ ##AUDIT TRAIL=  $$ (NUMBER, WHEN, WHO, WHERE, VERSION, WHAT)
(   1,<2024-10-15 09:24:43.250 +0400>,<Irina>,<DPX200>,<TOPSPIN 1.3>,
      <created by zg
	started at 2024-10-15 09:23:35.203 +0400,
	POWCHK disabled, PULCHK disabled
       configuration hash MD5:
       BE 6D 3F 07 2A EA 11 49 91 17 2B D3 AF B3 58 0D
       data hash MD5: 16K
       4E AE 59 BC 8C AF 47 E7 0E 1C A5 E3 CE DF CB 88>)
(   2,<2024-10-15 09:24:43.656 +0400>,<Irina>,<DPX200>,<TOPSPIN 1.3>,
      <Start of raw data processing
       efp BC_mod = 2 LB = 0.02 FT_mod = 6 PKNL = 1 PHC0 = 323.0903 PHC1 = 10.11988 SI = 32K 
       data hash MD5: 32K
       A4 43 32 4A 20 11 FC 40 86 93 BA 9C 3E 2A 8E 15>)
(   3,<2024-10-15 09:24:46.250 +0400>,<Irina>,<DPX200>,<TOPSPIN 1.3>,
      <apk 
       data hash MD5: 32K
       11 7E 79 B1 1F 0B 74 EA B5 D3 C7 4F 2B 59 F2 B8>)
(   4,<2024-10-15 09:24:57.312 +0400>,<Irina>,<DPX200>,<TOPSPIN 1.3>,
      <pk fgphup PHC0 = -4.392993 PHC1 = 7.2 
       data hash MD5: 32K
       E5 AE 9C 0E BB A6 41 89 16 6F BA 37 B4 59 93 D9>)
(   5,<2024-10-15 09:24:58.812 +0400>,<Irina>,<DPX200>,<TOPSPIN 1.3>,
      <abs n ABSG = 5 
       data hash MD5: 32K
       7E 3F BD 73 95 29 FE 6E C9 6B 70 5B 2C 49 2F 71>)
$$ ##END=
$$ 
$$ $$ hash MD5
$$ $$ 16 58 E7 73 0C E3 29 CD 36 E4 19 6C 29 58 16 D8
##$RELAX= 
##$RELAX= 
##$RELAX= 
##$RELAX= 
##$RELAX= 
##$RELAX= 
##$RELAX= 
##$RELAX= 
##$RELAX= 
$$ Bruker specific parameters
$$ --------------------------
##$DU= <F:/spectra>
##$EXPNO= 4
##$NAME= <1H>
##$PROCNO= 1
##$TYPE= <nmr>
##$USER= <iren>
##$AMP= (0..31)
100 100 100 100 100 100 100 100 100 100 100 100 100 100 100 100 100 100 
100 100 100 100 100 100 100 100 100 100 100 100 100 100 
##$ANAVPT= -1
##$AQSEQ= 0
##$AQ_mod= 1
##$AUNM= <au_zg>
##$AUTOPOS= <>
##$BF1= 200.13
##$BF2= 200.13
##$BF3= 200.13
##$BF4= 200.13
##$BF5= 200.13
##$BF6= 200.13
##$BF7= 200.13
##$BF8= 200.13
##$BYTORDA= 1
##$CFDGTYP= 0
##$CFRGTYP= 5
##$CHEMSTR= <none>
##$CNST= (0..63)
1 1 145 1 1 1 1 1 1 1 1 1 1 1 1 1 1 1 1 1 1 1 1 1 1 1 1 1 1 1 1 1 1 1 
1 1 1 1 1 1 1 1 1 1 1 1 1 1 1 1 1 1 1 1 1 1 1 1 1 1 1 1 1 1 
##$CPDPRG= <>
##$CPDPRG1= <>
##$CPDPRG2= <>
##$CPDPRG3= <>
$$ [...]
##$SW_h= 4401.40845070422
##$TD= 16384
##$TD0= 1
##$TE= 300
##$TE2= 300
##$TE3= 300
##$TEG= 300
##$TL= (0..7)
0 120 120 120 120 120 120 120 
##$TP= (0..7)
150 150 150 150 150 150 150 150 
##$TP07= 0
##$TPNAME0= <>
##$TPNAME1= <>
##$TPNAME2= <>
##$TPNAME3= <>
##$TPNAME4= <>
##$TPNAME5= <>
##$TPNAME6= <>
##$TPNAME7= <>
##$TPOAL= (0..7)
0.5 0.5 0.5 0.5 0.5 0.5 0.5 0.5 
##$TPOFFS= (0..7)
0 0 0 0 0 0 0 0 
##$TUNHIN= 0
##$TUNHOUT= 0
##$TUNXOUT= 0
##$USERA1= <user>
##$USERA2= <user>
##$USERA3= <user>
##$USERA4= <user>
##$USERA5= <user>
##$V9= 5
##$VALIST= <valist>
##$VCLIST= <CCCCCCCCCCCCCCC>
##$VD= 0
##$VDLIST= <DDDDDDDDDDDDDDD>
##$VPLIST= <PPPPPPPPPPPPPPP>
##$VTLIST= <TTTTTTTTTTTTTTT>
##$WBST= 1024
##$WBSW= 25
##$XGAIN= (0..3)
0 0 0 0 
##$XL= 0
##$YL= 0
##$YMAX_a= 926929
##$YMIN_a= -1811612
##$ZGOPTNS= <>
##$ZL1= 120
##$ZL2= 120
##$ZL3= 120
##$ZL4= 120
##$ABSF1= 17.95386
##$ABSF2= -4.038887
##$ABSG= 5
##$ABSL= 3
##$ALPHA= 0
##$AQORDER= 0
##$ASSFAC= 0
##$ASSFACI= 0
##$ASSFACX= 0
##$ASSWID= 0
##$AUNMP= <proc_1d>
##$AXLEFT= 0
##$AXRIGHT= 0
##$AXTYPE= 0
##$AXUNIT= <>
##$AZFE= 0.1
##$AZFW= 0.1
##$BCFW= 0
##$BC_mod= 2
##$BYTORDP= 0
##$COROFFS= 0
##$CY= 7568.61572265625
##$DATMOD= 1
##$DC= 0
##$DFILT= <>
##$DTYPP= 0
##$F1P= 17.9538593292236
##$F2P= -4.03888763876832
##$FCOR= 0.5
##$FTSIZE= 32768
##$FT_mod= 6
##$GAMMA= 0
##$GB= 0
##$INTBC= 0
##$INTSCL= 1.483618e-010
##$ISEN= 128
##$LB= 0.02
##$LEV0= 0
##$LPBIN= 0
##$MAXI= 945.577
##$MC2= 0
##$MEAN= 0
##$ME_mod= 0
##$MI= -402.1523
##$NCOEF= 0
##$NC_proc= -5
##$NLEV= 6
##$NOISF1= 8.587773
##$NOISF2= 6.764455
##$NSP= 0
##$NTH_PI= 0
##$NZP= 0
##$OFFSET= 17.95386
##$PC= 1
##$PHC0= 316.08
##$PHC1= 19.05837
##$PH_mod= 1
##$PKNL= yes
##$PPARMOD= 0
##$PPDIAG= 0
##$PPIPTYP= 0
##$PPMPNUM= 100
##$PPRESOL= 1
##$PSCAL= 0
##$PSIGN= 0
##$REVERSE= no
##$SF= 200.13
##$SI= 32768
##$SIGF1= 16.12182
##$SIGF2= -4.496377
##$SINO= 3.521527
##$SIOLD= 32768
##$SREGLST= <1H.CDCl3>
##$SSB= 0
##$STSI= 32768
##$STSR= 0
##$SW_p= 4401.40845070423
##$SYMM= 0
##$S_DEV= 0
##$TDeff= 16384
##$TDoff= 0
##$TI= <>
##$TILT= no
##$TM1= 0
##$TM2= 0
##$TOPLEV= 0
##$USERP1= <user>
##$USERP2= <user>
##$USERP3= <user>
##$USERP4= <user>
##$USERP5= <user>
##$WDW= 1
##$XDIM= 32768
##$YMAX_p= 444112018
##$YMIN_p= -322943
$$ End of Bruker specific parameters
$$ ---------------------------------
##NTUPLES= NMR SPECTRUM
##VAR_NAME=  FREQUENCY,     SPECTRUM/REAL,   SPECTRUM/IMAG
##SYMBOL=    X,             R,               I
##VAR_TYPE=  INDEPENDENT,   DEPENDENT,       DEPENDENT
##VAR_FORM=  AFFN,          ASDF,            ASDF
##VAR_DIM=   32768,         32768,           32768
##UNITS=     HZ,            ARBITRARY UNITS, ARBITRARY UNITS
##FACTOR=    0.134324425510551, 1,           1
##FIRST=     4401.40845070423, 5913,         -2010794
##LAST=      0,             23451,           -2522131
##MIN=       0,             -322943,         0
##MAX=       4401.40845070423, 444112018,    0
$$ Real data points
##PAGE= N=1
##DATA TABLE= (X++(R..R)), XYDATA
$$ [...]
$$ plain form
11574 -38024 -49808 -85194 -117704 -116590 -83466 -45119 -30112 -42235 -49080 -20563 19735 22624
11562 22624 -3724 1686 47307 59304 -2421 -68267 -60609 -12321 -6449 -41951 -50014 -21576
11550 -21576 -22974 -80622 -135771 -135192 -96454 -57173 -23109 890 -12591 -62897 -95343 -74464
11538 -74464 -42663 -50285 -63328 -15265 65740 72652 -17149 -83769 -29424 68067 57851 -63742
11526 -63742 -146848 -107981 -40883 -57682 -122434 -132778 -92263 -84238 -113060 -100845 -41062 -26451
11514 -26451 -90488 -137529 -91570 -17700 -17509 -79247 -119440 -116898 -111752 -108466 -77450 -40187 -61054
11501 -61054 -143394 -204678 -176326 -81677 -290 11772 -38915 -95716 -104097 -68323 -40066 -39198
11489 -39198 -30751 -9772 -43492 -162147 -265801 -237188 -114454 -43139 -67949 -88460 -35062
$$ packed form
11574c8024j1784l5386l2510J114L3124L8347J5007j2123o845K8517M0298K889
11562B2624k6348N410M5621J1997o1725o5846P658M8288N872l5502q063K8438
11550b1576j398n7648n5149N79L8738L9281L4064K3999j3481n0306l2446K0879
11538g4464L1801p622j3043M8063Q1005O912q9801o6620N4345R7491j0216j21593
11526f3742q3106L8867O7098j6799o4752j0344M0515Q025k8822J2215N9783J4611
11514b6451o4037m7041M5959P3870J91o1738m0193K542N146L286L1016L7263k0867
11501f1054q2340o1284K8352R4649Q1387J2062n0687n6801q381L5774K8257Q68
11489c9198Q447K0979l3720j18655j03654K8613J22734P1315k4810k0511N3398
$$ plain form
11478 -35062 27766 16995 -48104 -98275 -111637 -101439 -70333 -33610 -33354 -75017 -99445 -70433
11466 -70433 -40665 -73142 -142128 -176320 -165806 -158458 -169890 -161605 -106607 -29463 22687 22854
11454 22854 -16080 -48410 -39162 -11276 -21438 -80824 -140190 -162815 -158652 -133355 -73872 -9965
11442 -9965 -6582 -52794 -50885 22090 45168 -59925 -173427 -141182 -16574 19760 -64323 -131660
11430 -131660 -117575 -107820 -146563 -145526 -54502 29282 12487 -57032 -95755 -114161 -142387 -134641
11418 -134641 -65603 -29748 -109742 -214752 -194234 -68214 5757 -24544 -51521 -9316 21031
11407 21031 -37269 -122454 -131754 -73183 -39026 -75259 -144270 -186674 -167227 -85258 12913 52353
11395 52353 4105 -72060 -96060 -63962 -37889 -52280 -77725 -81381 -75302 -80766 -81055 -49536 -6923
$$ packed form
11478c5062O2828j0771o5099n0171j3362J0198L1106L6723K56m1663k4428K9012
11466g0433K9768l2477o8986l4192J0514P348j1432Q285N4998P7144N2150J67
11454B2854l8934l2330R248K7886j0162n9386n9366k2625M163K5297N9483O3907
11442i965L383m6212J909P2975K3078j05093j13502L2245J24608L6334q4083o7337
11430a31660J4085R755l8743J037R1024Q3784j6795o9519l8723j8406k8226P746
11418a34641O9038L5855p9994j05010K0518J26020P3971l0301k6977M2205L0347
11407B1031n8300q5185r300N8571L4157l6233o9011m2404J9447Q1969R8171L9440
11395E2353m8248p6165k4000L2098K6073j4391k5445l656O079n464k89L1519M2613
$$ plain form
11382 -6923 -3866 -45651 -82031 -87354 -98489 -137833 -153227 -98873 -32968 -44439 -105342 -107019
11370 -107019 -45144 -39022 -128796 -191881 -141278 -74157 -102679 -155471 -109079 -26437 -65453 -196019
11358 -196019 -228335 -126579 -66959 -130921 -167518 -68987 24823 -43269 -181826 -206737 -136769
11347 -136769 -121208 -157675 -112446 10578 51301 -38346 -117241 -97345 -72871 -127885 -185328
11336 -185328 -156605 -102004 -115985 -159678 -139590 -73101 -42931 -46013 -22627 3268 -47051 -149971
11324 -149971 -188241 -132560 -88794 -126031 -172877 -149685 -107397 -141443 -226618 -243087 -152160
11313 -152160 -51445 -36111 -80677 -102190 -88081 -95171 -137748 -149073 -81712 4431 6831 -84754
11301 -84754 -171273 -167208 -95621 -42945 -54523 -101504 -129666 -115224 -80556 -67549 -88808 -109339
$$ packed form
11382f923L057m1785l6380n323j1135l9344j5394N4354O5905j1471o0903j677
11370a07019O1875O122q9774o3085N0603O7121k8522n2792M6392Q2642l9016j30566
11358a96019l2316J01756N9620o3962l6597R8531R3810o8092j38557k4911O9968
11347a36769J5561l6467M5229J23024M0723q9647p8895J9896K4474n5014n7443
11336a85328K8723N4601j3981m3693K0088O6489L0170l082K3386K5895n0319j02920
11324a49971l8270N5681M3766l7237m6846K3192M2288l4046q5175j6469R0927
11313a52160J00715J5334m4566k1513J4109p090m2577j1325O7361Q6143K400r1585
11301h4754q6519M065P1587N2676j1578m6981k8162J4442L4668J3007k1259k0531
$$ plain form
11289 -109339 -97305 -80990 -110184 -162455 -152793 -60893 17302 -8170 -103320 -171458 -182132 -170381
11277 -170381 -151521 -120506 -106550 -136329 -157643 -96200 12824 49899 -19283 -100062 -120288
11266 -120288 -120657 -147682 -159115 -108235 -40137 -22947 -47886 -75986 -120566 -195921 -243427 -210021
11254 -210021 -153399 -159830 -195780 -164061 -81976 -62329 -116603 -130107 -68165 -52738 -157855
11243 -157855 -266775 -243210 -136189 -84582 -99042 -85769 -37840 -43717 -113041 -146146 -102716
11232 -102716 -64550 -84103 -96673 -52984 -26615 -93297 -189406 -202005 -142246 -112259 -133099
11221 -133099 -128364 -74258 -44158 -75564 -98793 -52447 9613 -6586 -101633 -185463 -187506 -120864
11209 -120864 -57092 -64062 -141452 -199993 -148618 -24766 22069 -81605 -225808 -260802 -188767
$$ packed form
11289a09339J2034J6315k9194n2271R662R1900P8195k5472r5150o8138j0674J1751
11277a70381J8860L1015J3956k9779k1314O1443J09024L7075o9182q0779k0226
11266a20288l69k7025j1433N0880O8098J7190k4939k8100m4580p5355m7506L3406
11254b10021N6622o431l5950L1719Q2085J9647n4274j3504O1942J5427j05117
11243a57855j08920K3565J07021N1607j4460J3273M7929n877o9324l3105M3430
11232a02716L8166j9553j2570M3689K6369o6682r6109j2599N9759K9987k0840
11221a33099M735N4106L0100l1406k3229M6346O2060j6199r5047q3830k043O6642
11209a20864O3772o970p7390n8541N1375J23852M6835j03674j44203l4994P2035
$$ plain form
11198 -188767 -126604 -123677 -124629 -97955 -88381 -123510 -163447 -174344 -175444 -184957 -190532 -197698 -230979
11185 -230979 -259171 -205513 -75942 7637 -38521 -147079 -204925 -199178 -183758 -168894 -135255
11174 -135255 -108034 -122393 -148500 -136524 -104542 -99175 -105354 -85543 -71823 -116282 -180112 -184743
11162 -184743 -150725 -162567 -209511 -200364 -140545 -141159 -219686 -248940 -169001 -100416 -152129 -248964
11150 -248964 -267152 -228550 -222271 -222450 -143753 -28481 -12435 -108676 -174780 -124862 -49927 -73409
11138 -73409 -178415 -245784 -213165 -135940 -106094 -148356 -203065 -205874 -171902 -172515 -226517 -265509
11126 -265509 -235234 -176151 -153426 -156042 -132057 -88981 -85677 -140707 -210623 -247042 -228326 -161557
11114 -161557 -101204 -124720 -230294 -307031 -277221 -210786 -209241 -241553 -218172 -172375 -209366
$$ packed form
11198a88767O2163K927r52K6674R574l5129l9937j0897j100r513n575p166l3281
11185b30979k8192N3658J29571Q3579m6158j08558n7846N747J5420J4864L3639
11174a35255K7221j4359k6107J1976L1982N367o179J9811J3720m4459o3830m631
11162a84743L4018j1842m6944R147N9819o14p8527k9254P9939O8585n1713r6835
11150b48964j8188L8602O279j79P8697J15272J6046r6241o6104M9918P4935k3482
11138g3409j05006o7369L2619P7225K9846m2262n4709k809L3972o13n4002l8992
11126b65509L0275N9083K2725k616K3985M3076L304n5030o9916l6419J8716O6769
11114a61557O0353k3516j05574p6737K9810O6435J545l2312K3381M5797l6991
$$ plain form
11103 -209366 -298074 -291193 -170324 -95740 -160306 -257125 -267986 -233189 -235550 -247289 -209341 -159651
11091 -159651 -164337 -201993 -222087 -239257 -267249 -245918 -150788 -91253 -164089 -278661 -276578 -173406
11079 -173406 -123053 -173175 -221140 -206577 -183089 -180709 -154418 -107971 -121653 -200546 -230898 -159897
11067 -159897 -95773 -139784 -225132 -229365 -165618 -144658 -195943 -241888 -232301 -203720 -199713 -210731
11055 -210731 -210726 -199632 -192465 -200461 -229312 -268158 -282409 -247659 -190027 -164710 -193649 -247510 -285603
11042 -285603 -287248 -247816 -179355 -123990 -131148 -196927 -251564 -240025 -196322 -191851 -219103 -196439
11030 -196439 -110687 -71937 -155358 -258465 -232321 -118318 -104000 -232177 -322943 -253837 -151587
11019 -151587 -177838 -264973 -242451 -130770 -102249 -189563 -245687 -200996 -157104 -181443 -197863
$$ packed form
11103b09366q8708O881J20869P4584o4566r6819j0861L4797k361j1739L7948M9690
11091a59651m686l7656k0094j7170k7992K1331R5130N9535p2836j14572K083J03172
11079a73406N0353n0122m7965J4563K3488K380K6291M6447j3682p8893l0352P1001
11067a59897O4124m4011q5348m233O3747K0960n1285m5945R587K8581M007j1018
11055b10731NJ1094P167p996k8851l8846j4251L4750N7632K5317k8939n3861l8093
11042b85603j645L9432O8461N5365p158o5779n4637J1539M3703M471k7252K2664
11030a96439Q5752L8750q3421j03107K6144J14003J4318j28177r0766O9106J02250
11019a51587k6251q7135K2522J11681K8521q7314n6124M4691M3892k4339j6420
$$ plain form
11008 -197863 -156286 -141844 -216872 -297878 -298217 -268819 -282234 -288339 -212896 -109264 -79609 -112508
10996 -112508 -125477 -114366 -136128 -183182 -193591 -161303 -134533 -128301 -126575 -138973 -171715 -184911
10984 -184911 -163099 -171202 -243929 -289030 -222892 -134111 -159922 -251201 -238408 -110694 -38497
10973 -38497 -102548 -188527 -198263 -186881 -214923 -227572 -181041 -149378 -190830 -224285 -162379 -72515
10961 -72515 -73360 -142050 -161672 -117709 -110272 -180014 -244532 -230044 -173845 -157540 -195058 -224969
10949 -224969 -190758 -106652 -45261 -58698 -117831 -150965 -136075 -114133 -110500 -99391 -64934 -42230
10937 -42230 -67378 -129836 -196896 -239985 -223051 -128413 -19061 -5093 -108744 -226351 -263102
10926 -263102 -236453 -201862 -156322 -84032 -30053 -46772 -109882 -155148 -159992 -135802 -91896 -61712
$$ packed form
11008a97863M1577J4442p5028q1006l39K9398j3415o105P5443J03632K9655l2899
10996a12508j2969J1111k1762m7054j0409L2288K6770O232J726j2398l2742j3196
10984a84911K1812q103p2727m5101O6138Q8781k5811r1279J2793J27714P2197
10973c8497o4051q5979r736J1382k8042j2649M6531L1663m1452l3455O1906Q9864
10961g2515q45o8690j9622M3963P437o9742o4518J4488N6199J6305l7518k9911
10949b24969L4211Q4106O1391j3437n9133l3134J4890K1942L633J1109L4457K2704
10937d2230k5148o2458o7060m3089J6934R4638J09352J3968j03651j17607l6751
10926b63102K6649L4591M5540P2290N3979j6719o3110m5266m844K4190M3906L0184
$$ plain form
10914 -61712 -99613 -186231 -209241 -118677 -26369 -52037 -142265 -163442 -116072 -114341 -183215 -225098
10902 -225098 -190149 -142698 -135934 -139505 -123394 -112499 -124632 -139102 -151077 -178181 -198982 -168327
10890 -168327 -106377 -85876 -118147 -140916 -132328 -141894 -188611 -223011 -214458 -186506 -148458 -88260
10878 -88260 -47179 -89789 -177402 -193534 -128854 -108628 -186374 -250459 -210277 -137983 -127600 -140749
10866 -140749 -109923 -82298 -126274 -186476 -173422 -125267 -137272 -189258 -190976 -155199 -172220 -234287
10854 -234287 -237159 -157729 -90690 -91734 -108847 -95423 -80101 -89363 -93983 -69732 -40213 -33497
10842 -33497 -52239 -91925 -133457 -132557 -81988 -53886 -97390 -137224 -87068 -20820 -77467 -212544
10830 -212544 -229494 -88558 9487 -69780 -182954 -134020 30676 112732 54850 -22335 -31760
$$ packed form
10914f1712l7901q6618k3010R0564R2308k5668r0228k1177M7370J731o8874m1883
10902b25098L4949M7451O764l571J6111J0895j2133j4470j1975k7104k0801L0655
10890a68327O1950K0501l2271k2769Q588r566m6717l4400Q553K7952L8048O0198
10878h8260M1081m2610q7613j6132O4680K0226p7746o4085M0182P2294J0383j3149
10866a40749L0826K7625m3976o0202J3054M8155j2005n1986j718L5777j7021o2067
10854b34287k872P9430O7039j044j7113J3424J5322r262m620K4251K9519O716
10842c3497j8742l9686m1532R00N0569K8102m3504l9834N0156O6248n6647j35077
10830b12544j6950J40936R8045p9267j13174M8934J64696Q2056n7882p7185r425
$$ plain form
10819 -31760 -14959 -31257 -74099 -111244 -123816 -100675 -58380 -52922 -107040 -151068 -110842 -28103
10807 -28103 -6196 -54346 -83342 -53353 -23888 -38749 -58496 -45959 -35546 -63402 -91444 -63033
10795 -63033 3296 32580 -11002 -88818 -138804 -132464 -86532 -37693 -5511 20418 46821 43764
10783 43764 -18783 -103020 -121795 -46591 46167 70534 37500 23070 56348 93408 93804 66574
10771 66574 31256 -13386 -56584 -59243 -13086 18458 -24267 -96556 -90678 14009 108817 96094
10759 96094 15570 -20196 24224 83111 91954 50049 -9626 -51322 -38788 33200 105210 108926
10747 108926 61306 41415 69024 82124 52367 36523 73904 116961 121302 125501 166021 183418
10735 183418 109117 -3960 -42181 5317 47974 45266 49810 91995 124298 109732 81032 75610
$$ packed form
10819c1760J6801j6298m2842l7145j2572K3141M2295N458n4118m4028M0226Q2739
10807b8103K1907m8150k8996K9989K9465j4861j9747J2537J0413k7856k8042K8411
10795f3033O6329K9284m3582p7816m9986O340M5932M8839L2182K5929K6403l057
10783D3764o2547q4237j8775P5204R2758K4367l3034j4430L3278L7060L96k7230
10771F6574l5318m4642m3198k659M6157L1544m2725p2289N878J04687R4808j2723
10759I6094q0524l5766M4420N8887Q843m1905n9675m1696J2534P1988P2010L716
10747A08926m7620j9891K7609J3100k9757j5844L7381M3057M341M199M0520J7397
10735A83418p4301j13077l8221M7498M2657k708M544M2185L2303j4566k8700n422
$$ plain form
10723 75610 82286 89071 118441 172403 198520 159434 96598 80722 126395 188931 220420 203719
10711 203719 158418 135003 173421 247352 281531 243937 185821 169145 192633 216340 221033 209534
10699 209534 182766 153076 156115 210325 279631 308724 285218 244050 222994 232080 252111 249717
10687 249717 212540 178184 200149 274664 337592 349891 343468 357070 373390 360430 336622 344805
10675 344805 385878 424665 442535 440562 409781 348196 297591 312513 386651 447264 433303 358231
10663 358231 292780 299398 378262 465989 497110 473108 452423 471306 510786 549323 595093 639096
10651 639096 632948 561399 492979 505008 591613 691845 765788 790297 734594 618960 553684
10640 553684 624391 762922 827591 793811 761798 784795 809416 803677 823558 904431 986646
$$ packed form
10723G5610O676O785K9370N3962K6117l9086o2836j5876M5673O2536L1489j6701
10711B03719m5301k3415L8418P3931L4179l7594n8116j6676K3488K3707M693j1499
10699B09534k6768k9690L039N4210O9306K9093k3506m1168k1056R086K0031k394
10687B49717l7177l4356K1965P4515O2928J2299o423J3602J6320j2960k3808Q183
10675C44805M1073L8787J7870j973l0781o1585n0605J4922P4138O0613j3961p5072
10663C58231o5451O618P8864Q7727L1121k4002k0685J8883L9480L8537M5770M4003
10651F39096o148p1549o8420J2029Q6605J00232P3943K4509n5703j15634o5276
10640E53684P0707J38531O4669l3780l2013K2997K4621n739J9881Q0873Q2215
$$ plain form
10629 986646 1009042 997502 1004185 1030146 1062383 1116360 1182504 1199403 1146225 1097953 1118377 1161460
10617 1161460 1160439 1154047 1220320 1323633 1344149 1256092 1171288 1184270 1259640 1307688 1306437 1305266
10605 1305266 1345749 1416615 1472534 1479622 1449839 1430975 1454369 1504045 1547167 1570104 1568820 1541729
10593 1541729 1520345 1560348 1657656 1723006 1700754 1661386 1693005 1749548 1721956 1635468 1636191 1764088
10581 1764088 1880416 1877485 1833499 1871533 1970357 2027129 2030325 2042973 2060215 2019109 1940566
10570 1940566 1931784 2022739 2108664 2098401 2032006 1997724 2005259 2007487 1996747 2007427 2046856 2084216
10558 2084216 2098089 2089939 2063014 2030617 2029699 2076126 2117202 2087767 2014417 1996479 2061340 2106401
10546 2106401 2035434 1903296 1854987 1939105 2051876 2074957 2011593 1959806 1987613 2066923 2117099
$$ packed form
10629I86646K2396j1540O683K5961L2237N3977O6144J6899n3178m8272K0424M3083
10617A161460j021o392O6273J03313K0516q8057q4804J2982P5370M8048j251j171
10605A305266M0483P0866N5919P088k9783j8864K3394M9676M3122K2937j284k7091
10593A541729k1384M0003R7308O5350k2252l9368L1619N6543k7592q6488P23J27897
10581A764088J16328k931m3986L8034R8824N6772L196J2648J7242m1106p8543
10570A940566q782R0955Q5925j0263o6395l4282P535K228j0740J0680L9429L7360
10558B084216J3873q150k6925l2397r18M6427M1076k9435p3350j7938O4861M5061
10546B106401p0967j32138m8309Q4118J12771K3081o3364n1787K7807P9310N0176
$$ plain form
10535 2117099 2092068 2024549 1987371 2011898 2060896 2091004 2106963 2119670 2092586 2000919 1919321
10524 1919321 1951275 2062735 2096639 1996833 1907079 1965740 2098230 2129874 2038711 1958256 1958485
10513 1958485 1969771 1934920 1900534 1912964 1934504 1922508 1905681 1920847 1943081 1936063 1913249
10502 1913249 1897828 1877893 1849192 1845059 1875374 1894774 1881040 1879546 1912660 1919371 1863908 1833845
10490 1833845 1924916 2074728 2127394 2045597 1946701 1926485 1953452 1961643 1956274 1982274 2044943
10479 2044943 2100350 2096902 2019132 1919862 1893913 1973289 2068957 2077465 2023155 2017360 2093124 2173727
10467 2173727 2202969 2204296 2196317 2156256 2100893 2101194 2167464 2213148 2189244 2165846 2214258 2291240
10455 2291240 2316684 2294069 2274680 2268128 2269578 2310622 2393782 2437330 2382794 2302557 2297605 2343297
$$ packed form
10535B117099k5031o7519l7178K4527M8998L0108J5959J2707k7084r1667q1598
10524A919321L1954J11460L3904r9806q9754N8661J32490L1644r1163q0455K29
10513A958485J1286l4851l4386J2430K1540j1996j6827J5166K2234p018k2814
10502A913249j5421j9935k8701m133L0315J9400j3734j494L3114O711n5463l0063
10490A833845R1071J49812N2666q1797r8896k0216K6967Q191n369K6000O2669
10479B044943N5407l448p7770r9270k5949P9376R5668Q508n4310n795P5764Q0603
10467B173727K9242J327p979m0061n5363L01O6270M5684k3904k3398M8412P6982
10455B291240K5444k2615j9389o552J450M1044Q3160M3548n4536q0237m952M5692
$$ plain form
10443 2343297 2354322 2350808 2415751 2516655 2531238 2454911 2421100 2485319 2549403 2553702 2580094
10432 2580094 2672639 2711729 2604976 2483819 2540199 2734703 2842701 2770753 2660495 2657964
10422 2657964 2730498 2772498 2774544 2798598 2854101 2888175 2875150 2850675 2858574 2902241 2953563 2993430
10410 2993430 3037305 3111806 3198417 3229089 3175385 3115507 3148071 3249365 3299110 3260118 3235387
10399 3235387 3301580 3384747 3386538 3351328 3386855 3469251 3474854 3400719 3395338 3523362 3647952
10388 3647952 3640789 3585122 3635592 3762893 3803521 3729034 3690120 3773445 3879032 3901542 3889223
10377 3889223 3926845 3979976 3978559 3966547 4027604 4119610 4134998 4097525 4137158 4263945 4335925
10366 4335925 4298918 4291888 4417531 4553069 4534037 4427200 4444960 4625777 4778043 4763554
$$ packed form
10443B343297J1025l514O4943J00904J4583p6327l3811O4219O4084M299K6392
10432B580094R2545L9090j06753j21157N6380J94504J07998p1948j10258k531
10422B657964P2534M2000K046K4054N5503L4074j3025k4475P899M3667N1322L9867
10410B993430M3875P4501Q6611L0672n3704n9878L2564J01294M9745l8992k4731
10399C235387O6193Q3167J791l5210L5527Q2396N603p4135n381J28024J24590
10388C647952p163n5667N0470J27301M0628p4487l8914Q3325J05587K2510j2319
10377C889223L7622N3131j417j2012O1057R2006J5388l7473L9633J26787P1980
10366D335925l7007p030J25643J35538j9032j06837J7760J80817J52266j4489
$$ plain form
10356 4763554 4679054 4686196 4782840 4848210 4844722 4857897 4949478 5069344 5139173 5158514 5184472
10345 5184472 5239742 5290056 5309778 5325794 5372632 5431933 5457462 5453729 5481492 5569225 5663938
10334 5663938 5703193 5700504 5716963 5776178 5855925 5940461 6023644 6077541 6085335 6097692 6180471 6303418
10322 6303418 6367974 6366212 6413436 6570768 6730259 6762934 6709323 6715508 6823631 6943599 7016735
10311 7016735 7084685 7179390 7258952 7296149 7335625 7408863 7475545 7512105 7579496 7722509 7869879
10300 7869879 7934336 7961627 8061395 8214638 8287029 8251423 8258634 8419832 8634021 8737643 8746723
10289 8746723 8816440 8988663 9124205 9120429 9076764 9160969 9379667 9580477 9662673 9692932 9789609
10278 9789609 9962942 10123468 10215374 10279460 10380260 10521394 10661155 10780240 10893692 11008681
$$ packed form
10356D763554q4500P142R6644O5370l488J3175R1581J19866O9829J9341K5958
10345E184472N5270N0314J9722J6016M6838N9301K5529l733K7763Q7733R4713
10334E663938L9255k689J6459N9215P9747Q4536Q3183N3897P794J2357Q2779J22947
10322F303418O4556j762M7224J57332J59491L2675n3611O185J08123J19968P3136
10311G016735O7950R4705P9562L7197L9476P3238O6682L6560O7391J43013J47370
10300G869879O4457K7291R9768J53243P2391l5606P211J61198K14189J03622R080
10289H746723O9717J72223J35542l776m3665Q4205K18698K00810Q2196L0259R6677
10278I789609J73333J60526R1906O4086J00800J41134J39761J19085J13452J14989
$$ plain form
10268 11008681 11115529 11225391 11372928 11561472 11742899 11880107 11995667 12123133 12246355
10259 12246355 12341057 12448780 12634842 12876743 13075339 13197662 13330562 13549885 13806640
10250 13806640 14007127 14152463 14318656 14529374 14736061 14918842 15121263 15364434 15599070
10241 15599070 15782257 15951465 16176130 16464370 16761154 17027259 17282551 17565755 17874726
10232 17874726 18164528 18405455 18628493 18893017 19212374 19544286 19865841 20213774 20616125
10223 20616125 21026617 21383704 21706599 22065686 22473176 22876069 23252534 23636357 24038577
10214 24038577 24428149 24813115 25259474 25791255 26340920 26838361 27286982 27721644 28166773
10205 28166773 28670673 29287874 29970633 30575912 31059731 31567130 32224932 32939538 33540126
$$ packed form
10268A1008681J06848J09862J47537J88544J81427J37208J15560J27466J23222
10259A2246355R4702J07723J86062K41901J98596J22323J32900K19323K56755
10250A3806640K00487J45336J66193K10718K06687J82781K02421K43171K34636
10241A5599070J83187J69208K24665K88240K96784K66105K55292K83204L08971
10232A7874726K89802K40927K23038K64524L19357L31912L21555L47933M02351
10223B0616125M10492L57087L22895L59087M07490M02893L76465L83823M02220
10214B4038577L89572L84966M46359N31781N49665M97441M48621M34662M45129
10205B8166773N03900O17201O82759O05279M83819N07399O57802P14606O00588
$$ plain form
10196 33540126 34051263 34654198 35408179 36188394 36911076 37648484 38472951 39337484 40183119
10187 40183119 41043166 41963942 42922893 43898098 44924771 46008545 47073524 48078626 49104291
10178 49104291 50239329 51457299 52692111 53960498 55309117 56704564 58084899 59473529
10170 59473529 60938527 62482859 64079161 65766642 67592273 69489805 71351851 73211246
10162 73211246 75214898 77407496 79672174 81912116 84164368 86489974 88871495 91284022
10154 91284022 93764376 96330255 98909198 101426602 103901471 106381166 108841874 111239511
10146 111239511 113614958 116053613 118554482 121023823 123406840 125759178 128164037 130620963
10138 130620963 133047898 135379718 137639866 139901773 142185407 144421820 146541582 148567444
$$ packed form
10196C3540126N11137O02935P53981P80215P22682P37408Q24467Q64533Q45635
10187D0183119Q60047R20776R58951R75205J026673J083774J064979J005102J025665
10178D9104291J135038J217970J234812J268387J348619J395447J380335J388630
10170E9473529J464998J544332J596302J687481J825631J897532J862046J859395
10162G3211246K003652K192598K264678K239942K252252K325606K381521K412527
10154I1284022K480354K565879K578943K517404K474869K479695K460708K397637
10146A11239511K375447K438655K500869K469341K383017K352338K404859K456926
10138A30620963K426935K331820K260148K261907K283634K236413K119762K025862
$$ plain form
10130 148567444 150575811 152592574 154588792 156558341 158514601 160414957 162195824 163911572
10122 163911572 165732435 167749965 169881422 172034588 174266971 176684812 179273157 181953617
10114 181953617 184751716 187761478 190961348 194203809 197402144 200609242 203882994 207177110
10106 207177110 210404965 213525227 216519690 219356557 222021811 224539699 226935885 229223309
10098 229223309 231423387 233528491 235438119 237028634 238319785 239478651 240606804 241608943
10090 241608943 242333680 242760922 242972255 243012550 242878492 242586767 242144868 241489513 240565757
10081 240565757 239453724 238308684 237170617 235931391 234502857 232918277 231240277 229467806
10073 229467806 227588620 225647525 223700923 221761224 219842667 218003353 216269853 214565310
$$ packed form
10130A48567444K008367K016763J996218J969549J956260J900356J780867J715748
10122A63911572J820863K017530K131457K153166K232383K417841K588345K680460
10114A81953617K798099L009762L199870L242461L198335L207098L273752L294116
10106B07177110L227855L120262K994463K836867K665254K517888K396186K287424
10098B29223309K200078K105104J909628J590515J291151J158866J128153J002139
10090B41608943P24737M27242K11333M0295j34058k91725m41899o55355r23756
10081B40565757j112033j145040j138067j239226j428534j584580j678000j772471
10073B29467806j879186j941095j946602j939699j918557j839314j733500j704543
$$ plain form
10065 214565310 212795470 210980668 209214810 207498604 205704517 203730677 201611713 199434492
10057 199434492 197207301 194873325 192413826 189867283 187255479 184553088 181742661 178852739
10049 178852739 175916706 172920078 169813062 166568677 163220040 159843295 156495122 153153760
10041 153153760 149739142 146220212 142682667 139241118 135897536 132562040 129225043 126012763
10033 126012763 123012508 120125843 117194622 114225169 111371586 108709873 106150335 103597112
10025 103597112 101079280 98664701 96336199 94038326 91792726 89679493 87722098 85856196
10017 85856196 84007029 82154672 80333956 78604633 77005388 75508443 74043563 72591040
10009 72591040 71208115 69925989 68676674 67388553 66108197 64937489 63871858 62798573
$$ packed form
10065B14565310j769840j814802j765858j716206j794087j973840k118964k177221
10057A99434492k227191k333976k459499k546543k611804k702391k810427k889922
10049A78852739k936033k996628l107016l244385l348637l376745l348173l341362
10041A53153760l414618l518930l537545l441549l343582l335496l336997l212280
10033A26012763l000255k886665k931221k969453k853583k661713k559538k553223
10025A03597112k517832k414579k328502k297873k245600k113233j957395j865902
10017H5856196j849167j852357j820716j729323j599245j496945j464880j452523
10009G2591040j382925j282126j249315j288121j280356j170708j065631j073285
$$ plain form
10001 62798573 61659092 60520339 59462643 58480611 57531813 56611618 55730456 54869927 54011733
9992 54011733 53173915 52377668 51609785 50851689 50111651 49394367 48674849 47943368 47245068
9983 47245068 46628781 46076369 45525130 44946235 44363502 43806263 43278905 42769758 42261988
9974 42261988 41744286 41232428 40763521 40344870 39931383 39486074 39040760 38655046 38329053
9965 38329053 38001508 37630339 37234108 36852038 36499170 36166285 35836325 35499858 35177659
9956 35177659 34917575 34734995 34566980 34331342 34031366 33753751 33554952 33400328 33233340
9947 33233340 33051680 32880362 32715511 32545264 32397567 32309533 32257950 32176567 32052443 31955627
9937 31955627 31944991 31979759 31966475 31880569 31795735 31783647 31826637 31861216 31877856 31925208 32021200
$$ packed form
10001F2798573j139481j138753j057696r82032r48798r20195q81162q60529q58194
9992E4011733q37818p96247p67883p58096p40038p17284p19518p31481o98300
9983D7245068o16287n52412n51239n78895n82733n57239n27358n09147n07770
9974D2261988n17702n11858m68907m18651m13487m45309m45314l85714l25993
9965C8329053l27545l71169l96231l82070l52868l32885l29960l36467l22199
9956C5177659k60084j82580j68015k35638k99976k77615j98799j54624j66988
9947C3233340j81660j71318j64851j70247j47697q8034n1583q1383j24124r6816
9937C1955627j0636L4768j3284q5906q4834j2088M2990L4579J6640M7352R5992
$$ plain form
9926 32021200 32120841 32193368 32273768 32394606 32518949 32609199 32723900 32949953 33244776 33456334
9916 33456334 33535821 33626059 33866231 34196863 34464155 34656446 34900961 35242506 35574383 35825896
9906 35825896 36082154 36437328 36839706 37194977 37543047 37991918 38514082 38963481 39306147
9897 39306147 39684412 40197236 40750652 41220701 41657737 42199269 42842905 43451633 43972188
9888 43972188 44510122 45158105 45863421 46523614 47135219 47784671 48537991 49385307 50257295
9879 50257295 51066789 51779861 52475281 53283618 54237142 55236025 56194019 57143594 58144892
9870 58144892 59171926 60174972 61193880 62306442 63501578 64705409 65905248 67141518
9862 67141518 68399370 69631732 70888611 72291151 73850498 75440527 76998136 78625634
$$ packed form
9926C2021200R9641P2527Q0400J20838J24343R0250J14701K26053K94823K11558
9916C3456334P9487R0238K40172L30632K67292J92291K44515L41545L31877K51513
9906C5825896K56258L55174M02378L55271L48070M48871N22164M49399L42666
9897C9306147L78265N12824N53416M70049M37036N41532O43636O08728N20555
9888D3972188N37934O47983P05316O60193O11605O49452P53320Q47316Q71988
9879E0257295Q09494P13072O95420Q08337R53524R98883R57994R49575J001298
9870E8144892J027034J003046J018908J112562J195136J203831J199839J236270
9862F7141518J257852J232362J256879J402540J559347J590029J557609J627498
$$ plain form
9854 78625634 80420774 82318396 84200399 86074807 88033655 90096674 92214836 94390531
9846 94390531 96677320 99074280 101524612 104018023 106603165 109295986 112061340 114891681
9838 114891681 117821480 120852278 123940761 127070856 130256626 133462632 136615674 139723777
9830 139723777 142884281 146122352 149316806 152363049 155327792 158339721 161382464 164317254
9822 164317254 167093765 169815177 172570492 175308579 177930520 180422391 182823628 185126075
9814 185126075 187301183 189404358 191549065 193756857 195921030 197968707 199988727 202124090
9806 202124090 204384904 206663644 208917416 211220878 213611308 215990737 218252322 220421988
9798 220421988 222582920 224716880 226728728 228601528 230415536 232212442 233944004 235568554
$$ packed form
9854G8625634J795140J897622J882003J874408J958848K063019K118162K175695
9846I4390531K286789K396960K450332K493411K585142K692821K765354K830341
9838A14891681K929799L030798L088483L130095L185770L206006L153042L108103
9830A39723777L160504L238071L194454L046243K964743L011929L042743K934790
9822A64317254K776511K721412K755315K738087K621941K491871K401237K302447
9814A85126075K175108K103175K144707K207792K164173K047677K020020K135363
9806B02124090K260814K278740K253772K303462K390430K379429K261585K169666
9798B20421988K160932K133960K011848J872800J814008J796906J731562J624550
$$ plain form
9790 235568554 237094204 238496639 239700914 240700465 241596284 242437495 243100946 243425790 243414160
9781 243414160 243196771 242836062 242276871 241484496 240513044 239400096 238085052 236495950 234668868
9772 234668868 232718547 230702458 228556055 226170470 223518593 220692738 217811929 214904325
9764 214904325 211916411 208845746 205809050 202932435 200216790 197577565 194987787 192497733
9756 192497733 190122250 187805608 185522357 183325968 181251671 179242422 177229557 175230476
9748 175230476 173298033 171410816 169486684 167491012 165467557 163461069 161459114 159417201
9740 159417201 157303953 155113767 152862028 150574434 148265967 145932845 143572183 141189177
9732 141189177 138771155 136287567 133743986 131199114 128683681 126136802 123483639 120750773
$$ packed form
9790B35568554J525650J402435J204275R99551Q95819Q41211O63451L24844j1630
9781B43414160k17389l60709n59191p92375r71452j112948j315044j589102j827082
9772B34668868j950321k016089k146403k385585k651877k825855k880809k907604
9764B14904325k987914l070665l036696k876615k715645k639225k589778k490054
9756A92497733k375483k316642k283251k196389k074297k009249k012865j999081
9748A75230476j932443j887217j924132j995672k023455k006488k001955k041913
9740A59417201k113248k190186k251739k287594k308467k333122k360662k383006
9732A41189177k418022k483588k543581k544872k515433k546879k653163k732866
$$ plain form
9724 120750773 118029203 115334920 112596793 109795674 107019014 104332703 101685316 99011814
9716 99011814 96365627 93853859 91477079 89134888 86786300 84506258 82357503 80292170
9708 80292170 78232815 76189812 74231511 72373108 70569554 68812673 67159599 65632567
9700 65632567 64145558 62595042 61012856 59559339 58328079 57204335 55985809 54633705
9692 54633705 53321042 52200321 51205309 50163246 49048763 48007563 47129010 46319787 45456001
9683 45456001 44558334 43726960 42970087 42206182 41410817 40654863 39986557 39361160 38714912
9674 38714912 38046929 37399571 36802310 36253316 35717482 35137670 34497513 33875399 33371445
9665 33371445 32967833 32534199 31998053 31434505 30947278 30538261 30151393 29770123 29393715
$$ packed form
9724A20750773k721570k694283k738127k801119k776660k686311k647387k673502
9716I9011814k646187k511768k376780k342191k348588k280042k148755k065333
9708H0292170k059355k043003j958301j858403j803554j756881j653074j527032
9700F5632567j487009j550516j582186j453517j231260j123744j218526j352104
9692E4633705j312663j120721r95012j042063j114483j041200q78553q09223q63786
9683D5456001q97667q31374p56873p63905p95365p55954o68306o25397o46248
9674C8714912o67983o47358n97261n48994n35834n79812o40157o22114n03954
9665C3371445m03612m33634n36146n63548m87227m09017l86868l81270l76408
$$ plain form
9656 29393715 28979455 28501017 28022420 27621576 27272721 26898087 26505655 26168055 25881224
9647 25881224 25561986 25190614 24837820 24529933 24207313 23855509 23556894 23346869 23127784
9638 23127784 22812407 22463430 22189975 21973892 21709106 21372299 21046835 20793213 20588121
9629 20588121 20387840 20175189 19944177 19701133 19477288 19287893 19095340 18866296 18636269
9620 18636269 18449906 18269380 18029380 17761759 17562619 17435640 17275850 17033646 16794255
9611 16794255 16647000 16556178 16418914 16195210 15930954 15694620 15529233 15427849 15327762 15168151
9601 15168151 14970119 14808745 14693866 14550661 14346276 14154204 14041082 13962705 13839253 13674358
9591 13674358 13526519 13408973 13291870 13167485 13042660 12899014 12729908 12585267 12506765 12446211
$$ packed form
9656B9393715m14260m78438m78597m00844l48855l74634l92432l37600k86831
9647B5881224l19238l71372l52794l07887l22620l51804k98615k10025k19085
9638B3127784l15377l48977k73455k16083k64786l36807l25464k53622k05092
9629B0588121k00281k12651k31012k43044k23845j89395j92553k29044k30027
9620A8636269j86363j80526k40000k67621j99140j26979j59790k42204k39391
9611A6794255j47255r0822j37264k23704k64256k36334j65387j01384j00087j59611
9601A5168151j98032j61374j14879j43205k04385j92072j13122p8377j23452j64895
9591A3674358j47839j17546j17103j24385j24825j43646j69106j44641p8502o0554
$$ plain form
9581 12446211 12323990 12145206 11980028 11850609 11723139 11597747 11512188 11454283 11361188 11217427
9571 11217427 11069076 10927853 10752012 10547207 10393057 10326090 10278716 10186481 10079894 10006550
9561 10006550 9929916 9786520 9602073 9468591 9419829 9393255 9313411 9168607 9007597 8889221
9551 8889221 8826506 8765350 8644718 8490870 8402353 8409678 8408163 8288391 8086199 7929499 7868249
9540 7868249 7839760 7786586 7718771 7651223 7564899 7461381 7388613 7370584 7358930 7295741 7190959
9529 7190959 7099806 7047428 7009334 6950900 6860579 6756514 6677721 6651642 6653687 6620312 6524880
9518 6524880 6420593 6378322 6394298 6393574 6324357 6216594 6136471 6108782 6103559 6082263 6031304 5956372
9506 5956372 5873710 5814072 5806243 5837088 5850454 5810692 5746500 5701154 5664661 5604315 5542213 5530706
$$ packed form
9581A2446211j22221j78784j65178j29419j27470j25392q5559n7905r3095j43761
9571A1217427j48351j41223j75841k04805j54150o6967m7374r2235j06587p3344
9561A0006550p6634j43396j84447j33482m8762k6574p9844j44804j61010j18376
9551H889221o2715o1156j20632j53848q8517P325j515j19772k02192j56700o1250
9540G868249k8489n3174o7815o7548q6324j03518p2768j8029j1654o3189j04782
9529G190959r1153n2378l8094n8434r0321j04065p8793k6079K045l3375r5432
9518F524880j04287m2271J5976p24o9217j07763q0123k7689n223k1296n0959p4932
9506E956372q2662n9638p829L0845J3366l9762o4192m5346l6493o0346o2102j1507
$$ plain form
9494 5530706 5550112 5514194 5403354 5308340 5294204 5303675 5265441 5219734 5238009 5278475 5242138
9483 5242138 5140957 5083156 5098045 5101853 5049422 4993727 4965073 4916138 4835409 4794674 4817510
9472 4817510 4814193 4730053 4652607 4670896 4722621 4698545 4621406 4590957 4609835 4602895 4569119 4567051
9460 4567051 4569281 4487528 4352082 4311211 4409443 4504900 4472590 4371478 4327539 4347646 4346762 4295218
9448 4295218 4241224 4219099 4215933 4216595 4221520 4222937 4202521 4153065 4088804 4043579 4050807 4092864 4087204
9435 4087204 3983614 3865605 3870935 4001597 4106691 4081192 3984494 3922285 3913879 3930817 3959279
9424 3959279 3954784 3848996 3690331 3655165 3798286 3913538 3804182 3588804 3538339 3677945
9414 3677945 3781355 3738563 3680940 3705528 3719686 3653949 3613600 3682099 3747624 3681684 3555891
$$ packed form
9494E530706J9406l5918j10840r5014j4136R471l8234m5707J8275M0466l6337
9483E242138j01181n7801J4889L808n2431n5695k8654m8935q0729m0735K2836
9472D817510l317q4140p7446J8289N1725k4076p7139l0449J8878o940l3776k068
9460D567051K230q1753j35446m0871R8232R5457l2310j01112m3939K0107q84n1544
9448D295218n3994k2125l166O62M925J417k0416m9456o4261m5225P228M2057n660
9435D087204j03590j18009N330J30662J05094k5499r6698o2209q406J6938K8462
9424C959279m495j05788j58665l5166J43121J15252j09356k15378n0465J39606
9414C677945J03410m2792n7623K4588J4158o5737m0349O8499O5525o5940j25793
$$ plain form
9403 3555891 3520060 3570229 3599470 3595300 3621864 3666296 3664461 3638837 3657404 3687390 3643113 3555547
9391 3555547 3534566 3571481 3546253 3444428 3396770 3461022 3526278 3502671 3459140 3481781 3522220
9380 3522220 3497155 3440468 3438122 3480106 3491623 3465804 3458383 3478033 3479580 3454910 3447520 3477277
9368 3477277 3515405 3534644 3535445 3528157 3528456 3555857 3601595 3621453 3595152 3560516 3552242 3551389 3542552
9355 3542552 3567232 3652833 3737597 3748807 3717077 3721930 3755911 3747603 3702727 3707725 3786516 3862284
9343 3862284 3880596 3868223 3846528 3793058 3725166 3715305 3773392 3815860 3808432 3832632 3936037 4026245
9331 4026245 4016237 3976032 4010568 4067092 4020790 3906313 3890901 4015685 4127721 4106762 4015987
9320 4015987 3969399 3977331 4000821 4049423 4129820 4180714 4157543 4118665 4132993 4162029 4139036 4112746
$$ packed form
9403C555891l5831N0169K9241m170K6564M4432j835k5624J8567K9986m4277q7566
9391C555547k0981L6915k5228j01825m7658O4252O5256k3607m3531K2641M0439
9380C522220k5065n6687k346M1984J1517k5819p421J9650J547k4670p390K9757
9368C477277L8128J9239Q01p288K99K7401M5738J9858k6301l4636q274q53q837
9355C542552K4680Q5601Q4764J1210l1730M853L3981q308m4876M998P8791P5768
9343C862284J8312j2373k1695n3470o7892r861N8087M2468p428K4200J03405R0208
9331D026245j0008m0205L4536N6524m6302j14477j5412J24784J12036k0959r0775
9320D015987m6588P932K3490M8602Q0397N0894k3171l8878J4328K9036k2993k6290
$$ plain form
9308 4112746 4183372 4319070 4376247 4316709 4268771 4323132 4390466 4346794 4227700 4170084 4214686
9297 4214686 4278791 4303964 4320705 4356067 4376022 4357814 4343099 4367216 4391224 4363033 4307885
9286 4307885 4294373 4330373 4357160 4344773 4331496 4352136 4379134 4367293 4323506 4295710 4309039
9275 4309039 4343941 4369730 4373990 4362033 4349659 4357167 4391789 4432282 4445566 4424156 4395728 4387860
9263 4387860 4391315 4370952 4315008 4260681 4255179 4295378 4331581 4340253 4359966 4425525 4498629 4517938
9251 4517938 4498978 4510774 4552335 4542908 4466612 4429007 4499419 4584141 4561478 4478250 4479365 4575789
9239 4575789 4635243 4608732 4604300 4684863 4747257 4697293 4616847 4632841 4716164 4749630 4727475 4737781
9227 4737781 4786504 4794284 4758802 4768829 4841138 4886296 4870353 4873799 4939196 4992613 4987670 5002455
$$ packed form
9308D112746P0626J35698N7177n9538m7938N4361O7334m3672j19094n7616M4602
9297D214686O4105K5173J6741L5362J9955j8208j4715K4117K4008k8191n5148
9286D307885j3512L6000K6787j2387j3277K0640K6998j1841m3787k7796J3329
9275D309039L4902K5789M260j1957j2374P508L4622M0493J3284k1410k8428p868
9263D387860L455k0363n5944n4327n502M0199L6203Q672J9713O5559P3104J9309
9251D517938j8960J1796M1561r427p6296l7605P0412Q4722k2663q3228J115R6424
9239D575789N9454k6511m432Q0563O2394m9964q0446J5994Q3323L3466k2155J0306
9227D737781M8723P780l5482J0027P2309M5158j5943L446O5397N3417m943J4785
$$ plain form
9215 5002455 5097768 5187691 5167112 5083959 5060017 5104686 5138872 5155822 5213052 5285559 5280278 5211728
9203 5211728 5217883 5351989 5481904 5469642 5358893 5305059 5384822 5548281 5707008 5797934 5800878
9192 5800878 5761821 5770057 5853955 5930716 5918022 5858495 5859212 5935513 6003843 6022773 6046007 6115453
9180 6115453 6190502 6227439 6256182 6319452 6392805 6434883 6474453 6563780 6666995 6690230 6631860
9169 6631860 6606896 6681215 6769054 6768883 6732713 6793217 6950939 7056725 7027586 6968543 7018201
9158 7018201 7158307 7263725 7288815 7304036 7362097 7423045 7433655 7413414 7426281 7502212 7610500
9147 7610500 7691265 7706899 7681907 7687104 7760802 7858864 7913530 7921880 7933667 7972108 8020518 8070595
9135 8070595 8122175 8148931 8132881 8119040 8156454 8200385 8173447 8115752 8146954 8263533 8321839
$$ packed form
9215E002455R5313Q9923k0579q3153k3942M4669L4186J6950N7230P2507n281o8550
9203E211728O155J34106J29915j2262j10749n3834P9763J63459J58727R0926K944
9192E800878l9057Q236Q3898P6761j2694n9527P17P6301O8330J8930K3234O9446
9180F115453P5049L6937K8743O3270P3353M2078L9570Q9327J03215K3235n8370
9169F631860k4964P4319Q7839j71l6170O0504J57722J05786k9139n9043M9658
9158G018201J40106J05418K5090J5221N8061O0948J0610k0241J2867P5931J08288
9147G610500Q0765J5634k4992N197P3698R8062N4666Q350J1787L8441M8410N0077
9135H070595N1580K6756j6050j3841L7414M3931k6938n7695L1202J16579N8306
$$ plain form
9124 8321839 8272677 8253819 8356307 8455324 8413815 8318711 8332146 8408140 8373503 8239722 8199780
9113 8199780 8305527 8376236 8292572 8179858 8192337 8278990 8299056 8252799 8250429 8317936 8369013
9102 8369013 8345957 8285321 8248219 8254889 8284831 8298827 8272667 8231707 8223515 8243574 8236298 8183621
9090 8183621 8130904 8108229 8099261 8106582 8157146 8214910 8195712 8113883 8093365 8166746 8195270 8085986
9078 8085986 7954798 7940805 7981799 7942491 7865195 7892689 8003519 8038859 7971773 7936151 7976253
9067 7976253 7976802 7885248 7805621 7802513 7795789 7740780 7741184 7863710 7985606 7964725 7852563 7800637
9055 7800637 7837647 7872982 7861423 7838800 7832568 7843407 7884892 7952596 7987372 7948195 7882701 7853742
9043 7853742 7846685 7825728 7821876 7873751 7937313 7954649 7960967 8015388 8073713 8052329 7984900 7986170
$$ packed form
9124H321839m9162j8858J02488R9017m1509r5104J3435P5994l4637j33781l9942
9113H199780J05747P0709q3664j12714J2479Q6653K0066m6257k370O7507N1077
9102H369013k3056o0636l7102O670K9942J3996k6160m0960q192K0059p276n2677
9090H183621n2717k2675q968P321N0564N7764j9198q1829k0518P3381K8524j09284
9078H085986j31188j3993M0994l9308p7296K7494J10830L5340o7086l5622M0102
9067G976253N49r1554p9627l108o724n5009M04J22526J21896k0881j12162n1926
9055G800637L7010L5335j1559k2623o232J0839M1485O7704L4776l9177o5494k8959
9043G853742p057k0957l852N1875O3562J7336O318N4421N8325k1384o7429J270
$$ plain form
9031 7986170 8076037 8165882 8211405 8249274 8279659 8249905 8180536 8176133 8265049 8343255 8330461 8278014
9019 8278014 8263699 8276906 8275461 8269763 8277128 8268296 8236282 8250584 8357529 8480644 8512296 8470190
9007 8470190 8470439 8558745 8656471 8684756 8668124 8681370 8739615 8786768 8784362 8772061 8812253 8889084
8995 8889084 8914679 8859417 8819788 8894129 9031560 9094549 9055245 9024461 9075899 9154126 9194585
8984 9194585 9224302 9279285 9321624 9323878 9352432 9466012 9594304 9625801 9573486 9544644 9575967
8973 9575967 9612192 9636007 9699966 9811578 9892315 9892379 9867887 9897713 9979768 10053811 10088514 10106984
8961 10106984 10146198 10215710 10288215 10327925 10337243 10358832 10413322 10468369 10506540 10580582 10734007
8950 10734007 10898114 10957319 10911085 10879174 10933118 11013304 11044368 11047666 11088348 11176888 11279275
$$ packed form
9031G986170Q9867Q9845M5523L7869L0385k9754o9369m403Q8916P8206j2794n2447
9019H278014j4315J3207j445n698P365q832l2014J4302J06945J23115L1652m2106
9007H470190K49Q8306R7726K8285j6632J3246N8245M7153k406j2301M0192P6831
8995H889084K5595n5262l9629P4341J37431O2989l9304l0784N1438P8227M0459
8984I194585K9717N4983M2339K254K8554J13580J28292L1497n2315k8842L1323
8973I575967L6225K3815O3959J11612Q0737O4k4492K9826Q2055P4043L4703J8470
8961A0106984L9214O9512P2505L9710R318K1589N4490N5047L8171P4042J53425
8950A0734007J64107N9205m6234l1911N3944Q0186L1064L298M0682Q8540J02387
$$ plain form
8939 11279275 11376629 11463964 11529872 11581977 11654378 11749675 11816673 11830371 11848294 11931016 12046054
8928 12046054 12116545 12137737 12173784 12252206 12334714 12397412 12472783 12589533 12720300 12817722 12872447
8917 12872447 12914417 12979037 13085289 13223449 13350569 13420955 13438953 13464843 13550962 13684695
8907 13684695 13812278 13908096 13996144 14102102 14210975 14293474 14362733 14473167 14652298 14859616
8897 14859616 15036326 15176715 15317028 15466007 15592346 15685898 15783634 15913739 16055926 16188426
8887 16188426 16336397 16529156 16736260 16900845 17026995 17177712 17378992 17579231 17728248
8878 17728248 17854262 18025082 18258044 18509020 18739663 18953936 19164726 19364174 19547705
8869 19547705 19740438 19972303 20241559 20527283 20822676 21124673 21404714 21636217 21851872
$$ packed form
8939A1279275R7354Q7335O5908N2105P2401R5297O6998J3698J7923Q2722J15038
8928A2046054P0491K1192L6047P8422Q2508O2698P5371J16750J30767R7422N4725
8917A2872447M1970O4620J06252J38160J27120P0386J7998K5890Q6119J33733
8907A3684695J27583R5818Q8048J05958J08873Q2499O9259J10434J79131K07318
8897A4859616J76710J40389J40313J48979J26339R3552R7736J30105J42187J32500
8887A6188426J47971J92759K07104J64585J26150J50717K01280K00239J49017
8878A7728248J26014J70820K32962K50976K30643K14273K10790J99448J83531
8869A9547705J92733K31865K69256K85724K95393L01997K80041K31503K15655
$$ plain form
8860 21851872 22121815 22458381 22793798 23080834 23363413 23703198 24083599 24446024 24784254
8851 24784254 25133125 25489904 25825834 26164767 26569286 27045259 27533677 28001733 28468061
8842 28468061 28935989 29388498 29859408 30411745 31020554 31580802 32071897 32607215 33263589
8833 33263589 33970750 34643466 35309695 36009084 36679704 37283682 37951500 38830329 39842621
8824 39842621 40776003 41592617 42463777 43485421 44548053 45544108 46530745 47594528 48698491
8815 48698491 49778341 50878752 52066890 53289138 54442870 55542262 56690054 57910752
8807 57910752 59129761 60316149 61536920 62843580 64190722 65509830 66804335 68120687
8799 68120687 69459120 70770421 72042609 73343282 74740241 76199597 77617137 78964421
$$ packed form
8860B1851872K69943L36566L35417K87036K82579L39785L80401L62425L38230
8851B4784254L48871L56779L35930L38933M04519M75973M88418M68056M66328
8842B8468061M67928M52509M70910N52337O08809N60248M91095N35318O56374
8833C3263589P07161O72716O66229O99389O70620O03978O67818Q78829J012292
8824C9842621R33382Q16614Q71160J021644J062632R96055R86637J063783J103963
8815D8698491J079850J100411J188138J222248J153732J099392J147792J220698
8807E7910752J219009J186388J220771J306660J347142J319108J294505J316352
8799F8120687J338433J311301J272188J300673J396959J459356J417540J347284
$$ plain form
8791 78964421 80342952 81844763 83413704 84928540 86393008 87936275 89617907 91336645
8783 91336645 92966294 94493872 95983467 97485981 99029691 100621842 102213639 103742758
8775 103742758 105252985 106875235 108634067 110386944 112042660 113723585 115586062 117580617
8767 117580617 119550695 121502202 123594107 125884533 128264751 130657468 133114552 135680022
8759 135680022 138307448 140973345 143741649 146641637 149591018 152521968 155496630 158614143
8751 158614143 161867018 165166225 168465828 171806118 175268962 178923893 182771594 186716647
8743 186716647 190653183 194592754 198632285 202783803 206943070 211060673 215214260 219435436
8735 219435436 223591580 227556458 231401034 235281959 239213704 243094680 246909324 250753075
$$ packed form
8791G8964421J378531J501811J568941J514836J464468J543267J681632J718738
8783I1336645J629649J527578J489595J502514J543710J592151J591797J529119
8775A03742758J510227J622250J758832J752877J655716J680925J862477J994555
8767A17580617J970078J951507K091905K290426K380218K392717K457084K565470
8759A35680022K627426K665897K768304K899988K949381K930950K974662L117513
8751A58614143L252875L299207L299603L340290L462844L654931L847701L945053
8743A86716647L936536L939571M039531M151518M159267M117603M153587M221176
8735B19435436M156144L964878L844576L880925L931745L880976L814644L843751
$$ plain form
8727 250753075 254678188 258659146 262705137 266864406 271108246 275354997 279638684 284111664
8719 284111664 288826933 293653780 298491581 303450804 308713362 314293086 320046868 325873258
8711 325873258 331790119 337835419 343983943 350160222 356264574 362189082 367864001 373281133
8703 373281133 378427289 383226046 387613443 391643577 395428762 398984218 402238386 405217686
8695 405217686 408108042 411069142 414075341 417020704 419904311 422800879 425695808 428481823
8687 428481823 431113044 433627886 435990556 438046265 439709458 441084465 442295227 443282369
8679 443282369 443893946 444112018 444039039 443690830 442970576 441860447 440472530 438862859 436960550
8670 436960550 434767566 432470129 430215772 427903087 425359042 422641931 419983568 417465944
$$ packed form
8727B50753075L925113L980958M045991M159269M243840M246751M283687M472980
8719B84111664M715269M826847M837801M959223N262558N579724N753782N826390
8711C25873258N916861O045300O148524O176279O104352N924508N674919N417132
8703C73281133N146156M798757M387397M030134L785185L555456L254168K979300
8695D05217686K890356K961100L006199K945363K883607K896568K894929K786015
8687D28481823K631221K514842K362670K055709J663193J375007J210762R87142
8679D43282369O11577K18072p2979l48209p20254j110129j387917j609671j902309
8670D36960550k192984k297437k254357k312685k544045k717111k658363k517624
$$ plain form
8662 417465944 414935848 412239484 409367624 406334905 403072195 399500544 395592037 391307719
8654 391307719 386595645 381504220 376173302 370647411 364827555 358696539 352462742 346358662
8646 346358662 340404111 334508595 328714756 323165188 317872313 312699122 307570364 302549077
8638 302549077 297684322 292926211 288232938 283637115 279151737 274717422 270305467 265983568
8630 265983568 261813257 257755058 253736081 249742236 245778363 241801509 237771502 233724775
8622 233724775 229724658 225766955 221798840 217808427 213835720 209909131 206021746 202160929
8614 202160929 198324593 194524710 190805086 187226897 183799220 180453634 177125852 173827338
8606 173827338 170594221 167412539 164257674 161167020 158191969 155300001 152410073 149518579
$$ packed form
8662D17465944k530096k696364k871860l032719l262710l571651l908507m284318
8654C91307719m712074n091425n330918n525891n819856o131016o233797o104080
8646C46358662n954551n895516n793839n549568n292875n173191n128758n021287
8638C02549077m864755m758111m693273m595823m485378m434315m411955m321899
8630B65983568m170311m058199m018977l993845l963873l976854m030007m046727
8622B33724775m000117l957703l968115l990413l972707l926589l887385l860817
8614B02160929l836336l799883l719624l578189l427677l345586l327782l298514
8606A73827338l233117l181682l154865l090654k975051k891968k889928k891494
$$ plain form
8598 149518579 146706657 144020004 141425868 138902689 136486287 134195342 131985574 129818960
8590 129818960 127718466 125716145 123804066 121975722 120257723 118650724 117086867 115498660
8582 115498660 113895989 112333670 110840130 109414888 108048870 106701387 105305924 103851870
8574 103851870 102412928 101038804 99674867 98260081 96843784 95507153 94215861 92870012
8566 92870012 91476231 90138792 88878407 87597243 86253651 84935828 83703319 82482173
8558 82482173 81204298 79941506 78788902 77695681 76537416 75307569 74111646 72996408
8550 72996408 71910566 70834809 69827253 68906085 67987367 66993294 65954795 64956578 64030167
8541 64030167 63146298 62272319 61391122 60491177 59581138 58700997 57886919 57133092 56408825
$$ packed form
8598A49518579k811922k686653k594136k523179k416402k290945k209768k166614
8590A29818960k100494k002321j912079j828344j717999j606999j563857j588207
8582A15498660j602671j562319j493540j425242j366018j347483j395463j454054
8574A03851870j438942j374124j363937j414786j416297j336631j291292j345849
8566I2870012j393781j337439j260385j281164j343592j317823j232509j221146
8558H2482173j277875j262792j152604j093221j158265j229847j195923j115238
8550G2996408j085842j075757j007556r21168r18718r94073j038499r98217r26411
8541F4030167q83869q73979q81197q99945r10039q80141q14078p53827p24267
$$ plain form
8532 56408825 55700357 55013237 54343139 53670554 52988768 52320021 51690467 51091842 50483034
8523 50483034 49840337 49192903 48585161 48013214 47434745 46840842 46269218 45734561 45203852
8514 45203852 44667730 44171474 43729686 43278616 42780831 42310639 41942575 41610696 41195653
8505 41195653 40715504 40295134 39958864 39603339 39194195 38831800 38565566 38292933 37933179
8496 37933179 37570833 37309374 37087170 36775182 36387017 36050698 35808556 35576396 35289304
8487 35289304 34974943 34681267 34423306 34201015 33992687 33742137 33426963 33116218 32878291
8478 32878291 32664067 32383123 32066319 31826194 31662982 31449053 31129639 30803162 30552069
8469 30552069 30318403 30020711 29689052 29393126 29115163 28791684 28432118 28105304 27833994
$$ packed form
8532E6408825p08468o87120o70098o72585o81786o68747o29554n98625o08808
8523E0483034o42697o47434o07742n71947n78469n93903n71624n34657n30709
8514D5203852n36122m96256m41788m51070m97785m70192l68064l31879m15043
8505D1195653m80149m20370l36270l55525m09144l62395k66234k72633l59754
8496C7933179l62346k61459k22204l11988l88165l36319k42142k32160k87092
8487C5289304l14361k93676k57961k22291k08328k50550l15174l10745k37927
8478C2878291k14224k80944l16804k40125j63212k13929l19414l26477k51093
8469C0552069k33666k97692l31659k95926k77963l23479l59566l26814k71310
$$ plain form
8460 27833994 27576641 27299504 27007599 26710880 26403884 26078979 25740280 25413797 25143706
8451 25143706 24945655 24763359 24519559 24214942 23919853 23664780 23414658 23163911 22960876
8442 22960876 22799938 22588976 22287056 21984391 21769186 21598995 21393766 21177376 21017372
8433 21017372 20885787 20700519 20465359 20250447 20062195 19852143 19636010 19479450 19368832
8424 19368832 19218636 19015890 18837810 18709364 18565144 18382782 18231817 18141977 18038982 17875064
8414 17875064 17716630 17624247 17540757 17391012 17214681 17096979 17023978 16912697 16750020 16599879
8404 16599879 16489895 16385903 16276036 16192925 16140709 16073431 15966478 15852396 15764686 15691967
8394 15691967 15609443 15521040 15449611 15405236 15372964 15320734 15227708 15120495 15059011 15056642 15041468
$$ packed form
8460B7833994k57353k77137k91905k96719l06996l24905l38699l26483k70091
8451B5143706j98051j82296k43800l04617k95089k55073k50122k50747k03035
8442B2960876j60938k10962l01920l02665k15205j70191k05229k16390j60004
8433B1017372j31585j85268k35160k14912j88252k10052k16133j56560j10618
8424A9368832j50196k02746j78080j28446j44220j82362j50965q9840j02995j63918
8414A7875064j58434r2383q3490j49745j76331j17702p3001j11281j62677j50141
8404A6599879j09984j03992j09867q3111n2216o7278j06953j14082q7710p2719
8394A5691967q2524q8403p1429m4375l2272n2230r3026j07213o1484k369j5174
$$ plain form
8383 15041468 14943130 14795722 14694467 14663704 14639600 14582916 14525499 14485173 14424510 14341140 14311609
8372 14311609 14367133 14397890 14289342 14111255 14042331 14111851 14155812 14069569 13966005 13988972 14078715
8361 14078715 14059533 13904154 13762901 13738848 13772842 13774434 13739084 13688474 13610448 13524933 13506941
8350 13506941 13563402 13580116 13485489 13379569 13384735 13445137 13418231 13314266 13278125 13345067 13387476
8339 13387476 13333090 13271275 13278088 13283428 13207283 13109502 13092037 13139083 13168199 13174733 13208618 13250461
8327 13250461 13227857 13141633 13076377 13082078 13121483 13139997 13128036 13110771 13118817 13162074 13203472 13189304
8315 13189304 13137762 13142619 13235115 13307907 13260756 13163200 13160853 13257272 13317366 13278744 13227352 13243383
8303 13243383 13296928 13339308 13386494 13450929 13481902 13443495 13383543 13362469 13372768 13385495 13414813
$$ packed form
8383A5041468r8338j47408j01255l0763k4104n6684n7417m0326o0663q3370k9531
8372A4311609N5524L0757j08548j78087o8924O9520M3961q6243j03564K2967Q9743
8361A4078715j9182j55379j41253k4053L3994J592l5350n0610p8026q5515j7992
8350A3506941N6461J6714r4627j05920N166O0402k6906j03965l6141O6942M2409
8339A3387476n4386o1815O813N340p6145r7781j7465M7046K9116O534L3885M1843
8327A3250461k2604q6224o5256N701L9405J8514j1961j7265Q046M3257M1398j4168
8315A3189304n1542M857R2496P2792m7151r7556k347R6419O0094l8622n1392J6031
8303A3243383N3545M2380M7186O4435L0973l8407n9952k1074J0299J2727K9318
$$ plain form
8292 13414813 13471955 13510760 13492472 13463903 13498241 13587398 13661658 13692526 13707885 13723730 13733528
8281 13733528 13758650 13835325 13941938 14008049 14019658 14053456 14164269 14287526 14319043 14275466 14300233
8270 14300233 14480147 14711520 14812161 14746587 14664215 14702003 14831538 14949999 15042510 15160034
8260 15160034 15285261 15342647 15338441 15371387 15477978 15579300 15628839 15703350 15870504 16060462
8250 16060462 16168912 16217329 16296754 16399186 16433758 16401086 16425008 16579430 16782199 16912199
8240 16912199 16964393 17032989 17180545 17374535 17539677 17641004 17715774 17831372 18008885 18200364
8230 18200364 18358184 18504242 18692313 18919022 19128492 19307414 19514429 19788810 20078725
8221 20078725 20302935 20458944 20627692 20875332 21182372 21479070 21732266 21977917 22265067
$$ packed form
8292A3414813N7142L8805j8288k8569L4338Q9157P4260L0868J5359J5845R798
8281A3733528K5122P6675J06613O6111J1609L3798J10813J23257L1517m3577K4767
8270A4300233J79914K31373J00641o5574q2372L7788J29535J18461R2511J17524
8260A5160034J25227N7386m206L2946J06591J01322M9539P4511J67154J89958
8250A6060462J08450M8417P9425J02432L4572l2672K3922J54422K02769J30000
8240A6912199N2194O8596J47556J93990J65142J01327P4770J15598J77513J91479
8230A8200364J57820J46058J88071K26709K09470J78922K07015K74381K89915
8221B0078725K24210J56009J68748K47640L07040K96698K53196K45651K87150
$$ plain form
8212 22265067 22584686 22878078 23117022 23347737 23638429 24002338 24390001 24740256 25024890
8203 25024890 25268470 25543928 25916807 26363067 26774277 27085162 27364922 27729042 28187435
8194 28187435 28649392 29067629 29496277 29990934 30527701 31060600 31600088 32180751 32786286
8185 32786286 33362182 33890078 34401809 34918378 35417300 35881576 36354402 36905181 37535086
8176 37535086 38155666 38699398 39228514 39872375 40654404 41455741 42182149 42887676 43667512
8167 43667512 44499768 45295919 46067908 46924303 47900547 48906659 49869878 50830667 51857672
8158 51857672 52954387 54098048 55291330 56515016 57695311 58788519 59856575 61000095
8150 61000095 62251108 63578841 64957816 66374140 67804824 69257313 70804946 72520470
$$ packed form
8212B2265067L19619K93392K38944K30715K90692L63909L87663L50255K84634
8203B5024890K43580K75458L72879M46260M11210L10885K79760L64120M58393
8194B8187435M61957M18237M28648M94657N36767N32899N39488N80663O05535
8185C2786286N75896N27896N11731N16569M98922M64276M72826N50779O29905
8176C7535086O20580N43732N29116O43861P82029Q01337P26408P05527P79836
8167D3667512Q32256P96151P71989Q56395R76244J006112R63219R60789J027005
8158E1857672J096715J143661J193282J223686J180295J093208J068056J143520
8150F1000095J251013J327733J378975J416324J430684J452489J547633J715524
$$ plain form
8142 72520470 74389499 76346053 78379513 80545904 82875474 85327999 87855677 90469011
8134 90469011 93219345 96142328 99242792 102527431 106026741 109762285 113697507 117766894
8126 117766894 121990921 126525661 131534608 137030636 142919854 149181924 155889628 163027931
8118 163027931 170427581 177956521 185660550 193584294 201511147 209011377 215735068 221561698
8110 221561698 226486062 230477100 233464914 235366008 236084135 235562498 233887894 231311698
8102 231311698 228139105 224609236 220872523 217039437 213231867 209596743 206260648 203261047
8094 203261047 200549619 198081275 195865230 193915792 192217622 190778135 189647049 188836920
8086 188836920 188306232 188087161 188332125 189130809 190374483 191936163 193902621 196461588 199620965
$$ packed form
8142G2520470J869029J956554K033460K166391K329570K452525K527678K613334
8134I0469011K750334K922983L100464L284639L499310L735544L935222M069387
8126A17766894M224027M534740N008947N496028N889218O262070O707704P138303
8118A63027931P399650P528940P704029P923744P926853P500230O723691N826630
8110B21561698M924364L991038K987814J901094P18127n21637j674604k576196
8102B31311698l172593l529869l736713l833086l807570l635124l336095k999601
8094B03261047k711428k468344k216045j949438j698170j439487j131086q10129
8086A88836920n30688k19071K44964P98684J243674J561680J966458K558967L159377
$$ plain form
8077 199620965 203233449 207265111 211824223 216929014 222492489 228595187 235537645 243514517
8069 243514517 252432382 262151328 272685041 284010277 295900727 308169058 320880527
8062 320880527 334023317 347052646 359067889 369454810 378119990 385096087 390196665
8055 390196665 393150566 393833820 392205210 388180255 381783640 373397993 363718420 353422978
8047 353422978 342908508 332307503 321703150 311316316 301465724 292308693 283662081
8040 283662081 275189843 266785534 258665628 251057165 243928827 237124185 230649139 224677504
8032 224677504 219310514 214477563 210091997 206182293 202809753 199936270 197450147 195289375
8024 195289375 193476291 192047367 191013183 190394571 190238050 190563973 191345794 192588344 194389005
$$ packed form
8077A99620965L612484M031662M559112N104791N563475O102698O942458P976872
8069B43514517Q917865R718946J0533713J1325236J1890450J2268331J2711469
8062C20880527J3142790J3029329J2015243J0386921Q665180O976097N100578
8055C90196665K953901O83254j628610m024955o396615q385647r679573j0295442
8047C53422978j0514470j0601005j0604353j0386834r850592r157031q646612
8040B83662081q472238q404309q119906p608463p128338o804642o475046n971635
8032B24677504n366990m832951m385566l909704l372540k873483k486123k160772
8024A95289375j813084j428924j034184o18612j56521L25923P81821J242550J800661
$$ plain form
8015 194389005 196844251 199894913 203339674 207030356 210988780 215279008 219802471 224266115
8007 224266115 228324004 231712237 234286249 235993917 236813373 236682696 235494800 233175113
7999 233175113 229740538 225280897 219947832 213990799 207718494 201347612 194941403 188557576
7991 188557576 182371496 176540831 171008980 165583225 160191057 154932948 149893190 145039483
7983 145039483 140330230 135793689 131463928 127345846 123475070 119904839 116598245 113438667
7975 113438667 110382345 107492541 104787911 102181190 99623188 97184117 94920030 92773856
7967 92773856 90688580 88705482 86859928 85089410 83345972 81694384 80187716 78748954
7959 78748954 77300122 75906319 74645615 73429298 72122982 70776106 69541967 68412461
$$ packed form
8015A94389005K455246L050662L444761L690682L958424M290228M523463M463644
8007B24266115M057889L388233K574012J707668Q19456j30677j187896k319687
7999B33175113l434575m459641n333065n957033o272305o370882o406209o383827
7991A88557576o186080n830665n531851n425755n392168n258109n039758m853707
7983A45039483m709253m536541m329761m118082l870776l570231l306594l159578
7975A13438667l056322k889804k704630k606721k558002k439071k264087k146174
7967I2773856k085276j983098j845554j770518j743438j651588j506668j438762
7959G8748954j448832j393803j260704j216317j306316j346876j234139j129506
$$ plain form
7951 68412461 67235222 65987599 64825250 63818391 62829109 61728311 60580792 59519825
7943 59519825 58554201 57596948 56605476 55611350 54666113 53809497 53036433 52267238 51422498
7934 51422498 50547874 49769365 49094151 48370717 47506288 46610624 45836269 45171462 44495993
7925 44495993 43769289 43049683 42373165 41721843 41089401 40485677 39892102 39290523 38716027
7916 38716027 38204224 37706884 37142582 36519850 35928466 35412039 34928434 34437991 33948340
7907 33948340 33457087 32931974 32382506 31884124 31484353 31130330 30734509 30281312 29828867
7898 29828867 29428356 29079280 28748816 28400134 28009527 27586517 27173905 26802406 26451268
7889 26451268 26085556 25728826 25450371 25258196 25051586 24730705 24327332 23963641 23689829
$$ packed form
7951F8412461j177239j247623j162349j006859r89282j100798j147519j060967
7943E9519825r65624r57253r91472r94126r45237q56616p73064p69195q44740
7934E1422498q74624p78509o75214p23434q64429q95664p74355o64807o75469
7925D4495993p26704p19606o76518o51322o32442o03724n93575o01579n74496
7916C8716027n11803m97340n64302o22732n91384n16427m83605m90443m89651
7907C3948340m91253n25113n49468m98382l99771l54023l95821m53197m52445
7898B9828867m00511l49076l30464l48682l90607m23010m12612l71499l51138
7889B6451268l65712l56730k78455j92175k06610l20881m03373l63691k73812
$$ plain form
7880 23689829 23437982 23150740 22869603 22645897 22439050 22180199 21885434 21621018 21393179
7871 21393179 21162489 20937879 20753234 20566339 20295921 19965628 19696017 19529749 19376221
7862 19376221 19163584 18931592 18724936 18510127 18267752 18060035 17921750 17777962 17561455
7853 17561455 17325372 17142454 16976897 16765221 16546022 16387297 16252692 16071297 15880403
7844 15880403 15753799 15636468 15413370 15118696 14906288 14809798 14702918 14524412 14373329 14322561
7834 14322561 14289465 14172829 13995800 13829403 13678125 13523269 13388689 13284523 13166069 13017390
7824 13017390 12892197 12806484 12687243 12507300 12368786 12347744 12346794 12229080 12031058 11903545
7814 11903545 11880200 11844213 11716208 11548950 11421445 11341210 11272820 11185364 11059937 10916341
$$ packed form
7880B3689829k51847k87242k81137k23706k06847k58851k94765k64416k27839
7871B1393179k30690k24610j84645j86895k70418l30293k69611j66268j53528
7862A9376221k12637k31992k06656k14809k42375k07717j38285j43788k16507
7853A7561455k36083j82918j65557k11676k19199j58725j34605j81395j90894
7844A5880403j26604j17331k23098k94674k12408r6490j06880j78506j51083n0768
7834A4322561l3096j16636j77029j66397j51278j54856j34580j04166j18454j48679
7824A3017390j25193q5713j19241j79943j38514k1042r50j17714j98022j27513
7814A1903545k3345l5987j28005j67258j27505q0235o8390q7456j25427j43596
$$ plain form
7804 10916341 10827423 10833261 10852427 10767250 10593462 10464342 10433442 10401180 10277682 10118805 10032416
7793 10032416 10021648 10000088 9921626 9820347 9735451 9657468 9558373 9442733 9353594 9327585 9342535
7782 9342535 9324015 9225943 9090786 8996409 8957979 8928294 8881164 8830459 8768904 8666824 8551039
7771 8551039 8503261 8537497 8552809 8467325 8337214 8270845 8274298 8265419 8208612 8143981 8093524 8030801
7759 8030801 7955073 7910605 7903772 7875769 7799373 7736706 7742779 7763507 7705465 7581743 7504606 7524767
7747 7524767 7553826 7486227 7346247 7254472 7267547 7312934 7295111 7217049 7159352 7163624 7183353
7736 7183353 7154399 7075314 6994935 6944640 6915752 6896353 6893287 6904281 6896090 6838194 6749291 6683986
7724 6683986 6670035 6677707 6658205 6598060 6527230 6484685 6484594 6507360 6515844 6488059 6439350 6403026
$$ packed form
7804A0916341q8918N838J9166q5177j73788j29120l0900l2262j23498j58877q6389
7793A0032416j0768k1560p8462j01279q4896p7983r9095j15640q9139k6009J4950
7782I342535j8520r8072j35157r4377l8430k9685m7130n0705o1555j02080j15785
7771H551039m7778L4236J5312q5484j30111o6369L453q879n6807o4631n0457o2723
7759H030801p5728m4468o833k8003p6396o2667O073K0728n8042j23722p7137K0161
7747G524767K9059o7599j39980r1775J3075M5387j7823p8062n7697M272J9729
7736G183353k8954p9085q0379n0295k8888j9399l066J0994q191n7896q8903o5305
7724F683986j3951P672j9502o0145p0830m2545r1K2766Q484k7785m8709l6324
$$ plain form
7712 6403026 6386130 6361439 6311263 6257193 6228299 6218505 6199448 6162035 6120244 6085486 6062926 6060340
7700 6060340 6070793 6059377 6002711 5931193 5891535 5875845 5836522 5770437 5733346 5758020 5807740
7689 5807740 5829679 5811489 5768009 5714800 5672993 5660139 5661460 5648293 5626465 5615375 5588614 5515616
7677 5515616 5459309 5518044 5643928 5655490 5501017 5369436 5423112 5547399 5527268 5377614
7667 5377614 5300977 5363699 5425032 5392775 5345683 5354656 5365541 5336064 5330340 5383355 5408427 5345631
7655 5345631 5285668 5330017 5421871 5436348 5367530 5308400 5297426 5296918 5289657 5298626 5331597 5380593
7643 5380593 5448239 5514798 5526034 5478467 5458603 5522814 5602348 5615085 5602787 5647548 5711788
7632 5711788 5691371 5590883 5512068 5487815 5462232 5428637 5446206 5501437 5486869 5360371 5217697
$$ packed form
7712F403026j6896k4691n0176n4070k8894r794j9057l7413m1791l4758k2560k586
7700F060340J0453j1416n6666p1518l9658j5690l9323o6085l7091K4674M9720
7689E807740K1939j8190m3480n3209m1807j2854J321j3167k1828j1090k6761p2998
7677E515616n6307N8735J25884J1562j54473j31581N3676J24287k0131j49654
7667E377614p6637O2722O1333l2257m7092Q973J0885k9477n724N3015K5072o2796
7655E345631n9963M4349R1854J4477o8818n9130j0974n08p261Q969L2971M8996
7643E380593O7646O6559J1236m7567j9864O4211P9534J2737j2298M4761O4240
7632E711788k0417j00488p8815k4253k5583l3595J7569N5231j4568j26498j42674
$$ plain form
7621 5217697 5161028 5182959 5216777 5219736 5175965 5096303 5041116 5065287 5123123 5112876 5028329 4967579
7609 4967579 4975250 4989976 4977465 4989479 5039761 5049158 4987203 4948557 5001464 5073796 5089552 5106001
7597 5106001 5192475 5276131 5258246 5204395 5248829 5358526 5377787 5299764 5303951 5478506 5671238
7586 5671238 5704373 5615761 5580204 5666325 5778803 5810934 5762896 5702153 5665769 5630785 5567276
7575 5567276 5496988 5473026 5492812 5470831 5342925 5172652 5090355 5128696 5181535 5138212 5001643
7564 5001643 4853755 4757711 4725019 4736288 4756112 4749577 4710868 4662891 4621609 4585121 4560238
7553 4560238 4560715 4566599 4529290 4443600 4376629 4387777 4446217 4469166 4428732 4378539 4372724 4397196
7541 4397196 4402130 4380689 4381868 4439108 4513904 4539130 4508952 4487489 4519342 4571668 4591066 4581846
$$ packed form
7621E217697n6669K1931L3818K959m3771p9662n5187K4171N7836j0247q4547o0750
7609D967579P671J4726j2511J2014N0282R397o1955l8646N2907P2332J5756J6449
7597E106001Q6474Q3656j7885n3851M4434J09697J9261p8023M187J74555J92732
7586E671238L3135q8612l5557Q6121J12478L2131m8038o0743l6384l4984o3509
7575E567276p0288k3962J9786k1981j27906j70273q2297L8341N2839m3323j36569
7564E001643j47888r6044l2692J1269J9824o535l8709m7977m1282l6488k4883
7553D560238M77N884l7309q5690o6971J1148N8440K2949m0434n0193n815K4472
7541D397196M934k1441J179N7240P4796K5226l0178k1463L1853N2326J9398r220
$$ plain form
7529 4581846 4585497 4605649 4604376 4567375 4525771 4506969 4500987 4484485 4449647 4402822 4358532 4336847
7517 4336847 4343074 4349683 4320900 4253704 4175054 4107252 4059034 4037741 4040189 4041203 4020881 3993520
7505 3993520 3982835 3984124 3978472 3961639 3928775 3865384 3795309 3793058 3883900 3971325 3946454 3842327
7493 3842327 3787417 3823810 3874447 3885311 3886368 3896398 3881251 3840502 3831803 3869187 3894960 3891158
7481 3891158 3914720 3977000 4001435 3960750 3939579 3984942 4014020 3967713 3938414 4020582 4135915
7470 4135915 4151570 4092146 4078674 4118417 4122049 4090906 4112768 4183405 4205448 4177082 4213871 4347138
7458 4347138 4458909 4474790 4477910 4555069 4654110 4686744 4676856 4709720 4799510 4892340 4954834 4992345
7446 4992345 5018087 5056899 5142165 5267097 5376227 5434964 5465000 5491128 5508739 5524988 5569082
$$ packed form
7529D581846L651K0152j273l7001m1604j8802n982j6502l4838m6825m4290k1685
7517D336847O227O609k8783o7196p8650o7802m8218k1293K448J014k0322k7361
7505C993520j0685J289n652j6833l2864o3391p0075k251R0842Q7425k4871j04127
7493C842327n4910L6393N0637J0864J057J0030j5147m0749q699L7384K5773l802
7481C891158K3562O2280K4435m0685k1171M5363K9078m6307k9299Q2168J15333
7470D135915J5655n9424j3472L9743L632l1143K1862P0637K2043k8366L6789J33267
7458D347138J11771J5881L120P7159R9041L2634r888L2864Q9790R2830O2494L7511
7446D992345K5742L8812Q5266J24932J09130N8737L0036K6128J7611J6249M4094
$$ plain form
7435 5569082 5637492 5693078 5737208 5807647 5887373 5908092 5873495 5876190 5949191 6009910 6008740 6016997
7423 6016997 6089020 6152169 6133963 6093903 6115759 6165228 6178505 6199851 6289817 6379341 6373615 6333383
7411 6333383 6381671 6484582 6511615 6475405 6504141 6588546 6584028 6492515 6506719 6696826 6876291
7400 6876291 6898009 6880581 6983383 7134602 7181243 7177872 7299097 7532111 7680142 7661553 7607843
7389 7607843 7639250 7713383 7746951 7745281 7740974 7711960 7635934 7551131 7496311 7443636 7343765 7194937
7377 7194937 7029206 6874572 6763226 6725054 6729783 6682613 6530549 6341103 6222851 6190000
7367 6190000 6159155 6069518 5950962 5863823 5816350 5768336 5693819 5611466 5555339 5535297 5532474
7356 5532474 5520871 5482727 5413424 5330737 5275366 5276411 5310423 5320535 5286335 5245270 5229679 5220767
$$ packed form
7435E569082O8410N5586M4130P0439P9726K0719l4597K695P3001O0719j170Q257
7423F016997P2023O3149j8206m0060K1856M9469J3277K1346Q9966Q9524n726m0232
7411F333383M8288J02911K7033l6210K8736Q4405m518r1513J4204J90107J79465
7400F876291K1718j7428J02802J51219M6641l371J21225K33014J48031j8589n3710
7389G607843L1407P4133L3568j670m307k9014p6026q4803n4820n2675r9871j48828
7377G194937j65731j54634j11346l8172M729m7170j52064j89446j18252l2851
7367F190000l0845q9637j18556q7139m7473m8014p4517q2353n6127k0042k823
7356E532474j1603l8144o9303q2687n5371J045L4012J0112l4200m1065j5591q912
$$ plain form
7344 5220767 5195307 5178287 5198792 5222483 5191722 5119247 5071281 5056525 5009376 4905080 4813660
7333 4813660 4792313 4789135 4720331 4598980 4510199 4480045 4450242 4385906 4329793 4318770 4307717
7322 4307717 4227425 4085547 3957687 3888648 3848945 3794502 3729024 3684650 3664955 3638228 3584032
7311 3584032 3521739 3484003 3475050 3465551 3424081 3348291 3268811 3224052 3224262 3238171 3222100 3162014
7299 3162014 3077639 2991771 2918415 2877814 2883598 2900822 2862284 2760572 2680234 2685863 2718424 2680649
7287 2680649 2600068 2600822 2702202 2763077 2685166 2567328 2559518 2637760 2649758 2549827 2451470 2436546
7275 2436546 2443627 2397651 2341028 2351416 2401632 2397984 2323179 2251269 2230235 2229172 2210881 2190554
7263 2190554 2199364 2237006 2284280 2326809 2344149 2308224 2221548 2136487 2107572 2132485 2160013 2150394
$$ packed form
7344E220767k5460j7020K0505K3691l0761p2475m7966j4756m7149j04296r1420
7333D813660k1347l178o8804j21351q8781l0154k9803o4336n6113j1023j1053
7322D307717q0292j41878j27860o9039l9703n4443o5478m4374j9695k6727n4196
7311C584032o2293l7736q953r499m1470p5790p9480m4759K10J3909j6071o0086
7299C162014q4375q5868p3356m0601N784J7224l8538j01712q0338N629L2561l7775
7287B680649q0581P54J01380O0875p7911j17838p810P8242J1998r9931r8357j4924
7275B436546P081m5976n6623J0388N0216l648p4805p1910k1034j063j8291k0327
7263B190554Q810L7642M7274M2529J7340l5925q6676q5061k8915K4913K7528r619
$$ plain form
7251 2150394 2110980 2075263 2061696 2057352 2038051 2002553 1980768 1996494 2024160 2005551 1924386 1845371
7239 1845371 1847839 1920931 1960673 1895156 1787135 1767046 1865495 1966931 1958653 1874468 1829837
7228 1829837 1849309 1849639 1795378 1764847 1813390 1866561 1835091 1765365 1765730 1825459 1832029 1757414
7216 1757414 1697436 1707526 1726668 1708209 1703821 1747347 1765279 1696046 1609942 1606451 1661345 1681402
7204 1681402 1652443 1625048 1607105 1584524 1596395 1663600 1694541 1609794 1516031 1576875 1731477
7193 1731477 1750059 1589480 1467756 1515221 1581567 1516600 1426929 1467857 1556503 1520879 1412198
7182 1412198 1418599 1534612 1570541 1477158 1418647 1490993 1584662 1588514 1542907 1515786 1491635 1464405
7170 1464405 1490893 1564621 1573389 1473826 1382907 1403480 1477932 1507793 1497696 1481161 1428989 1346675
$$ packed form
7251B150394l9414l5717j3567m344j9301l5498k1785J5726K7666j8609q1165p9015
7239A845371K468P3092L9742o5517j08021k0089R8449J01436q278q4185m4631
7228A829837J9472L30n4261l0531M8543N3171l1470o9726L65N9729O570p4615
7216A757414n9978J0090J9142j8459m388M3526J7932o9233q6104l491N4894K0057
7204A681402k8959k7395j7943k2581J1871O7205L0941q4747r3763O0844J54602
7193A731477J8582j60579j21724M7465O6346o4967q9671M0928Q8646l5624j08681
7182A412198O401J16013L5929r3383n8511P2346R3669L852m5607k7121k4151k7230
7170A464405K6488P3728Q768r9563r0919K0573P4452K9861j0097j6535n2172q2314
$$ plain form
7158 1346675 1337857 1436970 1499656 1413309 1299734 1326543 1423475 1406293 1305281 1313091 1431013
7147 1431013 1444762 1294009 1195550 1292058 1417733 1372957 1239922 1228070 1337705 1390514 1328109
7136 1328109 1276649 1321668 1387755 1375060 1296548 1236863 1247959 1313553 1371063 1363411 1304806 1276792
7124 1276792 1319025 1362305 1330276 1265325 1267777 1335894 1365490 1308657 1237233 1226836 1260012 1279554
7112 1279554 1273295 1264443 1262005 1258059 1247600 1228532 1203157 1188213 1199095 1223605 1238898 1246477
7100 1246477 1255226 1245351 1200681 1165089 1199891 1282073 1316540 1267698 1208731 1209122 1238875 1229943
7088 1229943 1180766 1147001 1160413 1201570 1232430 1226882 1191150 1169921 1198524 1239140 1217242 1138736
7076 1138736 1100399 1145928 1190223 1153563 1099591 1143041 1263621 1320995 1246588 1123042 1061706
$$ packed form
7158A346675q818R9113O2686q6347j13575K6809R6932j7182j01012P810J17922
7147A431013J3749j50753r8459R6508J25675m4776j33035j1852J09635N2809o2405
7136A328109n1460M5019O6087j2695p8512n9685J1096O5594N7510p652n8605k8014
7124A276792M2233M3280l2029o4951K452O8117K9596n6833p1424j0397L3176J9542
7112A279554o259q852k438l946j0459j9068k5375j4944J0882K4510J5293P579
7100A246477Q749r875m4670l5592L4802Q2182L4467m8842n8967L91K9753q932
7088A229943m9177l3765J3412M1157L0860n548l5732k1229K8603M0616k1898p8506
7076A138736l8337M5529M4295l6660n3972M3450J20580N7374p4407j23546o1336
$$ plain form
7065 1061706 1082232 1132717 1162183 1151137 1120666 1121645 1169992 1201186 1150584 1066602 1060937 1145173
7053 1145173 1211916 1195866 1151912 1137853 1126483 1093986 1092702 1151133 1190070 1140546 1073612 1097296
7041 1097296 1178683 1195940 1134732 1097778 1126129 1145714 1109175 1065081 1051251 1035461 1009919
7030 1009919 1035005 1125556 1191000 1163648 1102971 1091714 1103907 1068506 1003686 986667 1027884
7019 1027884 1070148 1087667 1098691 1100306 1075321 1049284 1060874 1088988 1086439 1069238 1090106 1139142
7007 1139142 1159553 1148824 1148538 1144948 1088854 1012809 1007726 1070004 1100469 1080241 1103106 1182643
6995 1182643 1184086 1041094 895802 897275 983359 1010041 990684 1029582 1094123 1056019 932634
6984 932634 886052 966829 1043329 1025779 987739 1001908 1015815 978505 950786 984427 1009123 955061
$$ packed form
7065A061706K0526N0485K9466j1046l0471R79M8347L1194n0602q3982n665Q4236
7053A145173O6743j6050m3954j4059j1370l2497j284N8431L8937m9524o6934K3684
7041A097296Q1387J7257o1208l6954K8351J9585l6539m4094j3830j5790k5542
7030A009919K5086R0551O5444k7352o0677j1257J2193l5401o4820j7019M1217
7019A027884M2264J7519J1024J615k4985k6037J1590K8114k549j7201K0868M9036
7007A139142K0411j0729k86l590n6094p6045n083O2278L0465k0228K2865P9537
6995A182643J443j42992j45292J473Q6084K6682j9357L8898O4541l8104j23385
6984I32634m6582Q0777P6500j7550l8040J4169J3907l7310k7719L3641K4696n4062
$$ plain form
6972 955061 891383 919280 1001753 1026194 983186 957831 976664 984184 958207 940424 952897 973863
6960 973863 993163 1010966 993615 917649 846078 865582 951625 995367 968057 951073 985411 1006402
6948 1006402 970750 940458 974694 1027018 1026464 989994 974363 973917 950905 924291 941116 985236
6936 985236 996590 966787 940069 929623 909170 884660 894195 925345 912453 845869 811111 870280
6924 870280 961121 977646 917401 878567 919371 988634 1012275 990713 971735 966151 945203 908047
6912 908047 892715 907867 906426 859495 815994 841843 922686 976958 956440 888738 827946 810955
6900 810955 854367 936128 981344 934722 856605 869322 983283 1062363 1009465 900092 859166
6889 859166 884288 889517 863224 863365 890313 891241 880373 925111 1002086 1000088 901920 832890 867240
$$ packed form
6972I55061o3678K7897Q2473K4441m3008k5355J8833P520k5977j7783J2473K0966
6960I73863J9300J7803j7351p5966p1571J9504Q6043M3742k7310j6984L4338K0991
6948A006402l5652l0292L4236N2324n54l6470j5631m46k3012k6614J6825M4120
6936I85236J1354k9803k6718j0446k0453k4510R535L1150j2892o6584l4758N9169
6924H70280R0841J6525o0245l8834M0804O9263K3641k1562j8978n584k0948l7156
6912I08047j5332J5152j441m6931m3501K5849Q0843N4272k0518o7702o0792j6991
6900H10955M3412Q1761M5216m6622p8117J2717J13961P9080n2898j09373m0926
6889H59166K5122N229k6293J41K6948R28j0868M4738P6975j998r8168o9030L4350
$$ plain form
6876 867240 909767 858747 777977 789361 872347 902598 848726 801179 817769 856573 868218 855582
6864 855582 830701 799657 797681 851629 902773 866135 779980 782927 906026 1004835 962553 851291
6852 851291 802830 816106 806865 773034 775813 800326 778277 735812 773753 883805 925577 834734
6840 834734 726782 721364 775308 785704 764551 788503 836734 818365 743524 731722 829054 933047
6828 933047 943992 894895 869783 870754 844803 792780 767584 783985 802813 799603 787690 773838
6816 773838 750108 735637 765920 822930 834939 777057 717934 722830 760122 765429 757274 802049
6804 802049 878258 879223 777698 689761 712813 782499 782561 735296 758786 857219 896335 817319
6792 817319 739767 777071 862203 864728 796692 769642 797880 794279 749989 760503 839239 854225
$$ packed form
6876H67240M2527n1020q0770J1384Q2986L0251n3872m7547J6590L8804J1645j2636
6864H55582k4881l1044j976N3948N1144l6638q6155K947J23099R8809m2282j11262
6852H51291m8461J3276r241l3831K779K4513k2049m2465L7941J10052M1772r0843
6840H34734j07952n418N3944J0396k1153K3952M8231j8369p4841j1802R7332J03993
6828I33047J0945m9097k5112R71k5951n2023k5196J6401J8828l210j1913j3852
6816G73838k3730j4471L0283N7010J2009n7882n9123M896L7292N307q155M4775
6804H02049P6209R65j01525q7937K3052O9686O2m7265K3490R8433L9116p9016
6792H17319p7552L7304Q5132K525o8036k7050K8238l601m4290J0514P8736J4986
$$ plain form
6780 854225 728772 586159 589508 719870 824849 831453 794918 767988 740529 708704 700508
6769 700508 713695 710528 693524 712287 772941 810976 783600 729489 706724 723050 753337 776099
6757 776099 770077 726986 687925 707690 761653 761253 695096 667582 736981 803075 751446 641761
6745 641761 628710 725927 781977 703936 584452 560258 636600 712394 714955 650434 569155 538579
6733 538579 612065 763282 874672 850217 732117 655283 686475 755260 755401 674491 596227
6722 596227 593711 651367 697510 694359 673419 680953 715290 740511 743477 740470 733111 702189 655232
6709 655232 636362 665947 708002 726442 737849 770204 800923 786373 734788 696237 687124 678479
6697 678479 659615 655334 666357 651685 600584 569501 602226 655483 661993 638573 659163 726187
$$ packed form
6780H54225j25453j42613L349J30362J04979O604l6535k6930k7459l1825q196
6769G00508J3187l167j7004J8763O0654L8035k7376n4111k2765J6326L0287K2762
6757G76099o022m3091l9061J9765N3963m00o6157k7514O9399O6094n1629j09685
6745F41761j3051R7217N6050p8041j19484k4194P6342P5794K561o4521q1279l0576
6733E38579P3486J51217J11390k4455j18100p6834L1192O8785J41q0910p8264
6722E96227k516N7656M6143l151k0940P534L4337K5221K966l007p359l0922m6957
6709F55232j8870K9585M2055J8440J1407L2355L0719j4550n1585l8551r113q645
6697F78479j8864m281J1023j4672n1101l1083L2725N3257O510k3420K0590O7024
$$ plain form
6685 726187 748717 675986 584154 576628 643318 685724 660147 622780 629001 659168 673108 679719
6673 679719 706531 740403 749513 736125 714858 663787 563994 476089 496258 618751 718335 708716
6661 708716 652184 655848 715369 738993 693258 635760 608553 588318 564037 581708 661656 731495
6649 731495 709381 624973 589883 651527 735257 746929 687146 632751 629981 644249 619781 563566
6637 563566 545508 610693 711002 751124 703864 647249 664951 736688 767609 715086 635564
6626 635564 595503 587637 569779 546196 556039 597030 619045 599615 574049 572486 575759 565857 575786
6613 575786 636950 702796 688646 589150 499696 502825 577930 648254 677542 683392 683516 676421 668353
6600 668353 674946 685752 661780 592116 533084 556731 655329 727573 688548 579758 525835 574174
$$ packed form
6685G26187K2530p2731r1832p526O6690M2406k5577l7367O221L0167J3940O611
6673F79719K6812L3872R110j3388k1267n1071r9793q7905K0169J22493R9584r619
6661G08716n6532L664N9521K3624m5735n7498k7207k0235k4281J7671P9948O9839
6649G31495k2114q4408l5090O1644Q3730J1672n9783n4395k770J4268k4468n6215
6637E63566j8058O5185J00309M0122m7260n6615J7702P1737L0921n2523p9522
6626F35564m0061p866j7858k3583R843M0991K2015j9430k5566j563L273r902R929
6613E75786O1164O5846j4150r9496q9454L129P5105P0324K9288N850J24p095q068
6600F68353O593J0806k3972o9664n9032K3647R8598P2244l9025j08790n3923M8339
$$ plain form
6588 574174 633009 607895 544358 555108 635776 663306 591230 529844 574532 659050 672454 638037
6576 638037 653135 703946 683950 585199 527031 570101 634064 646453 648416 682616 691406 624508
6564 624508 556675 583854 665766 689266 643271 609331 607173 579553 526410 522888 580489 610986
6552 610986 571730 538508 575603 630785 633565 614365 636571 674661 661199 613664 607290 638719
6540 638719 626872 562233 550553 659003 796166 816460 706030 594482 589023 658135 699173
6529 699173 676199 645394 655062 674123 650972 610242 632989 736974 833648 836259 768616 720541
6517 720541 723428 727651 696829 665781 685540 748319 791932 764413 675857 597927 605457 695550
6505 695550 773258 750387 651852 581961 588000 613586 600266 570818 572694 593912 593895 581367 594077
$$ packed form
6588E74174N8835k5114o3537J0750Q0668K7530p2076o1386M4688Q4518J3404l4417
6576F38037J5098N0811j9996r8751n8168M3070O3963J2389J963L4200Q790o6898
6564F24508o7833K7179Q1912K3500m5995l3940k158k7620n3143l522N7601L0497
6552F10986l9256l3222L7095N5182K780j9200K2206L8090j3462m7535o374L1429
6540F38719j1847o4639j1680J08450J37163K0294j10430j11548n459O9112M1038
6529F99173k2974l0805R668J9061k3151m0730K2747J03985R6674K611o7643m8075
6517G20541K887M223l0822l1048J9759O2779M3613k7519q8556p7930P530R0093
6505F95550P7708k2871r8535o9891O039K5586j3320k9448J876K1218j7j2528J2710
$$ plain form
6492 594077 618562 600320 536084 490571 503644 538070 548966 555281 597695 658830 679448 644907
6480 644907 606961 611933 645940 670055 679593 696275 714699 697240 635122 582052 593294 645011
6468 645011 657104 602934 551926 575277 645330 674145 633720 585426 588707 629282 654722 644701
6456 644701 623592 625239 659323 694454 672717 571066 451260 407390 451709 499531 489948 468535
6444 468535 508253 594160 645601 627149 579102 550446 553399 577657 605277 617936 624270 659570
6432 659570 719511 732060 658114 581049 604843 686834 686815 586105 528165 599128 692846 672934
6420 672934 567127 501660 519112 568021 615875 659658 662196 592804 513299 515625 581931 611296
6408 611296 582412 576759 625166 647315 588046 516879 530974 626265 719039 744735 695724 610774
$$ packed form
6492E94077K4485j8242o4236m5513J3073L4426J0896O315M2414O1135K0618l4541
6480F44907l7946M972L4007K4115R538J6682J8424j7459o2118n3070J1242N1717
6468F45011J2093n4170n1008K3351P0053K8815m0425m8294L281M0575K5440j0021
6456F44701k1109J647L4084L5131k1737j01651j19806m3870M4319M7822r583k1413
6444D68535L9718Q5907N1441j8452m8047k8656K953K4258K7620J2659O334L5300
6432F59570N9941J2549p3946p7065K3794Q1991j9j00710n7940P0963R3718j9912
6420F72934j05807o5467J7452M8909M7854M3783K538o9392p9505K326O6306K9365
6408F11296k8884n653M8407K2149n9269p1167J4095R5291R2774K5696m9011q4950
$$ plain form
6396 610774 558724 581046 627040 607281 530820 507537 580875 654995 648368 621558 661037 719551
6384 719551 690737 589934 532835 555751 581041 563621 554430 591416 628013 614353 574354 557377
6372 557377 570866 598749 634400 658228 631502 555672 499178 519300 583643 615319 601812 608851
6360 608851 674622 731235 677971 532742 451895 544087 701097 711872 550204 425210 486369
6349 486369 608863 595631 484776 472755 585729 643966 567505 499156 547458 606813 561542
6338 561542 502612 570827 699962 705914 571224 459059 466603 531698 586275 643476 700667
6327 700667 695392 614726 544618 554177 609978 647900 653536 630999 569995 494974 479879 557207
6315 557207 661986 713919 709696 691152 670391 637626 605740 595512 599116 595841 582392 561889
$$ packed form
6396F10774n2050K2322M5994j9759p6461k3283P3338P4120o627k6810L9479N8514
6384G19551k8814j00803n7099K2916K5290j7420r191L6986L6597j3660l9999j6977
6372E57377J3489K7883L5651K3828k6726p5830n6494K0122O4343L1676j3507P039
6360F08851O5771N6613n3264j45229q0847R2192J57010J0775j61668j24994O1159
6349D86369J22494j3232j10855j2021J12974N8237p6461o8349M8302N9355m5271
6338E61542n8930O8215J29135N952j34690j12165P544O5095N4577N7201N7191
6327G00667n275q0666p0108R559N5801L7922N636k2537o1004p5021j5095P7328
6315E57207J04779N1933m223j8544k0761l2765l1886j0228L604l275j3449k0503
$$ plain form
6303 561889 533696 518221 551410 623713 668224 648943 617916 636877 682568 689325 655171 636872
6291 636872 653044 661987 640480 620993 628857 632987 595214 540590 537679 608178 684171 676457 581918
6278 581918 498386 516339 616436 704999 733006 730443 728622 714965 684762 672097 688908 689394
6266 689394 646002 610960 639037 689581 681121 620324 595719 645677 708660 719325 689936 670486
6254 670486 676160 684433 675024 649789 627584 626192 637805 632454 604067 590882 618891 652176 645315
6241 645315 619401 626742 660110 668244 651051 658904 695340 706763 684766 689109 737701 763651
6229 763651 730821 706656 751494 808143 787470 713946 693750 761489 842800 864283 831053 790900
6217 790900 776598 792648 821455 837009 832356 822803 810202 778523 744874 761501 827348 858697
$$ packed form
6303E61889k8193j5475L3189P2303M4511j9281l1027J8961M5691O757l4154j8299
6291F36872J6172Q943k1507j9487P864M130l7773n4624k911P0499P5993p714r4539
6278E81918q3532J7953J00097Q8563K8007k563j821j3657l0203j2665J6811M86
6266F89394m3392l5042K8077N0544q460o0797k4605M9958O2983J0665k9389j9450
6254F70486N674Q273r409k5235k2205j392J1613n351k8387j3185K8009L3285o861
6241F45315k5914P341L3368Q134j7193P853L6436J1423k1997M343M8592K5950
6229G63651l2830k4165M4838N6649k0673p3524k0196O7739Q1311K1483l3230m0153
6217G90900j4302J6050K8807J5554m653r553j2601l1679l3649J6627O5847L1349
$$ plain form
6205 858697 810648 768677 832781 956408 1004888 948729 886812 882885 894367 880945 875423 910282
6193 910282 963896 1016783 1079850 1134128 1127223 1066868 1033149 1058185 1082333 1071966 1078691 1123039
6181 1123039 1130047 1066439 1036819 1131712 1268793 1314074 1287882 1304079 1357836 1340262 1248045
6170 1248045 1211311 1292234 1404053 1466954 1507689 1553358 1555238 1491992 1445283 1492374 1599052
6159 1599052 1684367 1721939 1723164 1696917 1682362 1741425 1857954 1927339 1911014 1908019 1992278 2078851
6147 2078851 2062603 2001877 2028829 2140206 2223608 2250603 2290071 2348719 2358515 2331730 2371829
6136 2371829 2494394 2581606 2569300 2547376 2603996 2690026 2726412 2744554 2816451 2920125 2982049
6125 2982049 3006255 3061488 3165574 3267602 3332879 3379005 3436076 3519864 3629737 3735312 3791370
$$ packed form
6205H58697m8049m1971O4104J23627M8480n6159o1917l927J1482j3422n522L4859
6193I10282N3614N2887O3067N4278o905o0355l3719K5036K4148j0367O725M4348
6181A123039P008o3608k9620R4893J37081M5281k6192J6197N3757j7574r2217
6170A248045l6734Q0923J11819O2901M0735M5669J880o3246m6709M7091J06678
6159A599052Q5315L7572J225k6247j4555N9063J16529O9385j6325k995Q4259Q6573
6147B078851j6248o0726K6952J11377Q3402K6995L9468N8648R796k6785M0099
6136B371829J22565Q7212j2306k1924N6620Q6030L6386J8142P1897J03674O1924
6125B982049K4206N5233J04086J02028O5277M6126N7071Q3788J09873J05575N6058
$$ plain form
6114 3791370 3802477 3837920 3944481 4086914 4217026 4349532 4513710 4682294 4817182 4941025
6104 4941025 5090707 5242402 5362573 5493136 5695302 5939626 6148239 6324752 6542175 6815471
6094 6815471 7090568 7356422 7661659 8014185 8371401 8744015 9200715 9746658 10306499 10857883
6084 10857883 11467792 12155828 12842243 13490650 14178207 14937960 15645249 16170563 16552184
6075 16552184 16895924 17182157 17310439 17280327 17176818 16998962 16654465 16137522 15578209 15078831
6065 15078831 14608685 14100708 13557207 13013639 12479920 11968126 11510302 11101363 10686783
6056 10686783 10252290 9860887 9545933 9231352 8832570 8391244 8025024 7766255 7536788
6047 7536788 7280251 7030355 6821333 6610831 6351112 6085182 5894655 5769256 5608792 5369939
$$ packed form
6114C791370J1107L5443J06561J42433J30112J32506J64178J68584J34888J23843
6104D941025J49682J51695J20171J30563K02166K44324K08613J76513K17423K73296
6094F815471K75097K65854L05237L52526L57216L72614M56700N45943N59841N51384
6084A0857883O09909O88036O86415O48407O87557P59753P07289N25314L81621
6075A6552184L43740K86233J28282l0112j03509j77856l44497n16943n59313m99378
6065A5078831m70146n07977n43501n43568n33719n11794m57824m08939m14580
6056A0686783m34493l91403l14954l14581l98782m41326l66220k58769k29467
6047G536788k56537k49896k09022k10502k59719k65930j90527j25399j60464k38853
$$ plain form
6037 5369939 5136737 5001230 4932808 4831860 4674246 4521727 4405491 4288913 4154695 4041363
6027 4041363 3964870 3884024 3781862 3703109 3662628 3596404 3467639 3345277 3296829 3272119 3188794
6016 3188794 3075104 3018935 3017912 2996314 2941848 2904043 2872638 2785080 2657374 2582664 2583499 2583120
6004 2583120 2543642 2513499 2509118 2470904 2378745 2297075 2259541 2220698 2167268 2156486 2188797 2169960
5992 2169960 2070550 1995710 2013074 2040333 2000975 1958385 1976064 1976880 1886945 1797017 1810602 1840338
5980 1840338 1751927 1622207 1629501 1740970 1752855 1631908 1567109 1643391 1703151 1616521 1479365
5969 1479365 1429734 1444526 1444820 1451259 1495591 1502582 1408080 1301734 1307928 1392806 1425681 1381065
5957 1381065 1347676 1367417 1389036 1374578 1349675 1341708 1342244 1336075 1318434 1291717 1277258 1299623
$$ packed form
6037E369939k33202j35507o8422j00948j57614j52519j16236j16578j34218j13332
6027D041363p6493q0846j02162p8753m0481o6224j28765j22362m8448k4710q3325
6016C188794j13690n6169j023k1598n4466l7805l1405q7558j27706p4710Q35l79
6004B583120l9478l0143m381l8214r2159q1670l7534l8843n3430j0782L2311j8837
5992B169960r9410p4840J7364K7259l9358m2590J7679Q16q9935q9928J3585K9736
5980A840338q8411j29720P294J11469J1885j20947o4799P6282N9760q6630j37156
5969A479365m9631J4792K94O439M4332O991r4502j06346O194Q4878L2875m4616
5957A381065l3389J9741K1619j4458k4903p967N36o169j7641k6717j4459K2365
$$ plain form
5945 1299623 1329710 1296986 1199187 1133289 1160913 1214834 1211248 1180487 1193822 1226887 1205873 1141105
5933 1141105 1101389 1092037 1071400 1054982 1081618 1103177 1042996 952899 966565 1084384 1152983
5922 1152983 1096417 1022386 1032246 1059619 997646 885204 848921 917441 1000708 1024064 992098
5911 992098 935437 875402 841419 856856 894935 895238 839439 780693 783152 847845 909853 906924
5899 906924 847035 800595 819815 877273 898080 842156 740872 667924 686002 792547 898352
5888 898352 901694 814779 762110 806844 851296 791472 694903 698499 782787 807493 752227 739584
5876 739584 796902 788810 659721 560929 619833 736963 754349 697829 691454 732834 731236 700331
5864 700331 728601 791684 772495 663726 588071 605404 647830 664799 689332 729778 732761 696063
$$ packed form
5945A299623L0087l2724r7799o5898K7624N3921l586l0761J3335L3065k1014o4768
5933A141105l9716r352k0637j6418K6636K1559o0181r0097J3666J17819O8599
5922A152983n6566p4031R860K7373o1973j12442l6283O8520Q3267K3356l1966
5911I92098n6661o0035l3983J5437L8079L03n5799n8746K459O4693O2008k929
5899I06924n9889m6440J9220N7458K0807n5924j01284p2948J8078J06545J05805
5888H98352L342q6915n2669M4734M4452n9824r6569L596Q4288K4706n5266j2643
5876G39584N7318q092j29089r8792N8904J17130J7386n6520o375M1380j598l0905
5864G00331K8270O3083j9189j08769p5655J7333M2426J6969K4533M0446K983l6698
$$ plain form
5852 696063 691195 725651 707551 608104 538198 581633 655488 633887 535020 484806 540459 637931
5840 637931 689621 666891 600803 546785 535398 538004 509003 465517 470812 530371 574927 564334
5828 564334 531049 500751 460995 435766 482792 571937 585198 501970 456688 525470 593794 557841
5816 557841 515619 587399 669892 589323 418793 389467 511101 552178 434558 374346 519656
5805 519656 692360 664082 503064 439097 508080 551384 505529 476120 524141 562667 510697
5794 510697 417820 379798 416357 477546 512171 500211 460015 437045 454495 484448 499520 519006
5782 519006 553887 553348 484008 420408 456392 552532 583905 527283 477007 471963 446908 387940
5770 387940 389331 483883 549463 487908 390619 403813 507068 559024 515464 466882 476508 506860
$$ packed form
5852F96063m868L4456j8100r9447o9906M3435P3855k1601r8867n0214N5653R7472
5840F37931N1690k2730o6088n4018j1387K606k9001m3486N295N9559M4556j0593
5828E64334l3285l0298l9756k5229M7026Q9145J3261q3228m5282O8782O8324l5953
5816E57841m2222P1780Q2493q0569j70530k9326J21634M1077j17620o0212J45310
5805E19656J72704k8278j61018o3967O8983M3304m5855k9409M8021L8526n1970
5794E10697r2877l8022L6559O1189L4625j1960m0196k2970J7450K9953J5072J9486
5782E19006L4881n39o9340o3600L5984R6140L1373n6622n0276n044k5055n8968
5770C87940J391R4552O5580o1555r7289J3194J03255N1956m3560m8582R626L0352
$$ plain form
5758 506860 514439 508693 495727 454244 394462 366831 387723 419599 440106 463491 478311 440068
5746 440068 356519 310360 354638 440645 490181 489655 471689 451164 428139 418554 433367 449362
5734 449362 438749 408781 383700 371023 371614 394860 434787 458387 447315 425249 416307 405955
5722 405955 375196 344669 346813 374199 390221 377578 351443 340178 368522 434626 490668 482157
5710 482157 421900 380201 384120 385840 359937 358909 417946 474157 455888 398135 385939 424730
$$ packed form
5758E06860P579n746j2966m1483n9782k7631K0892L1876K0507K3385J4820l8243
5746D40068q3549m6159M4278Q6007M9536n26j7966k0525k3025r585J4813J5995
5734D49362j0613k9968k5081j2677N91K3246L9927K3600j1072k2066q942j0352
5722D05955l0759l0527K144K7386J6022j2643k6135j1265K8344O6104N6042q511
5710D82157o0257m1699L919J720k5903j028N9037N6211j8269n7753j2196L8791
$$ [...]
##END NTUPLES=NMR SPECTRUM
##END=
