##TITLE=1H ikalashn
CA-9293-1x
21.10.2024
##JCAMPDX= 6.0         $$ Bruker NMR JCAMP-DX V2.0
##DATA TYPE= NMR SPECTRUM
##DATA CLASS= NTUPLES
##ORIGIN= UXNMR, Bruker Analytische Messtechnik GmbH
##OWNER= root
$$ TOPSPIN		Version 1.3
$$ 2024-10-21 10:46:11.859 +0400  Irina@DPX200
$$ Compression mode = diff/dup
##.OBSERVE FREQUENCY= 200.13100065
##.OBSERVE NUCLEUS= ^1H
##.ACQUISITION MODE= SIMULTANEOUS
##.ACQUISITION SCHEME= undefined
##.AVERAGES= 16
##.DIGITISER RES= 18
##SPECTROMETER/DATA SYSTEM= spect
##.PULSE SEQUENCE= zg
##.SOLVENT NAME= CDCl3
##.SHIFT REFERENCE= INTERNAL, CDCl3, 1, 15.99637
##AUDIT TRAIL= $$ (NUMBER, WHEN, WHO, WHERE, WHAT)
$$ ##TITLE= Audit trail, TOPSPIN		Version 1.3
$$ ##JCAMPDX= 5.01
$$ ##ORIGIN= Bruker BioSpin GmbH
$$ ##OWNER= Irina
$$ $$ F:/spectra/data/iren/nmr/1H/4/pdata/1/auditp.txt
$$ ##AUDIT TRAIL=  $$ (NUMBER, WHEN, WHO, WHERE, VERSION, WHAT)
(   1,<2024-10-21 10:38:36.453 +0400>,<Irina>,<DPX200>,<TOPSPIN 1.3>,
      <created by zg
	started at 2024-10-21 10:37:28.515 +0400,
	POWCHK disabled, PULCHK disabled
       terminated by command 'halt'
       configuration hash MD5:
       BE 6D 3F 07 2A EA 11 49 91 17 2B D3 AF B3 58 0D
       data hash MD5: 16K
       BC 80 D2 64 92 89 EC 2E 2D FD F9 BA E7 47 9A 2E>)
(   2,<2024-10-21 10:38:39.078 +0400>,<Irina>,<DPX200>,<TOPSPIN 1.3>,
      <Start of raw data processing
       efp BC_mod = 2 LB = 0.02 FT_mod = 6 PKNL = 1 PHC0 = -38.88924 PHC1 = 3.950947 SI = 32K 
       data hash MD5: 32K
       B9 20 4C BF A0 EE EB B1 D6 46 05 F6 E2 21 27 69>)
(   3,<2024-10-21 10:46:02.843 +0400>,<Irina>,<DPX200>,<TOPSPIN 1.3>,
      <abs n ABSG = 5 
       data hash MD5: 32K
       58 30 D8 CC 7D 3B 64 31 EA C4 0B CA FC 95 92 56>)
$$ ##END=
$$ 
$$ $$ hash MD5
$$ $$ 40 A8 19 BC 9C 6A 3C 80 9A 70 50 69 98 2E 9F 4F
##$RELAX= 
##$RELAX= 
##$RELAX= 
##$RELAX= 
##$RELAX= 
##$RELAX= 
##$RELAX= 
##$RELAX= 
##$RELAX= 
$$ Bruker specific parameters
$$ --------------------------
##$DU= <F:/spectra>
##$EXPNO= 4
##$NAME= <1H>
##$PROCNO= 1
##$TYPE= <nmr>
##$USER= <iren>
##$AMP= (0..31)
100 100 100 100 100 100 100 100 100 100 100 100 100 100 100 100 100 100 
100 100 100 100 100 100 100 100 100 100 100 100 100 100 
##$ANAVPT= -1
##$AQSEQ= 0
##$AQ_mod= 1
##$AUNM= <au_zg>
##$AUTOPOS= <>
##$BF1= 200.13
##$BF2= 200.13
##$BF3= 200.13
##$BF4= 200.13
##$BF5= 200.13
##$BF6= 200.13
##$BF7= 200.13
##$BF8= 200.13
##$BYTORDA= 1
##$CFDGTYP= 0
##$CFRGTYP= 5
##$CHEMSTR= <none>
##$CNST= (0..63)
1 1 145 1 1 1 1 1 1 1 1 1 1 1 1 1 1 1 1 1 1 1 1 1 1 1 1 1 1 1 1 1 1 1 
1 1 1 1 1 1 1 1 1 1 1 1 1 1 1 1 1 1 1 1 1 1 1 1 1 1 1 1 1 1 
##$CPDPRG= <>
##$CPDPRG1= <>
##$CPDPRG2= <>
##$CPDPRG3= <>
##$CPDPRG4= <mlev>
##$CPDPRG5= <mlev>
##$CPDPRG6= <mlev>
##$CPDPRG7= <mlev>
##$CPDPRG8= <mlev>
##$CPDPRGB= <>
##$CPDPRGT= <>
##$D= (0..63)
0 2 0 0 0 0 0 0 0 0.06 0 0.03 0 0 0 0 0.0002 0 0 0 0 0 0 0 0 0 0 0 0 0 
0 0 0 0 0 0 0 0 0 0 0 0 0 0 0 0 0 0 0 0 0 0 0 0 0 0 0 0 0 0 0 0 0 0 
##$DATE= 1729492713
##$DBL= (0..7)
$$ [...]
##$SW_h= 4401.40845070422
##$TD= 16384
##$TD0= 1
##$TE= 300
##$TE2= 300
##$TE3= 300
##$TEG= 300
##$TL= (0..7)
0 120 120 120 120 120 120 120 
##$TP= (0..7)
150 150 150 150 150 150 150 150 
##$TP07= 0
##$TPNAME0= <>
##$TPNAME1= <>
##$TPNAME2= <>
##$TPNAME3= <>
##$TPNAME4= <>
##$TPNAME5= <>
##$TPNAME6= <>
##$TPNAME7= <>
##$TPOAL= (0..7)
0.5 0.5 0.5 0.5 0.5 0.5 0.5 0.5 
##$TPOFFS= (0..7)
0 0 0 0 0 0 0 0 
##$TUNHIN= 0
##$TUNHOUT= 0
##$TUNXOUT= 0
##$USERA1= <user>
##$USERA2= <user>
##$USERA3= <user>
##$USERA4= <user>
##$USERA5= <user>
##$V9= 5
##$VALIST= <valist>
##$VCLIST= <CCCCCCCCCCCCCCC>
##$VD= 0
##$VDLIST= <DDDDDDDDDDDDDDD>
##$VPLIST= <PPPPPPPPPPPPPPP>
##$VTLIST= <TTTTTTTTTTTTTTT>
##$WBST= 1024
##$WBSW= 25
##$XGAIN= (0..3)
0 0 0 0 
##$XL= 0
##$YL= 0
##$YMAX_a= 1109436
##$YMIN_a= -1792575
##$ZGOPTNS= <>
##$ZL1= 120
##$ZL2= 120
##$ZL3= 120
##$ZL4= 120
##$ABSF1= 15.99637
##$ABSF2= -5.996376
##$ABSG= 5
##$ABSL= 3
##$ALPHA= 0
##$AQORDER= 0
##$ASSFAC= 0
##$ASSFACI= 0
##$ASSFACX= 0
##$ASSWID= 0
##$AUNMP= <proc_1d>
##$AXLEFT= 0
##$AXRIGHT= 0
##$AXTYPE= 0
##$AXUNIT= <>
##$AZFE= 0.1
##$AZFW= 0.1
##$BCFW= 0
##$BC_mod= 2
##$BYTORDP= 0
##$COROFFS= 0
##$CY= 7568.61572265625
##$DATMOD= 1
##$DC= 0
##$DFILT= <>
##$DTYPP= 0
##$F1P= 17.9538593292236
##$F2P= -4.03888763876832
##$FCOR= 0.5
##$FTSIZE= 32768
##$FT_mod= 6
##$GAMMA= 0
##$GB= 0
##$INTBC= 0
##$INTSCL= 1.936888e-010
##$ISEN= 128
##$LB= 0.02
##$LEV0= 0
##$LPBIN= 0
##$MAXI= 945.577
##$MC2= 0
##$MEAN= 0
##$ME_mod= 0
##$MI= -402.1523
##$NCOEF= 0
##$NC_proc= -5
##$NLEV= 6
##$NOISF1= 8.587773
##$NOISF2= 6.764455
##$NSP= 0
##$NTH_PI= 0
##$NZP= 0
##$OFFSET= 15.99637
##$PC= 1
##$PHC0= -38.88924
##$PHC1= 3.950947
##$PH_mod= 1
##$PKNL= yes
##$PPARMOD= 0
##$PPDIAG= 0
##$PPIPTYP= 0
##$PPMPNUM= 100
##$PPRESOL= 1
##$PSCAL= 0
##$PSIGN= 0
##$REVERSE= no
##$SF= 200.13
##$SI= 32768
##$SIGF1= 16.12182
##$SIGF2= -4.496377
##$SINO= 3.521527
##$SIOLD= 32768
##$SREGLST= <1H.CDCl3>
##$SSB= 0
##$STSI= 32768
##$STSR= 0
##$SW_p= 4401.40845070422
##$SYMM= 0
##$S_DEV= 0
##$TDeff= 16384
##$TDoff= 0
##$TI= <>
##$TILT= no
##$TM1= 0
##$TM2= 0
##$TOPLEV= 0
##$USERP1= <user>
##$USERP2= <user>
##$USERP3= <user>
##$USERP4= <user>
##$USERP5= <user>
##$WDW= 1
##$XDIM= 32768
##$YMAX_p= 332181371
##$YMIN_p= -1385752
$$ End of Bruker specific parameters
$$ ---------------------------------
##NTUPLES= NMR SPECTRUM
##VAR_NAME=  FREQUENCY,     SPECTRUM/REAL,   SPECTRUM/IMAG
##SYMBOL=    X,             R,               I
##VAR_TYPE=  INDEPENDENT,   DEPENDENT,       DEPENDENT
##VAR_FORM=  AFFN,          ASDF,            ASDF
##VAR_DIM=   32768,         32768,           32768
##UNITS=     HZ,            ARBITRARY UNITS, ARBITRARY UNITS
##FACTOR=    0.134324425510551, 1,           1
##FIRST=     4401.40845070422, -146763,      -742979
##LAST=      0,             -17619,          -943526
##MIN=       0,             -1385752,        0
##MAX=       4401.40845070422, 332181371,    0
$$ Real data points
##PAGE= N=1
##DATA TABLE= (X++(R..R)), XYDATA
$$ [...]
$$ plain form
17703 3495642 3401729 3335075 3417464 3536898 3504965 3331880 3200561 3216481 3316632 3401620
17693 3401620 3433529 3406476 3332551 3273019 3294291 3373813 3420174 3396428 3354974 3342627 3342329 3325081
17681 3325081 3296790 3274316 3264696 3277829 3314213 3341996 3335175 3321506 3333706 3337051 3286342 3231607
17669 3231607 3258869 3331364 3318153 3203834 3134099 3198265 3296814 3305923 3254745 3236385 3246710
17658 3246710 3233902 3225237 3270192 3317853 3288736 3225219 3230737 3290745 3301162 3257944 3260166 3317269
17646 3317269 3316890 3222545 3146548 3162057 3187684 3146489 3108238 3160262 3242561 3241110 3170856 3133505
17634 3133505 3143061 3126584 3073399 3053868 3088478 3112910 3090961 3064470 3065695 3065004 3037867 3013574
17622 3013574 3023887 3059416 3102761 3150965 3182185 3157177 3084934 3037702 3067258 3143365 3198239
$$ packed form
17703C495642r3913o6654Q2389J19434l1933j73085j31319J5920J00151Q4988
17693C401620L1909k7053p3925n9532K1272P9522M6361k3746m1454j2347k98j7248
17681C325081k8291k2474r620J3133L6384K7783o821j3669J2200L345n0709n4735
17669C231607K7262P2495j3211j14319o9735O4166R8549R109n1178j8360J0325
17658C246710j2808q665M4955M7661k9117o3517N518O0008J0417m3218K222N7103
17646C317269l79r4345p5997J5509K5627m1195l8251N2024Q2299j451p0254l7351
17634C133505R556j6477n3185j9531L4610K4432k1949k6491J225o91k7137k4293
17622C013574J0313L5529M3345M8204L1220k5008p2243m7232K9556P6107N4874
$$ plain form
17611 3198239 3193534 3128311 3031205 2965513 2984813 3052479 3063540 2986778 2924874 2976922 3094347
17600 3094347 3145864 3090626 3009149 2977972 2988514 2993868 2976192 2954356 2960169 3006746 3056324 3044955
17588 3044955 2975384 2942807 3005631 3074158 3020808 2874723 2791965 2832326 2892312 2889129 2878686
17577 2878686 2924580 2972704 2956484 2928198 2965019 3018456 2991644 2916617 2909196 2971052 2990331
17566 2990331 2944973 2945097 3026481 3053307 2918436 2726320 2664333 2765519 2907096 2990511 3010805
17555 3010805 2979782 2900018 2820902 2818736 2889795 2933899 2877331 2761641 2683769 2690713 2757434
17544 2757434 2829336 2857977 2825574 2764975 2737533 2767415 2810736 2807461 2750786 2687449 2660419
17533 2660419 2671889 2699546 2727487 2749549 2754175 2729788 2693631 2691598 2740257 2782816 2749329 2665289
$$ packed form
17611C198239m705o5223r7106o5692J9300O7666J1061p6762o1904N2048J17425
17600C094347N1517n5238q1477l1177J0542N354j7676k1836N813M6577M9578j1369
17588C044955o9571l2577O2824O8527n3350j46085q2758M0361N9986l183j0443
17577B878686M5894M8124j6220k8286L6821N3437k6812p5027p421O1856J9279
17566B990331m5358J24Q1384K6826j34871j92116o1987J01186J41577Q3415K0294
17555C010805l1023p9764p9116k166P1059M4104n6568j15690p7872O944O6721
17544B757434P1902K8641l2403o0599k7442K9882M3321l275n6675o3337k7030
17533B660419J1470K7657K7941K2062M626k4387l6157k033M8659M2559l3487q4040
$$ plain form
17521 2665289 2641642 2723464 2804467 2756704 2612596 2536005 2611970 2744570 2791049 2730362 2649711
17510 2649711 2610989 2597081 2578027 2567285 2590929 2637134 2668441 2673712 2678406 2696152 2694986 2637230
17498 2637230 2543464 2483465 2496100 2547862 2584981 2595987 2599026 2595891 2574121 2539613 2514770 2512033
17486 2512033 2530186 2560859 2579688 2558618 2513140 2502205 2545098 2579612 2552902 2509132 2516624
17475 2516624 2548161 2526399 2464825 2454494 2507856 2527866 2462022 2386883 2393994 2473904 2557771
17464 2557771 2599385 2576958 2493228 2415597 2430361 2508152 2507865 2377287 2253182 2278049 2405172
17453 2405172 2483648 2460677 2393591 2330094 2293131 2327276 2436351 2518515 2485267 2403742 2395658
17442 2395658 2441735 2433405 2379604 2387493 2449515 2440553 2349504 2317901 2389971 2418084 2316018 2228695
$$ packed form
17521B665289k3647Q1822Q1003m7763j44108p6591P5965J32600M6479o0687q0651
17510B649711l8722j3908j9054j0742K3644M6205L1307N271M694J7746j166n7756
17498B637230r3766n9999J2635N1762L7119J1006L039l135k1770l4508k4843k737
17486B512033J8153L0673J8829k1070m5478j0935M2893L4514k6710m3770P492
17475B516624L1537k1762o1574j0331N3362K0010o5844p5139P111P9910Q3867
17464B557771M1614k2427q3730p7631J4764P7791k87j30578j24105K4867J27123
17453B405172P8476k2971o7086o3497l6963L4145J09075Q2164l3248q1525q084
17442B395658M6077q330n3801P889O2022q962r1049l1603P2070K8113j02066q7323
$$ plain form
17430 2228695 2310121 2473089 2521524 2432700 2342705 2318310 2309554 2295106 2313696 2349303 2324379
17419 2324379 2232197 2165025 2178779 2219281 2217436 2184381 2173732 2201392 2236925 2242705 2202409 2133768
17407 2133768 2078908 2063702 2074459 2091685 2120859 2160849 2176292 2146874 2115159 2133210 2184471
17396 2184471 2210877 2194461 2156869 2103264 2032200 1982268 1995853 2042263 2047142 2000568 1970229
17385 1970229 1999519 2053267 2077435 2061661 2030873 2016270 2037735 2077641 2082224 2032357 1992418
17374 1992418 2030330 2108772 2128438 2069353 2010874 2011764 2049056 2081172 2092837 2068520 2001087 1937814
17362 1937814 1936487 1966338 1943413 1875959 1865867 1935703 1974317 1914471 1851027 1894522 1998677
17351 1998677 2035944 1980203 1913074 1892145 1905236 1925172 1930927 1901278 1853297 1851650 1915922 1964593
$$ packed form
17430B228695Q1426J62968M8435q8824q9995k4395q756j4448J8590L5607k4924
17419B324379r2182o7172J3754M0502j845l3055j0649K7660L5533N780m0296o8641
17407B133768n4860j5206J0757J7226K9174L9990J5443k9418l1715J8051N1261
17396B184471K6406j6416l7592n3605p1064m9932J3585M6410M879m6574l0339
17385A970229K9290N3748K4168j5774l0788j4603K1465L9906M583m9867l9939
17374A992418L7912P8442J9666n9085n8479Q90L7292L2116J1665k4317o7433o3273
17362A937814j327K9851k2925o7454j0092O9836L8614n9846o3444M3495J04155
17351A998677L7267n5741o7129k0929J3091J9936N755k9649m7981j647O4272M8671
$$ plain form
17339 1964593 1924153 1844978 1823072 1852226 1854480 1825197 1837159 1909343 1974496 1982806 1951207 1906488
17327 1906488 1860010 1837454 1852660 1857501 1804394 1749172 1788758 1895634 1931141 1847309 1759012
17316 1759012 1769493 1829888 1834756 1770371 1700786 1674388 1702246 1767212 1806963 1756798 1654523
17305 1654523 1621602 1686655 1722717 1637507 1530099 1549271 1671693 1748654 1724075 1671978 1643231
17294 1643231 1613252 1583554 1602945 1659981 1668868 1604678 1557141 1601399 1693460 1742199 1720219
17283 1720219 1660679 1603367 1582395 1611156 1646102 1623522 1560285 1548385 1616318 1678033 1667862
17272 1667862 1636264 1641143 1635925 1567312 1506415 1551372 1646484 1644397 1536124 1470051 1520066 1578549
17260 1578549 1538000 1455500 1449374 1520614 1572488 1554044 1499679 1459555 1457660 1491155 1520442 1494813
$$ packed form
17339A964593m0440p9175k1906K9154K254k9283J1962P2184O5153Q310l1599m4719
17327A906488m6478k2556J5206M841n3107n5222L9586J06876L5507q3832q8297
17316A759012J0481O0395M868o4385o9585k6398K7858O4966L9751n0165j02275
17305A654523l2921O5053L6062q5210j07408J9172J22422P6961k4579n2097k8747
17294A643231k9979k9698J9391N7036Q887o4190m7537M4258R2061M8739k1980
17283A720219n9540n7312k0972K8761L4946k2580o3237j1900O7933O1715j0171
17272A667862l1598M879n218o8613o0897M4957R5112k087j08273o6073N0015N8483
17260A578549m0549q2500o126P1240N1874j8444n4365m0124j895L3495K9287k5629
$$ plain form
17248 1494813 1430731 1413706 1473746 1525715 1501886 1468921 1513833 1580392 1550634 1449921 1420295
17237 1420295 1493764 1545780 1502569 1447068 1462110 1502861 1504095 1497094 1524961 1539816 1489478 1428763
17225 1428763 1436579 1482875 1483140 1435408 1401177 1393910 1386046 1384807 1401326 1389433 1322187 1281601
17213 1281601 1349634 1454078 1464202 1404465 1408355 1475838 1467377 1361114 1312887 1390321 1442331
17202 1442331 1348563 1226902 1239744 1330103 1330036 1239675 1207615 1277985 1341116 1333503 1323543 1369687
17190 1369687 1426166 1433879 1403878 1367336 1322405 1270402 1242671 1258779 1301868 1347620 1375459
17179 1375459 1358379 1297671 1255133 1282235 1330385 1314024 1253326 1252384 1326639 1365670 1305679 1230752
17167 1230752 1239289 1301337 1327652 1308171 1293725 1291506 1269006 1231430 1212335 1206467 1188352 1183000
$$ packed form
17248A494813o4082j7025O0040N1969k3829l2965M4912O6559k9758j00713k9626
17237A420295P3469N2016m3211n5501J5042M0751J234p001K7867J4855n0338o0715
17225A428763P816M6296K65m7732l4231p267p864j239J6519j1893o7246m0586
17213A281601O8033J04444J0124n9737L890O7483q461j06263m8227P7434N2010
17202A442331r3768j21661J2842R0359o7r0361l2060P0370O3131p613r960M6144
17190A369687N6479P713l0001l6542m4931n2003k7731J6108M3089M5752K7839
17179A375459j7080o0708m2538K7102M8150j6361o0698r42P4255L9031n9991p4927
17167A230752Q537O2048K6315j9481j4446k219k2500l7576j9095n868j8115n352
$$ plain form
17155 1183000 1238326 1328984 1368257 1332067 1297609 1325473 1365905 1333393 1233216 1153170 1144650
17144 1144650 1170742 1180123 1180662 1208679 1257540 1280345 1256274 1216301 1198188 1207148 1228712 1249239
17132 1249239 1251825 1224557 1189460 1188808 1221608 1232671 1194653 1159076 1183903 1249760 1298671 1317239
17120 1317239 1319455 1284453 1192111 1098929 1090416 1161495 1224867 1235607 1225262 1217187 1202785 1203556
17108 1203556 1250860 1294200 1249920 1163725 1184409 1325119 1404173 1314786 1201892 1233295 1327463
17097 1327463 1293026 1150948 1104276 1213816 1315367 1287128 1209923 1194793 1211805 1187192 1149172
17086 1149172 1165913 1218330 1240969 1239685 1271212 1329996 1340433 1264389 1160302 1122878 1187622
17075 1187622 1296340 1350449 1310288 1239005 1223832 1265495 1292031 1275795 1268330 1301088 1322294
$$ packed form
17155A183000N5326R0658L9273l6190l4458K7864M0432l2512j00177q0046q520
17144A144650K6092R381N39K8017M8861K2805k4071l9973j8113Q960K1564K0527
17132A249239K586k7268l5097o52L2800J1063l8018l5577K4827O5857M8911J8568
17120A317239K216l5002r2342r3182q513P1079O3372J0740j0345q075j4402P71
17108A203556M7304M3340m4280q6195K0684J40710P9054q9387j12894L1403R4168
17097A327463l4437j42078m6672J09540J01551k8239p7205j5130J7012k4613l8020
17086A149172J6741N2417K2639j284L1527N8784J0437p6044j04087l7424O4744
17075A187622J08718N4109m0161p1283j5173M1663K6536j6236p465L2758K1206
$$ plain form
17064 1322294 1276604 1196380 1162914 1206867 1286888 1342791 1339477 1283759 1225189 1216735 1254900 1285675
17052 1285675 1281354 1271712 1284193 1302340 1307430 1310339 1312554 1289137 1246771 1242928 1301256 1360574
17040 1360574 1359563 1320444 1291686 1263620 1214127 1187583 1237283 1321146 1350035 1322649 1316011 1348778
17028 1348778 1356530 1314027 1279113 1283715 1277902 1232857 1212735 1271570 1342799 1318282 1205301 1120510
17016 1120510 1132116 1181799 1183103 1142147 1139329 1210834 1289840 1282464 1186325 1102191 1115076 1192803
17004 1192803 1238262 1223781 1216083 1259168 1295852 1250889 1152313 1107646 1165049 1252675 1273167
16993 1273167 1220521 1173607 1191668 1248849 1275124 1238177 1169446 1120907 1116351 1145216 1184185
16982 1184185 1213357 1222320 1213627 1198157 1182932 1168986 1160531 1162659 1168911 1169858 1176150 1206097 1242646
$$ packed form
17064A322294m5690q0224l3466M3953Q0021N5903l314n5718n8570q454L8165L0775
17052A285675m321r642J2481J8147N090K909K215k3417m2366l843N8328N9318
17040A360574j011l9119k8758k8066m9493k6544M9700Q3863K8889k7386o638L2767
17028A348778P752m2503l4914M602n813m5045k0122N8835P1229k4517j12981q4791
17016A120510J1606M9683J304m0956k818P1505P9006p376r6139q4134J2885P7727
17004A192803M5459j4481p698M3085L6684m4963r8576m4667N7403Q7626K0492
16993A273167n2646m6914J8061N7181K6275l6947o8731m8539m556K8865L8969
16982A184185K9172Q963q693j5470j5225j3946q455K128O252R47O292K9947L6549
$$ plain form
16969 1242646 1238323 1184057 1137531 1150511 1199260 1226788 1224786 1223157 1221309 1192159 1147720 1138367
16957 1138367 1179872 1233765 1266466 1275335 1251916 1183750 1109747 1104572 1171529 1212803 1157171 1067044
16945 1067044 1054991 1126241 1175817 1136142 1061282 1043937 1093733 1135817 1118602 1085289 1112987
16934 1112987 1194300 1228801 1159089 1067223 1071696 1156137 1189157 1116789 1036265 1043949 1105168 1136942
16922 1136942 1136811 1145999 1149297 1108729 1054865 1048141 1078535 1096906 1115997 1174702 1226487 1190311
16910 1190311 1109373 1115869 1208841 1219174 1068734 922047 960426 1113286 1164725 1064817 971845
16899 971845 999467 1080383 1111416 1096286 1080676 1053596 997292 960805 994301 1054308 1056254 994503
16887 994503 936866 920170 924657 939166 973744 1007257 1001152 977635 1004438 1076775 1097981 1023375
$$ packed form
16969A242646m323n4266m6526J2980M8749K7528k002j629j848k9150m4439r353
16957A138367M1505N3893L2701Q869k3419o8166p4003n175O6957M1274n5632r0127
16945A067044j2053P1250M9576l9675p4860j7345M9796M2084j7215l3313K7698
16934A112987Q1313L4501o9712r1866M473Q4441L3020p2368q0524P684O1219L1774
16922A136942j31R188L298m0568n3864o724L0394J8371J9091N8705N1785l6176
16910A190311q0938O496R2972J0333j50440j46687L8379J52860N1439r9908r2972
16899I71845K7622Q0916L1033j5130j5610k7080n6304l6487L3496O0007J946o1751
16887I94503n7637j6696M487J4509L4578L3513o105k3517K6803P2337K1206p4606
$$ plain form
16875 1023375 943668 957287 1027598 1052610 1022643 1006460 1016085 1001361 967179 973946 1011067 995339
16863 995339 926511 914835 996977 1055464 1009331 960010 1023307 1121222 1098489 976611 916563
16852 916563 960441 990911 949517 914246 925565 911801 853438 853990 949360 998391 893291 754705
16840 754705 763589 888943 948729 885698 812226 802740 809358 796996 810072 864715 901640 895597
16828 895597 902067 942782 949229 886385 840135 898999 1016276 1073766 1036726 969020 928182 917369
16816 917369 921307 928688 929392 930706 955836 992831 982795 903767 823629 811356 836872 830219 802522
16803 802522 817699 864826 862483 796118 749897 775021 819713 831061 838120 875719 904432 880995
16791 880995 845135 851769 866970 827895 772467 798946 901665 958877 907788 829589 814969
$$ packed form
16875A023375p9707J3619P0311K5012k9967j6183R625j4724l4182O767L7121j5728
16863I95339o8828j1676Q2142N8487m6133m9321O3297R7915k2733j21878o0048
16852I16563M3878L0470m1394l5271J1319j3764n8363N52R5370M9031j05100j38586
16840G54705Q884J25354N9786o3031p3472r486O618j2362J3076N4643L6925o043
16828H95597O470M0715O447o2844m6250N8864J17277N7490l7040o7706m0838j0813
16816I17369L938P381P04J314K5130L6995j0036p9028q0138j2273K5516o653k7697
16803H02522J5177M7127k343o6365m6221K5124M4692J1348P059L7599K8713k3437
16791H80995l5860O634J5201l9075n5428K6479J02719N7212n1089p8199j4620
$$ plain form
16780 814969 836422 822494 786664 794537 843498 864389 830833 790948 789101 819445 861783 904771
16768 904771 924225 894522 837444 809807 825573 838594 820323 801004 806550 809854 787332 776353
16756 776353 821125 892962 922507 894693 858588 851777 864077 873638 874618 866159 849183 835340
16744 835340 832648 831898 833312 860863 909059 910459 823931 728655 738807 831544 868676 808448
16732 808448 772023 840296 909166 856939 758681 783010 922394 992703 908948 803693 817711
16721 817711 907446 948248 925616 912186 918613 888124 818625 782455 814861 865269 878369 859177
16709 859177 838242 828358 836553 868227 896874 877989 819032 788507 823407 873406 878985 863138
16697 863138 888430 949736 976599 939190 889714 883106 907932 924018 929473 949901 979158 974047
$$ packed form
16780H14969K1453j3928l5830P873M8961K0891l3556l9885j847L0344M2338M2988
16768I04771J9454k9703n7078k7637J5766J3021j8271j9319N546L304k2522j0979
16756G76353M4772P1837K9545k7814l6105o811J2300R561R80q459j6976j3843
16744H35340k692p50J414K7551M8196J400q6528r5276J0152R2737L7132o0228
16732H08448l6425O8273O8870n2227r8258K4329J39384P0309q3755j05255J4018
16721H17711Q9735M0802k2632j3430O427l0489o9499l6170L2406N0408J3100j9192
16709H59177k0935r884Q195L1674K8647j8885n8957l0525L4900M9999N579j5847
16697H63138K5292O1306K6863l7409m9476o608K4826J6086N455K0428K9257n111
$$ plain form
16685 974047 915801 848539 833822 873731 903696 873968 818626 813555 871381 918869 892438 815396
16673 815396 752081 724785 720587 746573 814678 886867 904812 875946 863304 882150 881131 847651
16661 847651 849475 922894 992053 968789 880463 824074 832303 862034 884163 900350 891746 842656
16649 842656 805929 845320 907764 865724 721609 654159 783634 983163 1034272 918733 831157
16638 831157 904701 1042153 1064982 946510 823287 811897 889878 962102 983632 978753 968931
16627 968931 937597 878101 834510 857887 936250 1001437 1003288 952574 896338 877715 912746 973229
16615 973229 995878 944984 865078 832719 858969 888050 892679 907095 949100 978505 969206 958650
16603 958650 975765 978277 926954 875058 903690 992107 1033659 979468 896958 873662 915897 958984
$$ packed form
16685I74047n8246o7262j4717L9909K9965k9728n5342n071N7826M7488k6431p7042
16673H15396o3315k7296m198K5986O8105P2189J7945k8866j2642J8846j019l3480
16661H47651J824P3419O9159k3264q8326n6389Q229K9731K2129J6187q604m9090
16649H42656l6727L9391O2444m2040j44115o7450J29475J99529N1109j15539q7576
16638H31157P3544J37452K2829j18472j23223j1390P7981P2224K1530m879r822
16627I68931l1334n9496m3591K3377P8363O5187J851n0714n6236j8623L5031O0483
16615I73229K2649n0894p9906l2359K6250K9081M629J4416M2005K9405r299j0556
16603I58650J7115K512n1323n1896K8632Q8417M1552n4191q2510k3296M2235M3087
$$ plain form
16591 958984 943601 874119 821770 856607 951655 988079 902910 795672 814951 958705 1074812
16580 1074812 1063380 988384 961039 994929 1028052 1029072 1018928 1013416 995689 945300 874843 836952
16568 836952 883442 995750 1077673 1061141 997801 984016 1016810 1012873 962975 952960 1006997
16557 1006997 1033511 984939 950134 998394 1044899 995408 930415 985315 1105475 1107435 977938
16546 977938 916947 1028559 1147579 1085588 913508 847841 934146 1011745 977957 925195 966643
16535 966643 1052551 1056114 972924 923179 966533 1015681 969999 864050 819755 883961 981115
16524 981115 1022293 997220 942010 875258 808138 778901 820156 897578 927869 874130 800012
16513 800012 806896 916357 1030560 1032241 927238 850317 897999 995947 999432 902041 846282
$$ packed form
16591I58984j5383o9482n2349L4837R5048L6424q5169j07238J9279J43754J16107
16580A074812j1432p4996k7345L3890L3123J020j0144n512j7727n0389p0457l7891
16568H36952M6490J12308Q1923j6532o3340j3785L2794l937m9898j0015N4037
16557A006997K6514m8572l4805M8260M6505m9491o4993N4900J20160J960j29497
16546I77938o0991J11612J19020o1991j72080o5667Q6305P7599l3788n2762M1448
16535I66643Q5908L563q3190m9745M3354M9148m5682j05949m4295O4206R7154
16524I81115M1178k5073n5210o6752o7120k9237M1255P7422L0291n3739p4118
16513H00012O884J09461J14203J681j05003p6921M7682R7948L485r7391n5759
$$ plain form
16502 846282 911577 998449 981853 890617 848217 895199 964252 996752 994805 975530 951551 945804
16490 945804 962398 961951 923981 898858 928948 963064 937797 898726 929268 993558 982331 901188
16478 901188 869048 919564 952729 917309 893666 938110 984211 975330 968700 1017807 1065050 1051499
16466 1051499 1032440 1074849 1125236 1091987 991424 908176 874225 885024 963595 1098043 1181263
16455 1181263 1132798 1028741 995546 1028046 1033732 1004313 1006928 1042321 1050099 1030707 1030762 1032566
16443 1032566 992884 963302 1022487 1108878 1085867 971687 930490 1013406 1083850 1046584 982954
16432 982954 987731 1020954 1008553 968519 951896 956540 968041 996068 1019393 990051 930723 923183
16420 923183 970490 990611 969925 978868 1007614 957916 845559 821529 920405 985006 931844
$$ packed form
16502H46282O5295Q6872j6596r1236m2400M6982O9053L2500j947j9275k3979n747
16490I45804J6594m47l7970k5123L0090L4116k5267l9071L0542O4290j1227q1143
16478I01188l2140N0516L3165l5420k3643M4444M6101q881o630M9107M7243j3551
16466A051499j9059M2409N0387l3249j00563q3248l3951J0799P8571J34448Q3220
16455A181263m8465j04057l3195L2500N686k9419K615L5393P778j9392N5J804
16443A032566l9682k9582N9185Q6391k3011j14180m1197Q2916P0444l7266o3630
16432I82954M777L3223j2401m0034j6623M644J1501K8027K3325k9342n9328p540
16420I23183M7307K0121k0686Q943K8746m9698j12357k4030R8876O4601n3162
$$ plain form
16409 931844 885796 940970 1001875 990806 990075 1036388 1019136 942404 1000568 1191108 1190949 902037
16397 902037 743884 1001509 1266976 1079389 767870 931717 1338943 1260664 832626 983877
16387 983877 1746247 1792863 366908 -1278220 -1385752 -47473 1071165 1056683 621004
16378 621004 628868 905971 919862 750309 768509 917500 913401 813622 862613 1006706 1016832
16367 1016832 925944 939090 1032220 1014055 902785 893433 996425 1028692 950394 917573 985779
16356 985779 1026656 978733 947261 996487 1042803 1022796 1000009 1032378 1068842 1046088 985755
16345 985755 946671 962068 1043198 1160963 1224415 1174801 1094209 1110855 1203710 1227308 1135628
16334 1135628 1045838 1053416 1113108 1144572 1141071 1128310 1117576 1138073 1215160 1284218 1236567 1090683
$$ packed form
16409I31844m6048N5174O0905j1069p31M6313j7252p6732N8164J90540j59k88912
16397I02037j58153K57625K65467j87587l11519J63847M07226p8279m28038J51251
16387I83877P62370M6616j425955j645128j07532J338279J118638j4482m35679
16378F21004P864K77103J3891j69553J8200J48991m099r9779M8991J44093J0126
16367A016832r0888J3146R3130j8165j11270r352J02992L2267p8298l2821O8206
16356I85779M0877m7923l1472M9226M6316k0007k2787L2369L6464k2754o0333
16345I85755l9084J5397Q1130J17765O3452m9614q0592J6646R2855K3598r1680
16334A135628q9790P578N9692L1464l501j2761j0734K0497P7087O9058m7651j45884
$$ plain form
16322 1090683 1002954 1057435 1158800 1193322 1178419 1173679 1155100 1081876 1006414 1011346 1087801
16311 1087801 1159958 1184544 1160498 1097163 1037429 1048534 1122087 1151636 1081762 1004109 1020173
16300 1020173 1085843 1096196 1057241 1053183 1090920 1103219 1080203 1077309 1103839 1112907 1095934 1086683
16288 1086683 1079959 1046579 1018911 1054413 1119039 1120367 1061390 1043366 1098469 1140019 1112054 1069895
16276 1069895 1062280 1046613 991088 962173 1022903 1116704 1143856 1106706 1093877 1145604 1206630
16265 1206630 1205475 1133734 1052137 1039620 1115555 1201495 1199218 1117559 1065056 1097145 1144071 1133014
16253 1133014 1105024 1137977 1210323 1230557 1175359 1113362 1095459 1094710 1069143 1030536 1026081 1076446
16241 1076446 1147707 1180238 1148833 1093286 1071400 1085445 1088734 1062992 1038805 1032177 1023698 1020525
$$ packed form
16322A090683q7729N4481J01365L4522j4903m740j8579p3224p5462M932P6455
16311A087801P2157K4586k4046o3335n9734J1105P3553K9549o9874p7653J6064
16300A020173O5670J0353l8955m058L7737J2299k3016k894K6530R068j6973r251
16288A086683o724l3380k7668L5502O4626J328n8977j8024N5103M1550k7965m2159
16276A069895p615j5667n5525k8915O0730R3801K7152l7150j2829N1727O1026
16265A206630j155p1741q1597j2517P5935Q5940k277q1659n2503L2089M6926j1057
16253A133014k7990L2953P2346K0234n5198o1997j7903p49k5567l8607m455N0365
16241A076446P1261L2531l1405n5547k1886J4045L289k5742k4187o628q479l173
$$ plain form
16229 1020525 1066119 1149990 1183155 1121969 1048161 1052838 1100303 1093169 1026799 982894 995188 1016460
16217 1016460 1012416 1005549 1021374 1053642 1081410 1074485 1006924 916746 906664 1011778 1118140
16206 1118140 1110550 1050442 1078964 1179487 1196098 1088685 997408 1010873 1036595 981843 915179
16195 915179 938379 1016144 1056623 1069880 1117995 1177191 1181233 1153997 1168378 1203111 1170252 1076057
16183 1076057 1029424 1076396 1135961 1128977 1078823 1047655 1047913 1056604 1059701 1048250 1018148 1000224
16171 1000224 1042775 1135844 1197094 1166405 1081624 1029669 1048062 1102758 1143204 1150224 1135813
16160 1135813 1116513 1094328 1064915 1040065 1042893 1071565 1092752 1090528 1092615 1118360 1134217 1108089
16148 1108089 1079579 1112417 1189203 1223857 1184562 1136392 1140897 1173602 1174158 1131970 1084752 1062563
$$ packed form
16229A020525M5594Q3871L3165o1186p3808M677M7465p134o6370m3905J2294K1272
16217A016460m044o867J5825L2268K7768o925o7561r0178j0082J05114J06362
16206A118140p590o0108K8522J00523J6611j07413r1277J3465K5722n4752o6664
16195I15179K3200P7765M0479J3257M8115N9196M042k7236J4381L4733l2859r4195
16183A076057m6633M6972N9565o984n0154l1168K58Q691L097j1451l0102j7924
16171A000224M2551R3069O1250l0689q4781n1955J8393N4696M0446P020j4411
16160A135813j9300k2185k9413k4850K828K8672K1187k224K087K5745J5857k6128
16148A108089k8510L2838P6786L4654l9295m8170M505L2705N56m2188m7218k2189
$$ plain form
16136 1062563 1064303 1068971 1051574 1010208 987463 1032868 1131333 1205544 1206967 1166522 1134337 1113306
16124 1113306 1086985 1074150 1105891 1166890 1204707 1192153 1147439 1099305 1065147 1061042 1098682
16113 1098682 1160455 1198656 1176981 1111495 1063568 1084859 1162657 1224978 1213064 1146146 1097272
16102 1097272 1106442 1141594 1152381 1137455 1138300 1176795 1219753 1214683 1158339 1113707 1136327 1192145
16090 1192145 1194899 1137242 1119562 1200352 1283975 1245979 1125935 1078995 1147998 1215651 1205875
16079 1205875 1193717 1249507 1300266 1250938 1150561 1117203 1158757 1190137 1187765 1202003 1235377
16068 1235377 1233261 1199474 1204742 1258836 1280309 1228963 1174049 1182232 1217233 1210318 1171444 1166005
16056 1166005 1213920 1266900 1275360 1244872 1227088 1259788 1308845 1291117 1187515 1101951 1142603
$$ packed form
16136A062563J740M668j7397m1366k2745M5405R8465P4211J423m0445l2185k1031
16124A113306k6321j2835L1741O0999L7817j2554m4714m8134l4158m105L7640
16113A098682O1773L8201k1675o5486m7927K1291P7798O2321j1914o6918m8874
16102A097272R170L5152J0787j4926Q45L8495M2958n070n6344m4632K2620N5818
16090A192145K754n7657j7680Q0790Q3623l7996j20044m6940O9003O7653r776
16079A205875j2158N5790N0759m9328j00377l3358M1554L1380k372J4238L3374
16068A235377k116l3787N268N4094K1473n1346n4914Q183L5001o915l8874n439
16056A166005M7915N2980Q460l0488j7784L2700M9057j7728j03602q5564M0652
$$ plain form
16045 1142603 1264002 1315525 1249325 1178799 1200754 1264069 1277652 1258721 1284127 1353717 1398575
16034 1398575 1394862 1380620 1370712 1334474 1263965 1203339 1196996 1247023 1324368 1388802 1401507 1352408
16022 1352408 1277575 1229259 1232936 1280558 1340331 1361781 1312454 1233309 1211022 1264458 1314205
16011 1314205 1305842 1294684 1342089 1397410 1378440 1314908 1297101 1317501 1293806 1236261 1248831
16000 1248831 1344609 1401214 1348767 1274131 1270294 1299493 1293219 1284496 1331864 1388551 1364812 1274688
15988 1274688 1214465 1226703 1280189 1353660 1442044 1502254 1489575 1434828 1398056 1366741 1296310
15977 1296310 1227938 1247259 1330288 1358972 1308035 1286373 1354997 1434550 1453594 1459926 1498709
15966 1498709 1501412 1412961 1330121 1372567 1484726 1518211 1470758 1479329 1580400 1644352 1587590
$$ packed form
16045A142603J21399N1523o6200p0526K1955O3315J3583j8931K5406O9590M4858
16034A398575l713j4242r908l6238p0509o0626o343N0027P7345O4434J2705m9099
16022A352408p4833m8316L677M7622N9773K1450m9327p9145k2287N3436M9747
16011A314205q363j1158M7405N5321j8970o3532j7807K0400k3695n7545J2570
16000A248831R5778N6605n2447p4636l837K9199o274q723M7368N6687k3739r0124
15988A274688o0223J2238N3486P3471Q8384O0210j2679n4747l6772l1315p0431
15977A296310o8372J9321Q3029K8684n0937k1662O8624P9553J9044O332L8783
15966A498709K703q8451q2840M2446J12159L3485m7453Q571J01071O3952n6762
$$ plain form
15955 1587590 1500919 1494645 1537255 1540169 1509926 1511678 1544215 1558156 1562311 1607283 1673661 1673464
15943 1673464 1579343 1477517 1461864 1524043 1577660 1560894 1492575 1443683 1465570 1537957 1590966
15932 1590966 1587428 1563787 1567157 1579349 1548738 1482564 1449750 1485504 1546227 1578701 1587780 1604893
15920 1604893 1625142 1616269 1574703 1536157 1529458 1543666 1550279 1548246 1572688 1647502 1734244 1756383
15908 1756383 1691436 1611219 1597827 1643222 1677992 1680188 1690048 1717071 1709489 1645712 1588956 1601662
15896 1601662 1654340 1674476 1650595 1629642 1633467 1636312 1618522 1595021 1590675 1619932 1682200 1748753
15884 1748753 1773401 1749584 1729698 1744993 1742925 1671240 1593645 1625176 1751882 1821184 1749295
15873 1749295 1641470 1637530 1714979 1741224 1678991 1630590 1673699 1748735 1752322 1683236 1639182
$$ packed form
15955A587590q6671o274M2610K914l0243J752L2537J3941M155M4972O6378j97
15943A673464r4121j01826j5653O2179N3617j6766o8319m8892K1887P2387N3009
15932A590966l538k3641L370J2192l0611o6174l2814L5754O0723L2474R079J7113
15920A604893K0249q873m1566l8546o699J4208O613k033K4442P4814Q6742K2139
15908A756383o4947q0217j3392M5395L4770K196R860K7023p582o3777n6756J2706
15896A601662N2678K0136k3881k0953L825K845j7790k3501m346K9257O2268O6553
15884A748753K4648k3817j9886J5295k068p1685p7595L1531J26706O9302p1889
15873A749295j07825l940P7449K6245o2233m8401M3109P5036L587o9086m4054
$$ plain form
15862 1639182 1688707 1790511 1842829 1791085 1682121 1620799 1671660 1796020 1888710 1882979 1812907
15851 1812907 1762291 1763368 1775346 1766464 1771925 1829321 1888650 1860495 1759059 1714999 1802285 1924869
15839 1924869 1948720 1888396 1860571 1886852 1874028 1800443 1780799 1880150 1983450 1956176 1851504
15828 1851504 1830854 1923866 2003432 1992079 1957798 1971950 1992286 1956790 1906365 1923943 1996810
15817 1996810 2026544 1965328 1875488 1847591 1904047 1991315 2037641 2015229 1965200 1954228 1988774
15806 1988774 1995524 1922741 1836495 1854119 1982516 2092508 2080513 1992059 1938265 1947769 1974257
15795 1974257 2009218 2085524 2172349 2177494 2093992 2044817 2109536 2190435 2154187 2046526 2032375
15784 2032375 2141773 2223827 2182254 2111743 2125050 2171106 2142533 2073734 2086661 2182103 2235952
$$ packed form
15862A639182M9525J01804N2318n1744j08964o1322N0861J24360R2690n731p0072
15851A812907n0616J077J1978q882N461N7396N9329k8155j01436m4060Q7286J22584
15839A924869K3851o0324k7825K6281j2824p3585j9644R9351J03300k7274j04672
15828A851504k0650R3012P9566j1353l4281J4152K0336l5496n0425J7578P2867
15817A996810K9734o1216q9840k7897N6456Q7268M6326k2412n0029j0972L4546
15806A988774O750p2783q6246J7624J28397J09992j1995q8454n3794R504K6488
15795A974257L4961P6306Q6825N145q3502m9175O4719Q0899l6248j07661j4151
15784B032375J09398Q2054m1573p0511J3307M6056k8573o8799J2927R5442N3849
$$ plain form
15773 2235952 2203870 2185362 2243543 2287548 2213276 2074280 2017647 2091402 2200059 2240185 2213822
15762 2213822 2196840 2233559 2283031 2269339 2184445 2118179 2149598 2226713 2222317 2114818 2028009
15751 2028009 2054202 2127431 2144323 2131101 2181124 2274275 2290536 2201437 2120642 2130175 2168612
15740 2168612 2151605 2108614 2117149 2170470 2206332 2223574 2267445 2316740 2292226 2192406 2125439
15729 2125439 2165034 2248799 2272328 2226179 2178400 2165637 2172906 2195908 2247243 2303885 2317773
15718 2317773 2289113 2269380 2278212 2278002 2251586 2240707 2271911 2305263 2304951 2304224 2338490 2364537 2325233
15705 2325233 2259001 2254543 2313309 2351118 2335502 2324399 2353422 2383080 2389981 2413068 2459676 2460115
15693 2460115 2385662 2326491 2363249 2431828 2419899 2343389 2308881 2335294 2344490 2321920 2347655
$$ packed form
15773B235952l2082j8508N8181M4005p4272j38996n6633P3755J08657M0126k6363
15762B213822j6982L6719M9472j3692q4894o6266L1419P7115m396j07499q6809
15751B028009K6193P3229J6892j3222N0023R3151J6261q9099q0795R533L8437
15740B168612j7007m2991Q535N3321L5862J7242M3871M9295k4514r9820o6967
15729B125439L9595Q3765K3529m6149m7779j2763P269K3002N1335N6642J3888
15718B317773k8660j9733Q832k10k6416j0879L1204L3352l12p27L4266K6047l9304
15705B325233o6232m458N8766L7809j5616j1103K9023K9658O901K3087M6608M39
15693B460115p4453n9171L6758O8579j1929p6510l4508K6413R196k2570K5735
$$ plain form
15682 2347655 2439251 2494473 2450433 2388468 2399984 2440600 2418873 2361976 2372736 2451748 2485328
15671 2485328 2421307 2349318 2364506 2433613 2458191 2419340 2390239 2424350 2494103 2546271 2569645
15660 2569645 2584788 2595495 2581577 2535041 2481179 2456424 2474121 2518406 2567656 2615941 2666913
15649 2666913 2709986 2716034 2670679 2606940 2581518 2610080 2649635 2661750 2664456 2687949 2706926 2674529
15637 2674529 2612793 2597268 2639764 2664076 2632208 2613488 2665795 2723198 2695727 2627716 2639632
15626 2639632 2733039 2780539 2725296 2668230 2708161 2799398 2840158 2823773 2818474 2847444 2870939
15615 2870939 2862643 2838306 2822572 2832452 2872849 2912701 2898928 2832831 2790994 2824301 2883259 2899494
15603 2899494 2889598 2905588 2931773 2922750 2906757 2945020 3008444 3009764 2955473 2943237 2991219 3000351
$$ packed form
15682B347655R1596N5222m4040o1965J1516M0616k1727n6897J0760P9012L3580
15671B485328o4021p1989J5188O9107K4578l8851k9101L4111O9753N2168K3374
15660B569645J5143J0707j3918m6536n3862k4755J7697M4285M9250M8285N0972
15649B666913M3073O048m5355o3739k5422K8562L9555J2115K706K3493J8977l2397
15637B674529o1736j5525M2496K4312l1868j8720N2307N7403k7471o8011J1916
15626B639632R3407M7500n5243n7066L9931R1237M0760j6385n299K8970K3495
15615B870939q296k4337j5734R880M0397L9852j3773o6097m1837L3307N8958J6235
15603B899494r896J5990K6185r023j5993L8263O3424J320n4291j2236M7982R132
$$ plain form
15591 3000351 2933157 2901707 2994546 3122614 3145971 3078656 3047408 3090306 3120302 3081050 3028411
15580 3028411 3036539 3104856 3184508 3237316 3248154 3227722 3215829 3237741 3255647 3216969 3150644
15569 3150644 3145767 3220061 3286421 3285286 3273696 3321509 3381933 3352726 3237477 3153205 3170967
15558 3170967 3229508 3239605 3211738 3225118 3300569 3367262 3363954 3325127 3328596 3375983 3379248 3289746
15546 3289746 3195637 3228058 3380367 3498723 3481007 3409272 3419788 3503485 3537072 3485591 3450848
15535 3450848 3496895 3546679 3517470 3461719 3476764 3541052 3555886 3518908 3532035 3628124 3705300
15524 3705300 3678529 3606432 3602404 3679304 3752017 3761869 3734821 3726053 3754792 3798200 3825483 3834623
15512 3834623 3854993 3897450 3913848 3853068 3757113 3732406 3801678 3863032 3847395 3835316 3928828
$$ packed form
15591C000351o7194l1450R2839J28068K3357o7315l1248M2898K9996l9252n2639
15580C028411Q128O8317P9652N2808J0838k0432j1893K1912J7906l8678o6325
15569C150644m877P4294O6360j135j1590M7813O0424k9207j15249q4272J7762
15558C170967N8541J0097k7867J3380P5451O6693l308l8827L469M7387L265q9502
15546C289746r4109L2421J52309J18356j7716p1735J0516Q3697L3587n1481l4743
15535C450848M6047M9784k9209n5751J5045O4288J4834l6978J3127R6089P7176
15524C705300k6771p2097m028P6900P2713R852k7048q768K8739M3408K7283R140
15512C834623K0370M2457J6398o0780r5955k4707O9272O1354j5637j2079R3512
$$ plain form
15501 3928828 4069461 4103131 4003876 3909327 3922047 3992470 4037574 4067578 4124706 4177250 4163424
15490 4163424 4098569 4059069 4079107 4126992 4169299 4199606 4212149 4204216 4205884 4255326 4335027 4378296
15478 4378296 4356182 4320076 4334823 4398192 4454069 4466629 4451096 4438936 4444526 4471931 4525544
15467 4525544 4593683 4640088 4639742 4616101 4613405 4634861 4644801 4636981 4653631 4713609 4769475 4778151
15455 4778151 4774669 4820083 4903927 4961619 4972425 4973771 4986718 4998477 5020136 5086307 5182138 5241903
15443 5241903 5243574 5239375 5268408 5306584 5332110 5369945 5433195 5488529 5521843 5568930 5634939 5660542
15431 5660542 5628864 5626650 5717374 5822977 5830202 5762996 5744020 5818944 5923292 6000810 6050679
15420 6050679 6070097 6053429 6046245 6102723 6188559 6222199 6211989 6246122 6336730 6390021 6363236
$$ packed form
15501C928828J40633L3670r9255r4549J2720P0423M5104L0004N7128N2544j3826
15490D163424o4855l9500K0038M7885M2307L0307J2543p933J668M9442P9701M3269
15478D378296k2114l6106J4747O3369N5877J2560j5533j2160N590K7405N3613
15467D525544O8139M6405l46k3641k696K1456R940p820J6650N9978N5866Q676
15455D778151l482M5414Q3844N7692J0806J346J2947J1759K1659O6171R5831N9765
15443E241903J671m199K9033L8176K5526L7835O3250N5334L3314M7087O6009K5603
15431E660542l1678k214R0724J05603P225o7206j8976P4924J04348P7518M9869
15420F050679J9418j6668p184N6478Q5836L3640j0210L4133R0608N3291k6785
$$ plain form
15409 6363236 6338710 6388888 6466424 6495503 6491701 6517302 6577907 6634460 6673823 6705607 6724552
15398 6724552 6729528 6750741 6814629 6905891 6990293 7042424 7038781 6979229 6934334 6999182 7162692
15387 7162692 7294628 7310028 7274771 7292131 7360729 7418998 7460419 7513107 7557906 7563809 7567643
15376 7567643 7624395 7708768 7759334 7790060 7853879 7918887 7902672 7831879 7840122 7971920 8103222
15365 8103222 8117678 8067889 8080759 8169024 8231867 8216645 8190534 8237474 8344903 8428274 8441441
15354 8441441 8421994 8421210 8425536 8389208 8333644 8350272 8473957 8608706 8636975 8568964 8517840
15343 8517840 8547148 8615845 8669888 8710012 8749725 8773840 8773996 8777811 8807471 8844507 8867664 8896098
15331 8896098 8960159 9047828 9114865 9144677 9170897 9230271 9307057 9345742 9326202 9302187 9334663
$$ packed form
15409F363236k4526N0178P7536K9079l802K5601O0605N6553L9363L1784J8945
15398F724552M976K1213O3888R1262Q4402N2131l643n9552m4895O4848J63510
15387G162692J31936J5400l5257J7360O8598N8269M1421N2688M4799N903L834
15376G567643N6752Q4373N0566L0726O3819O5008j6215p0793Q243J31798J31302
15365H103222J4456m9789J2870Q8265O2843j5222k6111M6940J07429Q3371J3167
15354H441441j9447p84M326l6328n5564J6628J23685J34749K8269o8011n1124
15343H517840K9308O8697N4043M0124L9713K4115J56L815K9660L7036K3157K8434
15331H896098O4061Q7669O7037K9812K6220N9374P6786L8685j9540k4015L2476
$$ plain form
15320 9334663 9404132 9440536 9435996 9457349 9528860 9583968 9578375 9570632 9622884 9695011 9720860 9721634
15308 9721634 9744832 9755242 9707083 9670543 9743740 9872330 9914263 9871749 9887835 9998873 10073058
15297 10073058 10044771 10028161 10108286 10183660 10139592 10046347 10044711 10129566 10187068 10182452 10181803 10227609
15285 10227609 10299060 10363860 10389352 10347615 10278967 10286629 10396503 10501252 10521462 10521255 10563420
15274 10563420 10570208 10475221 10402192 10498193 10663582 10670306 10522035 10466202 10625414 10836156 10918055
15263 10918055 10908073 10930849 10997398 11046462 11066432 11069809 11039524 10989443 10990801 11057523 11092995 11034154
15251 11034154 10964225 10992987 11099445 11184422 11213611 11216045 11197427 11150999 11114977 11131516 11175157
15240 11175157 11191324 11175144 11152265 11122530 11085919 11080021 11122565 11158150 11133237 11084591 11080154
$$ packed form
15320I334663O9469L6404m540K1353P1511N5108n593p743N2252P2127K5849P74
15308I721634K3198J0410m8159l6540P3197J28590M1933m2514J6086J11038P4185
15297A0073058k8287j6610Q0125P5374m4068r3245j636Q4855N7502m616o49M5806
15285A0227609P1451O4800K5492m1737o8648P662J09874J04749K0210k07M2165
15274A0563420O788r4987p3029R6001J65389O724j48271n5833J59212K10742Q1899
15263A0918055r982K2776O6549M9064J9970L377l0285n0081J358O6722L5472n8841
15251A1034154o9929K8762J06458Q4977K9189K434j8618m6428l6022J6539M3641
15240A1175157J6167j6180k2879k9735l6611n898M2544L5585k4913m8646m437
$$ plain form
15229 11080154 11110512 11117022 11093276 11076066 11063178 11025787 10984620 10989678 11032639 11055395 11038876
15218 11038876 11013742 10994648 10976135 10979615 11024041 11059785 11020150 10938745 10921993 10991348 11048406
15207 11048406 11027042 10987128 11006549 11062181 11088275 11091857 11126241 11181391 11186033 11119844 11053456
15196 11053456 11054441 11103424 11136748 11137582 11138490 11148574 11136490 11101529 11104156 11178628 11257518 11252651 11188856
15183 11188856 11173858 11238322 11300888 11310499 11318407 11362177 11384518 11345385 11320589 11386978 11485027
15172 11485027 11511051 11485774 11503706 11561175 11577455 11561791 11604913 11701165 11735132 11677411 11646209
15161 11646209 11718282 11810978 11824414 11785600 11770459 11783564 11801256 11845018 11922443 11974438 11971590
15150 11971590 11987930 12083580 12188092 12210310 12198501 12262480 12380792 12426994 12374903 12337795 12386690
$$ packed form
15229A1080154L0358O510k3746j7210j2888l7391m1167N058M2961K2756j6519
15218A1038876k5134j9094j8513L480M4426L5744l9635q1405j6752O9355N7058
15207A1048406k1364l9914J9421N5632K6094L582L4384N5150M642o6189o6388
15196A1053456R85M8983L3324Q34R08J0084j2084l4961K627P4472P8890m867o3795
15183A1188856j4998O4464O2566R611P908M3770K2341l9133k4796O6389R8049
15172A1485027K6024k5277J7932N7469J6280j5664M3122R6252L3967n7721l1202
15161A1646209P2073R2696J3436l8814j5141J3105J7692M3762P7425N1995k848
15150A1971590J6340R5650J04512K2218j1809O3979J18312M6202n2091l7108M8895
$$ plain form
15139 12386690 12456751 12473404 12461354 12473766 12505627 12543280 12624112 12768757 12905834 12946283 12906308
15128 12906308 12882534 12918349 12967150 12989330 13011702 13064588 13123087 13158298 13202453 13301300 13424161
15117 13424161 13489590 13479160 13458185 13472022 13495550 13514142 13571910 13680153 13755323 13737122 13707307
15106 13707307 13779443 13911986 13963382 13918630 13914200 14017493 14129845 14162765 14172781 14240083 14332317
15095 14332317 14385710 14421175 14477724 14520467 14521913 14550025 14659668 14776338 14814153 14831975 14927088
15084 14927088 15043242 15055717 15001626 15035732 15170086 15253931 15232705 15232318 15333385 15446594 15493992
15073 15493992 15545657 15671308 15803617 15869088 15926330 16042519 16145319 16145008 16112713 16177400 16310054
15062 16310054 16374970 16356656 16369839 16458611 16550526 16619541 16730279 16881460 16961552 16931568 16917371
$$ packed form
15139A2386690P0061J6653j2050J2412L1861L7653Q0832J44645J37077M0449l9975
15128A2906308k3774L5815M8801K2180K2372N2886N8499L5211M4155R8847J22861
15117A3424161O5429j0430k0975J3837K3528J8592N7768J08243P5170j8201k9815
15106A3707307P2136J32543N1396m4752m430J03293J12352L2920J0016O7302R2234
15095A4332317N3393L5465N6549M2743J446K8112J09643J16670L7815J7822R5113
15084A4927088J16154J2475n4091L4106J34354Q3845k1226l87J01067J13209M7398
15073A5493992N1665J25651J32309O5471N7242J16189J02800l11l2295O4687J32654
15062A6310054O4916j8314J3183Q8772R1915O9015J10738J51181Q0092k9984j4197
$$ plain form
15051 16917371 17027139 17189979 17286257 17342880 17461324 17613596 17670881 17626779 17634139 17778567
15041 17778567 17951519 18024885 18039801 18114745 18246376 18333663 18362204 18426488 18567402 18716556
15031 18716556 18826731 18933466 19043868 19092049 19077606 19125286 19303103 19489720 19552386 19563978
15021 19563978 19685594 19901213 20050968 20096078 20158094 20292029 20415227 20496510 20623462 20814853
15011 20814853 20948303 20968227 20999668 21144669 21320535 21426718 21522337 21686374 21839776 21888646
15001 21888646 21932774 22126081 22403274 22560146 22571687 22620664 22809226 23036028 23186280 23273159
14991 23273159 23351577 23439374 23563915 23757146 23973858 24135621 24266736 24451257 24654201 24754892
14981 24754892 24779212 24905181 25178239 25417877 25503969 25566769 25760423 26020474 26212007 26371151
$$ packed form
15051A6917371J09768J62840R6278N6623J18444J52272N7285m4102P360J44428
15041A7778567J72952P3366J4916P4944J31631Q7287K8541O4284J40914J49154
15031A8716556J10175J06735J10402M8181j4443M7680J77817J86617O2666J1592
15021A9563978J21616K15619J49755M5110O2016J33935J23198Q1283J26952J91391
15011B0814853J33450J9924L1441J45001J75866J06183R5619J64037J53402M8870
15001B1888646M4128J93307K77193J56872J1541M8977J88562K26802J50252Q6879
14991B3273159P8418Q7797J24541J93231K16712J61763J31115J84521K02944J00691
14981B4754892K4320J25969K73058K39638Q6092O2800J93654K60051J91533J59144
$$ plain form
14971 26371151 26601864 26841737 26951682 26983334 27135262 27445196 27727215 27852229 27917719 28073030
14961 28073030 28317820 28561753 28779873 29007526 29240041 29434198 29594215 29783459 30037492
14952 30037492 30308869 30527546 30701230 30914504 31208517 31505125 31711291 31871177 32116976
14943 32116976 32462327 32764271 32940412 33100877 33370564 33691305 33936217 34138870 34440264
14934 34440264 34841990 35189472 35416460 35643331 35978307 36357274 36662211 36899554 37170462
14925 37170462 37523448 37914086 38276412 38577535 38828221 39082780 39406775 39812194 40241039
14916 40241039 40631074 40978099 41322631 41696427 42089997 42462149 42793697 43140683 43589271
14907 43589271 44123734 44603145 44940850 45245121 45676409 46214485 46703839 47104546 47534262
$$ packed form
14971B6371151K30713K39873J09945L1652J51928L09934K82019J25014O5490J55311
14961B8073030K44790K43933K18120K27653K32515J94157J60017J89244K54033
14952C0037492K71377K18677J73684K13274K94013K96608K06166J59886K45799
14943C2116976L45351L01944J76141J60465K69687L20741K44912K02653L01394
14934C4440264M01726L47482K26988K26871L34976L78967L04937K37343K70908
14925C7170462L52986L90638L62326L01123K50686K54559L23995M05419M28845
14916D0241039L90035L47025L44532L73796L93570L72152L31548L46986M48588
14907D3589271N34463M79411L37705L04271M31288N38076M89354M00707M29716
$$ plain form
14898 47534262 48046394 48539864 48950820 49376524 49912683 50494657 51008628 51460741 51931569
14889 51931569 52450655 53015481 53644208 54301890 54866683 55296776 55749386 56389130 57142408
14880 57142408 57801395 58329179 58887347 59568254 60275857 60907147 61498874 62131990 62810611
14871 62810611 63506444 64231067 64993298 65752902 66480913 67216968 68012344 68849306 69658714
14862 69658714 70399928 71104975 71858298 72726397 73681816 74617293 75470861 76302683 77199080
14853 77199080 78151457 79105881 80074790 81089264 82088891 83001858 83909777 84967474 86153346
14844 86153346 87277179 88272069 89291709 90445523 91626664 92720481 93810876 95021385
14836 95021385 96290542 97487976 98652663 99922301 101290405 102626846 103906508 105230112
$$ packed form
14898D7534262N12132M93470M10956M25704N36159N81974N13971M52113M70828
14889E1931569N19086N64826O28727O57682N64793M30093M52610O39744P53278
14880E7142408O58987N27784N58168O80907P07603O31290N91727O33116O78621
14871F2810611O95833P24623P62231P59604P28011P36055P95376Q36962Q09408
14862F9658714P41214P05047P53323Q68099R55419R35477Q53568Q31822Q96397
14853G7199080R52377R54424R68909J014474R99627R12967R07919J057697J185872
14844H6153346J123833R94890J019640J153814J181141J093817J090395J210509
14836I5021385J269157J197434J164687J269638J368104J336441J279662J323604
$$ plain form
14828 105230112 106624645 108001940 109334900 110713401 112186740 113687788 115156783 116623844
14820 116623844 118131335 119680295 121282025 122957406 124662691 126324817 127966986 129679555
14812 129679555 131452830 133181478 134862420 136625431 138512626 140400542 142227045 144118069
14804 144118069 146163117 148232542 150184793 152114013 154193566 156382303 158510752 160592407
14796 160592407 162806358 165181447 167534777 169764801 171995606 174357513 176805248 179246548
14788 179246548 181697430 184202104 186721868 189215219 191734244 194339430 196996477 199646650
14780 199646650 202303466 204994822 207688190 210363094 213078961 215872399 218662605 221367416
14772 221367416 224042619 226785097 229562285 232277164 234953448 237697322 240493767 243203928
$$ packed form
14828A05230112J394533J377295J332960J378501J473339J501048J468995J467061
14820A16623844J507491J548960J601730J675381J705285J662126J642169J712569
14812A29679555J773275J728648J680942J763011J887195J887916J826503J891024
14804A44118069K045048K069425J952251J929220K079553K188737K128449K081655
14796A60592407K213951K375089K353330K230024K230805K361907K447735K441300
14788A79246548K450882K504674K519764K493351K519025K605186K657047K650173
14780A99646650K656816K691356K693368K674904K715867K793438K790206K704811
14772B21367416K675203K742478K777188K714879K676284K743874K796445K710161
$$ plain form
14764 243203928 245777545 248315318 250889586 253449288 255950252 258437688 260930539 263354305
14756 263354305 265674061 267976798 270323728 272628724 274797022 276887559 279005327 281115441
14748 281115441 283121122 285069514 287098725 289191545 291168209 292962949 294738026 296643894
14740 296643894 298609008 300478127 302251306 304053771 305932406 307814942 309645211 311438679
14732 311438679 313205801 314928117 316625816 318352429 320092031 321745138 323255435 324675407
14724 324675407 326060299 327371230 328546636 329600710 330561193 331356201 331871922 332110631
14716 332110631 332181371 332117849 331812061 331171148 330241216 329105282 327740226 326068948 324099079
14707 324099079 321903644 319491502 316805857 313849947 310711138 307440902 304001540 300361501
$$ packed form
14764B43203928K573617K537773K574268K559702K500964K487436K492851K423766
14756B63354305K319756K302737K346930K304996K168298K090537K117768K110114
14748B81115441K005681J948392K029211K092820J976664J794740J775077J905868
14740B96643894J965114J869119J773179J802465J878635J882536J830269J793468
14732C11438679J767122J722316J697699J726613J739602J653107J510297J419972
14724C24675407J384892J310931J175406J054074R60483P95008N15721K38709
14716C32110631P0740o3522l05788o40913r29932j135934j365056j671278j969869
14707C24099079k195435k412142k685645k955910l138809l270236l439362l640039
$$ plain form
14699 300361501 296562439 292657074 288657001 284581481 280482895 276376629 272216834 267992623
14691 267992623 263775509 259614266 255462665 251286325 247160310 243160623 239226583 235250837
14683 235250837 231259939 227376706 223629726 219934074 216253529 212646715 209142632 205704035
14675 205704035 202335947 199093264 195942727 192759243 189522955 186386194 183461255 180664579
14667 180664579 177869362 175095011 172423782 169831759 167247099 164702404 162276748 159934776
14659 159934776 157577577 155224441 152985703 150861474 148728703 146550428 144442930 142484585
14651 142484585 140597533 138691625 136804714 135007532 133266041 131506226 129751470 128084467
14643 128084467 126504300 124924920 123312513 121735717 120257750 118844356 117418219 115968827
$$ packed form
14699C00361501l799062l905365m000073m075520m098586m106266m159795m224211
14691B67992623m217114m161243m151601m176340m126015l999687l934040l975746
14683B35250837l990898l883233l746980l695652l680545l606814l504083l438597
14675B05704035l368088l242683l150537l183484l236288l136761k924939k796676
14667A80664579k795217k774351k671229k592023k584660k544695k425656k341972
14659A59934776k357199k353136k238738k124229k132771k178275k107498j958345
14651A42484585j887052j905908j886911j797182j741491j759815j754756j667003
14643A28084467j580167j579380j612407j576796j477967j413394j426137j449392
$$ plain form
14635 115968827 114561616 113241445 111969357 110682168 109386164 108138417 106943089 105743451
14627 105743451 104540326 103424691 102424698 101410666 100263209 99066276 97990979 97034023
14619 97034023 96044775 94999024 94042596 93220191 92368076 91376082 90369580 89491182 88665572
14610 88665572 87759232 86842086 86078099 85437098 84737772 83941360 83182543 82506674 81792975
14601 81792975 80984089 80195346 79515412 78862797 78140045 77398465 76741318 76162773 75586566
14592 75586566 74989268 74393142 73797759 73199007 72623915 72081298 71531026 70955172 70394970
14583 70394970 69866466 69319259 68739388 68202008 67742487 67268847 66703582 66124488 65642048
14574 65642048 65213847 64725879 64201629 63765773 63424522 63051193 62595394 62141612 61733137
$$ packed form
14635A15968827j407211j320171j272088j287189j296004j247747j195328j199638
14627A05743451j203125j115635r99993j014032j147457j196933j075297r56956
14619I7034023r89248j045751r56428q22405q52115r91994j006502q78398q25610
14610H8665572r06340r17146p63987o41001o99326p96412p58817o75869p13699
14601H1792975q08886p88743o79934o52615p22752p41580o57147n78545n76207
14592G5586566n97298n96126n95383n98752n75092n42617n50272n75854n60202
14583G0394970n28504n47207n79871n37380m59521m73640n65265n79094m82440
14574F5642048m28201m87968n24250m35856l41251l73329m55799m53782m08475
$$ plain form
14565 61733137 61304081 60842468 60458996 60200113 59930652 59522004 59049917 58671273 58381940
14556 58381940 58043299 57609718 57185099 56854223 56581597 56299300 55994527 55677930 55346951
14547 55346951 55018336 54732935 54491152 54234831 53925831 53596705 53292747 53009492 52724890
14538 52724890 52452989 52219287 52007843 51778003 51521522 51265670 51027939 50803020 50591628
14529 50591628 50406215 50238062 50045509 49795960 49513615 49269560 49113266 49011682 48869449
14520 48869449 48628645 48343869 48129534 48025578 47949089 47800049 47580646 47370800 47211034
14511 47211034 47066503 46905296 46752818 46643230 46558202 46447600 46288849 46099873 45912012
14502 45912012 45752837 45636550 45547799 45452420 45344133 45254667 45191423 45100332 44937469 44749903
$$ packed form
14565F1733137m29056m61613l83472k58883k69461m08648m72087l78644k89333
14556E8381940l38641m33581m24619l30876k72626k82297l04773l16597l30979
14547E5346951l28615k85401k41783k56321l09000l29126l03958k83255k84602
14538E2724890k71901k33702k11444k29840k56481k55852k37731k24919k11392
14529E0591628j85413j68153j92553k49549k82345k44055j56294j01584j42233
14520D8869449k40804k84776k14335j03956p6489j49040k19403k09846j59766
14511D7211034j44531j61207j52478j09588q5028j10602j58751j88976j87861
14502D5912012j59175j16287q8751r5379j08287q9466o3244r1091j62863j87566
$$ plain form
14492 44749903 44623552 44565411 44508078 44425902 44359242 44306595 44194977 44014917 43889818 43912884
14482 43912884 43981930 43921701 43739108 43613463 43621372 43624173 43497503 43335187 43297852 43349621 43310142
14471 43310142 43143827 43026120 43079090 43186522 43164673 43014642 42887337 42858151 42866125 42856626
14461 42856626 42852036 42859517 42828050 42749256 42701131 42721949 42727901 42644880 42546331 42545799 42607499 42604386
14449 42604386 42543307 42570859 42724679 42836315 42762895 42588464 42488037 42492896 42517403 42540695
14439 42540695 42610616 42703899 42736898 42717026 42743144 42834190 42891657 42873617 42875867 42971137 43082199
14428 43082199 43108113 43087051 43124349 43218158 43272972 43262567 43271949 43368370 43510167 43606767 43622894
14417 43622894 43607747 43644062 43765575 43912986 43997051 44016457 44060897 44171238 44272689 44306616
$$ packed form
14492D4749903j26351n8141n7333q2176o6660n2647j11618j80060j25099K3066
14482D3912884O9046o0229j82593j25645P909K801j26670j62316l7335N1769l9479
14471D3310142j66315j17707N2970J07432k1849j50031j27305k9186P974r499
14461D2856626m590P481l1467p8794m8125K0818N952q3021r8549n32O1700l113
14449D2604386o1079K7552J53820J11636p3420j74431j00427M859K4507K3292
14439D2540695O9921R3283L2999j9872K6118R1046N7467j8040K250R5270J11062
14428D3082199K5914k1062L7298R3809N4814j0405R382R6421J41797R6600J6127
14417D3622894j5147L6315J21513J47411Q4065J9406M4440J10341J01451L3927
$$ plain form
14407 44306616 44346677 44482868 44655034 44736110 44748711 44844951 45061901 45254306 45321186 45354329
14397 45354329 45474167 45639633 45739103 45785854 45889798 46074514 46246633 46340821 46393574 46466242
14387 46466242 46579930 46739252 46943736 47151879 47295929 47362612 47417654 47528738 47697793 47882428
14377 47882428 48048804 48188529 48314178 48453709 48627641 48824308 49015798 49194276 49368437
14368 49368437 49534588 49685235 49836324 50005222 50171694 50310353 50453508 50658158 50907379
14359 50907379 51117188 51259870 51403321 51592919 51775921 51903791 52035111 52249057 52508529
14350 52508529 52712510 52858517 53042788 53297808 53539401 53703662 53836664 53999636 54174341
14341 54174341 54330480 54510947 54761108 55025244 55212984 55342434 55515684 55757202 55979867
$$ packed form
14407D4306616M0061J36191J72166Q1076J2601R6240K16950J92405O6880L3143
14397D5354329J19838J65466R9470M6751J03944J84716J72119R4188N2753P2668
14387D6466242J13688J59322K04484K08143J44050O6683N5042J11084J69055J84635
14377D7882428J66376J39725J25649J39531J73932J96667J91490J78478J74161
14368D9368437J66151J50647J51089J68898J66472J38659J43155K04650K49221
14359E0907379K09809J42682J43451J89598J83002J27870J31320K13946K59472
14350E2508529K03981J46007J84271K55020K41593J64261J33002J62972J74705
14341E4174341J56139J80467K50161K64136J87740J29450J73250K41518K22665
$$ plain form
14332 55979867 56129965 56265561 56446625 56636265 56778759 56907032 57089645 57315083 57515990
14323 57515990 57684092 57872118 58087622 58274820 58417812 58579260 58801843 59039522 59230836
14314 59230836 59382906 59529708 59655053 59724885 59772202 59880900 60081747 60313448 60496473 60611035
14304 60611035 60694457 60790649 60913229 61040287 61137505 61194272 61234312 61285167 61351219 61427031 61514911
14293 61514911 61608761 61683141 61726406 61764957 61823246 61879430 61897687 61886297 61880560 61883387 61872636
14282 61872636 61857147 61867775 61891183 61870559 61785097 61678815 61597036 61541869 61501753 61472238 61431458
14271 61431458 61349545 61241869 61156362 61088458 60976388 60810810 60670885 60600542 60527023 60375005
14261 60375005 60191390 60063347 59967325 59809848 59585956 59378903 59212523 59024951 58801240
$$ packed form
14332E5979867J50098J35596J81064J89640J42494J28273J82613K25438K00907
14323E7515990J68102J88026K15504J87198J42992J61448K22583K37679J91314
14314E9230836J52070J46802J25345O9832M7317J08698K00847K31701J83025J14562
14304F0611035Q3422R6192J22580J27058R7218N6767M0040N0855O6052P5812Q7880
14293F1514911R3850P4380M3265L8551N8289N6184J8257j1390n737K827j0751
14282F1872636j5489J0628K3408k0624q5462j06282q1779n5167m0116k9515m0780
14271F1431458q1913j07676q5507o7904j12070j65578j39925p0343p3519j52018
14261F0375005j83615j28043r6022j57477k23892k07053j66380j87572k23711
$$ plain form
14252 58801240 58611822 58481868 58331016 58097781 57830669 57593610 57367216 57117403 56882852
14243 56882852 56704443 56531357 56297875 56045759 55859207 55706739 55469518 55128072 54801558
14234 54801558 54572472 54380392 54140323 53870584 53628797 53394447 53107766 52785032 52502458
14225 52502458 52278095 52052404 51788610 51515163 51250996 50961449 50626872 50298808 50037901
14216 50037901 49832187 49624253 49388146 49127687 48829167 48486146 48157351 47916460 47733677
14207 47733677 47493748 47164169 46854852 46648494 46459906 46164453 45798603 45498913 45276469
14198 45276469 45012263 44686998 44439413 44325604 44184438 43867737 43475095 43199864 43034682
14189 43034682 42816768 42512729 42248544 42057047 41811734 41467101 41162292 40983112 40800013
$$ packed form
14252E8801240j89418j29954j50852k33235k67112k37059k26394k49813k34551
14243E6882852j78409j73086k33482k52116j86552j52468k37221l41446l26514
14234E4801558k29086j92080k40069k69739k41787k34350k86681l22734k82574
14225E2502458k24363k25691k63794k73447k64167k89547l34577l28064k60907
14216E0037901k05714k07934k36107k60459k98520l43021l28795k40891j82783
14207D7733677k39929l29579l09317k06358j88588k95453l65850k99690k22444
14198D5276469k64206l25265k47585j13809j41166l16701l92642k75231j65182
14189D3034682k17914l04039k64185j91497k45313l44633l04809j79180j83099
$$ plain form
14180 40800013 40485007 40140897 39938294 39833925 39651022 39373905 39146259 38992108 38760347
14171 38760347 38392680 38049423 37875268 37792287 37636316 37382609 37119297 36885271 36655513
14162 36655513 36429869 36224380 36010039 35754886 35496523 35288617 35107635 34895420 34660267
14153 34660267 34448181 34246715 34013473 33773208 33581827 33411835 33187440 32928631 32736985
14144 32736985 32621931 32466647 32208558 31938603 31759980 31646330 31510861 31334070 31147943
14135 31147943 30960149 30766474 30584337 30413886 30222669 30019345 29867478 29766776 29612929
14126 29612929 29359478 29121262 29000869 28904474 28683594 28392517 28220214 28191414 28132194 27952105
14116 27952105 27765737 27670983 27585880 27408766 27194128 27044800 26940051 26798825 26628733 26486226
$$ packed form
14180D0800013l15006l44110k02603j04369j82903k77117k27646j54151k31761
14171C8760347l67667l43257j74155q2981j55971k53707k63312k34026k29758
14162C6655513k25644k05489k14341k55153k58363k07906j80982k12215k35153
14153C4660267k12086k01466k33242k40265j91381j69992k24395k58809j91646
14144C2736985j15054j55284k58089k69955j78623j13650j35469j76791j86127
14135C1147943j87794j93675j82137j70451j91217k03324j51867j00702j53847
14126B9612929k53451k38216j20393r6395k20880k91077j72303k8800n9220j80089
14116B7952105j86368r4754q5103j77114k14638j49328j04749j41226j70092j42507
$$ plain form
14106 26486226 26357091 26200869 26055879 25972495 25890755 25721114 25513571 25400246 25380412 25312410
14096 25312410 25134393 24946918 24836394 24755057 24640899 24530438 24460636 24361496 24160311 23926748
14086 23926748 23795198 23773112 23736330 23610856 23460480 23371556 23328618 23248622 23096964 22926236
14076 22926236 22809727 22761031 22724369 22640224 22511890 22392649 22311515 22242985 22160160 22077648
14066 22077648 22010477 21924955 21780050 21602471 21467923 21405177 21364404 21291867 21194394 21108439
14056 21108439 21039925 20967627 20887095 20815618 20756463 20688033 20595861 20493656 20402018 20325288 20264229
14045 20264229 20230225 20216889 20170653 20035689 19838693 19685039 19642414 19662719 19654008 19595428 19530423
14034 19530423 19472273 19385288 19260055 19142699 19071598 19034521 19004218 18968752 18911659 18814942 18703947
$$ packed form
14106B6486226j29135j56222j44990q3384q1740j69641k07543j13325j9834o8002
14096B5312410j78017j87475j10524q1337j14158j10461o9802r9140k01185k33563
14086B3926748j31550k2086l6782j25474j50376q8924m2938p9996j51658j70728
14076B2926236j16509m8696l6662q4145j28334j19241q1134o8530q2825q2512
14066B2077648o7171q5522j44905j77579j34548o2746m0773p2537r7473q5955
14056B1108439o8514p2298q0532p1477n9155o8430r2172j02205r1638p6730o1059
14045B0264229l4004j3336m6236j34964j96996j53654m2625K0305q711n8580o5005
14034A9530423n8150q6985j25233j17356p1101l7077l0303l5466n7093r6717j10995
$$ plain form
14023 18703947 18636472 18620050 18592903 18517553 18435432 18389293 18354041 18298882 18255503 18250759 18225591
14012 18225591 18114592 17972352 17914970 17942991 17928776 17800229 17641998 17571106 17586126 17595506
14002 17595506 17546697 17468446 17405430 17358336 17293908 17197584 17106621 17074683 17094031 17085377 16999317
13991 16999317 16893921 16856602 16877475 16873074 16817104 16758403 16711080 16628453 16509546 16431627 16432129
13980 16432129 16446728 16418123 16381682 16378581 16365433 16291597 16197955 16149107 16125148 16077501 16040436
13969 16040436 16072994 16122561 16073520 15930652 15830409 15842985 15874892 15819239 15710108 15655253
13959 15655253 15676378 15695797 15656460 15585568 15534831 15506274 15463189 15397478 15352178 15356868 15362613
13948 15362613 15291160 15153369 15055591 15058473 15097512 15094785 15073216 15077080 15054972 14946786 14835114
$$ packed form
14023A8703947o7475j6422k7147p5350q2121m6139l5252n5159m3379m744k5168
14012A8225591j10999j42240n7382K8021j4215j28547j58231p0892J5020R380
14002A7595506m8809p8251o3016m7094o4428r6324r0963l1938J9348q654q6060
13991A6999317j05396l7319K0873m401n5970n8701m7323q2627j18907p7919N02
13980A6432129J4599k8605l6441l101j3148p3836r3642m8848k3959m7647l7065
13969A6040436L2558M9567m9041j42868j00243J2576L1907n5653j09131n4855
13959A5655253K1125J9419l9337p0892n0737k8557m3085o5711m5300M690N745
13948A5362613p1453j37791r7778K882L9039k727k1569L864k2108j08186j11672
$$ plain form
13937 14835114 14853208 14956890 14960437 14822296 14714310 14743857 14790558 14730259 14650045 14677735 14733721
13926 14733721 14654630 14479062 14392086 14422401 14418730 14336037 14318419 14431401 14517911 14438010 14289521
13915 14289521 14246610 14299210 14309941 14248459 14203848 14202973 14176880 14109144 14076018 14107539 14123550
13904 14123550 14057433 13958385 13916206 13942687 13975958 13963986 13908915 13857443 13864109 13930364 13975635
13893 13975635 13919585 13800805 13747425 13806229 13873217 13837064 13723273 13635381 13611525 13613701 13615240
13882 13615240 13615956 13597474 13546144 13504544 13520571 13558057 13541383 13479127 13449138 13460592 13437809
13871 13437809 13361742 13316164 13348978 13392256 13379882 13345884 13334082 13308396 13243765 13212563 13267303
13860 13267303 13318790 13264437 13171818 13179954 13261118 13255247 13133194 13045183 13079083 13143483 13147267
$$ packed form
13937A4835114J8094J03682L547j38141j07986K9547M6701o0299q0214K7690N5986
13926A4733721p9091j75568q6976L0315l671q2693j7618J12982Q6510p9901j48489
13915A4289521m2911N2600J0731o1482m4611q75k6093o7736l3126L1521J6011
13904A4123550o6117r9048m2179K6481L3271j1972n5071n1472O666O6255M5271
13893A3975635n6050j18780n3380N8804O6988l6153j13791q7892k3856K176J539
13882A3615240P16j8482n1330m1600J6027L7486j6674o2256k9989J1454k2783
13871A3437809p6067m5578L2814M3278j2374l3998j1802k5686o4631l1202N4740
13860A3267303N1487n4353r2619Q136Q1164n871j22053q8011L3900O4400L784
$$ plain form
13849 13147267 13132460 13148320 13144066 13088693 13062610 13112318 13135578 13046093 12944706 12970981 13069614
13838 13069614 13077445 12986882 12939984 12984101 13017903 12990248 12974984 13006137 13000977 12917857 12854883
13827 12854883 12902229 12998831 13027247 12976029 12923711 12916957 12938479 12955444 12940864 12880543 12801581
13816 12801581 12759379 12768795 12792761 12815657 12860888 12911568 12899493 12820743 12776439 12829630 12897083
13805 12897083 12866057 12757449 12682477 12684247 12717394 12753374 12807792 12871625 12900472 12878686 12833720
13794 12833720 12788601 12750940 12735733 12745584 12745245 12711701 12688700 12727712 12792579 12794851 12718794 12643473
13782 12643473 12638241 12694951 12764100 12801833 12781555 12714478 12660583 12670113 12717312 12738129 12720528
13771 12720528 12704442 12708522 12717457 12727305 12740008 12729935 12684675 12658524 12705998 12782253 12801353 12776366
$$ packed form
13849A3147267j4807J5860m254n5373k6083M9708K3260q9485j01387K6275R8633
13838A3069614P831r0563m6898M4117L3802k7655j5264L1153n160q3120o2974
13827A2854883M7346R6602K8416n1218n2318o754K1522J6965j4580o0321p8962
13816A2801581m2202R416K3966K2896M5231N0680j2075p8750m4304N3191O7453
13805A2897083l1026j08608p4972J770L3147L5980N4418O3833K8847k1786m4966
13794A2833720m5119l7661j5207R851l39l3544k3001L9012O4867K272p6057p5321
13782A2643473n232N6710O9149L7733k0278o7077n3895R530M7199K0817j7601
13771A2720528j6086M080Q935R848J2703j0073m5260k6151M7474P6255J9100k4987
$$ plain form
13759 12776366 12793832 12855633 12869648 12811478 12767086 12781203 12791018 12759876 12749531 12792003 12812465
13748 12812465 12764486 12727492 12770457 12825105 12809607 12782230 12838165 12929350 12933148 12851686 12798989
13737 12798989 12819320 12855956 12881440 12921609 12956143 12929921 12869923 12862380 12902137 12895426 12833143
13726 12833143 12822755 12903996 12967800 12928560 12859374 12868173 12934857 12969671 12962312 12971287 13009670 13036313
13714 13036313 13038579 13044763 13063553 13072990 13065121 13054604 13047230 13036045 13025022 13031786 13069390 13131340
13702 13131340 13182355 13176028 13116923 13087334 13150436 13239317 13231098 13136107 13100172 13181755 13251126
13691 13251126 13189635 13074338 13049556 13105598 13126088 13096913 13111661 13187370 13228677 13194075 13162539
13680 13162539 13193240 13234057 13227213 13213496 13262473 13359746 13425183 13407804 13324533 13237355 13213655
$$ packed form
13759A2776366J7466O1801J4015n8170m4392J4117R815l1142j0345M2472K0462
13748A2812465m7979l6994M2965N4648j5498k7377N5935R1185L798q1462n2697
13737A2798989K0331L6636K5484M0169L4534k6222n9998p543L9757o711o2283
13726A2833143j0388Q1241O3804l9240o9186Q799O6684L4814p359Q975L8383K6643
13714A3036313K266O184J8790R437p869j0517p374j1185j1023O764L7604O1950
13702A3131340N1015o327n9105k9589O3102Q8881q219r4991l5935Q1583O9371
13691A3251126o1491j15297k4782N6042K0490k9175J4748P5709M1307l4602l1536
13680A3162539L0701M0817o844j3717M8977R7273O5437j7379q3271q7178k3700
$$ plain form
13669 13213655 13270736 13345185 13359185 13321336 13306821 13337392 13357124 13341732 13344843 13398532 13448961
13658 13448961 13442474 13407821 13400374 13426853 13475159 13551178 13628730 13633979 13550848 13477169 13497457 13561750
13646 13561750 13578407 13564670 13596513 13658234 13669200 13637442 13655348 13739395 13798713 13785383 13762076
13635 13762076 13784169 13816375 13812884 13794470 13797200 13814465 13830166 13846558 13853156 13837153 13839172 13909757
13623 13909757 13996018 13987949 13910712 13931221 14103613 14253626 14226394 14114019 14091406 14144343 14142733
13612 14142733 14096723 14128337 14229920 14271225 14246450 14293384 14429810 14489759 14401595 14325575 14396711
13601 14396711 14509769 14509083 14444537 14465616 14568974 14633461 14635767 14652308 14687986 14675354 14627698
13590 14627698 14631986 14689187 14712316 14694405 14730068 14841353 14923833 14914828 14890064 14932236 15011224
$$ packed form
13669A3213655N7081P4449J4000l7849j4515L0571J9732j5392L111N3689N0429
13658A3448961o487l4653p447K6479M8306P6019P7552N249q3131p3679K0288O4293
13646A3561750J6657j3737L1843O1721J0966l1758J7906Q4047N9318j3330k3307
13635A3762076K2093L2206l491j8414K730J7265J5701J6392O598j6003K019P0585
13623A3909757Q6261q069p7237K0509J72392J50013k7232j12375k2613N2937j610
13612A4142733m6010L1614J01583M1305k4775M6934J36426N9949q8164p6020P1136
13601A4396711J13058o86o4546K1079J03358O4487K306J6541L5678j2632m7656
13590A4627698M288N7201K3129j7911L5663J11285Q2480r005k4764M2172P8988
$$ plain form
13579 15011224 15061623 15087132 15118327 15142853 15145153 15154873 15198657 15257247 15313306 15382566 15460388
13568 15460388 15505424 15514626 15539910 15590879 15607425 15577578 15584568 15669012 15745240 15743927 15740994 15832184
13556 15832184 15962720 16013244 15993255 16007823 16072817 16109964 16107383 16139276 16221696 16283999 16301627
13545 16301627 16334107 16408112 16478800 16532216 16610824 16707968 16753735 16743022 16760268 16831543 16872883
13534 16872883 16845474 16840619 16930048 17043796 17093561 17117728 17192039 17279911 17299456 17283813 17344050
13523 17344050 17497025 17645614 17721945 17751196 17774903 17799919 17831230 17883859 17953357 18025392 18107571
13512 18107571 18205535 18290011 18340244 18389975 18469482 18536914 18540307 18516718 18549131 18649276 18762947
13501 18762947 18863149 18951290 19000587 19004658 19052900 19228015 19438135 19496348 19388097 19313743
$$ packed form
13579A5011224N0399K5509L1195K4526K300R720M3784N8590N6059O9260P7822
13568A5460388M5036R202K5284N0969J6546k9847O990Q4444P6228j313k933R1190
13556A5832184J30536N0524j9989J4568O4994L7147k581L1893Q2420O2303J7628
13545A6301627L2480P4005P0688N3416P8608R7144M5767j0713J7246P1275M1340
13534A6872883k7409m855Q9429J13748M9765K4167P4311Q7872J9545j5643O0237
13523A7344050J52975J48589P6331K9251K3707K5016L1311N2629O9498P2035Q2179
13512A8107571R7964Q4476N0233M9731P9507O7432L393k3589L2413J00145J13671
13501A8762947J00202Q8141M9297M071M8242J75115K10120N8213j08251p4354
$$ plain form
13491 19313743 19417419 19612493 19746394 19806388 19862630 19918418 19940538 19965486 20053904 20183422
13481 20183422 20291749 20387204 20512469 20631218 20665047 20635906 20664144 20808155 20992005 21114812
13471 21114812 21159855 21170357 21183106 21222904 21313079 21445863 21565220 21617564 21618965 21651363 21780813
13460 21780813 21980190 22147277 22216240 22237379 22312585 22461882 22606993 22689419 22736511 22789402
13450 22789402 22841903 22894458 22993782 23155240 23310189 23402887 23480321 23605187 23739801 23814878
13440 23814878 23861628 23960423 24096873 24197601 24284469 24446820 24659263 24784687 24795040 24836230
13430 24836230 25005244 25203413 25309523 25379033 25542769 25786542 25969164 26026801 26041161 26113286
13420 26113286 26266239 26473259 26697278 26887823 27003556 27060110 27120330 27231291 27394922 27586508
$$ packed form
13491A9313743J03676J95074J33901N9994N6242N5788K2120K4948Q8418J29518
13481B0183422J08327R5455J25265J18749L3829k9141K8238J44011J83850J22807
13471B1114812M5043J0502J2749L9798R0175J32784J19357N2344J401L2398J29450
13460B1780813J99377J67087O8963K1139P5206J49297J45111Q2426M7092N2891
13450B2789402N2501N2555R9324J61458J54949R2698P7434J24866J34614P5077
13440B3814878M6750R8795J36450J00728Q6868J62351K12443J25424J0353M1190
13430B4836230J69014J98169J06110O9510J63736K43773J82622N7637J4360P2125
13420B6113286J52953K07020K24019J90545J15733N6554O0220J10961J63631J91586
$$ plain form
13410 27586508 27769547 27909590 28010961 28126665 28299478 28509762 28710178 28886247 29048390
13401 29048390 29194756 29326606 29475820 29669452 29883725 30074121 30232945 30381932 30535397
13392 30535397 30709269 30930671 31188825 31412435 31555056 31671646 31847174 32079856 32305250
13383 32305250 32506186 32716143 32934013 33126945 33312380 33546161 33822150 34068854 34258135
13374 34258135 34436996 34638945 34846404 35058141 35309046 35596708 35868117 36106691 36353358
13365 36353358 36615076 36841682 37032294 37272679 37609620 37967930 38255936 38484577 38718970
13356 38718970 38977383 39245137 39529820 39834691 40128064 40399764 40694880 41035074 41369051
13347 41369051 41662174 41963364 42310215 42645790 42921086 43204287 43577074 43986319 44322411
$$ packed form
13410B7586508J83039J40043J01371J15704J72813K10284K00416J76069J62143
13401B9048390J46366J31850J49214J93632K14273J90396J58824J48987J53465
13392C0535397J73872K21402K58154K23610J42621J16590J75528K32682K25394
13383C2305250K00936K09957K17870J92932J85435K33781K75989K46704J89281
13374C4258135J78861K01949K07459K11737K50905K87662K71409K38574K46667
13365C6353358K61718K26606J90612K40385L36941L58310K88006K28641K34393
13356C8718970K58413K67754K84683L04871K93373K71700K95116L40194L33977
13347D1369051K93123L01190L46851L35575K75296K83201L72787M09245L36092
$$ plain form
13338 44322411 44593396 44889749 45220365 45530077 45849744 46264502 46734747 47116701 47387829
13329 47387829 47692721 48119759 48582811 48983544 49345489 49713410 50061868 50397221 50816404
13320 50816404 51347709 51847564 52187665 52454025 52822665 53311057 53797715 54233560 54678588
13311 54678588 55153322 55606680 56038710 56520808 57066290 57590602 58034559 58440355 58876332
13302 58876332 59360620 59880614 60417514 60933710 61403579 61870672 62406025 62999177 63564271
13293 63564271 64066452 64561165 65088124 65613923 66116717 66643569 67228248 67819733 68356101
13284 68356101 68862436 69415070 70038896 70688432 71308440 71878978 72422474 72987160 73594562
13275 73594562 74195056 74725013 75219303 75794892 76487363 77179724 77754258 78250510 78795620
$$ packed form
13338D4322411K70985K96353L30616L09712L19667M14758M70245L81954K71128
13329D7387829L04892M27038M63052M00733L61945L67921L48458L35353M19183
13320E0816404N31305M99855L40101K66360L68640M88392M86658M35845M45028
13311E4678588M74734M53358M32030M82098N45482N24312M43957M05796M35977
13302E8876332M84288N19994N36900N16196M69869M67093N35353N93152N65094
13293F3564271N02181M94713N26959N25799N02794N26852N84679N91485N36368
13284F8356101N06335N52634O23826O49536O20008N70538N43496N64686O07402
13275G3594562O00494N29957M94290N75589O92471O92361N74534M96252N45110
$$ plain form
13266 78795620 79427689 80078634 80704676 81336898 81998059 82650715 83253276 83815350 84375612
13257 84375612 84959482 85570381 86194366 86807803 87402223 87996138 88600480 89190116 89742731
13248 89742731 90287185 90869660 91482779 92073826 92619540 93150754 93703476 94281619 94864934
13239 94864934 95421997 95926859 96397973 96901524 97471005 98043538 98530857 98936280 99339647
13230 99339647 99783835 100250144 100730945 101232006 101699555 102052518 102317945 102631321 103053683
13221 103053683 103487090 103834304 104141248 104490601 104844599 105114291 105325134 105580961 105891692
13212 105891692 106167543 106377809 106586320 106814608 106995175 107098280 107192387 107325823 107447351
13203 107447351 107505605 107538925 107600150 107675529 107748340 107852571 107972664 107982336 107811723 107608397
$$ packed form
13266G8795620O32069O50945O26042O32222O61161O52656O02561N62074N60262
13257H4375612N83870O10899O23985O13437N94420N93915O04342N89636N52615
13248H9742731N44454N82475O13119N91047N45714N31214N52722N78143N83315
13239I4864934N57063N04862M71114N03551N69481N72533M87319M05423M03367
13230I9339647M44188M66309M80801N01061M67549L52963K65427L13376M22362
13221A03053683M33407L47214L06944L49353L53998K69692K10843K55827L10731
13212A05891692K75851K10266K08511K28288J80567J03105R4107J33436J21528
13203A07447351N8254L3320O1225P5379P2811J04231J20093R672j70613k03326
$$ plain form
13193 107608397 107577552 107691232 107718602 107547300 107306021 107131550 106989395 106812903 106660613
13184 106660613 106594795 106514486 106271695 105896059 105552133 105304659 105070529 104788218 104487388
13175 104487388 104182004 103836781 103467788 103142810 102843792 102463545 101992303 101568222 101262937
13166 101262937 100952344 100509330 100001961 99561557 99155282 98658571 98091521 97600705 97220213
13157 97220213 96820198 96309920 95743909 95197414 94672894 94168910 93711138 93262391 92723164
13148 92723164 92085927 91478456 90981475 90505816 89934274 89294184 88694056 88161002 87638342
13139 87638342 87091654 86527684 85949039 85366133 84813541 84290333 83736853 83134959 82563282
13130 82563282 82073336 81584382 81001161 80366670 79780268 79227006 78629012 78020852 77510287
$$ packed form
13193A07608397l0845J13680K7370j71302k41279j74471j42155j76492j52290
13184A06660613o5818q0309k42791l75636l43926k47474k34130k82311l00830
13175A04487388l05384l45223l68993l24978k99018l80247m71242m24081l05285
13166A01262937l10593m43014n07369m40404m06275m96711n67050m90816l80492
13157I7220213m00015n10278n66011n46495n24520n03984m57772m48747n39227
13148I2723164o37237o07471m96981m75659n71542o40090o00128n33054n22660
13139H7638342n46688n63970n78645n82906n52592n23208n53480o01894n71677
13130H2563282m89946m88954n83221o34491n86402n53262n97994o08160n10565
$$ plain form
13121 77510287 77074428 76560927 75917726 75271378 74729982 74240926 73705642 73123463 72554090
13112 72554090 72025565 71535917 71068993 70570825 69995652 69402847 68903503 68480964 67993204
13103 67993204 67402436 66853868 66442386 66053589 65560256 65034854 64603984 64208354 63705308
13094 63705308 63135571 62671370 62323975 61918445 61380036 60844691 60426421 60052905 59620413
13085 59620413 59163563 58761313 58385679 57960641 57498182 57070475 56694721 56331239 55956676
13076 55956676 55567858 55152486 54721910 54333640 54016850 53713483 53357130 52971319 52620028
13067 52620028 52297219 51946723 51570168 51228434 50933638 50615966 50220862 49790259 49423244
13058 49423244 49176053 49002480 48781925 48431172 48009328 47668656 47463038 47265277 46947146
$$ packed form
13121G7510287m35859n13501o43201o46348n41396m89056n35284n82179n69373
13112G2554090n28525m89648m66924m98168n75173n92805m99344m22539m87760
13103F7993204n90768n48568m11482l88797m93333n25402m30870l95630n03046
13094F3705308n69737m64201l47395m05530n38409n35345m18270l73516m32492
13085E9620413m56850m02250l75634m25038m62459m27707l75754l63482l74563
13076E5956676l88818m15372m30576l88270l16790l03367l56353l85811l51291
13067E2620028l22809l50496l76555l41734k94796l17672l95104m30603l67015
13058D9423244k47191j73573k20555l50753m21844l40672k05618j97761l18131
$$ plain form
13049 46947146 46579656 46331441 46194197 45968000 45560559 45148557 44936815 44868323 44716808
13040 44716808 44408959 44092836 43884260 43704695 43439557 43135766 42924872 42807704 42643203
13031 42643203 42355336 42043002 41836717 41720758 41570463 41330196 41072890 40879626 40733423
13022 40733423 40569276 40378724 40207046 40066737 39915965 39732756 39558505 39436489 39341008
13013 39341008 39209866 39033797 38869446 38757519 38665629 38533502 38350742 38162745 38011358
13004 38011358 37897035 37797068 37694588 37582802 37461861 37343599 37245209 37167013 37087481 36988485
12994 36988485 36872107 36745312 36609628 36482075 36400040 36371989 36340817 36241369 36091588 35977129
12984 35977129 35935516 35909510 35842324 35761829 35716329 35674373 35572561 35444772 35401821 35459853 35489578
$$ packed form
13049D6947146l67490k48215j37244k26197m07441m12002k11742o8492j51515
13040D4716808l07849l16123k08576j79565k65138l03791k10894j17168j64501
13031D2643203k87867l12334k06285j15959j50295k40267k57306j93264j46203
13022D0733423j64147j90552j71678j40309j50772j83209j74251j22016r5481
13013C9341008j31142j76069j64351j11927r1890j32127j82760j87997j51387
13004C8011358j14323r9967j02480j11786j20941j18262r8390p8196p9532r8996
12994C6988485j16378j26795j35684j27553q2035k8051l1172r9448j49781j14459
12984C5977129m1613k6006o7186q0495m5500m1956j01812j27789m2951N8032K9725
$$ plain form
12973 35489578 35397216 35267419 35228563 35243165 35169476 35006017 34907910 34923876 34891193 34701410
12963 34701410 34522410 34579627 34802170 34895024 34745034 34544732 34478082 34491255 34465463 34426872
12953 34426872 34441666 34453088 34393925 34347350 34410091 34484683 34414954 34268429 34253432 34374930 34420378
12942 34420378 34316950 34249026 34335713 34434723 34405012 34347123 34399480 34477743 34436364 34351438 34397905
12931 34397905 34533522 34561553 34469633 34450241 34576232 34702436 34738036 34783239 34906537 34998463
12921 34998463 34974964 34950692 35057387 35224511 35302313 35303893 35359720 35496779 35624454 35705763
12911 35705763 35792532 35900167 35982985 36043615 36150160 36323742 36505552 36655086 36793430 36931142
12901 36931142 37041787 37133623 37263340 37444214 37619594 37767344 37949359 38200057 38441265
$$ packed form
12973C5489578r2362j29797l8856J4602p3689j63459r8107J5966l2683j89783
12963C4701410j79000N7217K22543R2854j49990k00302o6650J3173k5792l8591
12953C4426872J4794J1422n9163m6575O2741P4592o9729j46525j4997J21498M5448
12942C4420378j03428o7924Q6687R9010k9711n7889N2357P8263m1379q4926M6467
12931C4397905J35617K8031r1920j9392J25991J26204L5600M5203J23298R1926
12921C4998463k3499k4272J06695J67124P7802J580N5827J37059J27675Q1309
12911C5705763Q6769J07635Q2818O0630J06545J73582J81810J49534J38344J37712
12901C6931142J10645R1836J29717J80874J75380J47750J82015K50698K41208
$$ plain form
12892 38441265 38588960 38690864 38862608 39114407 39344196 39506918 39687881 39966554 40290641
12883 40290641 40553524 40742848 40933828 41165261 41407038 41643663 41902607 42183211 42440378
12874 42440378 42673213 42951515 43304507 43659155 43955873 44250287 44607923 44966108 45227564
12865 45227564 45451113 45795968 46270207 46688587 46929689 47101052 47374200 47767082 48179505
12856 48179505 48555329 48913004 49279208 49677659 50128217 50586000 50950137 51209523 51499687
12847 51499687 51921516 52390077 52782738 53151104 53625052 54162618 54586470 54866580 55180106
12838 55180106 55648594 56178586 56631009 57011606 57408703 57848477 58297988 58733160 59133165
12829 59133165 59477607 59806803 60210917 60704488 61189041 61593791 61966594 62363133 62743488
$$ packed form
12892C8441265J47695J01904J71744K51799K29789J62722J80963K78673L24087
12883D0290641K62883J89324J90980K31433K41777K36625K58944K80604K57167
12874D2440378K32835K78302L52992L54648K96718K94414L57636L58185K61456
12865D5227564K23549L44855M74239M18380K41102J71363K73148L92882M12423
12856D8179505L75824L57675L66204L98451M50558M57783L64137K59386K90164
12847E1499687M21829M68561L92661L68366M73948N37566M23852K80110L13526
12838E5180106M68488N29992M52423L80597L97097M39774M49511M35172M00005
12829E9133165L44442L29196M04114M93571M84553M04750L72803L96539L80355
$$ plain form
12820 62743488 63066472 63397896 63814720 64265387 64640061 64936886 65248060 65610667 65978088
12811 65978088 66320232 66649088 66954309 67211481 67452370 67733990 68034848 68272859 68437426
12802 68437426 68616123 68867525 69143494 69365583 69516687 69632249 69752564 69901766 70068641
12793 70068641 70201505 70267035 70305665 70371782 70439330 70450495 70442729 70511996 70634948 70658490 70522628
12782 70522628 70370103 70341708 70367272 70284928 70094275 69939636 69868494 69766276 69559777 69342591
12772 69342591 69220243 69132574 68937022 68618068 68303156 68074040 67860324 67556971 67178966
12763 67178966 66838154 66594987 66392220 66134408 65786536 65383684 64982425 64622021 64302045
12754 64302045 63974552 63584423 63141376 62722606 62372045 62029778 61611963 61137699 60708534
$$ packed form
12820F2743488L22984L31424M16824M50667L74674K96825L11174L62607L67421
12811F5978088L42144L28856L05221K57172K40889K81620L00858K38011J64567
12802F8437426J78697K51402K75969K22089J51104J15562J20315J49202J66875
12793G0068641J32864O5530L8630O6117O7548J1165p766O9267J22952K3542j35862
12782G0522628j52525k8395K5564q2344j90653j54639p1142j02218k06499k17186
12772F9342591j22348q7669j95552l18954l14912k29116k13716l03353l78005
12763F7178966l40812k43167k02767k57812l47872m02852m01259l60404l19976
12754F4302045l27493l90129m43047m18770l50561l42267m17815m74264m29165
$$ plain form
12745 60708534 60361300 60012807 59577696 59081789 58613867 58205314 57808921 57376499 56909183
12736 56909183 56435663 55978758 55545151 55118949 54663710 54158157 53635462 53162234 52766850
12727 52766850 52406972 52021776 51600418 51177107 50766375 50335895 49859522 49372701 48940396
12718 48940396 48573235 48211580 47804568 47372484 46968306 46604444 46248539 45874008 45481653
12709 45481653 45081472 44684051 44303732 43943227 43582019 43204281 42826966 42474381 42140407
12700 42140407 41804534 41464278 41116952 40738882 40334953 39980804 39741843 39559814 39301701
12691 39301701 38931341 38552714 38259843 38022839 37763051 37470682 37190600 36938853 36690008
12682 36690008 36422372 36138271 35859848 35620171 35423644 35209743 34912817 34568344 34284739
$$ packed form
12745F0708534l47234l48493m35111m95907m67922m08553l96393m32422m67316
12736E6909183m73520m56905m33607m26202m55239n05553n22695m73228l95384
12727E2766850l59878l85196m21358m23311m10732m30480m76373m86821m32305
12718D8940396l67161l61655m07012m32084m04178l63862l55905l74531l92355
12709D5481653m00181l97421l80319l60505l61208l77738l77315l52585l33974
12700D2140407l35873l40256l47326l78070m03929l54149k38961j82029k58113
12691C9301701l70360l78627k92871k37004k59788k92369k80082k51747k48845
12682C6690008k67636k84101k78423k39677j96527k13901k96926l44473k83605
$$ plain form
12673 34284739 34086057 33871955 33577317 33274311 33046971 32859529 32642362 32422008 32249582
12664 32249582 32071597 31808976 31516208 31312254 31176746 30972964 30677935 30428271 30299116
12655 30299116 30188236 29986157 29729747 29501487 29289127 29048400 28817780 28657849 28533959
12646 28533959 28367810 28168085 28005338 27878332 27709749 27478304 27261461 27119511 27008559
12637 27008559 26849937 26640850 26449740 26318426 26209212 26058638 25860500 25668938 25520942
12628 25520942 25391563 25247089 25103760 24987157 24866644 24701692 24535215 24448804 24420188 24330254
12618 24330254 24144158 23974277 23899303 23830927 23662789 23460004 23361305 23345265 23251346 23028946
12608 23028946 22813283 22718433 22689526 22624299 22525862 22443347 22347988 22182403 21989297 21875917
$$ packed form
12673C4284739j98682k14102k94638l03006k27340j87442k17167k20354j72426
12664C2249582j77985k62621k92768k03954j35508k03782k95029k49664j29155
12655C0299116j10880k02079k56410k28260k12360k40727k30620j59931j23890
12646B8533959j66149j99725j62747j27006j68583k31445k16843j41950j10952
12637B7008559j58622k09087j91110j31314j09214j50574j98138j91562j47996
12628B5520942j29379j44474j43329j16603j20513j64952j66477q6411k8616q9934
12618B4330254j86096j69881p4974o8376j68138k02785r8699j6040r3919k22400
12608B3028946k15663r4850k8907o5227r8437q2515r5359j65585j93106j13380
$$ plain form
12598 21875917 21853490 21810219 21667194 21482142 21355728 21293500 21221750 21112031 21021174 20996532
12588 20996532 20993362 20924351 20772025 20613362 20528567 20512954 20494873 20425230 20326900 20253420 20214878
12577 20214878 20162739 20055235 19924806 19853453 19870594 19900511 19839755 19676294 19501301 19404099
12567 19404099 19384439 19373912 19319397 19234135 19176154 19176252 19186396 19125790 18993070 18886692 18870441
12556 18870441 18871709 18792583 18676689 18646036 18686675 18646742 18483189 18356587 18394110 18492831 18481412
12545 18481412 18369966 18290984 18268344 18211636 18103064 18023354 17995581 17956365 17894287 17870539 17878150
12534 17878150 17826859 17708346 17632424 17641766 17634386 17549493 17487951 17534851 17587945 17510483 17366022
12523 17366022 17332692 17425579 17474464 17383064 17255566 17218997 17245680 17230703 17162280 17120707 17140401
$$ packed form
12598B1875917k2427m3271j43025j85052j26414o2228p1750j09719r0857k4642
12588B0996532l170o9011j52326j58663q4795j5613j8081o9643r8330p3480l8542
12577B0214878n2139j07504j30429p1353J7141K9917o0756j63461j74993r7202
12567A9404099j9660j0527n4515q5262n7981R8J0144o0606j32720j06378j6251
12556A8870441J268p9126j15894l0653M0639l9933j63553j26602L7523R8721j1419
12545A8481412j11446p8982k2640n6708j08572p9710k7773l9216o2078k3748P611
12534A7878150n1291j18513p5922R342p380q4893o1542M6900N3094p7462j44461
12523A7366022l3330R2887M8885r1400j27498l6569K6683j4977o8423m1573J9694
$$ plain form
12512 17140401 17158183 17110547 17027172 16991173 17025096 17057975 17018339 16925617 16854236 16830441 16816936
12501 16816936 16790661 16770210 16755442 16709786 16632980 16587044 16607742 16647910 16655256 16646105 16643262 16603465
12489 16603465 16490920 16378295 16373452 16458879 16500733 16429123 16326533 16307871 16375197 16431808 16407525
12478 16407525 16335172 16305704 16354603 16401794 16334749 16158440 16010551 15995578 16062741 16102633 16101779
12467 16101779 16116141 16140880 16117258 16049695 16003468 15985939 15941624 15878729 15883542 15970714 16028699
12456 16028699 15974885 15874695 15835410 15853983 15847805 15786031 15716651 15692353 15722885 15774314 15781376
12445 15781376 15702244 15592273 15565674 15642940 15703714 15648481 15537172 15489801 15512464 15519819 15485432
12434 15485432 15458529 15449339 15407412 15320690 15243248 15210053 15202572 15207534 15230033 15240741 15198059 15136607
$$ packed form
12512A7140401J7782m7636q3375l5999L3923L2879l9636r2722p1381k3795j3505
12501A6816936k6275k0451j4768m5656p6806m5936K0698M0168P346r151k843l9797
12489A6603465j12545j12625m843Q5427M1854p1610j02590j8662O7326N6611k4283
12478A6407525p2353k9468M8899M7191o7045j76309j47889j4973O7163L9892q54
12467A6101779J4362K4739k3622o7563m6227j7529m4315o2895M813Q7172N7985
12456A6028699n3814j00190l9285J8573o178o1774o9380k4298L0532N1429P062
12445A5781376p9132j09971k6599P7266O0774n5233j11309m7371K2663P355l4387
12434A5485432k6903r190m1927q6722p7442l3195p481M962K2499J0708m2682o1452
$$ plain form
12422 15136607 15136590 15180229 15149560 15018031 14926625 14977715 15055764 14984499 14797094 14694449 14750829
12411 14750829 14819163 14761186 14629342 14548841 14534408 14522729 14504610 14511392 14517106 14467561 14387004
12400 14387004 14350876 14359379 14342184 14292117 14280264 14312552 14291424 14179149 14087511 14113575 14176651
12389 14176651 14135282 14006138 13934405 13969471 14001498 13933594 13804118 13706070 13677037 13705601 13766505
12378 13766505 13808129 13773788 13677074 13597765 13570480 13542304 13475978 13419770 13419325 13428494 13381589 13305695
12366 13305695 13280348 13311272 13321428 13264310 13184160 13152004 13180116 13213473 13191216 13111367 13029262
12355 13029262 12981739 12938376 12869684 12831058 12892282 12992704 12984281 12849592 12750881 12794168 12869800
12344 12869800 12835220 12744587 12746780 12828262 12831197 12707554 12590913 12595175 12677441 12735827 12731643
$$ packed form
12422A5136607j7M3639l0669j31529r1406N1090P8049p1265j87405j02645N6380
12411A4750829O8334n7977j31844q0501j4433j1679j8119O782N714m9545q0557
12400A4387004l6128Q503j7195n0067j1853L2288k1128j12275r1638K6064O3076
12389A4176651m1369j29144p1733L5066L2027o7904j29476r8048k9033K8564O0904
12378A3766505M1624l4341r6714p9309k7285k8176o6326n6208m45R169m6905p5894
12366A3305695k5347L0924J0156n7118q0150l2156K8112L3357k2257p9849q2105
12355A3029262m7523m3363o8692l8626O1224J00422q423j34689r8711M3287P5632
12344A2869800l4580r0633K193Q1482K935j23643j16641M262Q2266N8386m184
$$ plain form
12333 12731643 12676749 12595045 12533795 12533604 12560604 12542051 12479925 12444385 12449419 12439290 12414016 12448271
12321 12448271 12545106 12590097 12516005 12410338 12384686 12426090 12456237 12457808 12457646 12452089 12433735 12436055
12309 12436055 12472566 12486067 12436102 12381192 12389836 12422148 12394192 12319663 12288260 12326483 12374560
12298 12374560 12391280 12396183 12409451 12423547 12435523 12447756 12443013 12412148 12388709 12399393 12407091 12371330
12286 12371330 12336144 12372500 12450693 12466113 12394998 12331047 12348186 12413448 12468282 12517339 12585719
12275 12585719 12645015 12643052 12585615 12542585 12570869 12650107 12703197 12686200 12649875 12679395 12768457
12264 12768457 12810850 12750723 12675936 12697123 12791066 12852499 12858236 12872059 12908741 12913573 12883200
12253 12883200 12888828 12950220 12994618 12984916 12989711 13066290 13157625 13176940 13134878 13115543 13169314 13283502
$$ packed form
12333A2731643n4894q1704o1250j91K7000j8553o2126l5540N034j0129k5274L4255
12321A2448271R6835M4991p4092j05667k5652M1404L0147J571j62n557j8354K320
12309A2436055L6511J3501m9965n4910Q644L2312k7956p4529l1403L8223M8077
12298A2374560J6720M903J3268J4096J1976J2233m743l0865k3439J0684P698l5761
12286A2371330l5186L6356P8193J5420p1115o3951J7139O5262N4834M9057O8380
12275A2585719N9296j963n7437m3030K8284P9238N3090j6997l6325K9520Q9062
12264A2768457M2393o0127p4787K1187R3943O1433N737J3823L6682M832l0373
12253A2883200N628O1392M4398r702M795P6579R1335J9315m2062j9335N3771J14188
$$ plain form
12241 13283502 13417641 13517659 13535525 13486453 13454678 13498388 13580357 13631746 13648280 13678546 13747912
12230 13747912 13840365 13935119 14022539 14098804 14171350 14253463 14339994 14414764 14487621 14582019 14678990
12219 14678990 14731271 14750389 14812950 14950453 15102939 15222911 15349845 15521966 15686743 15781838
12209 15781838 15852412 15994965 16211374 16405126 16513423 16571106 16646022 16769722 16930108 17084940
12199 17084940 17187038 17231566 17262995 17308042 17338788 17339085 17353798 17410833 17444673 17377562 17240153
12188 17240153 17125326 17050676 16960640 16846047 16757035 16695430 16597253 16443661 16298244 16202309
12178 16202309 16113010 15984903 15845694 15745758 15681665 15610097 15502543 15358865 15199542 15064624
12168 15064624 14988615 14960748 14936545 14891203 14830184 14754610 14660777 14569446 14506449 14456551 14386189
$$ packed form
12241A3283502J34139J00018J7866m9072l1775M3710Q1969N1389J6534L0266O9366
12230A3747912R2453R4754Q7420P6265P2546Q2113Q6531P4770P2857R4398R6971
12219A4678990N2281J9118O2561J37503J52486J19972J26934J72121J64777R5095
12209A5781838P0574J42553K16409J93752J08297N7683P4916J23700J60386J54832
12199A7084940J02098M4528L1429M5047L0746K97J4713N7035L3840o7111j37409
12188A7240153j14827p4650r0036j14593q9012o1605r8177j53592j45417r5935
12178A6202309q9299j28107j39209r9936o4093p1568j07554j43678j59323j34918
12168A5064624p6009k7867k4203m5342o1019p5574r3833r1331o2997m9898p0362
$$ plain form
12157 14386189 14306695 14260667 14251936 14247269 14238101 14234967 14213534 14145886 14077391 14080052 14127350 14116405
12145 14116405 14028041 13957520 13959768 13975673 13953185 13928936 13933100 13922718 13879432 13869373 13926023
12134 13926023 13973167 13952235 13925692 13951834 13959127 13873457 13780831 13809645 13913913 13941097 13881155
12123 13881155 13871843 13956220 14009501 13946620 13851002 13834097 13889635 13955945 14018047 14072957 14081262
12112 14081262 14032827 13993071 14008961 14026757 13978945 13904538 13899082 13971070 14029752 14014610 13969311
12101 13969311 13968697 14019377 14065011 14070771 14065949 14090523 14127392 14130848 14117582 14163620 14279778 14361818
12089 14361818 14332792 14271807 14299013 14376942 14361201 14240141 14169194 14227635 14295138 14257731 14203035
12078 14203035 14280696 14459129 14569226 14546177 14486227 14476591 14501881 14530974 14574986 14624432 14632195
$$ packed form
12157A4386189p9494m6028q731m667r168l134k1433o7648o8495K661M7298j0945
12145A4116405q8364p0521K248J5905k2488k4249M164j0382m3286j0059N6650
12134A3926023M7144k0932k6543K6142P293q5670r2626K8814J04268K7184n9942
12123A3881155r312Q4377N3281o2881r5618j6905N5538O6310O2102N4910Q305
12112A4081262m8435l9756J5890J7796m7812p4407n456P1988N8682j5142m5299
12101A3969311o14N0680M5634N760m822K4574L6869L456j3266M6038J16158Q2040
12089A4361818k9026o0985K7206P7929j5741j21060p0947N8441O7503l7407n4696
12078A4203035P7661J78433J10097k3049n9950r636K5290K9093M4012M9446P763
$$ plain form
12067 14632195 14606192 14630524 14736769 14830113 14815754 14743217 14742406 14844649 14949633 14968699 14928845
12056 14928845 14912674 14946984 14986567 14984794 14950265 14937679 14993495 15103591 15191927 15187871 15103686
12045 15103686 15028073 15030856 15093704 15154152 15194573 15248211 15324000 15374085 15356150 15295224 15256075
12034 15256075 15272999 15330990 15400570 15463855 15512811 15546366 15572604 15602981 15643137 15688051 15717158
12023 15717158 15703306 15652511 15626748 15682848 15785815 15839711 15820502 15809567 15861105 15914431 15899922
12012 15899922 15857915 15865491 15907020 15922341 15933813 16001973 16086528 16090177 16032252 16032409 16108140 16141906
$$ packed form
12067A4632195k6003K4332J06245R3344j4359p2537q11J02243J04984J9066l9854
12056A4928845j6171L4310L9583j773l4529j2586N5816J10096Q8336m056q4185
12045A5103686p5613K783O2848O0448M0421N3638P5789N0085j7935o0926l9149
12034A5256075J6924N7991O9580O3285M8956L3555K6238L0377M0156M4914K9107
12023A5717158j3852n0795k5763N6100J02967N3896j9209j0935N1538N3326j4509
12012A5899922m2007P576M1529J5321J1472O8160Q4555L649n7925J57P5731L3766
$$ [...]
##END NTUPLES=NMR SPECTRUM
##END=
