##TITLE=1H ikalashn
CA-9279-5
23.10.2024
##JCAMPDX= 6.0         $$ Bruker NMR JCAMP-DX V2.0
##DATA TYPE= NMR SPECTRUM
##DATA CLASS= NTUPLES
##ORIGIN= UXNMR, Bruker Analytische Messtechnik GmbH
##OWNER= root
$$ TOPSPIN		Version 1.3
$$ 2024-10-23 16:03:12.390 +0400  Irina@DPX200
$$ Compression mode = diff/dup
##.OBSERVE FREQUENCY= 200.131300845
##.OBSERVE NUCLEUS= ^1H
##.ACQUISITION MODE= SIMULTANEOUS
##.ACQUISITION SCHEME= undefined
##.AVERAGES= 16
##.DIGITISER RES= 18
##SPECTROMETER/DATA SYSTEM= spect
##.PULSE SEQUENCE= zg
##.SOLVENT NAME= CDCl3
##.SHIFT REFERENCE= INTERNAL, CDCl3, 1, 17.49637
##AUDIT TRAIL= $$ (NUMBER, WHEN, WHO, WHERE, WHAT)
$$ ##TITLE= Audit trail, TOPSPIN		Version 1.3
$$ ##JCAMPDX= 5.01
$$ ##ORIGIN= Bruker BioSpin GmbH
$$ ##OWNER= Irina
$$ $$ F:/spectra/data/iren/nmr/1H/4/pdata/1/auditp.txt
$$ ##AUDIT TRAIL=  $$ (NUMBER, WHEN, WHO, WHERE, VERSION, WHAT)
(   1,<2024-10-23 16:01:53.765 +0400>,<Irina>,<DPX200>,<TOPSPIN 1.3>,
      <created by zg
	started at 2024-10-23 16:00:45.500 +0400,
	POWCHK disabled, PULCHK disabled
       configuration hash MD5:
       BE 6D 3F 07 2A EA 11 49 91 17 2B D3 AF B3 58 0D
       data hash MD5: 16K
       6E C2 89 29 7D BD F1 2C 52 0A B5 3A 0A B2 45 A2>)
(   2,<2024-10-23 16:02:57.000 +0400>,<Irina>,<DPX200>,<TOPSPIN 1.3>,
      <Start of raw data processing
       fp BC_mod = 2 FT_mod = 6 PKNL = 1 PHC0 = -39.08723 PHC1 = -1.886807 SI = 32K 
       data hash MD5: 32K
       08 2C B7 7E 18 34 E8 A3 39 C3 E6 49 36 F8 1B 15>)
(   3,<2024-10-23 16:02:59.828 +0400>,<Irina>,<DPX200>,<TOPSPIN 1.3>,
      <abs n ABSG = 5 
       data hash MD5: 32K
       5E AA C1 5A 8E 49 21 AB 75 C6 64 5D 14 58 6C 2B>)
$$ ##END=
$$ 
$$ $$ hash MD5
$$ $$ D9 4C CD 62 92 3B 6B 2A 13 3B 44 2B 0B B1 B2 BC
##$RELAX= 
##$RELAX= 
##$RELAX= 
##$RELAX= 
##$RELAX= 
##$RELAX= 
##$RELAX= 
##$RELAX= 
##$RELAX= 
$$ Bruker specific parameters
$$ --------------------------
##$DU= <F:/spectra>
##$EXPNO= 4
##$NAME= <1H>
##$PROCNO= 1
##$TYPE= <nmr>
##$USER= <iren>
##$AMP= (0..31)
100 100 100 100 100 100 100 100 100 100 100 100 100 100 100 100 100 100 
100 100 100 100 100 100 100 100 100 100 100 100 100 100 
##$ANAVPT= -1
##$AQSEQ= 0
##$AQ_mod= 1
##$AUNM= <au_zg>
##$AUTOPOS= <>
##$BF1= 200.13
##$BF2= 200.13
##$BF3= 200.13
##$BF4= 200.13
##$BF5= 200.13
##$BF6= 200.13
##$BF7= 200.13
##$BF8= 200.13
##$BYTORDA= 1
##$CFDGTYP= 0
##$CFRGTYP= 5
##$CHEMSTR= <none>
##$CNST= (0..63)
1 1 145 1 1 1 1 1 1 1 1 1 1 1 1 1 1 1 1 1 1 1 1 1 1 1 1 1 1 1 1 1 1 1 
1 1 1 1 1 1 1 1 1 1 1 1 1 1 1 1 1 1 1 1 1 1 1 1 1 1 1 1 1 1 
##$CPDPRG= <>
##$CPDPRG1= <>
##$CPDPRG2= <>
##$CPDPRG3= <>
##$CPDPRG4= <mlev>
##$CPDPRG5= <mlev>
##$CPDPRG6= <mlev>
##$CPDPRG7= <mlev>
##$CPDPRG8= <mlev>
##$CPDPRGB= <>
##$CPDPRGT= <>
##$D= (0..63)
0 2 0 0 0 0 0 0 0 0.06 0 0.03 0 0 0 0 0.0002 0 0 0 0 0 0 0 0 0 0 0 0 0 
0 0 0 0 0 0 0 0 0 0 0 0 0 0 0 0 0 0 0 0 0 0 0 0 0 0 0 0 0 0 0 0 0 0 
##$DATE= 1729684910
##$DBL= (0..7)
120 120 120 120 120 120 120 120 
##$DBP= (0..7)
$$ [...]
##$SW_h= 4401.40845070422
##$TD= 16384
##$TD0= 1
##$TE= 300
##$TE2= 300
##$TE3= 300
##$TEG= 300
##$TL= (0..7)
0 120 120 120 120 120 120 120 
##$TP= (0..7)
150 150 150 150 150 150 150 150 
##$TP07= 0
##$TPNAME0= <>
##$TPNAME1= <>
##$TPNAME2= <>
##$TPNAME3= <>
##$TPNAME4= <>
##$TPNAME5= <>
##$TPNAME6= <>
##$TPNAME7= <>
##$TPOAL= (0..7)
0.5 0.5 0.5 0.5 0.5 0.5 0.5 0.5 
##$TPOFFS= (0..7)
0 0 0 0 0 0 0 0 
##$TUNHIN= 0
##$TUNHOUT= 0
##$TUNXOUT= 0
##$USERA1= <user>
##$USERA2= <user>
##$USERA3= <user>
##$USERA4= <user>
##$USERA5= <user>
##$V9= 5
##$VALIST= <valist>
##$VCLIST= <CCCCCCCCCCCCCCC>
##$VD= 0
##$VDLIST= <DDDDDDDDDDDDDDD>
##$VPLIST= <PPPPPPPPPPPPPPP>
##$VTLIST= <TTTTTTTTTTTTTTT>
##$WBST= 1024
##$WBSW= 25
##$XGAIN= (0..3)
0 0 0 0 
##$XL= 0
##$YL= 0
##$YMAX_a= 1069956
##$YMIN_a= -1263216
##$ZGOPTNS= <>
##$ZL1= 120
##$ZL2= 120
##$ZL3= 120
##$ZL4= 120
##$ABSF1= 17.49637
##$ABSF2= -4.496376
##$ABSG= 5
##$ABSL= 3
##$ALPHA= 0
##$AQORDER= 0
##$ASSFAC= 0
##$ASSFACI= 0
##$ASSFACX= 0
##$ASSWID= 0
##$AUNMP= <proc_1d>
##$AXLEFT= 0
##$AXRIGHT= 0
##$AXTYPE= 0
##$AXUNIT= <>
##$AZFE= 0.1
##$AZFW= 0.1
##$BCFW= 0
##$BC_mod= 2
##$BYTORDP= 0
##$COROFFS= 0
##$CY= 7568.61572265625
##$DATMOD= 1
##$DC= 0
##$DFILT= <>
##$DTYPP= 0
##$F1P= 17.9538593292236
##$F2P= -4.03888763876832
##$FCOR= 0.5
##$FTSIZE= 32768
##$FT_mod= 6
##$GAMMA= 0
##$GB= 0
##$INTBC= 0
##$INTSCL= 1.936888e-010
##$ISEN= 128
##$LB= 0
##$LEV0= 0
##$LPBIN= 0
##$MAXI= 945.577
##$MC2= 0
##$MEAN= 0
##$ME_mod= 0
##$MI= -402.1523
##$NCOEF= 0
##$NC_proc= -4
##$NLEV= 6
##$NOISF1= 8.587773
##$NOISF2= 6.764455
##$NSP= 0
##$NTH_PI= 0
##$NZP= 0
##$OFFSET= 17.49637
##$PC= 1
##$PHC0= -39.08723
##$PHC1= -1.886807
##$PH_mod= 1
##$PKNL= yes
##$PPARMOD= 0
##$PPDIAG= 0
##$PPIPTYP= 0
##$PPMPNUM= 100
##$PPRESOL= 1
##$PSCAL= 0
##$PSIGN= 0
##$REVERSE= no
##$SF= 200.13
##$SI= 32768
##$SIGF1= 16.12182
##$SIGF2= -4.496377
##$SINO= 3.521527
##$SIOLD= 32768
##$SREGLST= <1H.CDCl3>
##$SSB= 0
##$STSI= 32768
##$STSR= 0
##$SW_p= 4401.40845070422
##$SYMM= 0
##$S_DEV= 0
##$TDeff= 16384
##$TDoff= 0
##$TI= <>
##$TILT= no
##$TM1= 0
##$TM2= 0
##$TOPLEV= 0
##$USERP1= <user>
##$USERP2= <user>
##$USERP3= <user>
##$USERP4= <user>
##$USERP5= <user>
##$WDW= 0
##$XDIM= 32768
##$YMAX_p= 289296704
##$YMIN_p= -271315
$$ End of Bruker specific parameters
$$ ---------------------------------
##NTUPLES= NMR SPECTRUM
##VAR_NAME=  FREQUENCY,     SPECTRUM/REAL,   SPECTRUM/IMAG
##SYMBOL=    X,             R,               I
##VAR_TYPE=  INDEPENDENT,   DEPENDENT,       DEPENDENT
##VAR_FORM=  AFFN,          ASDF,            ASDF
##VAR_DIM=   32768,         32768,           32768
##UNITS=     HZ,            ARBITRARY UNITS, ARBITRARY UNITS
##FACTOR=    0.134324425510551, 1,           1
##FIRST=     4401.40845070422, 32079,        -846883
##LAST=      0,             -5412,           -883038
##MIN=       0,             -271315,         0
##MAX=       4401.40845070422, 289296704,    0
$$ Real data points
##PAGE= N=1
##DATA TABLE= (X++(R..R)), XYDATA
$$ [...]
14561 -95179 -73535 -73470 -91996 -104800 -104102 -104434 -110460 -109342 -99337 -96798 -107132 -114489 -108513 -98348
14547 -98348 -93129 -91199 -95009 -112924 -137992 -147740 -134576 -116098 -107482 -104453 -100610 -98977 -98024 -89169
14533 -89169 -77257 -80064 -97839 -108019 -100987 -94647 -100501 -103917 -95754 -94655 -114313 -134207 -130366
14520 -130366 -114522 -114245 -131043 -146174 -153112 -155948 -148934 -127329 -108535 -112793 -129578 -130641 -110882
14507 -110882 -90547 -83094 -86823 -101571 -125449 -139807 -126734 -99420 -87159 -92571 -93361 -84925 -87668
14494 -87668 -107766 -123754 -121817 -115116 -116477 -118608 -114567 -113255 -119523 -120430 -107374 -93891 -95377 -105280
14480 -105280 -106214 -94522 -82610 -84611 -105096 -132909 -145560 -132569 -112547 -110288 -121150 -121519 -110638
14467 -110638 -110802 -124848 -129623 -119469 -117772 -131200 -132444 -109769 -93982 -107133 -121736 -107261
14455 -107261 -84210 -89519 -114837 -125107 -117735 -115199 -115250 -100027 -84144 -98903 -131238 -134080 -102762
14442 -102762 -85905 -107437 -131925 -128824 -119797 -131300 -144966 -133717 -112103 -108931 -115933 -106600
14430 -106600 -88330 -92892 -123324 -148812 -150004 -136690 -121431 -106254 -97367 -104689 -121388 -127266
14418 -127266 -117416 -106576 -101808 -93896 -82063 -83342 -104653 -124675 -119846 -96354 -80696 -85708 -100228
14405 -100228 -109116 -110617 -112032 -116500 -119135 -115035 -108019 -107774 -116616 -123164 -114630 -93980 -79312 -85670
14391 -85670 -110324 -134774 -139701 -122732 -104578 -109753 -134973 -146967 -123475 -86189 -74323 -91907
14379 -91907 -105817 -97002 -85853 -95404 -114543 -118396 -107990 -104992 -116055 -127038 -129912 -132116 -136737
14366 -136737 -134439 -121657 -109195 -104163 -98701 -86941 -79435 -87427 -102875 -108655 -102475 -96956 -100176
14353 -100176 -109176 -119345 -126739 -123911 -109002 -98115 -110632 -138626 -149638 -128785 -101042 -98236
14341 -98236 -118106 -133395 -131397 -123937 -122134 -122271 -119455 -118055 -122092 -126993 -126520 -119723 -109054 -100549
14327 -100549 -105242 -127389 -150551 -151367 -131307 -117624 -125487 -137383 -132007 -115650 -107348 -107627 -104183
14314 -104183 -98995 -104904 -118351 -120173 -106140 -94437 -96578 -101104 -95935 -89501 -96378 -114134 -127720
14301 -127720 -128788 -119733 -106274 -96861 -101927 -121028 -135769 -128798 -107523 -96046 -103813 -115489 -114964
14288 -114964 -106690 -105327 -113159 -118996 -116681 -113620 -117871 -124813 -123700 -114253 -108534 -114997 -127705 -135328
14274 -135328 -134929 -130809 -124666 -115759 -108574 -110099 -118148 -121606 -115481 -107773 -107588 -113807 -119909 -122684 -121042
14259 -121042 -113592 -103747 -100130 -104468 -106211 -98244 -90771 -97223 -111702 -116056 -108153 -105906 -118979 -133062
14245 -133062 -132056 -122483 -121493 -128571 -125857 -105903 -84717 -82711 -101887 -126464 -139410 -134799 -120512
14232 -120512 -113127 -123630 -142772 -146974 -125921 -98477 -91745 -108769 -128684 -135885 -133784 -128483 -117136
14219 -117136 -101235 -94774 -103908 -110379 -94251 -66565 -58485 -78926 -103648 -110067 -103144 -99129 -102032
14206 -102032 -108160 -118452 -131102 -133466 -118312 -100834 -102474 -121247 -133836 -125973 -106372 -90591
14194 -90591 -85480 -91685 -107360 -123419 -125942 -110943 -90980 -82096 -88585 -102769 -113858 -114596 -105643
14181 -105643 -96774 -98263 -108128 -113739 -109265 -104795 -112239 -126952 -131495 -117670 -98337 -93234 -105288
14168 -105288 -116702 -111403 -96096 -90666 -99504 -105096 -94685 -80214 -80980 -96358 -109329 -110467 -104205
14155 -104205 -96558 -91568 -95072 -105568 -106364 -86647 -66507 -76405 -111235 -132286 -120835 -101039 -98026
14142 -98026 -102917 -99067 -96372 -112371 -137657 -148198 -140322 -128771 -120884 -116202 -119729 -130475 -129442
14129 -129442 -106853 -88107 -99996 -123837 -122097 -102358 -106001 -133651 -137792 -103637 -80679 -104012
14117 -104012 -135008 -123195 -87130 -82015 -113404 -137908 -135452 -126574 -121970 -107732 -86951 -87503 -113645
14104 -113645 -130993 -118506 -99705 -100784 -110096 -105838 -97154 -106352 -127811 -136074 -125866 -115939 -116698
14091 -116698 -118609 -113685 -108204 -109784 -115924 -119753 -118413 -113846 -110788 -112440 -114059 -106566 -91804 -85241
14077 -85241 -94869 -107282 -106640 -98129 -97596 -105691 -110170 -109037 -111718 -118272 -117475 -108496 -105673 -115837 -127485
14062 -127485 -130011 -128344 -129133 -126675 -115064 -103397 -104323 -113588 -115182 -105205 -98364 -108245 -129000 -140748
14048 -140748 -130631 -106370 -88881 -91458 -107860 -122714 -129827 -133869 -136476 -131195 -115527 -99726
14036 -99726 -97399 -110433 -126586 -130522 -117753 -100421 -96120 -106524 -113682 -106273 -99979 -114437 -137251
14023 -137251 -137184 -114157 -105232 -128772 -152624 -140627 -106808 -93506 -111062 -131960 -137313 -135596 -134592
14010 -134592 -126330 -108483 -95837 -98982 -109644 -116518 -119961 -122982 -122714 -119183 -119308 -124889 -128743 -128136
13996 -128136 -128851 -131401 -128249 -119981 -117808 -123565 -124745 -117311 -114696 -124016 -132615 -130424 -125585 -123078
13982 -123078 -109930 -82466 -67683 -90184 -132141 -154832 -149884 -140002 -136811 -130530 -119593 -117466
13970 -117466 -125045 -125491 -114347 -108587 -116645 -124335 -121370 -118220 -123838 -129016 -126376 -125511 -131576 -129741
13956 -129741 -111645 -98866 -114643 -144618 -152694 -130314 -104958 -101083 -115443 -132796 -144734 -147407
13944 -147407 -138857 -127265 -128215 -144481 -158362 -153143 -135046 -124594 -129830 -137358 -131460 -115730 -109530
13931 -109530 -122727 -140899 -142657 -127854 -116911 -121321 -129211 -127145 -121841 -126700 -137266 -137702 -126979
13918 -126979 -120463 -125003 -129090 -122485 -112205 -111427 -120754 -128030 -123770 -112883 -110872 -126249 -146080
13905 -146080 -147018 -126203 -110245 -121413 -145289 -150469 -133471 -120585 -126203 -135344 -133484 -128218 -129024
13892 -129024 -128168 -118527 -111515 -117679 -124890 -117692 -106325 -112082 -130688 -135731 -118066 -98771 -98908 -114957
13878 -114957 -129579 -131869 -122223 -109944 -109244 -125460 -143655 -144170 -130132 -123549 -132497 -141224 -137902
13865 -137902 -131667 -132343 -132959 -126362 -122094 -130183 -142134 -145038 -141728 -139230 -130623 -109936 -93330 -100116
13851 -100116 -120510 -129183 -125048 -127366 -135082 -125957 -101781 -96529 -123470 -148588 -140548 -117696 -115796
13838 -115796 -132850 -140667 -134267 -131669 -133625 -122787 -101853 -94777 -105011 -108413 -97602 -97864 -121751
13825 -121751 -140381 -125545 -95751 -90306 -112888 -131216 -125777 -110568 -105322 -110824 -116965 -118098 -113830
13812 -113830 -105970 -100037 -102518 -113469 -126365 -135376 -138620 -136160 -129418 -120743 -110742 -99474 -91189
13799 -91189 -90968 -95686 -98142 -100913 -111699 -122860 -116157 -95389 -89913 -110646 -127906 -115762 -94043
13786 -94043 -95461 -112072 -113110 -101058 -104810 -123410 -125401 -107369 -103474 -124302 -134683 -113498 -90226
13773 -90226 -93282 -103814 -97162 -93005 -118913 -151965 -148082 -113705 -96156 -108060 -112792 -90567 -70800
13760 -70800 -81656 -106422 -113976 -104891 -101862 -112192 -123324 -125660 -120599 -111269 -100179 -93422 -95981
13747 -95981 -103570 -106433 -100890 -92640 -89282 -92760 -99584 -106700 -114200 -120241 -117862 -104841 -93744 -99246
13733 -99246 -115027 -119233 -106331 -94738 -96509 -101789 -103722 -112453 -127278 -123806 -94495 -73586 -88098
13720 -88098 -111018 -105278 -89107 -103546 -132818 -122869 -75881 -55389 -84688 -110113 -91764 -64202
13708 -64202 -68125 -82718 -76620 -73307 -104141 -136931 -120124 -72534 -59051 -89390 -109095 -90156
13696 -90156 -66223 -68524 -84302 -95091 -106452 -119766 -117113 -95520 -80263 -84931 -91571 -87502 -87051
13683 -87051 -97740 -100575 -87122 -81500 -98052 -110054 -93191 -70310 -74577 -93129 -91616 -77134
13671 -77134 -86681 -118957 -129763 -103774 -83126 -102803 -135497 -131797 -91209 -59552 -66187 -93852
13659 -93852 -109544 -101137 -79778 -64944 -72735 -103367 -133784 -136784 -115004 -101381 -115545 -135668
13647 -135668 -130674 -106706 -96948 -112152 -130123 -135425 -138958 -148671 -150207 -134009 -116981 -116294 -122814
13634 -122814 -122938 -125903 -142390 -154984 -142192 -117861 -112400 -124861 -129156 -120302 -116939 -122452 -122452 -118653
13620 -118653 -125125 -132955 -123097 -112837 -136148 -173586 -164842 -108095 -78376 -113912 -152981 -134878
13608 -134878 -99659 -116629 -163410 -162438 -110156 -79164 -98162 -117676 -106549 -100551 -127087 -151698
13596 -151698 -138836 -111135 -106124 -117043 -118495 -115515 -124692 -134351 -125228 -109766 -111716 -124063 -125397
13583 -125397 -122770 -137369 -157799 -151684 -122652 -111899 -133835 -150712 -131426 -102494 -109834 -148946
13571 -148946 -168425 -140719 -98121 -87186 -110032 -131115 -130089 -122134 -125398 -133771 -133942 -129449 -129640
13558 -129640 -129291 -120571 -114569 -126105 -143474 -140958 -120499 -111943 -126973 -141696 -135751 -121991 -121330
13545 -121330 -130635 -134844 -133540 -135338 -138581 -137140 -136402 -145344 -157843 -157273 -137927 -112120 -98099 -105697
13531 -105697 -128722 -148543 -151862 -144694 -139629 -134903 -123791 -118671 -137682 -167152 -170876 -144892 -127434
13518 -127434 -139926 -155293 -146923 -131932 -135320 -144895 -138726 -128958 -137859 -154051 -154447 -148018 -153362
13505 -153362 -153945 -126330 -95266 -103236 -135743 -139033 -109801 -101413 -133138 -160261 -153525 -143205 -154210
13492 -154210 -157880 -129115 -99899 -108520 -136396 -144232 -137171 -143304 -154787 -143964 -120248 -118637 -140823
13479 -140823 -155090 -149440 -140983 -136167 -125011 -114801 -126617 -153368 -161223 -141467 -124243 -129789
13467 -129789 -140929 -138646 -132837 -138111 -144809 -135854 -115155 -100882 -102725 -118141 -138308 -148573 -138255
13454 -138255 -119416 -119152 -142596 -161358 -151747 -126601 -112661 -113015 -112648 -108293 -108930 -113781 -114031 -114181
13440 -114181 -127806 -149435 -153992 -133056 -111376 -113104 -127743 -128845 -115852 -112823 -126903 -134426
13428 -134426 -118572 -98552 -102148 -124200 -136688 -132408 -131006 -141124 -145646 -134227 -123840 -129568
13416 -129568 -136809 -125554 -106893 -109040 -134727 -158115 -162360 -157116 -156297 -158781 -157493 -152581 -148110
13403 -148110 -144926 -141676 -137401 -132259 -129444 -132701 -138040 -136293 -129547 -132090 -145947 -152623 -143822 -140069
13389 -140069 -156201 -169053 -151587 -122416 -121197 -144463 -151307 -131277 -118284 -129964 -141972 -137855
13377 -137855 -137372 -152789 -161040 -146944 -133461 -138523 -141786 -128604 -125523 -149433 -162341 -130767 -94806
13364 -94806 -112440 -159699 -161190 -110819 -82919 -114352 -152523 -146462 -120511 -117562 -126235 -114438
13352 -114438 -93903 -98449 -124227 -139913 -138654 -136660 -134454 -121464 -108836 -116525 -133820 -132549 -116617
13339 -116617 -117968 -141492 -154666 -140171 -119957 -113453 -109085 -97316 -97159 -121053 -140931 -124346
13327 -124346 -87104 -73515 -93050 -113163 -113656 -110944 -119876 -126120 -115030 -100379 -99691 -101385 -85816
13314 -85816 -66415 -76223 -114892 -141799 -130586 -102715 -91907 -98637 -100868 -92993 -88763 -93213 -95970
13301 -95970 -91708 -87081 -85368 -81540 -75766 -76056 -82846 -84804 -74963 -58739 -41930 -24206 -9376 -6973
13287 -6973 -15217 -16755 -3116 8747 -1501 -28235 -48529 -54819 -61443 -78105 -92813 -88402 -67158
13274 -67158 -50661 -56840 -81505 -103346 -106056 -93418 -80896 -75952 -73601 -70325 -71585 -81082 -92132
13261 -92132 -97356 -99462 -103638 -105721 -98900 -88054 -84831 -89038 -87661 -76022 -68510 -79757 -101693
13248 -101693 -110676 -97896 -82263 -85705 -102049 -103835 -81547 -60315 -66200 -88385 -94425 -77704
13236 -77704 -65791 -78190 -99566 -106283 -99005 -92471 -89300 -84186 -82605 -93171 -107514 -109248 -100473
13223 -100473 -98794 -107837 -111148 -99378 -85123 -83269 -91355 -98445 -102427 -108542 -116486 -117044 -101630 -74730
13209 -74730 -56921 -68212 -102085 -125807 -118942 -101569 -105433 -125607 -128012 -104052 -86006 -97728
13197 -97728 -119285 -119591 -101338 -90199 -95708 -107394 -118556 -128830 -129911 -113988 -94622 -95625 -116913
13184 -116913 -132503 -126730 -112700 -107810 -109486 -106234 -98034 -92350 -89840 -87373 -88570 -98079 -108932
13171 -108932 -108683 -98046 -91530 -96863 -104863 -105833 -105755 -114524 -124001 -114722 -87444 -70839 -85777 -114893
13157 -114893 -125606 -114899 -107164 -109340 -98814 -67461 -47710 -68818 -107714 -117197 -93815 -80639
13145 -80639 -100738 -125661 -124180 -108697 -107926 -118317 -115197 -98495 -92311 -101892 -105072 -92967 -87867
13132 -87867 -105324 -124266 -117537 -94736 -88306 -105532 -120558 -112956 -90628 -71542 -64540 -73921 -100951
13119 -100951 -130019 -133377 -105153 -74754 -69882 -81137 -82739 -73854 -73278 -81989 -81074 -66248 -55701
13106 -55701 -59141 -65512 -68018 -74674 -84502 -81105 -64367 -61025 -83619 -104409 -95519 -72775 -69599
13093 -69599 -85358 -93833 -90065 -91070 -96216 -86399 -63986 -55436 -67187 -75002 -67917 -66849 -83256
13080 -83256 -94060 -80924 -64067 -68727 -82969 -80302 -64339 -56883 -56556 -45951 -31050 -34994 -54551
13067 -54551 -61220 -50041 -48442 -64341 -64222 -27312 10162 -179 -47781 -74757 -54241 -21301
13055 -21301 -17676 -35990 -39018 -16768 1275 -10747 -40686 -56689 -48578 -36159 -36905 -40587 -27265
13042 -27265 -2406 4610 -18528 -44584 -39700 -8963 10166 -2195 -25936 -34088 -27628 -22775 -20171
13029 -20171 -8989 6263 8158 -3659 -8496 2614 11549 1850 -16214 -24813 -26586 -34357 -45134
13016 -45134 -46363 -40869 -42754 -50960 -48645 -30253 -10544 -4152 -11715 -26587 -39629 -39471 -26117
13003 -26117 -20666 -39298 -62166 -57455 -34339 -34061 -62096 -73346 -43984 -13659 -23658 -52356 -56057
12990 -56057 -43036 -53121 -81774 -83853 -51210 -30019 -49178 -79690 -84363 -67990 -55420 -52311
12978 -52311 -52478 -58985 -73656 -83967 -80597 -72742 -70612 -69359 -64297 -63781 -72057 -77470 -72543 -67506
12964 -67506 -69686 -69958 -65088 -70101 -89068 -98241 -83008 -67992 -80191 -102966 -102075 -81428 -73293
12951 -73293 -82332 -81464 -62763 -51880 -64386 -82838 -88424 -85778 -84168 -80036 -71304 -67124 -71216 -74051
12937 -74051 -70430 -66320 -62206 -51054 -38782 -42262 -59079 -66008 -57631 -56618 -71283 -76134 -56931
12924 -56931 -41868 -56401 -76690 -68102 -46477 -52348 -78159 -77395 -46903 -40806 -82845 -118937 -94609
12911 -94609 -39616 -26126 -64516 -94618 -77943 -46988 -46978 -70580 -80649 -71339 -70204 -89428 -109102
12898 -109102 -111182 -102100 -93532 -83936 -70997 -62738 -61709 -55478 -39949 -35451 -56930 -81536 -74695
12885 -74695 -42507 -26960 -47102 -75458 -81254 -68391 -56264 -48005 -37114 -26836 -23186 -22618 -23354
12872 -23354 -34222 -54786 -62459 -41055 -9998 -2284 -22061 -45534 -55535 -52793 -40483 -22109
12860 -22109 -10632 -16214 -27485 -26884 -20302 -27095 -44221 -48043 -32610 -18819 -21781 -34351 -46532
12847 -46532 -55995 -56684 -44532 -37030 -55374 -82519 -76458 -36132 -12892 -36076 -68269 -64751 -39881
12834 -39881 -34797 -49422 -53472 -45222 -49493 -65638 -65452 -43534 -27328 -31828 -41846 -45929 -51951
12821 -51951 -59995 -54917 -39066 -39397 -64502 -83835 -71039 -44116 -38905 -59920 -80747 -81996 -68194
12808 -68194 -53452 -47254 -52043 -64141 -77812 -90254 -96795 -85200 -50776 -15884 -11991 -37667
12796 -37667 -58434 -56236 -51671 -63083 -73211 -61026 -42010 -44501 -61311 -59550 -33327 -14485
12784 -14485 -27560 -58838 -76726 -66109 -37986 -17441 -23712 -52141 -76908 -79333 -67546 -59872
12772 -59872 -59859 -60597 -60886 -59472 -45797 -18507 -2570 -22130 -62565 -85656 -78410 -60822 -49340
12759 -49340 -42245 -40461 -50751 -63243 -56103 -30942 -15837 -23970 -36364 -35922 -31303 -33960 -37111
12746 -37111 -32169 -23613 -15035 -3276 3902 -7757 -25685 -15333 24080 45031 18929 -17324
12734 -17324 -15660 14058 29713 24684 23050 26492 17467 6095 22432 62042 86481 82488 76416
12721 76416 82952 84383 73538 74196 98973 123886 127257 122278 128314 138777 141709 146468 164130
12708 164130 183166 190533 198311 223615 258028 283109 303170 336016 379433 411986 423765 426570
12696 426570 435559 455194 479499 495440 493013 480614 478968 491156 495397 479675 463413 467328
12684 467328 482503 491688 500474 518774 529794 512790 484895 481909 502067 507539 483296 456091
12672 456091 446855 440604 418982 391885 376644 368683 353405 330972 311077 295342 280544 269657
12660 269657 266112 264052 254797 238088 221141 211948 214786 223793 222201 200737 175488 170989 185844
12647 185844 194752 186220 175262 173480 171649 162409 156013 158944 158383 144210 127209 119212 114383 107277
12633 107277 108863 124038 133542 122984 111738 124648 150222 158727 150594 151755 166156 169918 155304
12620 155304 145129 153789 165134 163819 162370 177835 200729 208401 198748 191982 203104 226348 245686
12607 245686 251181 244153 231788 219634 210302 207826 216210 230019 234899 224689 209524 198809 188090
12594 188090 175278 175185 197406 221629 220939 202261 194970 203938 206722 197583 197886 215160 228046 225085
12580 225085 222920 228535 220387 192132 178946 205723 239670 236562 211266 214671 253664 284460
12568 284460 283439 275635 285096 301502 311384 323921 345241 358092 348361 326856 306458 283372
12556 283372 260322 260317 290913 319101 313103 290037 287645 303792 304071 283049 275025 298435 328535
12543 328535 338716 335243 332848 326369 311178 306575 328137 353376 348188 319331 306918 325206
12531 325206 344261 338735 324412 329127 350722 366360 369141 371996 381700 390303 391409 387931 382983
12518 382983 377553 377709 389318 403447 402253 384828 373186 383772 403927 407706 388429 364404
12506 364404 354562 357803 358488 347752 335718 340208 363287 385431 389306 382564 384925 397654 404264
12493 404264 401951 409544 434938 456165 451802 433475 427220 434587 436131 427217 425040 439212 457342
12480 457342 464624 460475 451422 443290 444881 463823 492671 512217 513780 506636 501261 499797 505377
12467 505377 522939 545217 556050 554488 556403 564608 561151 542277 534111 550960 562938 537657
12455 537657 496540 490126 524486 554360 552968 546330 562622 585344 584242 566265 563291 583397
12443 583397 605250 615321 622680 635428 645436 642623 628911 612935 602408 603792 617573 631695
12431 631695 631585 619315 611535 616403 625151 629203 630982 632187 627065 617464 620333 645613 676430 687424
12417 687424 677520 669315 678755 699791 717934 725113 720763 711400 710194 723673 737152 728328 700048
12404 700048 684185 703800 744084 772459 777745 775652 781213 791016 794045 789059 785756 792440 806505
12391 806505 818412 824619 832134 846031 858616 861433 863481 881354 911284 930153 929118 925743 933912
12378 933912 944079 947932 959395 988723 1015897 1018501 1011137 1024389 1053862 1065757 1050793 1037198
12366 1037198 1046805 1071279 1097428 1123227 1141320 1140936 1137010 1161732 1212392 1245330 1242385 1243404
12354 1243404 1282148 1328020 1333933 1312557 1314861 1351103 1385738 1402535 1421046 1446548 1456456 1449312
12342 1449312 1459344 1501157 1541257 1551440 1555021 1587187 1637281 1668579 1678069 1696462 1734315 1765816
12330 1765816 1771619 1766970 1775077 1796190 1819717 1849657 1896082 1948893 1983810 1998354 2021928 2078081
12318 2078081 2151008 2206216 2234423 2253913 2276084 2296939 2323586 2375048 2444101 2492899 2509801
12307 2509801 2537624 2611630 2699246 2747608 2769465 2824407 2922186 3008069 3053386 3097704 3176057
12296 3176057 3261652 3319482 3368903 3444060 3527859 3580984 3615388 3682002 3792030 3903212 3988411
12285 3988411 4071238 4180610 4308500 4432198 4550698 4677493 4814115 4948950 5073213 5185698
12275 5185698 5287620 5381569 5473493 5572304 5686859 5818567 5954748 6079278 6196860 6334746
12265 6334746 6509017 6700918 6880736 7043513 7204562 7371039 7537302 7699263 7854338
12256 7854338 7996815 8132453 8285613 8469952 8665709 8851183 9039826 9253103 9473320
12247 9473320 9667541 9849376 10066028 10322083 10568910 10782154 10998974 11257209 11544174
12238 11544174 11833048 12127282 12435629 12740274 13027863 13323132 13654226 14008896 14360318
12229 14360318 14711393 15075837 15440659 15791876 16157398 16575264 17031585 17479948 17915788
12220 17915788 18380023 18888598 19411041 19928816 20465471 21040875 21639146 22245488 22877814
12211 22877814 23554789 24262515 24981470 25723990 26518743 27375830 28289899 29261129 30292751
12202 30292751 31385128 32552030 33824436 35218881 36724260 38342628 40116650 42086704
12194 42086704 44251095 46613095 49240692 52219564 55562962 59242152 63302108 67849945
12186 67849945 72897943 78321482 84036491 90092603 96423735 102547340 107708194 111386821
12178 111386821 113544501 114338971 113818028 112083328 109618102 107162356 105220481 103886290
12170 103886290 103187612 103349503 104546566 106573242 108996009 111544437 114087908 116227227
12162 116227227 117205885 116404950 113802969 109822658 104854221 99111028 92874186 86616994
12154 86616994 80771341 75471844 70615224 66105746 61960554 58218986 54853889 51799447
12146 51799447 49014450 46486720 44199921 42123779 40229100 38492726 36889092 35392232
12138 35392232 33988601 32675548 31442995 30269409 29143235 28073921 27067649 26104436
12130 26104436 25159474 24239210 23371651 22563254 21792554 21049928 20355162 19724932 19148731
12121 19148731 18610952 18111704 17647561 17196027 16744191 16314038 15930714 15577477 15210805
12112 15210805 14814446 14412715 14033422 13682007 13351860 13037237 12732239 12434209 12150769
12103 12150769 11890200 11646050 11404855 11165320 10934616 10710885 10487950 10273308 10080319
12094 10080319 9903482 9722707 9533055 9349062 9177069 9005477 8828386 8657592 8501544
12085 8501544 8350472 8194141 8040151 7902156 7779024 7656353 7524194 7387643 7262594
12076 7262594 7160662 7074258 6981989 6876098 6774262 6691141 6611658 6514521 6410137 6324466
12066 6324466 6252321 6164469 6061978 5980840 5931196 5875080 5786654 5694418 5632260 5583470 5513170
12055 5513170 5429672 5367674 5326348 5271905 5196496 5128813 5082967 5039009 4983463 4930007 4884769
12044 4884769 4827004 4746452 4670421 4626524 4599690 4554728 4486797 4420049 4365390 4311344 4255939
12033 4255939 4215303 4190344 4152682 4083841 4009570 3968970 3957984 3932545 3870505 3801737 3762887
12022 3762887 3747134 3723257 3687156 3661335 3648849 3624483 3579060 3538445 3521260 3507133 3471581
12011 3471581 3428372 3405520 3395464 3365878 3314164 3273792 3262120 3256518 3235470 3214044 3217183 3237132
11999 3237132 3241883 3218637 3189001 3180830 3197246 3215852 3213106 3188402 3164372 3161308 3174771 3186188
11987 3186188 3191074 3201337 3219354 3230032 3227643 3231202 3256377 3286798 3295695 3288334 3297183 3333629
11975 3333629 3370003 3380498 3379159 3398651 3444371 3492803 3531531 3575795 3638236 3703951 3752123
11964 3752123 3788611 3836279 3898829 3955739 3993352 4019680 4042453 4052829 4043139 4025047 4014468
11953 4014468 4008411 3991435 3958095 3915899 3871911 3828172 3784629 3736322 3675145 3604429 3541238
11942 3541238 3492124 3439929 3371065 3301235 3251782 3214511 3169112 3124986 3109453 3116738 3108202 3070811
11930 3070811 3037738 3036128 3048831 3048237 3037580 3033883 3035768 3035898 3044248 3069281 3092470 3092622 3084425
11917 3084425 3102341 3153108 3213033 3267458 3323462 3385039 3445843 3510341 3593404 3689161 3764475
11906 3764475 3797164 3803404 3814004 3837334 3859140 3868303 3867514 3862948 3857668 3858005 3877247 3924596 3990114
11893 3990114 4048235 4084378 4115166 4170031 4250813 4323477 4356535 4353813 4339325 4324345 4304516
11882 4304516 4277770 4247020 4212608 4178754 4160067 4164410 4176985 4180639 4184674 4211577 4260879 4311411
11870 4311411 4357452 4415568 4492121 4570124 4636652 4701094 4776356 4861252 4952017 5054503 5174278
11859 5174278 5308615 5456981 5625750 5813867 6006192 6188534 6358170 6515272 6657755
11850 6657755 6789744 6921135 7053262 7177132 7286971 7379712 7442129 7461373 7452034 7447812 7458280
11839 7458280 7458048 7427659 7378824 7327136 7268133 7198075 7132219 7082002 7038429 6999279 6986689 7011921
11827 7011921 7047951 7068036 7089694 7146565 7236008 7331667 7430946 7547606 7668381 7763438 7838824
11816 7838824 7935631 8073474 8234126 8404908 8596541 8809462 9025611 9250314 9522502 9860276
11806 9860276 10230153 10596252 10971063 11390149 11863360 12383591 12962644 13621091 14354359
11797 14354359 15147828 16025310 17046479 18245892 19606897 21121131 22849146 24862184
11789 24862184 27081262 29189962 30768329 31558076 31590159 31050393 30084235 28800653 27414837
11780 27414837 26239161 25467155 25047990 24845723 24853600 25161173 25773735 26605608 27644979
11771 27644979 28961750 30468505 31783152 32454543 32297659 31428608 30023544 28180229
11763 28180229 26029947 23840074 21890201 20278614 18920689 17712714 16628083 15667248
11755 15667248 14800500 13996329 13258435 12598290 12000541 11445683 10941417 10499751 10102838
11746 10102838 9723562 9363140 9034139 8721140 8398962 8082230 7812116 7591818 7378919
11737 7378919 7149777 6926438 6723928 6517648 6291748 6078772 5912221 5770698 5612528
11728 5612528 5443071 5300579 5188845 5073270 4941122 4818282 4719213 4622567 4510406 4396103
11718 4396103 4295778 4201097 4099348 3996880 3904102 3817023 3731276 3656371 3597785 3540505 3469321
11707 3469321 3393189 3331033 3282977 3233277 3174199 3110162 3044247 2977551 2918665 2877210 2846875
11696 2846875 2807899 2750275 2686946 2640859 2621679 2614716 2591866 2538212 2470257 2421379 2405344
11685 2405344 2401658 2382528 2345828 2312129 2294965 2285731 2268019 2238184 2208150 2190902 2186356 2183124
11673 2183124 2173272 2159678 2146017 2128515 2106963 2094749 2102010 2114860 2112185 2100681 2107658 2135235
11661 2135235 2150596 2134511 2111974 2113894 2131327 2134074 2117545 2101317 2091366 2074620 2047849 2023320
11649 2023320 2004324 1980831 1953523 1937868 1936617 1929478 1900994 1862500 1835177 1823243 1814121 1796348
11637 1796348 1768344 1734657 1699507 1661973 1617553 1567508 1521473 1484131 1447519 1407366 1375784
11626 1375784 1359916 1339497 1292735 1238182 1216429 1227294 1223129 1178431 1128582 1113828 1117402 1096258
11614 1096258 1051378 1023379 1025293 1023900 995262 961032 951558 960379 958604 937801 914483 899212
11602 899212 883621 859670 834771 820816 818422 819994 822191 825968 826456 813709 787475 762431 750863
11589 750863 746043 733277 714063 705749 715369 727003 721686 700054 677445 663957 657710 652957 646814
11576 646814 639488 632391 625376 616185 606108 602341 606100 603715 585055 567256 576934 605957 612893
11563 612893 580144 540972 530208 536703 533432 528251 544116 565895 555168 514665 490224 501494
11551 501494 515472 503558 482947 479033 483522 477969 468678 467691 464498 448952 440454 458964 483875
11538 483875 479275 449049 429022 431281 435401 432735 437800 449073 438761 397999 359937 357368 380989
11525 380989 398680 396661 383915 372660 370983 380448 387712 374316 346512 335194 351586 366766
11513 366766 356708 343188 358522 388480 390001 358318 335196 346338 368302 370147 355820 346217
11501 346217 343338 334441 317342 302376 297160 301905 311849 316267 306240 290477 288879 302618 309154
11488 309154 298314 290997 303521 316220 304825 283913 283523 294901 282249 247039 234002 260683
11476 260683 285534 271784 244999 249778 276277 276223 241142 216917 234239 265351 268132 243737
11464 243737 226431 233810 251519 260101 256292 247512 239503 233245 227781 224207 227524 240370 253795
11451 253795 252806 235913 219956 218098 222344 218198 207537 202554 203580 200701 195385 201188 219393
11438 219393 231732 224956 208004 196055 191289 189714 193477 202555 205469 194623 182809 187244 202677
11425 202677 207980 195718 177538 163738 157123 163847 186060 203397 190098 156938 146173 172195
11413 172195 198324 192439 173970 175815 188304 181885 164951 169649 188746 180556 142002 123243
11401 123243 150448 181786 170394 132508 116286 131383 148907 152248 148708 141456 126247 111524
11389 111524 111390 121852 129501 136619 150735 158518 142317 116694 113521 132506 142282 132030 124485
11376 124485 131543 135019 123711 114328 119702 127728 128186 130456 138365 138205 128986 131786 149133 150382
11362 150382 122546 99074 106601 119865 108915 95511 112641 137535 124989 89155 86858 124436
11350 124436 147014 127717 104544 110669 126430 127719 130252 150449 164637 146967 116640 108895
11338 108895 122983 134634 139292 147243 152514 142535 128009 130593 147996 159395 158404 154870 151905
11325 151905 146837 146973 158054 164281 147171 119179 111361 130282 152472 158901 150674 134620 119294
11312 119294 120985 145309 165703 151050 113905 97627 112695 122942 105377 86475 98692 130757
11300 130757 146394 132681 107306 91871 95951 115122 130496 123176 100244 90506 104316 118612
11288 118612 115282 109676 120079 132486 124256 105459 104694 123847 138274 137021 133413 137488 145791
11275 145791 158763 181062 202268 204381 193629 197983 224363 244276 235079 212107 202578 206733
11263 206733 205186 191449 176570 169372 170247 179021 192586 199548 193510 187305 196250 210946 208906
11250 208906 193873 195815 220458 227668 186647 131949 125025 165049 183548 141888 90029 94082
11238 94082 138825 152791 115589 82029 92574 115940 107607 80134 75405 96769 112586 110301
11226 110301 104198 97439 77817 51702 44828 62407 78895 75208 59966 47370 39741 39148 50873
11213 50873 66435 67042 53147 47473 59478 70459 64383 49821 39654 32465 26722 30122 41752
11200 41752 48451 50986 66693 92214 95889 67741 43128 48838 59223 42158 17895 26567 59497
11187 59497 73412 60085 50446 55221 53291 40541 39341 51486 50610 34672 38255 72632 98151
11174 98151 83010 51131 41139 50267 51795 41613 33484 28666 23011 27712 51328 74464 72518
11161 72518 52854 41022 40596 36302 28493 32705 47707 53914 45596 39311 46590 59528 67253 68878
11147 68878 67385 65616 68526 75863 75797 60534 42676 39127 45407 45779 41825 47298 59686 63522
11133 63522 59883 64493 76011 75982 63718 59578 66371 61434 40384 33537 56422 76329 59866
11120 59866 28986 30682 64463 82348 61138 34399 38561 59333 57394 29855 15721 40038
11108 40038 77945 87916 66201 47801 55997 73248 71428 52274 39243 40155 40585 32184 26173
11095 26173 34437 53105 69772 75438 67860 54588 51526 65620 82413 85255 79417 77405 70886
11082 70886 47099 25320 37221 70482 77246 48553 31813 54256 78852 68283 45839 49432
11070 49432 65080 58074 39498 44962 68188 73277 59459 57111 68930 71614 68556 81605 95833
11057 95833 77820 48407 63806 114436 122632 66589 25054 55251 103377 97851 64885 73384
11045 73384 113790 119776 84168 65548 86279 104497 94338 82345 88317 92579 83498 82934 99702
11032 99702 106105 88546 78694 102927 136546 141568 121829 107538 107226 107414 104400 106256 112409 115397
11018 115397 115952 117862 116269 107253 99648 102442 110366 115000 117525 117161 103167 76317 62567 82496
11004 82496 118376 135657 129593 125987 139315 154712 153975 139969 130423 139796 167513 193812 192803
10991 192803 164127 144155 165230 208553 223057 192693 157568 158557 186386 203402 196535 184982
10979 184982 184803 190197 190542 186830 184936 185165 185552 186903 187780 181862 168587 160217 166866 177732 172078
10964 172078 150981 141089 157446 178972 177832 160169 154027 164370 169447 162210 162641 178505 186064
10951 186064 169957 154250 165955 189221 188976 166535 156109 171617 192070 201062 207763 221420
10939 221420 233840 238327 243181 255655 271324 286883 304274 316272 309575 289315 277911 282026
10927 282026 285486 283239 292150 313540 317975 291484 267474 281741 319518 341617 343329 348829 361785
10914 361785 364573 360253 371888 398493 411954 403004 391816 386164 370170 346982 349446 386646
10902 386646 420011 421559 418966 445945 480312 478434 449954 445081 474085 491562 467080 425109
10890 425109 400104 392575 390760 400283 423488 435996 417071 387586 385338 410509 426520 414041
10878 414041 394753 393705 401789 390952 354296 315668 301355 310948 318375 300312 262227 233070
10866 233070 232936 252089 266614 267059 261701 257224 250660 240924 234896 236979 241498 240541 233450 225300
10852 225300 220771 220606 219223 207616 186578 174147 187027 214379 225866 210718 192681 196172
10840 196172 212168 212913 191315 168688 165883 180836 195763 196784 184550 171174 167346 170858 171456
10827 171456 167065 165575 167965 163916 152035 148531 162121 175285 168954 152958 149451 156376 154119
10814 154119 142715 143018 160425 176095 178575 177107 177644 173227 166548 173700 193701 202381 191360
10801 191360 184816 199204 214600 209249 195808 195894 203215 203209 206452 226002 240714 223271 192340 191610
10787 191610 221794 239356 225106 208863 216644 235785 247215 253621 257289 245706 220726 209819
10775 209819 224900 239554 231699 219470 226118 237337 228392 211249 215592 237683 247853 240800
10763 240800 239267 249945 253864 244761 241423 251358 252805 228610 195228 181154 191783 209952 220389
10750 220389 221222 217752 214018 209019 200025 191561 194722 209883 219575 212210 203052 212384 231490 235238
10736 235238 223238 219125 229144 233777 225881 223073 230802 228261 209873 206215 236088 267845 262852
10723 262852 233397 218307 220134 212555 199530 214007 252999 266341 230901 192530 202976 247087
10711 247087 269130 250621 223581 216313 223506 230621 234980 234382 220814 197419 182639 185816 193982
10698 193982 193018 186494 181933 174410 160277 153774 168575 189628 186149 152995 119288 111911 127157
10685 127157 143803 148609 141455 128982 122331 130595 148388 159104 156102 149355 146143 140677 131183
10672 131183 129343 139301 144750 134162 121942 123569 126852 114899 102377 114562 139872 142815 122056
10659 122056 112867 126185 130511 110178 96611 114405 136180 127519 104843 105678 124321 124118 101240
10646 101240 88530 98451 107300 101551 98721 110198 118848 109594 93355 84463 79694 75549 81757
10633 81757 99337 107580 93728 76748 79425 92931 93505 81828 78571 87121 88937 77904 73747
10620 73747 91270 114697 117290 97362 80340 86220 106323 116879 108590 94050 87845 90463 95829
10607 95829 103173 111800 114014 107256 105806 122985 146134 149393 130881 116366 123331 141872 155235
10594 155235 157903 148058 125654 105943 109657 128739 128988 101843 84098 103946 136236 141214 122781
10581 122781 112384 114920 111549 103440 109116 123526 122893 110152 112488 129317 127225 98034 77930
10568 77930 89930 108303 105612 97436 107190 118152 101317 70823 68151 98264 120828 107891
10556 107891 78590 68093 85140 110593 122770 114945 96442 82723 81468 87874 94475 99520
10544 99520 102908 103324 104338 111973 119971 111695 85982 65570 67439 80266 85551 84382 85911 86940
10530 86940 84466 91545 115393 135412 131606 119611 124009 131172 110404 74082 68677 103267 135405
10517 135405 138884 137137 149762 153464 127758 100255 107667 139237 156914 150985 139890 133293 131836
10504 131836 147539 185241 214817 201986 161259 139319 148317 155776 142884 131069 139361 152853
10492 152853 151954 143859 144970 153771 159375 160593 162457 167811 180719 201610 213998 198855 169233
10479 169233 162931 188755 210481 202276 187717 196912 215718 214421 202349 209342 228154 224594 200152
10466 200152 193405 213539 223995 209086 206292 241124 274085 258205 219005 221758 270939 299941
10454 299941 268697 219575 211632 239645 254968 242402 234647 256775 293169 314941 312250 290908
10442 290908 260966 240280 247821 277444 295810 284366 267824 278991 308470 317543 295410 272774
10430 272774 275413 293613 307238 314164 318648 315075 303357 302027 323225 347983 349916 334276 329253
10417 329253 343081 353803 342901 319324 305850 315029 340658 363191 365492 352159 346489 358477
10405 358477 369001 361835 354121 368541 390330 388301 370252 374340 404577 421809 409623 400990
10393 400990 418090 432822 419935 406847 426943 457262 454377 429635 432297 467577 488089 470036
10381 470036 446001 448845 466892 473869 468117 461326 455796 452236 458164 472309 479682 474228 467490
10368 467490 466810 467736 475062 502649 541089 557072 541336 525329 529986 532934 515002 503813 530170
10355 530170 568791 572215 548021 549258 591354 630493 632842 618182 617460 627273 630673 631867 642522
10342 642522 655117 656801 655548 668114 691010 705597 707608 712166 729004 747701 752323 743109 738074
10329 738074 752378 778081 791530 785371 782138 802228 828912 829322 806516 800145 828665 862345
10317 862345 870210 865225 877390 903976 918400 916329 919725 937750 954293 958862 963943 981929 1004440
10304 1004440 1016784 1020156 1027709 1045386 1065749 1078910 1085215 1095894 1118405 1141334 1143733 1125179
10292 1125179 1113417 1129046 1155002 1160880 1148371 1146783 1166268 1184332 1183928 1176855 1177644 1179853 1175558
10279 1175558 1176604 1194702 1216626 1223116 1221428 1234318 1262628 1283338 1283984 1276625 1275199 1279385 1286068
10266 1286068 1298336 1315018 1326373 1329284 1334634 1350744 1370013 1381116 1385371 1391777 1403424 1417585
10254 1417585 1432212 1444023 1447895 1447438 1457519 1484245 1510798 1519249 1520436 1541652 1585040 1621336
10242 1621336 1632509 1638624 1666970 1712197 1749176 1775012 1811713 1867192 1919240 1947451 1960589
10231 1960589 1977508 1995876 1999144 1987391 1980971 1992536 2011716 2022254 2021347 2015381 2007814 2001323 2004255
10218 2004255 2022311 2045557 2055519 2048501 2043320 2059573 2092735 2118291 2120110 2107248 2098757 2097566
10206 2097566 2088194 2060402 2025408 2001833 1991061 1975823 1942283 1894737 1847199 1809103 1782866
10195 1782866 1767007 1754983 1737454 1713665 1695406 1690590 1687758 1669631 1640417 1623959 1630388 1640042
10183 1640042 1630900 1609574 1599975 1609219 1623061 1632408 1643781 1659228 1666114 1659011 1655937 1675307 1705807
10170 1705807 1718390 1705464 1689671 1691817 1707103 1719249 1723524 1725843 1729425 1733985 1743096 1762513
10158 1762513 1792541 1827181 1857963 1875667 1874907 1862738 1856374 1864999 1878977 1884273 1881632 1882335 1890243
10145 1890243 1899827 1909685 1925646 1949021 1971989 1987789 1998194 2008336 2020130 2033051 2046507 2059582
10133 2059582 2071173 2079985 2082787 2077314 2070719 2077521 2100901 2123835 2130960 2132251 2148490 2177666 2197006
10120 2197006 2200299 2210649 2246223 2291564 2317433 2317491 2311245 2318190 2341770 2374248 2406092 2431354
10108 2431354 2450231 2466235 2480810 2495714 2518498 2554721 2595188 2625385 2649141 2685207 2736121
10097 2736121 2781867 2813669 2850294 2904425 2955966 2982811 2999694 3037260 3094773 3145256 3181366
10086 3181366 3222996 3278464 3330536 3369546 3412552 3475593 3547574 3607512 3654507 3706562 3776460
10075 3776460 3857970 3933013 3990245 4039269 4101457 4180663 4254348 4306911 4357174 4430001 4513875
10064 4513875 4579154 4631219 4705571 4807692 4900489 4964082 5026709 5115473 5215211 5304203 5394990
10053 5394990 5503745 5608624 5681307 5740197 5827570 5944754 6053976 6140449 6229234 6337098
10043 6337098 6449077 6554443 6670030 6809303 6955000 7083005 7196139 7316378 7454267
10034 7454267 7599532 7735996 7858853 7982392 8130747 8311908 8503497 8677691 8837241
10025 8837241 9009426 9205704 9408583 9601932 9793240 9998156 10220749 10457652 10706483
10016 10706483 10962088 11218469 11482359 11772764 12100604 12459292 12838053 13232281 13640955
10007 13640955 14070701 14543408 15080441 15677235 16314928 16999582 17763398 18619057 19540009
9998 19540009 20499298 21502875 22567893 23689425 24844884 26010345 27154398 28233068
9990 28233068 29206736 30049630 30742133 31286583 31742351 32209086 32757867 33415639 34227418
9981 34227418 35266876 36543153 37963449 39451440 41030577 42682577 44171719 45159100
9973 45159100 45510822 45369540 44895250 44085709 42938813 41652725 40504716 39587974 38817510
9964 38817510 38170621 37761829 37657982 37769924 37992722 38322369 38724618 38979803 38802862
9955 38802862 38103260 37019926 35709194 34217214 32587976 30974333 29545483 28332976
9947 28332976 27250065 26240272 25332698 24560054 23903422 23343154 22902087 22592595 22353529
9938 22353529 22083639 21724847 21281948 20775254 20212549 19608678 19001130 18434195 17940384
9929 17940384 17535449 17212012 16937009 16675864 16424379 16201288 16009816 15830012 15655282
9920 15655282 15511054 15420795 15370990 15328283 15280268 15241950 15228711 15238974 15261213 15286213 15312963
9909 15312963 15348970 15402079 15468638 15536399 15602107 15676068 15765384 15866426 15980835 16122201 16294117
9898 16294117 16476860 16652146 16827747 17019039 17219110 17410503 17597290 17798299 18011939
9889 18011939 18216833 18411742 18628035 18890912 19187821 19488234 19780555 20077131 20393230
9880 20393230 20732930 21090636 21458686 21835324 22225540 22629173 23033004 23427217 23827226
9871 23827226 24262454 24741372 25243970 25752110 26269531 26805939 27360710 27933430 28533653
9862 28533653 29165425 29814351 30464843 31122012 31803837 32518180 33257901 34012395 34775775
9853 34775775 35550456 36348482 37179738 38034245 38890223 39746385 40628392 41551991 42499131
9844 42499131 43447325 44404478 45393278 46416171 47459276 48517877 49592675 50672948 51751936
9835 51751936 52848379 53980088 55123298 56234801 57312260 58393411 59492820 60582360
9827 60582360 61644917 62702053 63766230 64807604 65801189 66773986 67767734 68779624 69778817
9818 69778817 70761710 71748283 72736619 73705783 74659330 75621668 76587340 77514653 78379626
9809 78379626 79201007 80000076 80768889 81492361 82169605 82795605 83352169 83838846 84285540
9800 84285540 84710199 85090110 85404199 85680047 85962272 86249165 86498983 86691665 86846259
9791 86846259 86978920 87082287 87152119 87197559 87212838 87172103 87068919 86930195 86769983 86559173
9781 86559173 86270488 85929412 85582254 85225950 84810786 84313776 83771007 83225154 82672828
9772 82672828 82084007 81449978 80786484 80102907 79395739 78670017 77943111 77221119 76488111
9763 76488111 75727724 74945051 74158027 73373341 72579711 71763160 70922575 70069128 69212269
9754 69212269 68346917 67457254 66537932 65608380 64694437 63792995 62869562 61902019 60913908
9745 60913908 59945578 59000439 58045614 57066868 56093533 55155489 54241432 53323115 52402090
9736 52402090 51502570 50627949 49757325 48884678 48029448 47200538 46377477 45539156 44687770
9727 44687770 43832288 42972285 42113216 41272753 40451240 39619245 38760722 37908004 37101892
9718 37101892 36332486 35556340 34763308 33986064 33244462 32522480 31808913 31121056 30470383
9709 30470383 29837401 29201508 28569087 27952232 27346202 26750223 26183219 25649727 25113722
9700 25113722 24541504 23954721 23403761 22898297 22402537 21895865 21398289 20929878 20481237
9691 20481237 20037658 19603351 19185762 18778915 18378257 17992996 17629307 17279112 16939661
9682 16939661 16625216 16340978 16061900 15760255 15444826 15150183 14890945 14647265 14396099
9673 14396099 14138427 13890096 13659582 13443986 13240107 13049525 12871240 12695127 12510124
9664 12510124 12320341 12144263 11990563 11843791 11688028 11536657 11415985 11320521 11212371 11073534
9654 11073534 10931229 10815301 10716655 10611423 10503452 10411871 10332521 10246640 10158455 10087239
9644 10087239 10025933 9947848 9858034 9795234 9768340 9732248 9653114 9562926 9513694 9502139 9481234
9633 9481234 9433388 9388092 9366465 9349625 9315483 9274680 9249222 9236602 9217552 9187858 9161927
9622 9161927 9148748 9139994 9122330 9092254 9059170 9039122 9041652 9056843 9060389 9039082 9006803 8987312
9610 8987312 8986126 8989350 8985879 8977831 8970170 8963636 8960040 8962003 8964111 8956954 8944090 8940401 8946328 8940396
9596 8940396 8911078 8880968 8878654 8895989 8897858 8872353 8845974 8843766 8857053 8861554 8849846 8833116
9584 8833116 8823459 8825563 8835340 8838918 8825736 8808909 8814190 8838971 8846273 8818170 8790468 8804630 8844671
9571 8844671 8860049 8840562 8824906 8835112 8848750 8848622 8856095 8890451 8930806 8950196 8961351 8994031
9559 8994031 9045012 9086277 9112434 9144722 9190983 9234371 9265269 9297217 9344651 9406078 9474437
9548 9474437 9544961 9608987 9659838 9709770 9781416 9876204 9970990 10053795 10142209 10254094 10379212
9537 10379212 10497384 10610743 10737584 10880924 11022989 11151977 11279983 11428655 11602888
9528 11602888 11783368 11946151 12089923 12239505 12416258 12609859 12791557 12952581 13111788
9519 13111788 13283448 13459732 13635225 13825872 14043070 14265652 14464257 14645875 14846616
9510 14846616 15080543 15322936 15551576 15779669 16031720 16304015 16570159 16819169 17068518
9501 17068518 17337928 17625439 17915740 18201632 18487602 18777524 19070427 19369006 19681259
9492 19681259 20008202 20339445 20670295 21015287 21390802 21788710 22184654 22573005 22974975
9483 22974975 23407522 23863496 24330307 24806716 25288069 25758721 26221777 26716186 27273549
9474 27273549 27870460 28457335 29027288 29619449 30255945 30918361 31595527 32310110 33075106
9465 33075106 33862862 34650464 35466457 36354080 37308872 38294565 39308318 40385194 41540348
9456 41540348 42752925 44017684 45371244 46845726 48427340 50086855 51830307 53694276
9448 53694276 55705510 57870036 60193712 62690807 65375926 68266612 71392364 74785142
9440 74785142 78462257 82432474 86715140 91334563 96291703 101552505 107060481 112739849
9432 112739849 118479474 124130837 129534469 134542356 139015303 142824655 145884317 148182166
9424 148182166 149767814 150712534 151093687 151012127 150598925 149988515 149289799 148586921 147953264
9415 147953264 147446908 147093807 146889876 146825038 146897928 147102042 147401930 147727625 147990672 148102891
9405 148102891 147981170 147537963 146672148 145278174 143274791 140630687 137364604 133527825
9397 133527825 129195122 124468357 119472033 114334663 109175645 104104536 99212952 94555707
9389 94555707 90151916 86015335 82169952 78621755 75333459 72255621 69376085 66709235
9381 66709235 64239814 61915668 59707254 57637409 55727891 53946332 52239872 50601816
9373 50601816 49065997 47642944 46301262 45015474 43795461 42654484 41576888 40537222
9365 40537222 39532369 38575087 37667547 36798488 35959550 35151350 34378591 33647864 32963179
9356 32963179 32316375 31691627 31087564 30522759 30007561 29522715 29042106 28567742 28123385
9347 28123385 27718503 27338590 26971282 26622523 26301322 26004287 25723899 25460825 25217929
9338 25217929 24988512 24760179 24529339 24305949 24102845 23922998 23759163 23605771 23466583
9329 23466583 23344931 23230114 23106182 22977285 22870185 22802589 22761422 22724081 22688222 22664300
9319 22664300 22650811 22639345 22636605 22655841 22688942 22714152 22733518 22774023 22843634 22914032 22960288
9308 22960288 22992411 23030964 23075040 23115235 23157625 23210582 23264274 23308858 23359372 23435524 23527824
9297 23527824 23612346 23690405 23782575 23889274 23992161 24094715 24224299 24385567 24547014 24688919
9287 24688919 24833129 25005341 25195938 25383304 25572869 25783183 26008592 26226847 26436715
9278 26436715 26659827 26907223 27168444 27433829 27705450 27984367 28267842 28562668 28881954
9269 28881954 29223301 29567165 29902844 30240671 30592774 30957696 31331737 31719994 32125534
9260 32125534 32540689 32961132 33398170 33864227 34353811 34851819 35356031 35879537 36432857
9251 36432857 37012715 37607034 38204319 38799659 39395131 39990295 40571789 41123893 41654175
9242 41654175 42192163 42749662 43298729 43809963 44299556 44809229 45344786 45869335 46364264
9233 46364264 46862884 47404588 47981865 48557510 49115825 49669702 50229260 50792558 51362793
9224 51362793 51946997 52535944 53108784 53661890 54213224 54773754 55333436 55880795 56418252
9215 56418252 56952083 57485098 58026155 58588462 59169336 59749346 60322382 60910048 61534910
9206 61534910 62196120 62883861 63600246 64351034 65134200 65954014 66828908 67765017 68739037
9197 68739037 69731699 70763252 71868620 73050741 74289268 75584561 76957885 78414477
9189 78414477 79944900 81562320 83297642 85150958 87087864 89097823 91220482 93497061
9181 93497061 95927977 98496795 101205401 104066136 107089768 110302045 113740690 117412643
9173 117412643 121287660 125362665 129698474 134358074 139341654 144622957 150212870 156126122
9165 156126122 162301548 168613627 174954712 181251158 187409363 193317423 198914737 204203582
9157 204203582 209178407 213802010 218071877 222050458 225797277 229323071 232647653 235851941
9149 235851941 239023343 242187882 245346119 248541271 251832819 255223062 258666028 262135069
9141 262135069 265624514 269090596 272449221 275639831 278643253 281426756 283914944 286024928
9133 286024928 287686225 288811707 289296704 289082733 288205633 286770252 284906799 282762635
9125 282762635 280491996 278212235 275980212 273826264 271783978 269861951 268015008 266182619
9117 266182619 264344656 262508419 260653738 258728596 256696627 254554487 252299031 249908666
9109 249908666 247365005 244665271 241803560 238767494 235569768 232259549 228880986 225437317
9101 225437317 221919579 218357667 214813280 211324585 207886960 204495190 201177278 197968420
9093 197968420 194869562 191853797 188903168 186014373 183171319 180339856 177500066 174666068
9085 174666068 171863704 169103971 166389186 163728484 161129994 158589920 156109756 153718464
9077 153718464 151459465 149360349 147433852 145704937 144216101 143005243 142096341 141510225
9069 141510225 141259974 141328565 141670507 142242602 143013692 143936155 144930397 145914484 146835242
9060 146835242 147655998 148327548 148788768 148988693 148896032 148497754 147805798 146862876 145730082
9051 145730082 144468489 143133596 141775820 140437041 139152342 137956237 136872626 135894578
9043 135894578 134992957 134153110 133381556 132664333 131942518 131146526 130230374 129150284 127838538
9034 127838538 126236615 124339470 122172562 119741490 117046969 114138685 111102593 107989765
9026 107989765 104803421 101564989 98344618 95205757 92161466 89211731 86386808 83720758
9018 83720758 81210428 78834018 76587167 74467243 72443524 70482881 68594052 66809752
9010 66809752 65131947 63530843 61994047 60538256 59168422 57862889 56611335 55434154
9002 55434154 54343378 53308830 52288157 51276815 50304142 49385199 48497650 47608042 46704705
8993 46704705 45798111 44899702 44011018 43130579 42260136 41398882 40538519 39673754 38816023
8984 38816023 37986721 37195441 36434506 35696471 34983863 34295959 33620405 32950158 32299054
8975 32299054 31687385 31117912 30576411 30048407 29524365 28997537 28471179 27960749 27473867
8966 27473867 26994907 26505897 26015737 25548727 25108552 24676426 24244772 23828705 23438244
8957 23438244 23060753 22681416 22304799 21944583 21602990 21270183 20937432 20606226 20289879
8948 20289879 20004128 19746064 19487645 19206451 18917832 18654049 18414679 18167622 17902891
8939 17902891 17650590 17431700 17225335 17007601 16791689 16598412 16412621 16206756 15990739
8930 15990739 15797829 15629763 15456919 15270487 15092401 14928292 14752599 14555325 14365920
8921 14365920 14207766 14059267 13887623 13698244 13520714 13361871 13204371 13042779 12889197
8912 12889197 12744231 12592137 12430696 12280314 12152276 12028406 11887282 11735969 11598483
8903 11598483 11481443 11369328 11251198 11134010 11024633 10913334 10786777 10651148 10529907
8894 10529907 10437302 10362288 10282165 10186318 10081368 9976926 9874562 9772857 9676834 9594794
8884 9594794 9524934 9451397 9359893 9256156 9161686 9088627 9025886 8955636 8876032 8797156 8720171
8873 8720171 8636681 8549387 8475024 8418523 8360306 8282906 8198065 8130220 8080675 8027400 7958125
8862 7958125 7884553 7820976 7765697 7710172 7653353 7598760 7546502 7495450 7446684 7399397 7349338
8851 7349338 7295679 7243969 7199105 7160409 7124501 7086546 7039371 6981252 6924721 6885224 6858760
8840 6858760 6824648 6774943 6725837 6692267 6666967 6636188 6601232 6569180 6535094 6492479 6452468
8829 6452468 6431256 6421973 6399823 6355805 6306678 6268772 6239717 6211410 6184532 6161705 6138990 6113222
8817 6113222 6088014 6064964 6038463 6007043 5980287 5964955 5952565 5931627 5905561 5886155 5873479
8806 5873479 5856096 5830846 5808561 5795868 5783018 5757942 5724855 5699132 5687079 5680255 5669308 5653977
8794 5653977 5637387 5619917 5604076 5596827 5598374 5595428 5577359 5554931 5548567 5558237 5560967 5542646 5516636
8781 5516636 5502303 5499392 5495833 5489047 5484573 5481961 5477535 5475319 5480211 5485388 5481762 5474949 5475981 5479732
8767 5479732 5472315 5457664 5454566 5465820 5473621 5470868 5473195 5490022 5506644 5509707 5510014 5521846 5537072
8754 5537072 5541455 5543214 5560807 5589967 5608251 5610832 5617522 5639902 5662977 5669626 5667354 5676752 5701918
8741 5701918 5727263 5742803 5758847 5787787 5819968 5833475 5829708 5840403 5884872 5935645 5951804 5939200
8729 5939200 5945146 5989481 6035692 6046376 6036152 6044571 6080756 6123881 6160433 6190538 6210957 6222747
8717 6222747 6245805 6295451 6353118 6390308 6412304 6445472 6491326 6531970 6573601 6638706 6715183
8706 6715183 6763053 6780867 6815732 6890744 6971138 7025546 7072378 7133869 7190610 7223790 7263424
8695 7263424 7345034 7446955 7522083 7571411 7634337 7720294 7802966 7875469 7958945 8055548 8141782
8684 8141782 8214331 8297328 8395513 8483495 8553469 8631906 8732333 8829769 8902534 8966628 9046618
8673 9046618 9139681 9229078 9309294 9380009 9438917 9497554 9579974 9688454 9794732 9882268 9970648
8662 9970648 10078372 10189761 10284335 10373540 10478225 10589777 10684726 10763291 10844367 10934168 11026063
8651 11026063 11119838 11216429 11305985 11384890 11470048 11572112 11672784 11756907 11845952 11963584 12087704
8640 12087704 12181521 12258607 12365566 12504766 12629980 12725348 12832391 12978772 13131032 13248938
8630 13248938 13346764 13464958 13610111 13758729 13899900 14040328 14180635 14316915 14457034 14609957
8620 14609957 14765831 14908611 15042365 15186029 15347726 15520434 15696100 15868918 16032259
8611 16032259 16186981 16345406 16514804 16686876 16855247 17029312 17215552 17400324 17570720
8602 17570720 17739391 17927008 18130500 18330002 18517390 18696603 18867148 19031812 19209931
8593 19209931 19414788 19625960 19814018 19985657 20170542 20367737 20544736 20693277 20845000
8584 20845000 21019446 21195377 21352299 21503450 21661557 21804671 21909583 21994500 22091370 22192813
8574 22192813 22265874 22309032 22354092 22410931 22451038 22457743 22457525 22479365 22507563 22502162 22454278 22394863
8562 22394863 22349719 22307247 22237387 22128576 21995797 21858507 21721013 21574548 21410560 21228131
8552 21228131 21033459 20837484 20650610 20472701 20289643 20087924 19873190 19665822 19476247
8543 19476247 19294055 19104908 18907111 18704903 18497061 18283586 18074752 17879703 17691362
8534 17691362 17495957 17292572 17088620 16881098 16661547 16438477 16232914 16047370 15861094
8525 15861094 15664019 15471252 15289050 15091430 14856866 14610440 14396258 14216438 14033760
8516 14033760 13834204 13645853 13483304 13314111 13108973 12894253 12716208 12571039 12412586
8507 12412586 12223302 12034417 11869584 11709246 11529639 11345555 11188106 11058727 10930081
8498 10930081 10782525 10620155 10457964 10308563 10175279 10047172 9909426 9766913 9642864
8489 9642864 9543340 9441804 9315302 9176314 9047978 8928775 8809236 8702380 8620451 8537549
8479 8537549 8420649 8290084 8198763 8149041 8083878 7974375 7862239 7788172 7727236 7634780 7517670
8468 7517670 7413290 7325509 7231491 7135166 7062694 7009720 6940620 6844318 6749746 6676922 6609066
8457 6609066 6527297 6442340 6373102 6315410 6251229 6176543 6104743 6047459 6000091 5944700 5868215
8446 5868215 5781208 5710294 5663785 5618430 5554969 5489444 5444342 5405089 5341437 5263316 5212029
8435 5212029 5193789 5167474 5110897 5054153 5023663 4994489 4933277 4857154 4807848 4785565 4751385
8424 4751385 4689519 4628710 4597729 4589503 4578016 4549746 4509330 4467711 4431567 4397323 4354933 4303427
8412 4303427 4257537 4229812 4212821 4190804 4162142 4136041 4112733 4084155 4052374 4029693 4017492
8401 4017492 3999658 3963593 3918393 3885103 3872466 3867074 3848683 3814601 3784192 3773649 3772456 3758231
8389 3758231 3731482 3715597 3720019 3726825 3722124 3715760 3716209 3712281 3700293 3703827 3739050 3782576 3805889
8376 3805889 3822723 3866038 3934376 4002673 4073181 4166027 4263116 4315046 4310460 4285437 4250517 4165695
8364 4165695 4016680 3862558 3763125 3698618 3612076 3502482 3419202 3378314 3342449 3286291 3231478
8353 3231478 3202046 3184590 3153025 3106182 3061714 3030541 3011730 2998469 2979007 2945794 2911606
8342 2911606 2900730 2915674 2929883 2924021 2910662 2907851 2907726 2895439 2885387 2906727 2954799 2990268
8330 2990268 2997278 3013160 3078904 3181611 3274912 3343544 3411578 3485945 3529636 3508151 3434040
8319 3434040 3341418 3237979 3111930 2973027 2852975 2766450 2699154 2635208 2571583 2505684 2436237
8308 2436237 2379430 2355022 2350102 2326766 2275583 2229513 2210186 2194312 2156207 2111112 2084847 2067528
8296 2067528 2035407 1998816 1985817 1988859 1971638 1927813 1891336 1882151 1879540 1861655 1838084 1825405
8284 1825405 1816983 1797839 1771273 1751562 1742324 1737210 1732205 1724888 1710150 1687314 1664602 1648655
8272 1648655 1636200 1621103 1601803 1578065 1550186 1525870 1517832 1529032 1547531 1558278 1552558 1528187
8260 1528187 1493561 1469917 1472015 1484548 1476432 1442783 1412793 1409161 1421143 1428549 1430151 1431347 1423393
8247 1423393 1397914 1369811 1361809 1371650 1375551 1361972 1342789 1330309 1321157 1308317 1295391 1289817
8235 1289817 1288697 1280469 1261085 1242801 1241015 1252439 1254866 1234861 1207189 1195375 1200589 1206078 1206185
8222 1206185 1208738 1210764 1198917 1178559 1173615 1186687 1188166 1161745 1132795 1128808 1137447 1132472 1119006
8209 1119006 1118465 1124963 1115860 1097137 1097259 1115670 1117719 1089876 1063622 1067872 1087463 1090432 1074541
8196 1074541 1062667 1064911 1068386 1060510 1044735 1031911 1026780 1025726 1023349 1019359 1018170 1020441 1018981
8183 1018981 1008838 997798 997908 1007965 1013812 1006360 990909 977832 971554 970202 970666 972562 978279
8170 978279 986290 985572 966655 939717 927026 932411 936515 930542 930524 942297 940414 909343 879837 886904
8156 886904 911761 910678 887602 884969 906003 905089 866706 836987 852471 886449 897036 886613
8144 886613 878651 871764 855550 843264 849287 856481 843119 822424 819613 829417 833166 837712 855874
8131 855874 866432 841537 802836 799490 833011 854438 840205 820331 819299 818060 797245 776200
8119 776200 779523 796119 801760 798256 800566 804249 796589 787085 795917 817409 823207 802947 778311
8106 778311 771287 777493 780075 775845 774523 778619 778565 769809 763056 768952 779853 779732 769325 765050 770517
8091 770517 768222 748824 729666 728679 736654 735672 730722 737964 751307 749051 730397 717474 719885 723227
8077 723227 716884 708996 707359 706812 702922 700133 700606 701230 704328 714204 722995 719788 712437 716627 724616
8062 724616 713918 689149 682282 703185 722946 718883 704366 698567 697792 695286 699590 712277 715446
8049 715446 702867 695730 705275 709659 693459 678709 685815 694835 682675 669531 684325 708367 703462
8036 703462 678871 676247 696431 697272 666259 641390 647915 661818 654732 636277 630836 642075 658596
8023 658596 670471 667359 644278 619075 618800 640474 652883 644627 638103 645288 646515 631937 627957
8010 627957 654616 686129 686545 663820 654814 669294 680792 668244 640114 616502 606007 602687
7998 602687 596068 584670 581524 597179 617137 614515 589752 574497 585775 601671 598636 587148
7986 587148 587679 594547 591848 586832 595791 609125 603120 580605 569361 581161 598904 605386 601786
7973 601786 596001 592588 595481 603715 605718 594030 581428 584254 595193 594216 582705 582336 599499 614506
7959 614506 610610 593725 578249 570503 570950 578299 587722 595748 605068 613651 608060 585304 570395 586355
7945 586355 614505 616272 591966 581864 603861 627372 623169 604884 599697 605640 603374 590677 579969
7932 579969 574101 565888 553598 541470 532966 533493 547556 564010 560548 534679 513112 516683 533014
7919 533014 538374 528720 513066 494880 478573 476185 487647 492128 479026 467287 471627 473889 457472
7906 457472 444751 460567 479902 461106 418259 404322 424415 426739 391977 370308 400137 443557
7894 443557 445455 416439 406574 422736 426035 401420 378907 381151 391588 387511 373802 367722 371150
7881 371150 373399 368780 359812 351114 347366 350999 358120 362084 361349 357874 351015 342018 340110 351314
7867 351314 364024 360746 343899 334135 340939 350856 349641 341185 337504 342360 351439 357592 350946 327001
7853 327001 300471 295760 314943 331293 326657 318294 330520 354082 358166 336206 314276 313185 325142
7840 325142 333223 333674 329878 321050 308924 303699 310842 319593 315811 301370 290848 291655 296215 294041
7826 294041 285499 281083 288233 300971 306514 303021 302658 310656 311955 293483 271499 274203 298241 308742
7812 308742 289672 267741 271660 291668 300406 293922 286235 278243 261595 245385 249002 269602 283215
7799 283215 279568 271947 270554 269787 266006 265810 271443 277286 283352 292002 291609 269292 241106 238368 258155
7784 258155 262471 238909 224029 244714 273200 271980 251946 247064 255374 249313 230113 226255 242550
7771 242550 253300 247446 241896 245441 245748 239478 240641 248954 243379 220867 210165 229174 255363
7758 255363 258384 240381 224803 223648 233312 246161 250563 236033 212625 207052 225237 239478 229488
7745 229488 213177 214879 225923 224607 215659 217002 222013 211559 195244 202202 231571 249467 240388
7732 240388 226284 224624 222062 206630 195285 205314 221374 218366 202534 202210 224147 244009 240165
7719 240165 217372 194564 184735 189974 203364 211648 206154 194593 193164 204535 213746 209916 200920
7706 200920 198963 201730 199760 195705 200688 212688 215220 202412 190154 192664 201076 199143 189930 188815
7692 188815 195614 194262 180370 169093 171394 181046 190992 203338 214039 207569 181138 157701 158414
7679 158414 175640 189190 194902 198194 193326 173101 150019 143166 149682 152425 149927 153177 157662
7666 157662 148139 130849 130143 148722 161535 156762 152375 160560 166067 156405 145550 147671 152658 150189
7652 150189 154096 175984 194810 183209 150514 129869 132297 141867 148278 154781 158311 150804 139708
7639 139708 141435 154498 162735 163147 165408 166526 154988 139691 142728 159645 160696 139904 127676
7626 127676 140512 153572 144553 131876 141127 161429 167931 165303 172749 182567 172489 149289 140842
7613 140842 148795 147696 131573 122785 129646 134224 132234 145003 174099 183106 151953 116649 121127
7600 121127 154417 172558 164269 154557 154301 149113 137247 137901 154415 163951 154561 142366 140700 141409
7586 141409 139611 146999 163297 163984 139089 117615 126197 146789 146947 132688 134715 155118 167436
7573 167436 164537 166242 177093 175458 154247 137236 140260 146910 140522 132806 139320 149352 144423
7560 144423 130172 126115 135044 143877 146372 146187 144529 141367 141949 147462 147691 137852 132853 147267 169686
7545 169686 176322 164444 153137 154057 159593 159088 151390 141477 136232 140641 148879 147290 137081 140347
7531 140347 166209 186277 169652 131260 114229 129270 145143 140364 129381 129052 132366 130718 133907
7518 133907 148433 158194 147802 129316 126240 141692 158014 159374 143509 120239 106511 112272
7506 112272 125703 126172 115189 114860 130373 139496 130659 123884 135656 149740 146984 139747 147227 157394
7492 157394 147989 130221 133581 155213 163151 148656 137248 142352 144193 127681 110791 117012 140950
7479 140950 158966 159219 146927 131656 121589 121546 127720 131283 131085 133727 139848 143005 143566 148231 152896
7464 152896 144031 123407 112852 123982 140059 141399 134090 136188 145258 139690 111736 83395 82894
7451 82894 111579 140468 141382 118937 104532 115750 133064 128629 107830 101161 117572 130566 117449
7438 117449 90954 79477 91661 113782 130372 134548 126738 115133 111963 120900 132442 135702 128304
7425 128304 113626 98739 95893 111987 133994 140350 129928 122100 124741 123992 112468 103057 103363
7412 103363 101750 94050 98035 121033 138540 130296 114216 114885 119873 102729 72969 63762 79361
7399 79361 94360 100195 111795 127906 126015 103882 88187 90965 92330 79692 70691 80366 95610
7386 95610 100986 102887 108718 107752 93861 83713 89667 96159 87153 77049 87264 108254 113488 99934
7372 99934 87215 84716 85887 88954 96938 100432 86359 64476 61437 84200 108429 108462 84636 57892
7358 57892 48958 63365 86543 95539 84690 73105 75828 79757 66679 48026 49983 70374 80997
7345 80997 73396 70642 85995 99688 90905 68490 53652 51926 58044 70936 87563 96909 94870
7332 94870 90815 87386 73027 49982 46605 77549 111663 110331 83229 70935 81284 83522 65834
7319 65834 55377 68101 78219 61882 40208 47558 77191 91884 78533 60508 58333 66846
7307 66846 74671 81089 85442 80072 64944 54682 59893 71739 74627 66153 56205 53111 57994 66979
7293 66979 72808 69961 63116 63641 72822 77196 67420 52683 46921 48938 48517 46596 54652 74217 90049
7278 90049 88263 73845 65297 73734 89031 88781 65180 39770 39530 58135 60528 34919 17056
7265 17056 40964 84360 95219 64048 33565 34842 50346 52342 45296 49198 63952 72965 67680
7252 67680 51170 30536 19346 31287 56621 63485 40502 18924 30298 60323 71692 58081
7240 58081 45081 47058 54511 59815 65444 67674 59722 50986 57139 71916 75258 68063 69719 81273
7226 81273 83001 71571 66150 71183 67566 50869 43652 55888 66784 61938 55068 55341 49052 35128
7212 35128 40120 69499 83310 57098 29548 43932 75807 74219 48188 47370 71626 71506 39555
7199 39555 28587 61751 91431 78129 51804 54382 69913 60446 35556 33744 56368 70157
7187 70157 64366 60193 67185 70232 61433 51572 46962 42920 41871 51668 64972 66022 58291 58987 66346
7172 66346 62461 50679 55609 77418 82703 58083 37487 49694 69731 58364 27552 23315 52913
7159 52913 74366 62916 45938 54649 75040 73615 50668 38085 52477 76573 87226 81604
7147 81604 70918 62529 55735 48904 45482 52312 68957 79399 66141 38691 32248 62578 96781
7134 96781 93386 61972 50610 74758 95976 83103 58173 57592 77157 86925 79789 71596 67579
7121 67579 63237 67886 90838 110851 98321 65975 56113 74120 79260 52935 29794 38607 55108
7108 55108 45928 23944 21783 37136 44779 43038 47632 54010 46739 36019 43940 61498 61064 47421
7094 47421 51567 72526 73087 43854 24689 42336 68216 65660 45263 41273 57389 68677 62577
7081 62577 50100 45122 52809 69665 80857 70768 48301 42628 59810 68198 47255 24266 33506
7068 33506 61968 70794 53858 37954 36844 42586 52826 67533 66581 33836 -300 11902 60818
7055 60818 84209 57592 27915 35939 56494 50299 30766 33952 53784 56488 40132 31877 36699
7042 36699 34749 25825 32211 53701 59990 37785 12148 9191 25682 46716 66713 80266 77208
7029 77208 61694 54564 62200 63996 46521 28812 33272 49532 52028 41555 42533 62721 80462
7016 80462 75975 57001 45918 52510 66782 73529 68417 59562 54937 52714 48914 48840 58344 66887
7002 66887 58609 42793 48919 80034 97011 71282 31294 25632 54280 72927 60523 43252
6990 43252 45128 51992 41900 22498 15986 26423 42899 60208 76164 80137 64601 41429 30304
6977 30304 36288 50911 66491 76358 71860 54940 43090 44987 43849 26148 12720 30777 63436
6964 63436 65328 31477 10951 36427 75586 78538 47078 24695 33493 54426 64630 63434 58547
6951 58547 51777 46511 51105 65566 76359 71510 53966 37789 37470 58208 86800 96559 75749
6938 75749 47830 45283 64683 70854 49772 30865 42996 71821 82398 67917 51681 50078
6926 50078 57530 64392 68464 69285 68018 70988 77901 73105 48803 29329 44103 78903 87955 60178
6912 60178 36918 48913 72428 73835 64394 73567 92396 88576 65908 61495 83811 98660 85907
6899 85907 68499 68605 72804 64537 58407 72075 89309 84714 67712 66783 81075 84152 72133 71197
6885 71197 91821 109049 101563 83728 81037 93046 100032 94316 86518 86670 93790 101412 102907 94166
6871 94166 79462 70972 74426 79904 76466 71245 80531 102084 111937 96287 74304 75230 98194 111906
6857 111906 97342 74019 72188 91396 104889 99675 90752 93229 101723 106472 111072 120558 127252
6844 127252 124515 121777 128271 133124 121561 101976 95082 102431 108417 109112 114849 126144 132363 134792
6830 134792 145046 158022 154072 134110 124761 139048 158564 165741 166595 168060 161472 147171 148084
6817 148084 175310 203447 205216 190469 185595 193688 202102 210939 224289 229119 214430 198824 207867
6804 207867 234933 254667 263465 274680 286138 287721 289733 305395 315901 295796 264425 263863 290238
6791 290238 300348 287200 289569 316981 329085 311342 307005 338901 360034 330310 290593 301685
6779 301685 348787 370600 356839 350699 368193 379834 371384 364689 371459 376362 375380 386042 408751
6766 408751 419847 415607 422882 450259 467483 455130 441125 460910 505671 537525 540754 534051
6754 534051 540400 563172 588387 600357 598353 600337 622566 656498 678295 680218 677636 685566 704363
6741 704363 727686 747990 756891 758218 774825 820053 870293 894628 903820 933256 981779 1012218
6729 1012218 1015954 1027832 1065314 1104298 1135023 1187670 1270837 1337014 1353062 1359726 1409253 1481951
6717 1481951 1524266 1541654 1588477 1680130 1778969 1864079 1956901 2074464 2208216 2354092 2519641
6706 2519641 2702338 2904992 3163710 3506835 3899292 4299588 4761756 5374922 6070334 6594982
6696 6594982 6750812 6585367 6268228 5856782 5303150 4651035 4076430 3697552 3449286 3201554
6686 3201554 2927886 2693735 2531296 2401674 2264803 2124996 2002137 1899131 1809191 1730342
6676 1730342 1662573 1604091 1554242 1510497 1463356 1404164 1336462 1270902 1212037 1158997 1114425
6665 1114425 1080693 1049228 1006308 951348 899369 861973 833968 803675 770538 745224 732682
6654 732682 721459 695806 657895 629557 625204 629828 616908 585553 561636 557489 551274 521433
6642 521433 484248 473101 488575 496551 477271 449972 439536 441476 436071 420865 409741 408272
6630 408272 407843 400788 387448 370774 355523 349013 350985 347183 326360 299919 289795 298921 309282
6617 309282 308150 299660 289973 278891 269011 265739 265225 260659 262416 287334 321457 323170 280037 234479
6603 234479 228438 247113 248701 229426 219577 226123 223572 203428 190800 200313 211663 206364 198360
6590 198360 206522 220892 220205 205675 194193 190310 186389 181534 180593 180702 176421 173293 180313 192486
6576 192486 195130 183239 165127 149952 141471 139836 140260 134845 124052 119367 125985 132281 127676 120861
6562 120861 125766 137795 140576 130686 119160 112401 108202 108240 117460 130403 133272 122570 110774 111585
6548 111585 126745 145205 148352 122879 79345 50628 58504 88173 109407 113818 113429 111972 102384
6535 102384 89325 87861 96655 95654 76326 54747 48935 60048 79576 97908 103625 92947 81814
6522 81814 88808 105458 106688 91719 86115 97939 103400 87549 68039 62030 59605 50761 50102 68989
6508 68989 88235 87173 78191 81598 85508 65788 32383 18991 33073 50413 56548 60712 67557
6495 67557 65944 51605 36171 28496 27411 34125 50028 61615 51245 25926 13224 24825 44460
6482 44460 54248 52258 42350 28553 21850 30722 43209 40479 27847 26673 36317 35393 23448 25679
6468 25679 47285 59900 48167 33721 33555 30779 12364 1344 18463 40666 35130 12263 5991
6455 5991 18504 24588 18751 17656 22769 20306 15265 26614 47712 49476 28076 13971 25270
6442 25270 44456 50580 43975 29788 8290 -7485 2895 29404 31541 -4073 -36658 -26599
6430 -26599 9017 24913 9939 -10368 -17749 -15792 -9726 -531 6156 8928 20344 44195 55102
6417 55102 31511 -522 5030 43812 60554 29457 -6252 1478 35953 44342 14567 -14612
6405 -14612 -13266 6054 19011 23613 29523 33924 27281 13918 8861 15370 20269 15397 11374 20434
6391 20434 33601 30248 10746 2716 24727 56823 64067 42866 23634 27194 40254 41963 34496
6378 34496 32006 34381 32091 28749 37169 54300 59959 44565 22160 10148 9830 14079 21260 31013
6364 31013 35673 28312 14983 8206 10277 12290 9076 6130 9804 17682 22567 21891 19071 16892 12964
6349 12964 2775 -13785 -30165 -37536 -31032 -12635 9251 22904 21039 9322 2797 8244 14261
6336 14261 7050 -7341 -8704 8499 25064 21994 5080 -4457 2763 15656 18241 6514 -9246
6323 -9246 -15066 -7353 3161 5174 2368 6525 16940 20695 15133 12854 18424 19107 9071 2808
6309 2808 9607 15050 7170 108 6961 10623 -5570 -18171 2434 32597 23057 -17087 -24493 18185
6295 18185 48924 22977 -15308 -3944 40253 55304 32708 17935 27436 30317 13607 5886
6283 5886 22460 37699 32029 24292 33558 43680 32578 10182 766 6972 14735 18160 18550 12086
6269 12086 -2260 -13308 -12007 -4478 2168 13155 30722 40838 33533 23111 27256 36789 29906
6256 29906 10616 7302 30519 54379 49479 20235 -2424 295 14827 16027 1170 -7165 5451
6243 5451 22029 17829 -1842 -9010 3627 11846 -937 -17640 -13855 8965 31128 39138 28897
6230 28897 1588 -28170 -36568 -19904 -4439 -10770 -25670 -27599 -20564 -19266 -19308 -9837 459 15
6216 15 1562 19055 32247 14486 -14852 -12669 15841 19049 -18676 -48274 -30748 5975 15644
6203 15644 594 -7458 -4690 -10912 -24264 -21774 -1406 11135 1197 -15478 -18637 -9798 -5053
6190 -5053 -13060 -26401 -30381 -19031 -3053 2286 -3219 -6139 -317 7008 11164 14768 13367 -1936
6176 -1936 -20631 -17292 7130 16441 -7882 -32550 -20370 11631 19465 1071 -5735 11145 19979
6163 19979 416 -23455 -22976 -7021 -1888 -9811 -10596 5842 27028 34212 20387 -4881 -23044
6150 -23044 -23037 -12612 -8236 -14495 -21228 -19089 -8182 6209 15108 7150 -16731 -33689 -22722 3338
6136 3338 11130 -6075 -18470 -4444 18479 21099 1812 -17826 -22778 -14002 958 12158 10161
6123 10161 -2936 -12552 -10926 -7737 -12191 -16931 -12495 -5732 -7772 -13437 -11031 -5837 -13149 -29348
6109 -29348 -30945 -8163 16986 16450 -9452 -34239 -38244 -28736 -23687 -23559 -11275 17977 41206
6096 41206 35055 10127 -1202 10815 22525 14202 -4300 -15189 -18963 -23750 -26015 -20245 -14505
6083 -14505 -17572 -21479 -15349 -6193 -6476 -10925 -7261 -1354 -7627 -20296 -19958 -6218 2392 798 2613
6068 2613 10400 8916 -4829 -12346 -5368 -897 -10886 -21885 -21738 -22048 -32539 -35837 -15280 10057
6054 10057 10210 -7298 -8711 10683 19432 2910 -12452 -2833 15565 15105 -306 -7584 -4410 -7192
6040 -7192 -16397 -14437 514 7323 -3475 -13643 -9271 -4985 -16042 -26294 -11748 16010 22047
6027 22047 1265 -13115 -322 19307 19728 6007 -3205 -6889 -11605 -8568 11691 33571 33222
6014 33222 14331 673 -1516 -5979 -14731 -14553 -6455 -7426 -17199 -14497 4014 12739 -474 -12151
6000 -12151 -3174 8648 1531 -11489 -7780 3268 -260 -8763 2703 23912 19216 -12530 -31829
5987 -31829 -20570 -7517 -15114 -21675 -4055 16433 8029 -14964 -12587 14013 20679 -10567 -40685
5974 -40685 -29472 7878 25335 9072 -11714 -10503 5944 15944 11375 -1646 -16579 -28240
5962 -28240 -28235 -12270 8418 13776 -3037 -26199 -33901 -21702 -6179 -6218 -22384 -35791 -29052 -7919
5948 -7919 3353 -8435 -27659 -30482 -17457 -10648 -18568 -22601 -7367 11443 6231 -23653 -50159
5935 -50159 -51998 -35687 -19217 -10070 -6366 -7895 -15262 -23576 -26539 -25099 -24949 -26460 -24225 -17646
5921 -17646 -14686 -20182 -25398 -17506 1042 11997 4559 -9226 -10741 -286 5514 -901 -8969 -8092
5907 -8092 -1764 1205 -1290 -6798 -12948 -15650 -12943 -13837 -29627 -51625 -54594 -31464 -6815 -3273
5893 -3273 -12930 -17909 -19005 -22015 -16054 4716 14863 -9523 -42700 -37484 350 13667 -20230
5880 -20230 -53358 -39742 -2073 8695 -10915 -22298 -8168 9282 8104 -8178 -25092 -32265
5868 -32265 -23998 -4678 8146 3247 -6664 -4452 2523 -4525 -20684 -22723 -8445 -1633 -12135
5855 -12135 -18791 -4898 12182 5440 -21577 -38075 -25038 3323 18074 7326 -13877 -23609
5843 -23609 -18754 -14911 -21525 -29209 -28245 -26182 -33397 -42289 -39158 -29251 -29043 -37245 -35500 -18175 -471
5828 -471 5266 1435 -8622 -24863 -37216 -30795 -11701 -5580 -20768 -33983 -24643 -3680 5851
5815 5851 -689 -13204 -25554 -35560 -39442 -39360 -43727 -49836 -43083 -25052 -21081 -42067 -59602 -42985
5801 -42985 -4770 16673 8064 -11311 -23646 -27687 -25642 -19756 -18664 -26896 -33888 -31500 -30313 -36914
5787 -36914 -33076 -8621 4295 -26259 -68129 -58888 -3022 25849 -5503 -40799 -26006 8427
5775 8427 6278 -20184 -17982 11846 16053 -20198 -48660 -35147 -7927 -7097 -26664 -34683 -23191
5762 -23191 -10043 -6891 -8525 -6483 1537 10453 9293 -7039 -24524 -22954 -5816 1399 -10491
5749 -10491 -19986 -11618 -3722 -17943 -39979 -39453 -18450 -8373 -19619 -26474 -11214 5415 -2884
5736 -2884 -24353 -24520 2073 21874 8783 -21052 -34675 -28045 -25551 -37897 -44733 -28941 -8467
5723 -8467 -13295 -40006 -53963 -38071 -15507 -13832 -26661 -28519 -14385 -2938 -5378 -12007 -11908 -8448
5709 -8448 -8823 -11327 -11295 -10616 -12804 -14680 -11614 -7908 -13255 -27808 -37321 -28398 -7405 2306 -12415
5694 -12415 -34042 -32400 -5532 11957 -7130 -42406 -49573 -19651 9640 6659 -13978 -18754 -3931
5681 -3931 5760 -2144 -13367 -14201 -11309 -15349 -20752 -15309 -1832 3676 -5526 -17209 -16405 -4901
5667 -4901 1307 -7371 -21373 -23152 -9610 1777 -7241 -32040 -47325 -35836 -10769 -2892 -24079
5654 -24079 -50614 -50043 -21606 1437 -6538 -31157 -38302 -19239 658 -1953 -20152 -31215 -26134
5641 -26134 -14420 -8054 -11680 -23792 -37605 -42910 -34818 -19234 -5124 4631 10119 8879 1014
5628 1014 -5925 -5764 -2822 -4443 -9858 -14822 -20599 -28177 -30462 -22540 -13330 -13285 -16647 -11731 -2991 -3904
5612 -3904 -11678 -10717 -706 1905 -6575 -9899 -1121 4253 -4879 -16342 -15966 -9267 -7503 -8459 -5952
5597 -5952 -4136 -8128 -13715 -18686 -29232 -42585 -41263 -19960 557 3954 2608 10401 13005 -6656
5583 -6656 -32065 -35117 -20653 -14664 -19483 -17981 -13406 -23296 -37721 -29097 -6317 -10783 -47013 -65652
5569 -65652 -37184 1905 6186 -14259 -22303 -14884 -14197 -20059 -14707 -3378 -8639 -28015 -34746 -22317
5555 -22317 -14322 -23505 -31179 -19624 -1403 -294 -17360 -31486 -27870 -14801 -12010 -27380 -47954
5542 -47954 -54788 -43318 -23425 -3522 13299 19226 6040 -16388 -25057 -15045 -6624 -12308 -19066
5529 -19066 -15748 -13030 -18025 -15513 707 3466 -28132 -65555 -65093 -31136 -6433 -9147 -19661
5516 -19661 -23834 -27416 -28082 -14320 4220 3871 -11389 -13533 486 4353 -7389 -9922 533 -5570
5502 -5570 -33999 -46067 -21364 4731 -983 -16381 -7584 11746 8934 -9914 -16834 -13194 -18118
5489 -18118 -25323 -18046 -11048 -29637 -58222 -58554 -32578 -18257 -25443 -25850 -10029 -4160 -18865 -27339
5475 -27339 -11770 7533 7966 -4050 -14943 -25654 -34448 -28663 -11489 -7589 -23345 -30662 -10903
5462 -10903 13709 15671 1622 -9771 -22633 -45251 -58879 -41468 -9019 2067 -13260 -27162
5450 -27162 -24873 -19967 -22450 -21780 -9474 4697 8432 1736 -10825 -27095 -39874 -37370 -20041
5437 -20041 -5652 -8210 -19885 -23064 -15116 -11193 -22259 -38392 -39909 -22967 -5778 -4759 -12355
5424 -12355 -9496 4479 10336 -1159 -14937 -14654 -5309 -1945 -6825 -9648 -3416 9013 18281 13508
5410 13508 -6823 -25561 -22609 -5006 -2536 -23982 -40054 -26402 -1370 3241 -9346 -11472 2125
5397 2125 10473 4220 -4116 -7385 -11972 -16596 -11016 -332 -3587 -21534 -31552 -22682 -10690 -8709
5383 -8709 -7979 -266 4045 -4698 -18074 -25662 -29175 -27752 -11692 13024 18215 -6336 -28635 -18047
5369 -18047 5901 1845 -28784 -43595 -23766 465 -2847 -25723 -40400 -37636 -28041 -21214 -19467
5356 -19467 -22157 -24151 -18231 -7582 -5779 -15812 -21580 -12315 -2884 -11938 -28474 -23396 5488 24042
5342 24042 7518 -23568 -30912 -10036 7556 897 -15355 -19541 -15745 -21022 -33041 -33066 -18716
5329 -18716 -11649 -25957 -45963 -47523 -30830 -18090 -22509 -32504 -28955 -9993 6775 5153 -10740
5316 -10740 -21990 -18747 -11379 -12636 -17044 -11066 506 -2990 -25414 -42464 -34049 -12547 -3373
5303 -3373 -9171 -12694 -8583 -9878 -21547 -28527 -19112 -4861 -4368 -16344 -22969 -16878 -10629 -16171
5289 -16171 -26725 -28255 -21838 -21187 -28678 -29589 -17210 -8670 -20678 -39712 -36722 -8383 17313 18311
5275 18311 1063 -18007 -31898 -35914 -23100 68 11786 2287 -13704 -23187 -31766 -39939 -29939
5262 -29939 -21 15660 -5077 -28949 -14110 18126 11053 -35240 -58389 -28853 7332 3416
5250 3416 -22408 -29782 -21255 -22521 -29577 -21433 -5365 -5085 -15798 -12788 2015 2367 -15127 -24928
5236 -24928 -17373 -13538 -26332 -38781 -34341 -22317 -17913 -18100 -12631 -2728 4652 7765 4518 -10436
5222 -10436 -32364 -42976 -31671 -10081 3610 4224 -4369 -19413 -34258 -35309 -17918 2697 9103
5209 9103 3593 821 5321 9350 8314 5003 606 -6427 -13169 -14391 -12050 -13373 -19152 -22754 -21727
5194 -21727 -21715 -26084 -28913 -23029 -11274 -5311 -13080 -28691 -36317 -26654 -9111 -2858 -14240 -28984
5180 -28984 -30142 -17038 -1106 9628 12957 5510 -13796 -34260 -39571 -26556 -8994 -377 -1409
5167 -1409 -7072 -15760 -25285 -28522 -21725 -11994 -8488 -10443 -11795 -13130 -18599 -23848 -19959 -10135 -8145
5152 -8145 -15270 -14135 3263 15564 -802 -32504 -42343 -22704 -8868 -26544 -51171 -43769 -10664
5139 -10664 5085 -12145 -29577 -18532 2811 -174 -26823 -46151 -42491 -29526 -21870 -17755 -13493
5126 -13493 -13431 -17627 -17198 -11260 -12785 -26466 -35632 -26313 -12013 -15281 -31948 -35995 -19539 -5440
5112 -5440 -13044 -30462 -33272 -16946 3379 15016 14326 -298 -23533 -35381 -19377 9392 15339
5099 15339 -10492 -33738 -21438 12145 24368 387 -31564 -40497 -27807 -16222 -19447 -32437
5087 -32437 -42289 -40072 -27228 -15588 -15857 -23346 -22763 -10101 512 -2506 -11983 -15782 -16274 -22598
5073 -22598 -31142 -30610 -23996 -27510 -44313 -55590 -46151 -26578 -18685 -26831 -36035 -35105 -29063 -27068
5059 -27068 -28604 -27680 -24609 -25804 -32798 -37873 -33088 -20294 -9312 -7786 -14960 -23467 -24750 -15680
5045 -15680 -4211 -5177 -22963 -40523 -37012 -17659 -11309 -30224 -47919 -34057 -649 11124 -10895
5032 -10895 -31797 -19649 10541 22394 10321 -266 2918 4434 -5741 -12148 -695 15390
5020 15390 15483 3112 -3895 -5087 -14095 -27283 -24198 -5029 671 -22046 -45594 -39512 -18860 -21055
5006 -21055 -44165 -46270 -10865 23802 18365 -13887 -32322 -27148 -21283 -25388 -25347 -15258 -10984 -19972
4992 -19972 -23146 -4322 20102 21617 57 -17514 -15623 -7693 -10082 -16592 -11399 3020 7710
4979 7710 -3803 -14228 -7438 7418 9880 -545 -4551 4984 10243 -3458 -23314 -28090 -20013
4966 -20013 -18118 -25434 -24849 -9540 3377 -1679 -15813 -20473 -14244 -11130 -17603 -24431 -21306 -10258
4952 -10258 -1674 -1309 -4064 -1189 6262 4537 -16751 -46974 -61197 -47330 -20057 -4085 -8795
4939 -8795 -22940 -29425 -21401 -7030 -889 -8243 -18445 -18569 -11157 -9650 -17281 -22807 -20086 -18661
4925 -18661 -27330 -37994 -36278 -21889 -8636 -7343 -15780 -23589 -22734 -14549 -7456 -5411 -2621 3138
4911 3138 -534 -22476 -43894 -36599 -7259 4426 -18430 -44432 -40829 -17681 -1765 6330 17365
4898 17365 18892 -4892 -33789 -34737 -16180 -14955 -32361 -32329 -8545 -987 -27288 -47035 -24691
4885 -24691 13045 19920 -1974 -17796 -19275 -24882 -35746 -35017 -25076 -25238 -33381 -27180 -6458 1398
4871 1398 -14018 -28807 -23578 -11019 -10138 -17524 -20785 -20749 -23271 -24375 -19261 -13636 -13264 -14417 -15397
4856 -15397 -22682 -33821 -31899 -13221 -2323 -17346 -36740 -29080 -4761 -2884 -28645 -42346 -21113
4843 -21113 4784 -504 -23751 -26586 -5530 7335 -3326 -18181 -19975 -16063 -14851 -8755 3933
4830 3933 5361 -13343 -30550 -25336 -13098 -21193 -41070 -38897 -10714 8971 -79 -16836 -19253
4817 -19253 -19860 -36942 -54268 -41631 -4830 16236 351 -28623 -34927 -13406 10282 12169 -6443
4804 -6443 -25118 -27811 -16928 -4086 5933 13623 13297 -251 -14547 -9741 8962 12585 -7556
4791 -7556 -22768 -11580 4706 -2362 -20332 -18262 -809 857 -15509 -20234 -5490 868 -14794
4778 -14794 -28184 -20114 -8160 -13554 -25994 -25936 -17956 -16333 -16376 -5825 9120 12765 4738 -3969
4764 -3969 -10220 -16943 -22073 -24243 -28203 -31576 -21525 1070 12957 2249 -9383 -846 12527
4751 12527 5280 -14385 -20018 -11662 -9299 -12061 -2865 11724 6809 -15426 -25570 -16416 -12480 -22314
4737 -22314 -22856 -6043 -346 -23109 -46471 -38318 -9162 9792 11438 7517 -177 -13624 -20642
4724 -20642 -12319 -4376 -13363 -25821 -20638 -8330 -14326 -33207 -36999 -24531 -22762 -36051 -34849
4711 -34849 -7486 14038 1406 -26469 -33441 -18148 -7507 -11805 -16005 -11444 -9011 -17113 -27732
4698 -27732 -31832 -32659 -34752 -32463 -21067 -10494 -13846 -25465 -25580 -9336 3526 -3437 -18593 -20214
4684 -20214 -10677 -12097 -29092 -39269 -28250 -12126 -10545 -16341 -12337 -3995 -10003 -27500 -33335
4671 -33335 -19789 -4573 -1513 -3737 -2508 -1736 -4508 -4017 1043 -1001 -14808 -26101 -23095 -15411
4657 -15411 -16766 -22208 -19672 -12960 -14087 -20817 -21559 -17220 -18110 -22060 -16506 -2929 1363 -9784 -21049
4642 -21049 -19306 -11689 -11353 -18338 -23966 -23652 -16872 -4375 6225 2517 -14894 -26126 -15705 4821
4628 4821 11333 -689 -12938 -11927 -5638 -9314 -25363 -42292 -47027 -35166 -14679 -1561 -5946
4615 -5946 -20405 -27665 -21668 -14057 -16547 -24640 -25740 -18353 -13886 -19059 -24414 -15678 5302 16995
4601 16995 532 -35243 -58561 -49593 -23831 -10833 -14938 -14188 -53 4158 -20192 -49855 -45729
4588 -45729 -10788 8277 -14777 -47854 -46689 -18184 -7203 -27590 -41278 -16201 24188 32652
4576 32652 3156 -24108 -19276 2856 12040 3307 -6262 -6051 584 8156 11335 2375 -15828 -20642
4562 -20642 3484 32018 22662 -24040 -57027 -42407 -8876 -1083 -14470 -12602 7992 14404 -4539
4549 -4539 -20778 -16353 -10560 -20730 -30250 -19280 -176 4135 -3404 -5544 -2322 -5200 -12934 -18067
4535 -18067 -25100 -37523 -39611 -18566 6820 9514 -3760 -6549 -252 -9760 -34321 -43809 -29121
4522 -29121 -16555 -21668 -27013 -20154 -16535 -25609 -29549 -18017 -10517 -18797 -20274 985 18779 6119
4508 6119 -16442 -14461 2827 3756 -7039 -1628 13092 5418 -17885 -16119 12174 18460 -16836
4495 -16836 -48761 -37540 -6673 1533 -11059 -17335 -15202 -18991 -23467 -15374 -5046 -11086 -26427
4482 -26427 -32215 -32433 -41288 -48798 -35904 -14951 -15911 -36093 -43443 -30535 -24273 -35310 -39189 -22293
4468 -22293 -8257 -17130 -30630 -23849 -5625 309 -5730 -7554 -5177 -10891 -23156 -29616 -28643 -25411
4454 -25411 -15263 5067 18289 6313 -16204 -18371 -1651 1542 -17156 -24732 -370 26730
4442 26730 19645 -10535 -23625 -10405 1352 -3518 -7334 4145 16061 11424 1102 5455 19736
4429 19736 21099 4956 -8137 -4324 4558 2753 -3788 1858 18895 27526 16752 -1233 -10161
4416 -10161 -11004 -13563 -15540 -6031 11275 15422 -4234 -30590 -39709 -30493 -21081 -21582 -24684 -21469
4402 -21469 -12293 -1013 8164 6075 -14120 -39806 -44623 -21211 4998 7194 -9219 -19589 -16641
4389 -16641 -14279 -19166 -20703 -13084 -8042 -15857 -26850 -23867 -6955 4787 -4498 -28385 -42920
4376 -42920 -31451 -4897 8462 -2791 -18305 -14527 2359 8785 916 -4006 -1090 -5015 -18596
4363 -18596 -22556 -9192 425 -9053 -20488 -15313 -8398 -21122 -37103 -22558 15829 32190 5167
4350 5167 -32662 -39438 -12163 20598 32306 14701 -19331 -39676 -25290 4905 8749 -22130
4338 -22130 -46857 -31654 3972 19797 11724 6790 15080 18616 5198 -14239 -25187 -25984 -21202
4325 -21202 -14507 -10680 -12132 -13548 -10995 -11889 -22188 -30277 -22216 -7806 -8691 -22170 -22769 -3748
4311 -3748 9868 253 -15910 -15238 -2794 209 -10254 -20239 -21477 -17065 -9211 1626 8715 5155
4297 5155 -4238 -10014 -13770 -23178 -34248 -33945 -20700 -7821 -4058 -3805 -149 4539 6594 9410 16748
4282 16748 24211 23685 12863 -2721 -14114 -15165 -9034 -7360 -16592 -27372 -26825 -19205 -20844 -33506
4268 -33506 -38892 -25870 -7565 -921 -2966 -1179 3737 1976 -5819 -10188 -9706 -9609 -6987 4448 15973
4253 15973 10286 -10462 -22736 -14621 -2595 -5405 -17705 -22476 -16263 -8197 -4765 -8707 -22088
4240 -22088 -36239 -30350 1998 34268 35059 8116 -16459 -24543 -26521 -26773 -14850 7301 18439
4227 18439 10557 2885 8203 10043 -6113 -21965 -14373 2930 -1317 -23507 -27816 -2999 17792
4214 17792 6007 -21451 -29223 -11906 6050 7726 -506 -6972 -9440 -9097 -3890 5706 12656 12026
4200 12026 9331 13461 22635 24407 11977 -5597 -15123 -16396 -18467 -21525 -16216 -3662 -208 -12690
4186 -12690 -23756 -17077 -4829 -9178 -24479 -24076 -4114 8118 -2215 -13545 -5309 4306 -14315
4173 -14315 -49959 -58214 -23415 15640 15554 -15641 -32937 -16511 4394 -4294 -32878 -42078 -18361
4160 -18361 8282 7580 -11083 -17583 -4676 9198 12652 12153 11127 2917 -10931 -18040 -17711 -23656
4146 -23656 -35607 -32904 -10273 5343 -5527 -21358 -12765 9559 12939 -3310 -9056 4422 11240
4133 11240 -3345 -18558 -14082 -1522 65 -2385 8775 27017 27186 2168 -26282 -35074 -23968
4120 -23968 -8597 598 5990 12245 14097 520 -26165 -42511 -27074 9253 29738 13968 -18029
4107 -18029 -32096 -20700 -5829 -6690 -18137 -22968 -15343 -5002 -1513 -1707 3949 16329 25504 23860
4093 23860 14488 4425 -2653 -3564 4435 14150 10165 -9345 -23557 -15775 852 1840 -13036 -23002
4079 -23002 -18554 -7812 4478 18944 25232 11776 -7614 -7003 8986 9111 -11271 -18655 2617
4066 2617 21756 12171 -5750 -3386 6461 -3939 -25680 -28461 -10499 5688 13901 22404 23570
4053 23570 5822 -12688 -4197 19635 21036 -3275 -18177 -8895 773 -3958 -6938 1339 5655
4040 5655 170 1373 11711 10277 -3368 1006 28548 37946 6144 -27836 -21611 5422 9246
4027 9246 -8158 -13916 -5993 -8336 -19200 -14782 2859 7956 -2564 -7354 -2261 -2451 -6217 1224
4013 1224 10697 460 -17076 -9050 15730 13092 -18998 -28746 2944 24374 -3968 -43165 -39486
4000 -39486 -9108 -3414 -22432 -24119 -1424 11374 3613 1813 13980 13189 -10240 -26552 -16298
3987 -16298 -3577 -15391 -37952 -39691 -16778 7840 15392 2201 -25156 -47136 -38456 1374
3975 1374 36082 31835 -202 -20931 -15519 -5333 -9750 -20439 -20561 -11110 -6652 -14507 -27574 -33333
3961 -33333 -25152 -8875 -33 -8376 -23348 -23070 -1778 19848 18604 -3134 -21573 -19907 -3642
3948 -3642 10615 11767 -1179 -20452 -30381 -16379 17072 42083 32636 -4793 -35226 -32784 -6594
3935 -6594 14564 14553 -784 -18975 -32568 -36437 -26654 -8156 4204 -437 -17117 -31595 -35020
3922 -35020 -27485 -12142 5357 13468 2214 -21460 -34571 -22620 1299 10930 -1314 -16749
3910 -16749 -15731 -242 13813 17546 13470 5395 -4978 -13579 -16364 -15809 -16155 -13814 -3633 6147
3896 6147 175 -19181 -28848 -14964 8323 20350 20016 16547 8596 -7179 -17148 -5786 13819
3883 13819 11500 -14927 -32647 -20723 1141 5219 -5463 -11187 -10114 -13550 -17880 -8950 8281
3870 8281 10566 -8956 -28225 -26030 -7712 7628 12338 12655 14888 18365 17974 9313 -4704 -12512
3856 -12512 -6893 1815 -2450 -15865 -16692 1837 17451 8561 -16121 -31787 -30089 -21263 -12252 -1723
3842 -1723 6144 1620 -14314 -27936 -30611 -27465 -25479 -23667 -19081 -13865 -11995 -14512 -19687 -23339
3828 -23339 -20641 -13472 -11585 -17877 -19177 -5227 10011 5808 -10189 -9613 11196 22038 5881
3815 5881 -13970 -13056 -5545 -16901 -37181 -36536 -16677 -9818 -27153 -43344 -38581 -24400 -16171 -8194
3801 -8194 7468 20546 19864 13235 11456 7801 -6850 -21208 -17622 -1023 7126 -331 -10458 -13017
3787 -13017 -11093 -9094 -6794 -7128 -15121 -25990 -27130 -15498 -2520 752 -6194 -18451 -29442 -29063
3773 -29063 -12092 8285 10197 -7143 -18110 -5651 11685 3749 -27761 -48750 -36519 -7685
3761 -7685 5103 -6856 -22987 -23314 -10756 -493 2390 4795 9334 8721 -463 -9006 -7855 -2517
3747 -2517 -4489 -11906 -10237 6500 24691 25885 7915 -12716 -18488 -9536 -3502 -13853 -30373
3734 -30373 -30588 -12584 -2218 -17909 -42676 -48282 -35099 -24019 -16750 3748 31307 31436 -5433
3721 -5433 -37212 -23863 14701 27471 5315 -12631 -3402 8339 -3937 -24341 -21215 1689
3709 1689 10885 -5618 -21826 -15190 -571 -5193 -24293 -26750 -3490 15831 5855 -16586 -18810
3696 -18810 -1846 4742 -7803 -15653 -5303 3512 -7264 -23895 -26748 -22845 -26573 -27385 -7947
3683 -7947 18652 23883 9490 3829 14191 18370 7919 3628 16362 26349 19022 10940 17208 19896
3669 19896 -2161 -31640 -33442 -7378 10705 -1485 -27921 -41215 -33480 -16080 -4075 -4596 -10465
3656 -10465 -6460 9031 16234 2482 -11510 2376 32265 35376 289 -31041 -20905 10339
3644 10339 15077 -12457 -30778 -13809 12359 8579 -23073 -45283 -36522 -13588 -1446 -992 1133
3631 1133 4702 -2672 -19611 -26313 -11648 10114 18418 10342 -4167 -18945 -29963 -27372 -7272
3618 -7272 13488 13064 -5440 -17751 -13642 -9043 -16894 -25192 -17197 552 7195 -2264 -11846 -8892
3604 -8892 -184 165 -9226 -15479 -8602 4540 7797 -2536 -10546 -1717 15080 18538 5281 -6235
3590 -6235 -4651 -1621 -10029 -21124 -17403 852 16437 18060 10212 3333 4257 13387 22837 21741
3576 21741 11154 6399 15089 22928 15507 3358 5022 13699 7338 -10851 -13121 6350 18415
3563 18415 6349 -5873 3628 12837 -8050 -39012 -33058 8702 31158 4373 -32879 -31271 423
3550 423 16513 2719 -13589 -13636 -10894 -18752 -24952 -14286 2700 3256 -13876 -25901 -16365 4943
3536 4943 16287 9934 -2370 -6533 -1379 5385 10243 15062 17115 9054 -6710 -14164 -3733 11688
3522 11688 13338 3682 1062 8988 9996 -4151 -14497 -891 25668 33935 12560 -15715 -23123
3509 -23123 -9597 673 -8514 -24947 -24508 -4166 12789 9128 -1413 4207 21261 24092 7915
3496 7915 -3032 4003 9202 -4634 -20817 -16433 -1764 -3157 -19154 -24932 -14233 -5288 -5956 -4369
3482 -4369 1905 -1609 -15370 -16394 5416 25832 19122 -6134 -21862 -16769 -1571 9980 10358
3469 10358 -1111 -13749 -11339 6548 19819 14494 1312 -3072 1002 5109 9830 17691 22243
3456 22243 19654 18088 20372 12920 -9816 -26477 -17325 2655 4840 -10811 -21979 -21910 -20851 -17167
3442 -17167 -209 20355 21097 2440 -10940 -9638 -8268 -11590 -5757 8928 10504 -7250 -21378
3429 -21378 -17306 -9133 -7903 -2045 12479 15800 690 -7360 5816 11566 -14430 -43604 -36083
3416 -36083 -7548 -4943 -28907 -34216 -6632 13761 -1953 -28808 -31594 -14607 -2962 -2102 -2330
3403 -2330 -3928 -12097 -19306 -14957 -4657 -1540 -4797 -3293 4090 7220 2245 -2514 578 8372 11527
3388 11527 5173 -4979 -6237 7731 26251 30667 16664 659 -182 12219 22087 18709 3897
3375 3897 -14509 -28812 -32687 -23470 -5773 9906 14917 9477 1214 -4050 -7660 -11346 -9657 1643
3361 1643 12074 6233 -10280 -13215 3176 12036 -5993 -28463 -22769 2760 11707 -4354 -18245
3348 -18245 -15109 -10703 -15139 -15242 -6733 -8880 -27343 -34729 -13451 10651 7293 -9943 -8471 8971
3334 8971 12967 -626 -6765 3057 8356 -1979 -10843 -2261 15843 28602 33027 30242 17475 -1752
3320 -1752 -14170 -12839 -5513 -1449 -1068 -2069 -3656 -2298 4045 6778 -3551 -18331 -19397 -7364
3306 -7364 -1136 -6322 -7195 3371 10548 5249 1029 7890 11964 390 -14412 -17815 -20857 -37492
3292 -37492 -49838 -29933 10813 29235 10085 -13763 -10060 11131 19070 4915 -14522 -22566
3280 -22566 -16653 -4204 3965 1506 -5195 -3436 7132 13448 11713 15093 27751 28635 1138 -33391
3266 -33391 -37631 -9846 13458 9614 -2667 1035 13014 11701 -220 -1880 10260 18937 16417
3253 16417 13665 15780 11628 -3379 -14553 -10202 216 3896 5231 12326 16376 4282 -16821
3240 -16821 -27728 -24261 -17002 -9146 3683 14109 7853 -9184 -12488 4718 18045 6075 -19908
3227 -19908 -33189 -24282 -3694 15641 25601 21992 8507 -4196 -9783 -9122 -681 16854 30037
3214 30037 20683 -1944 -5248 16241 24316 -4715 -34904 -20496 21384 33702 4072 -23007
3202 -23007 -18269 -2107 2748 4433 8868 -831 -24076 -23564 17056 51386 30644 -20469 -38480
3189 -38480 -14609 2120 -9878 -16251 4614 20955 4604 -16614 -3215 30085 37054 11218
$$ [...]
##END NTUPLES=NMR SPECTRUM
##END=
