##TITLE=1H ikalashn
CA-9279-4
24.10.2024
##JCAMPDX= 6.0         $$ Bruker NMR JCAMP-DX V2.0
##DATA TYPE= NMR SPECTRUM
##DATA CLASS= NTUPLES
##ORIGIN= UXNMR, Bruker Analytische Messtechnik GmbH
##OWNER= root
$$ TOPSPIN		Version 1.3
$$ 2024-10-24 15:13:05.265 +0400  Irina@DPX200
$$ Compression mode = diff/dup
##.OBSERVE FREQUENCY= 200.131300845
##.OBSERVE NUCLEUS= ^1H
##.ACQUISITION MODE= SIMULTANEOUS
##.ACQUISITION SCHEME= undefined
##.AVERAGES= 16
##.DIGITISER RES= 18
##SPECTROMETER/DATA SYSTEM= spect
##.PULSE SEQUENCE= zg
##.SOLVENT NAME= DMSO
##.SHIFT REFERENCE= INTERNAL, DMSO, 1, 17.49637
##AUDIT TRAIL= $$ (NUMBER, WHEN, WHO, WHERE, WHAT)
$$ ##TITLE= Audit trail, TOPSPIN		Version 1.3
$$ ##JCAMPDX= 5.01
$$ ##ORIGIN= Bruker BioSpin GmbH
$$ ##OWNER= Irina
$$ $$ F:/spectra/data/iren/nmr/1H/4/pdata/1/auditp.txt
$$ ##AUDIT TRAIL=  $$ (NUMBER, WHEN, WHO, WHERE, VERSION, WHAT)
(   1,<2024-10-24 15:12:36.468 +0400>,<Irina>,<DPX200>,<TOPSPIN 1.3>,
      <created by zg
	started at 2024-10-24 15:11:28.671 +0400,
	POWCHK disabled, PULCHK disabled
       configuration hash MD5:
       BE 6D 3F 07 2A EA 11 49 91 17 2B D3 AF B3 58 0D
       data hash MD5: 16K
       03 61 B5 CE C3 B8 15 1D B1 8A DC 1A 62 D5 7F 65>)
(   2,<2024-10-24 15:12:37.671 +0400>,<Irina>,<DPX200>,<TOPSPIN 1.3>,
      <Start of raw data processing
       fp BC_mod = 2 FT_mod = 6 PKNL = 1 PHC0 = -41.51857 PHC1 = 7.069217 SI = 32K 
       data hash MD5: 32K
       B6 C1 7D 82 36 E5 1A C0 27 64 26 BB 53 D0 4A 61>)
(   3,<2024-10-24 15:12:40.390 +0400>,<Irina>,<DPX200>,<TOPSPIN 1.3>,
      <apk 
       data hash MD5: 32K
       F4 E4 B8 DC F7 FC C2 61 26 A1 AF DD 41 70 D3 D4>)
(   4,<2024-10-24 15:12:42.734 +0400>,<Irina>,<DPX200>,<TOPSPIN 1.3>,
      <abs n ABSG = 5 
       data hash MD5: 32K
       EB E5 43 07 EF E7 AB CB BC A6 C9 A6 27 61 9A C0>)
(   5,<2024-10-24 15:12:51.578 +0400>,<Irina>,<DPX200>,<TOPSPIN 1.3>,
      <pk fgphup PHC0 = 4.115088 PHC1 = -8 
       data hash MD5: 32K
       97 0E 4C B1 E0 6E 64 24 E0 60 71 5B 15 BB C6 EA>)
(   6,<2024-10-24 15:12:53.203 +0400>,<Irina>,<DPX200>,<TOPSPIN 1.3>,
      <abs n ABSG = 5 
       data hash MD5: 32K
       BE E4 FC 88 68 2B 60 5A 77 93 80 AE 15 C4 98 7C>)
$$ ##END=
$$ 
$$ $$ hash MD5
$$ $$ FD D1 B0 B9 F7 F3 EB 7E 7B 86 44 02 2D BD 45 AC
##$RELAX= 
##$RELAX= 
##$RELAX= 
##$RELAX= 
##$RELAX= 
##$RELAX= 
##$RELAX= 
##$RELAX= 
##$RELAX= 
$$ Bruker specific parameters
$$ --------------------------
##$DU= <F:/spectra>
##$EXPNO= 4
##$NAME= <1H>
##$PROCNO= 1
##$TYPE= <nmr>
##$USER= <iren>
##$AMP= (0..31)
100 100 100 100 100 100 100 100 100 100 100 100 100 100 100 100 100 100 
100 100 100 100 100 100 100 100 100 100 100 100 100 100 
##$ANAVPT= -1
##$AQSEQ= 0
##$AQ_mod= 1
##$AUNM= <au_zg>
##$AUTOPOS= <>
##$BF1= 200.13
##$BF2= 200.13
##$BF3= 200.13
##$BF4= 200.13
##$BF5= 200.13
##$BF6= 200.13
##$BF7= 200.13
##$BF8= 200.13
##$BYTORDA= 1
##$CFDGTYP= 0
##$CFRGTYP= 5
##$CHEMSTR= <none>
##$CNST= (0..63)
$$ [...]
##$SW_h= 4401.40845070422
##$TD= 16384
##$TD0= 1
##$TE= 300
##$TE2= 300
##$TE3= 300
##$TEG= 300
##$TL= (0..7)
0 120 120 120 120 120 120 120 
##$TP= (0..7)
150 150 150 150 150 150 150 150 
##$TP07= 0
##$TPNAME0= <>
##$TPNAME1= <>
##$TPNAME2= <>
##$TPNAME3= <>
##$TPNAME4= <>
##$TPNAME5= <>
##$TPNAME6= <>
##$TPNAME7= <>
##$TPOAL= (0..7)
0.5 0.5 0.5 0.5 0.5 0.5 0.5 0.5 
##$TPOFFS= (0..7)
0 0 0 0 0 0 0 0 
##$TUNHIN= 0
##$TUNHOUT= 0
##$TUNXOUT= 0
##$USERA1= <user>
##$USERA2= <user>
##$USERA3= <user>
##$USERA4= <user>
##$USERA5= <user>
##$V9= 5
##$VALIST= <valist>
##$VCLIST= <CCCCCCCCCCCCCCC>
##$VD= 0
##$VDLIST= <DDDDDDDDDDDDDDD>
##$VPLIST= <PPPPPPPPPPPPPPP>
##$VTLIST= <TTTTTTTTTTTTTTT>
##$WBST= 1024
##$WBSW= 25
##$XGAIN= (0..3)
0 0 0 0 
##$XL= 0
##$YL= 0
##$YMAX_a= 1263425
##$YMIN_a= -1675446
##$ZGOPTNS= <>
##$ZL1= 120
##$ZL2= 120
##$ZL3= 120
##$ZL4= 120
##$ABSF1= 17.49637
##$ABSF2= -4.496376
##$ABSG= 5
##$ABSL= 3
##$ALPHA= 0
##$AQORDER= 0
##$ASSFAC= 0
##$ASSFACI= 0
##$ASSFACX= 0
##$ASSWID= 0
##$AUNMP= <proc_1d>
##$AXLEFT= 0
##$AXRIGHT= 0
##$AXTYPE= 0
##$AXUNIT= <>
##$AZFE= 0.1
##$AZFW= 0.1
##$BCFW= 0
##$BC_mod= 2
##$BYTORDP= 0
##$COROFFS= 0
##$CY= 7568.61572265625
##$DATMOD= 1
##$DC= 0
##$DFILT= <>
##$DTYPP= 0
##$F1P= 17.9538593292236
##$F2P= -4.03888763876832
##$FCOR= 0.5
##$FTSIZE= 32768
##$FT_mod= 6
##$GAMMA= 0
##$GB= 0
##$INTBC= 0
##$INTSCL= 1.936888e-010
##$ISEN= 128
##$LB= 0
##$LEV0= 0
##$LPBIN= 0
##$MAXI= 945.577
##$MC2= 0
##$MEAN= 0
##$ME_mod= 0
##$MI= -402.1523
##$NCOEF= 0
##$NC_proc= -5
##$NLEV= 6
##$NOISF1= 8.587773
##$NOISF2= 6.764455
##$NSP= 0
##$NTH_PI= 0
##$NZP= 0
##$OFFSET= 17.49637
##$PC= 1
##$PHC0= -36.48821
##$PHC1= -4.678399
##$PH_mod= 1
##$PKNL= yes
##$PPARMOD= 0
##$PPDIAG= 0
##$PPIPTYP= 0
##$PPMPNUM= 100
##$PPRESOL= 1
##$PSCAL= 0
##$PSIGN= 0
##$REVERSE= no
##$SF= 200.13
##$SI= 32768
##$SIGF1= 16.12182
##$SIGF2= -4.496377
##$SINO= 3.521527
##$SIOLD= 32768
##$SREGLST= <1H.CDCl3>
##$SSB= 0
##$STSI= 32768
##$STSR= 0
##$SW_p= 4401.40845070422
##$SYMM= 0
##$S_DEV= 0
##$TDeff= 16384
##$TDoff= 0
##$TI= <>
##$TILT= no
##$TM1= 0
##$TM2= 0
##$TOPLEV= 0
##$USERP1= <user>
##$USERP2= <user>
##$USERP3= <user>
##$USERP4= <user>
##$USERP5= <user>
##$WDW= 0
##$XDIM= 32768
##$YMAX_p= 391163931
##$YMIN_p= -1054767
$$ End of Bruker specific parameters
$$ ---------------------------------
##NTUPLES= NMR SPECTRUM
##VAR_NAME=  FREQUENCY,     SPECTRUM/REAL,   SPECTRUM/IMAG
##SYMBOL=    X,             R,               I
##VAR_TYPE=  INDEPENDENT,   DEPENDENT,       DEPENDENT
##VAR_FORM=  AFFN,          ASDF,            ASDF
##VAR_DIM=   32768,         32768,           32768
##UNITS=     HZ,            ARBITRARY UNITS, ARBITRARY UNITS
##FACTOR=    0.134324425510551, 1,           1
##FIRST=     4401.40845070422, 27662,        -1636249
##LAST=      0,             -265852,         -1830949
##MIN=       0,             -1054767,        0
##MAX=       4401.40845070422, 391163931,    0
$$ Real data points
##PAGE= N=1
##DATA TABLE= (X++(R..R)), XYDATA
$$ [...]
12311A1695668k25618k28896k67250k37950j54148j40882k07084k05985r3390
$$ 11695668 11470050 11241154 10973904 10735954 10581806 10440924 10233840 10027855 9934465
12302I934465l2391j23102k14859j54060n2969r7424k13470j80164j0497M7601
$$ 9934465 9902074 9778972 9564113 9410053 9357084 9259660 9046190 8866026 8855529 8903130
12292H903130j03701k69391k57897j17652l504K5037r261p6190j20020q1322k79
$$ 8903130 8799429 8530038 8272141 8154489 8150985 8176022 8166761 8090571 7970551 7889229 7888950
12281G888950J0190n9242q9147l2692p15p0274j47903j25412m9802k2096l1098
$$ 7888950 7899140 7839898 7750751 7718059 7717344 7647070 7499167 7373755 7323953 7301857 7270759
12270G270759j3109Q156k6346q0541p4276k4678j7307o0048p3293j7556N4916
$$ 7270759 7257650 7265806 7239460 7158919 7084643 7059965 7042658 6982610 6909317 6891761 6946677
12259F946677P4356K2621n6668q0946l272J03726J07659J293o6712p819P4107
$$ 6946677 7021033 7043654 6986986 6906040 6902768 7006494 7114153 7115446 7048734 7040915 7115022
12248G115022O1719J3663L8772R0376N8988j1199P229Q9814J01060M4480N5241
$$ 7115022 7176741 7190404 7229176 7319552 7378540 7367341 7374570 7464384 7565444 7609924 7665165
12237G665165J39179J44928L9197j1511Q3985J85733J50639M1711j0242J177K8751
$$ 7665165 7804344 7949272 7988469 7976958 8060943 8246676 8397315 8439026 8428784 8429961 8458712
12226H458712Q7393J63124J46837J1569p4935J4178J38298R7178l8568m1558Q8882
$$ 8458712 8546105 8709229 8856066 8867635 8792700 8806878 8945176 9042354 9003786 8962228 9051110
12215I051110J23970o845r1945J6605J61873J25926n0146j51911r8604r737q709
$$ 9051110 9175080 9168235 9076290 9092895 9254768 9380694 9330548 9178637 9080033 9070296 9061587
12204I061587q6523j54952j52808r7114o8561j26222k16259k18906j17370m2645
$$ 9061587 8975064 8820112 8667304 8570190 8501629 8375407 8159148 7940242 7822872 7780227
12194G780227q9432j69545j46714n2598l5920j21267j69701j09092n8078j31333
$$ 7780227 7690795 7521250 7374536 7321938 7286018 7164751 6995050 6885958 6827880 6696547
12184F696547k31781j76669J1999R8651m8546k60207k81475j08102K3476l3758
$$ 6696547 6464766 6288097 6300096 6398747 6350201 6089994 5808519 5700417 5723893 5690135
12174E690135j59586j72097q6874n2603r9310j06637k3107L7507j7521j02201
$$ 5690135 5530549 5358452 5271578 5218975 5119665 5013028 4989921 5027428 5009907 4907706
12164D907706q7142q753r283j02607j44056n5037N1137L6262o2598r6814k3583
$$ 4907706 4820564 4811811 4802528 4699921 4555865 4500828 4551965 4588227 4525629 4428815 4405232
12153D405232M5145J2161p6817j13005p2315k4509j9602k8666r075K1359J3292
$$ 4405232 4450377 4462538 4385721 4272716 4200401 4175892 4156290 4127624 4118549 4139908 4153200
12142D153200l4287o7660n1956j2002J2045J4422Q370n588k5356l0079j4832j5265
$$ 4153200 4118913 4051253 3999297 3987295 3999340 4013762 4022132 4016544 3991188 3961109 3946277 3931012
12130C931012n0911p1671k6082L7510K5302m7370o1887J3798N8753p737q1615
$$ 3931012 3880101 3808430 3782348 3819858 3845160 3797790 3735903 3749701 3808454 3800717 3719102
12119C719102l8114N3464L5435p3398j03558j8957K2972n6558j18466m1944O6819
$$ 3719102 3680988 3734452 3769887 3696489 3592931 3573974 3596946 3540388 3421922 3379978 3446797
12108C446797M7214o1699j06524o8213m7086n7732k5899L4075K5161m2290m5103
$$ 3446797 3494011 3432312 3325788 3257575 3210489 3152757 3126858 3160933 3186094 3143804 3098701
12097C098701L7671P4996L47q3053q2844n3002o3903p5985m0977m093k952J4829
$$ 3098701 3136372 3211368 3211715 3128662 3045818 2992816 2928913 2852928 2811951 2807858 2804906 2819735
12085B819735O6282N2775o6911j49805p1291N7822N6545l9500o0824j120j292
$$ 2819735 2886017 2938792 2871881 2722076 2650785 2708607 2765152 2725652 2664828 2663708 2662416
12074B662416p0780o9199K3115N7541j2845m8808J1426L1524o4595j28044l5876
$$ 2662416 2591636 2522437 2545552 2603093 2590248 2541440 2552866 2584390 2519795 2391751 2355875
12063B355875P7638L2364r7427j06792J0543P5163J8603m1565k0524K3589K5004
$$ 2355875 2433513 2465877 2368450 2261658 2272201 2347364 2365967 2324402 2303878 2327467 2352471
12052B352471M123j2824m3744p9864o8790p019L9080L6284K5598L2007J8318l1901
$$ 2352471 2356594 2343770 2300026 2220162 2151372 2144353 2183433 2219717 2245315 2277322 2295640 2263739
12040B263739o1797k2924M3744N6855n291q3751r8940k5221P2080Q7045m048r5274
$$ 2263739 2201942 2179018 2222762 2279617 2274326 2190575 2091635 2066414 2138494 2225539 2221491 2126217
12028B126217q0172K103K9314j6234k8312M4112J08864P0031l1578q3475n0743
$$ 2126217 2046045 2048148 2077462 2061228 2032916 2077028 2185892 2255923 2224345 2140870 2090127
12017B090127L325J4200j6178l5473j071O3549P8033M587p9766p3201J549K7664
$$ 2090127 2093452 2107652 2091474 2056001 2054930 2118479 2196512 2201099 2121333 2048132 2049681 2077345
12005B077345k0556l5253M0036R9261L5387p6654p6387M7800J40846R3554l0045
$$ 2077345 2056789 2021536 2061572 2160833 2196220 2119566 2043179 2090979 2231825 2325379 2295334
11994B295334j00993q0961k6819Q983K7708M5456N0293K1327k4940m1494j3625
$$ 2295334 2194341 2113380 2086561 2095544 2123252 2168708 2219001 2240328 2215388 2173894 2160269
11983B160269J8879K5057K8924N2506N8378J3648l1700j8928M545m0041r9698
$$ 2160269 2179148 2204205 2233129 2285635 2344013 2357661 2325961 2307033 2311578 2271537 2171839
11972B171839n2440O4610P2684n2145r9124M6775J84568Q7852j32349j84093k8522
$$ 2171839 2119399 2184009 2256693 2204548 2105424 2152199 2336767 2424619 2292270 2108177 2079655
11961B079655R1574L8508n0755k9268M0153L0000m4266p9238m6788P36K4857K1369
$$ 2079655 2171229 2209737 2158982 2129714 2169867 2199867 2155601 2076363 2029575 2030311 2055168 2076537
11949B076537o677l9082m1318j4744j995j9259l2997k1447m067L894Q209M86k9281
$$ 2076537 2069860 2030778 1989460 1974716 1972721 1953462 1920465 1899018 1894951 1898845 1907054 1907540 1878259
11936A878259m6512j5088J9928j1971p2636n5168L2233N9611j3103o4254j3331
$$ 1878259 1831747 1816659 1836587 1824616 1751980 1696812 1729045 1788656 1775553 1711299 1697968
11925A697968M8651K2018m0412m5696j9342k8716m5692j4030K8539K2148K455
$$ 1697968 1746619 1768637 1728225 1682529 1663187 1634471 1588779 1574749 1603288 1625436 1627891
11914A627891K1028K7595l2468q3324l4945L9424J4278o2362m7773L5245L4239
$$ 1627891 1648919 1676514 1644046 1560722 1525777 1565201 1579479 1517117 1469344 1504589 1538828
11903A538828n0762n5573M9826R0766r921q8024j5666Q0939L8220p6550r4476
$$ 1538828 1488066 1432493 1482319 1573085 1563164 1475140 1459474 1540413 1578633 1502083 1407607
11892A407607j8724J9597n473j2211J0171j303l3298j0258M7872M0067l3440n5284
$$ 1407607 1388883 1408480 1403007 1390796 1400967 1399664 1366366 1356108 1403980 1444047 1410607 1355323
11880A355323J2579O0458J1241o0514o1572k0308n327K989N1455R0853L8733o1356
$$ 1355323 1367902 1428360 1439601 1379087 1317515 1297207 1291880 1294869 1346324 1437177 1475910 1414554
11868A414554p2064L1005J03145L6199p8172q4098N127L6463l5952p9955j0095
$$ 1414554 1342490 1373495 1476640 1512839 1434667 1350569 1355696 1392159 1356207 1276252 1266157
11857A266157N8375l689j06194o7083P6836R7081o1510j62062l2465J52045J27926
$$ 1266157 1324532 1320843 1214649 1147566 1224402 1321483 1259973 1097911 1065446 1217491 1345417
11846A345417n2346j13351P914Q6243n045r3714j4235J04939N4667r8117j06328
$$ 1345417 1293071 1179720 1187634 1273877 1268832 1175118 1160883 1265822 1320489 1222372 1116044
11835A116044N7176J43201J1178j48916j01862Q3936J49244K7046q4570l8854
$$ 1116044 1173220 1316421 1327599 1178683 1076821 1160757 1310001 1337047 1252477 1213623
11825A213623N5934L5318n9707o5280L0638O6488l0960j20343n7334Q3194J14093
$$ 1213623 1269557 1304875 1245168 1179888 1210526 1277014 1246054 1125711 1068377 1151571 1265664
11814A265664M404r0565n9907K6876N2675J7852k673J917j7692n3554l3495M7049
$$ 1265664 1270068 1179503 1119596 1146472 1199147 1216999 1214326 1216243 1198551 1144997 1111502 1158551
11802A158551Q1561K580r5137p5011L5482P7263J813n3505R092P9806K0442r0746
$$ 1158551 1240112 1242692 1147555 1072544 1108026 1185289 1187102 1133597 1142689 1222495 1242937 1152191
11790A152191o9867O3000R3809m1372j36029l5285J10245P5839q7217j35941n417
$$ 1152191 1082324 1145324 1239133 1197761 1061732 1026447 1136692 1212531 1125314 989373 983956
11779I83956J13976P1174n5234j09179o1218P727L4673K1838N569J4101K9368
$$ 983956 1097932 1169106 1113872 1004693 943475 951202 985875 1007713 1013282 1027383 1056751
11768A056751R91o3148o8388K7319J05854M3380p6721o8566N9447J07355N327
$$ 1056751 1057742 994594 926206 953525 1059379 1102759 1026038 957472 1016919 1124274 1129601
11757A129601p8134k3167N2742J6021n6372l2931L6807K3858n2557q0586n2288
$$ 1129601 1051467 1028300 1081042 1097063 1040691 1007760 1044567 1068425 1015868 935282 882994
11746H82994k7045J9610J20695J66037M1780j29150j23917K2516N6164p6175j27868
$$ 882994 855949 875559 996254 1162291 1204071 1074921 951004 973520 1029684 953509 825641
11735H25641L1086J72570O5873j43337j49489N1374J75154P6411q1914j10206
$$ 825641 856727 1029297 1095170 951833 802344 853718 1028872 1105283 1023369 913163
11725I13163l8474M06j4586j0262K7253L4123j1508m3722q686M8621M6377j3015
$$ 913163 874689 875095 860509 850247 877500 911623 900115 856393 847707 896328 942705 929690
11713I29690m6315j5858J7991L225j6564J4689N7346M0043j5519l7836l4464n5244
$$ 929690 883375 867517 885508 888733 872169 886858 944204 984247 968728 930892 896428 841184
11701H41184o0589K0089J12257O4631q3149j09698M0049J35475J8722j29354p5516
$$ 841184 780595 800684 912941 977572 894423 784725 824774 960249 978971 849617 774101
11690G74101Q9968J10107k5233r6411k9304K3808j8396m9508m919K5994o168j2015
$$ 774101 864069 974176 948943 852532 823228 847036 828640 779132 774213 800207 794039 782024
11678G82024M9092P1377j858n7872q265N4794K6004l4228k9955n142l2465m7589
$$ 782024 831116 902493 900635 842763 834498 889292 915296 881068 851113 845971 813506 765917
11666G65917K8763J03305M0472r0108j02767N961O0473K503l1752L0901P2617
$$ 765917 794680 897985 938457 848349 745582 751543 812016 814519 782767 813668 886285
11655H86285Q56q0806m0230O9186R5354J2288o6964o3723j3337J8839J9604J5367
$$ 886285 887141 806335 766105 835291 930645 942933 875969 812246 798909 817748 837352 852719
11643H52719K3825L1367Q563m4895p9376n1975O561L2995K7984L7513M5214j1149
$$ 852719 876544 907911 916474 871579 792203 740228 746789 779784 807768 845281 890495 879346
11631H79346r6375p9578N7136J40118M3689j01088q6645N6350J05591j3147j25058
$$ 879346 782971 703393 760529 900647 944336 843248 756603 812953 918544 905397 780339
11620G80339q4661K0019L4655k5459l4741K9366O9427L5818r514o756J6178K986
$$ 780339 695678 715697 750352 724893 690152 719518 788945 824763 815249 808493 824671 827657
11608H27657m3247o5022j9799O7792J13309M9377q1245j41773n8249O9919Q7728
$$ 827657 784410 719388 699589 767381 880690 930067 848822 707049 648800 718719 806447
11597H06447m855n6351R519Q2130L9897o0480p6841l681K9032l2172q4752l7162
$$ 806447 801592 745241 754760 836890 876787 816307 739466 735785 764817 732645 647893 610731
11585F10731N6414R2673O4870L2913J2209j7456l5456r342K1746r543p6906p9892
$$ 610731 667145 759818 824688 857601 869810 852354 816898 807556 829302 819759 742853 662961
11573F62961K542P3758O2482J1960j4169k3534l4783j3657N1291Q4159K7687m6132
$$ 662961 665503 739261 801743 813703 799534 776000 741217 727560 778851 863010 890697 844565
11561H44565l6786K2222K1835l5091m3430J2672K6536m3073r3394m6672K9306
$$ 844565 807779 830001 851836 816745 773315 785987 812523 769450 676056 629384 658690
11550F58690M7463L3896M1551L5826k2706o9247l1734L4733L8756J1621L1931
$$ 658690 706153 740049 781600 817426 794720 725473 693739 728472 767228 778849 810780
11539H10780N3174j8470j12066o2986R8212J47353J3191r6943k6268Q2908L5003
$$ 810780 863954 845484 733418 670432 768644 915997 929188 832245 805977 888885 923888
11528I23888r4698r4514L5653J02595L6935l3190k3539n83j3202m432M8184O4480
$$ 923888 829190 734676 770329 872924 909859 876669 853130 852547 839345 834913 883097 947577
11516I47577P536l9902k0023O080j3354k4773R590J9439l7697o7492N643Q1940
$$ 947577 955113 915211 895188 901268 887914 863141 872731 892170 854473 786981 792624 874564
11504H74564L7621n5905m0632N9927P6430k2211q1877k4585L5239p6n5497l0075
$$ 874564 912185 856280 815648 875575 952005 929794 847917 823332 858571 858495 802998 772923
11492G72923L9344O8325O5582P1167N0690k7691q9738n8178K340j8841q2124n0824
$$ 772923 812267 880592 946174 1017341 1068031 1040340 950602 892424 894764 875923 793799 742975
11480G42975P2302J23641K6086q8877p6707J9422N8030R054l3431j0107L3468
$$ 742975 815277 938918 965004 876127 799420 818842 876872 885926 852495 842388 875856
11469H75856L5715J221k6307k5098n594J4064K2151J2754j4885n1552p3142n2743
$$ 875856 911571 912792 886485 861387 855793 869857 892008 904762 889877 838325 765183 712440
11457G12440N784N4192M7225L191j5486J1889L6874J6268k6418m1466j9626J4309
$$ 712440 718224 772416 819641 822832 807346 819235 856109 872377 845959 804493 784867 799176
11445G99176M1890M7694R372o0649r2364l7236M7404N9751n719n0107j2991M8210
$$ 799176 841066 888760 898132 837483 745119 707883 755287 815038 809319 759212 746221 794431
11433G94431M9907q020o2573o8642k1127N9001J20339J05386K3640l9538l2049
$$ 794431 844338 836318 773745 705103 683976 742977 863316 968702 992342 952804 920755
11422I20755p183l0457o5646l5802L8239O1239J5100j8195K342J7561j4555m1243
$$ 920755 913572 883115 817469 781667 819906 881145 896245 878050 880392 897953 883398 842155
11410H42155j3309K2880P548k3078L045O5248P2852K272o8482o7156q762M0350
$$ 842155 828846 851726 859274 836196 839241 904489 977341 979613 911131 843975 835213 875563
11398H75563L7906k329k9441j1495J5509j2974q3433r5052k951R3721Q1445n822
$$ 875563 913469 911140 881699 870204 885713 872739 789306 694254 691303 785024 866469 860647
11386H60647m8969k2065M164M795J6444K3784k6787r1940o2034M4065P7008K187
$$ 860647 811678 789613 793777 798572 815016 838800 812013 720073 658039 702104 779112 781299
11374G81299k9527N4788J02539m983j20006n6551Q5527P2331p2076j05034K2144
$$ 781299 751772 806560 909099 904116 784110 727559 813086 885417 813341 708307 730451
11363G30451Q5518k2049j08718k1257Q7478K3719j10725q7921O6431J23674K7540
$$ 730451 815969 793920 685202 663945 751423 775142 664417 576496 642927 766601 794141
11352G94141m1962Q462M4364l8050j21852o7604N1499O9466j2674n0121P248N7623
$$ 794141 752179 760641 805005 766955 645103 577499 628998 698464 685790 635669 642917 700540
11340G00540K9787j8335k1535j0829l1123m6121q080M0591K8707j8586j6042L5030
$$ 700540 730327 711992 690457 679628 648505 602384 594304 634895 663602 645016 628974 664004
11328F64004M3025j8028n6945j4293L7698J7832k5591K81O7383O3762k8236j07349
$$ 664004 707029 689001 632056 617763 655461 673293 647702 647983 715366 779128 750892 643543
11316F43543j06241n9054n631N8796J09726Q3261q170n3620l336M4978m73p6024
$$ 643543 537302 478248 472617 531413 641139 724400 716230 662610 659274 704252 703779 627755
11304F27755o7571P921M3364J5850l343J1180J0772j6745k1526P510J5736j7927
$$ 627755 560184 568105 611469 627319 623976 635156 645928 629183 607657 615167 630903 612976
11292F12976m0336j2331L3547M9339K4942k7723p9557p1557K1902J12771Q1630
$$ 612976 572640 560309 593856 643195 668137 640414 560857 489300 511202 623973 705603
11281G05603m0927q8594K675R1808M3999o6438p5191K9587J08649P3198k9485
$$ 705603 664676 576082 578757 670565 714564 648126 572935 602522 711171 784369 754884
11270G54884j09854j16730m2881N8620Q4605l36q3163m1885O5812Q3106L523k3410
$$ 754884 645030 528300 485419 544039 628644 628308 545145 503260 569072 652178 655701 632291
11258F32291M5201O2564m9937j38593n0092J08171J18622j9862j09045o0126J0347
$$ 632291 677492 740056 690119 551526 501434 609605 728227 708365 599320 539194 549541
11247E49541N417j8037L849K2958o141k4202J9128N7225K0358l3241j6485L2974
$$ 549541 554958 536921 540770 563728 557587 533385 552513 609738 630096 596855 580370 613344
11235F13344K4170k4770l0940m520j6090m0760L515P6385N1329n4632p6048K7376
$$ 613344 637514 612744 581804 577284 561194 520434 523949 600334 651663 597031 520983 548359
11223E48359Q5997j274r1851l7309P0879O6355j5860k8408K0266N541o2281n2938
$$ 548359 634356 633082 541231 503922 574801 641156 625296 596888 617154 622695 560414 507476
11211E07476L3907N6473j3963m0959K7606O4998l080o5522k7660K6715nm2458
$$ 507476 541383 597856 583893 542934 570540 635538 632458 566936 539276 565991 565986 523528
11199E23528j961O8740N9786q988l8383j3441J3523L3292M8522P753r6757j42761
$$ 523528 521567 590307 650093 641105 602722 589281 602804 636096 684618 692371 595614 452853
11187D52853l9078R7251R1455k0069n7653N052K3794l9806m9096N0416J15470
$$ 452853 413775 511026 602481 582412 524759 529811 553605 513799 464703 515119 630589
11176F30589M1378o3893o2173K498R642l0875k3855L1314M8471Q094k0586j819
$$ 630589 671967 608074 545901 548399 558041 527166 503311 534625 583096 591190 570604 568785
11164E68785K1128P403k7811m8844l8761j794L8321M9693K7799L451l184p577
$$ 568785 589913 597316 569505 520661 481900 480106 518427 568120 595919 599370 596186 588609
11152E88609k0896k4619j0729l582j0070N208N4290P9694K6364o8644j08699m8654
$$ 588609 567713 543094 532365 528783 518713 523921 578211 657905 684269 615625 506926 458272
11140D58272N7959J12885O2365m6898j01374m5456L8370L2347m7207p3284l277
$$ 458272 516231 629116 691481 644583 543209 497753 536123 568470 521263 447979 444702
11129D44702O3949N6716K9685L4228K0698l7821n1947K8729Q2682l626j18606
$$ 444702 508651 565367 595052 629280 649978 612157 560210 588939 671621 667995 549389
11118E49389p8638O4411Q7636m3786j13925j744J28575R1426m3803q8035j9829
$$ 549389 470751 535162 622798 579012 465087 463343 591918 683344 639541 551506 531677
11107E31677K8055O36k4873j347J4895j7828m1631J0196R6548J06947O332j05778
$$ 531677 559732 560368 535495 534148 549043 531215 489584 499780 596328 703275 709607 603829
11095F03829j05232M432Q9992N4384l8835n5166K6244R1631N6817k6563o0471
$$ 603829 498597 503029 593021 647405 608570 553404 579648 671279 728096 701533 641062
11084F41062l2079n379j9251m6536m2777J38M8855O1620K9313j5033l5831l3585
$$ 641062 608983 603604 584353 537817 495040 495178 544033 605653 634966 619933 584102 550517
11072E50517k5809r491K1506L9959J7170j7461p166L9991N2013J21n4589m7252
$$ 550517 524708 515217 536723 576682 593852 576391 569225 609216 661229 661350 606761 559509
11060E59509P087M4476K9548k0495n7879l7612L7369R8471P8464q99n3739m3313
$$ 559509 566596 611072 640620 620125 562246 524634 562003 660474 738938 738039 684300 640987
11048F40987j5105j1041j4213J493K3820K9752J6954q545l6334m0018o817K8146
$$ 640987 625882 614841 600628 602121 625941 655693 672647 664102 627768 587750 580933 609079
11036F09079L0090K7519N6638P1036O438q4212q4663k865L4783p195k4099K8408
$$ 609079 639169 666688 723326 794362 800800 716588 631925 629060 663843 656648 632549 660957
11024F60957M9611j6711o7955j9927M5334K6441k9936l2830j848O855J7561N1823
$$ 660957 710568 693857 625902 605975 651309 677750 647814 614984 613136 619991 637552 689375
11012F89375M3999k9359n9670J2981O6987Q038m3458K7828Q8017j6811j37155
$$ 689375 733374 704015 644345 657326 724313 732351 688893 716721 804738 787927 650772
11001F50772l9668J59241J42943p1900j46652J4214J18461L063j05008j7197R5696
$$ 650772 611104 770345 913288 841388 694736 708950 827411 830474 725466 708269 803965
10990H03965M4162m0398J8019R8325K2339r1322m0618P7059M1576p3148k8590
$$ 803965 848127 807729 825748 924073 946412 855090 814472 891531 933107 859959 831369
10979H31369J22464R9586j05495j82208j0154J48178Q4530m6374k9491O5126N3268
$$ 831369 953833 1053419 947924 765716 755562 903740 988270 941896 912405 977531 1030799
10968A030799m4374q0273m4450l3355l9727J9143J04693Q2484n1529j34430o3862
$$ 1030799 986425 906152 861702 828347 788620 807763 912456 994940 943411 808981 745119
10957G45119O5384J07533N2313m174j0546j506j2808l0865l7074m2256m6983j6287
$$ 745119 810503 918036 970349 966175 955629 954123 941315 910450 873376 831120 784137 767850
10945G67850N6988J01104M8144n0933p9484k4023J0105k4426l8808L2088J03635
$$ 767850 824838 925942 974086 923153 843669 819646 829751 805325 766517 798605 902240
10934I02240P3529j0214l3814m152j6527p5483q6458j7196N6755P3144M5253J757
$$ 902240 975769 965555 931741 927589 911062 835579 749121 731925 788680 861824 907077 908834
10922I08834l8510l8668J0993L5088l0869j07553o5525N9001R3906q465r8453
$$ 908834 870324 831656 842649 877737 846868 739315 673790 732791 826697 818232 719779
10911G19779n9843L5881P0587M1252M770k2369l2004L778N6258L7753n4220r6996
$$ 719779 659936 695817 766404 807656 812426 790057 758053 761831 818089 855842 801622 704626
10899G04626k2933O9888P3280K5382J0872J0673k8956o6029l2691K9364L0434
$$ 704626 681693 751581 824861 850243 861115 871788 842832 776803 744112 773476 803910
10888H03910j8793l8342j6153n40O591L5864N9477K4996l9531n6623k0775M617
$$ 803910 785117 746775 730622 730082 736673 772537 832014 857010 817479 760856 740081 744698
10876G44698k939o342J2345L2813M1510L1076j3567o5625m7371M9157R8635O271
$$ 744698 741759 735417 747762 780575 822085 853161 839594 773969 726598 775755 874390 880661
10864H80661j26639j29999r666P9189P0143L8143K6188q835n6222k7126P4134
$$ 880661 754022 624023 614357 693546 763689 801832 828020 819185 762963 735837 809971
10853H09971J05467n120j29964j14342J3490J00212P2291n552m1239j4119K5177
$$ 809971 915438 910318 780354 666012 679502 779714 852005 846453 805214 791095 816272
10842H16272J6990l7491o9026l1596K1079J0893l4427j6925O8131J09507M5841
$$ 816272 833262 795771 726745 695149 716228 727121 692694 675769 743900 853407 899248
10831H99248m5017o5837k4708J0754J4881P881Q612K3000M2215L7154k845l1407
$$ 899248 854231 788394 763686 774440 789321 797202 805814 828814 871029 908183 905338 873931
10819H73931n797L0501R336l6168j6698M9414M8484l7799r3010n0952J9219N5099
$$ 873931 868134 898635 907971 871803 855105 904519 953003 915204 822194 771242 790461 845560
10807H45560P9834Q4081n164j51658j73980n932J57650J21646l3870r9843m2627
$$ 845560 925394 1009475 1004311 852653 678673 672741 830391 952037 918167 818324 775697
10796G75697J8790M4340Q1374J02338L7373n6866n1921L5209N9146j3214n5238
$$ 775697 794487 838827 920201 1022539 1059912 1003046 951125 986334 1045480 1032266 977028
10785I77028q60N3087J4801o9985j08221p2223J6626J13399J34381K8483j10505
$$ 977028 976168 1029255 1044056 974071 865850 793627 810253 923652 1058033 1086516 976011
10774I76011j21259M964J03944P4754M366l52K8391J5004j6954l993L2956K6516
$$ 976011 854752 859716 963660 1038414 1042780 1042428 1070819 1085823 1068869 1064876 1097832 1124348
10762A124348k1999n0196k6563K5451O5016N5395j0809p6434o4184J3217N4197
$$ 1124348 1102349 1052153 1025590 1051041 1116057 1171452 1160643 1084209 1020025 1033242 1087439
10751A087439J5590k0757J7891P6166O2413o435m2074k4818j5125m1908n9494
$$ 1087439 1103029 1082272 1100163 1176329 1238742 1232307 1190233 1165415 1150290 1108382 1048888
10740A048888k3602M2288P2870L6447k0823j9155M4880O6964k2648j21079p1526
$$ 1048888 1025286 1067574 1140444 1176891 1156068 1136913 1181793 1248757 1226109 1105030 1033504
10729A033504Q6507J37690N947j15373m9632R7963J14050l19o9011l3808l410
$$ 1033504 1120011 1257701 1263648 1148275 1098643 1196606 1310656 1310337 1241326 1207518 1204108
10718A204108k7570k5033L3465N4485j342l1467L0797Q5638K4243q7748j07806
$$ 1204108 1176538 1151505 1184970 1239455 1238113 1206646 1237443 1323081 1347324 1259576 1151770
10707A151770k6297M6386N7773N2862N3724K4001l1975m4035J0655N6538L2490
$$ 1151770 1125473 1171859 1229632 1282494 1336218 1360219 1328244 1284209 1294864 1351402 1383892
10696A383892j5247j3030K5465L6426J5841J0192K0457L795l3224l4666r56O81
$$ 1383892 1368645 1355615 1381080 1417506 1433347 1443539 1463996 1467791 1434567 1399901 1398945 1399626
10684A399626l8644l5558L9998Q8523L4363l9665k2338M3132M2447r934j6370
$$ 1399626 1360982 1325424 1365422 1453945 1488308 1448643 1426305 1469437 1511884 1501950 1485580
10673A485580M766m3446j14354n1843J19290J67753J0909j27598n7514Q6340Q5027
$$ 1485580 1490346 1446900 1332546 1280703 1399993 1567746 1578655 1451057 1393543 1479883 1564910
10662A564910p853L090Q8327M2858j37240k11302o4366J23134J55739P1006O123
$$ 1564910 1557057 1560147 1648474 1691332 1554092 1342790 1278424 1401558 1557297 1628303 1634426
10651A634426j2652k5164j4170M0108P1396J7020o2086n9241J9641P1344M4568
$$ 1634426 1621774 1596610 1582440 1622548 1693944 1710964 1648878 1589637 1609278 1680622 1725190
10640A725190j0651l3705k2269l150J4340L5924N5635N1678J6545j5698j561M0996
$$ 1725190 1714539 1680834 1658565 1655415 1669755 1705679 1761314 1812992 1829537 1813839 1812278 1853274
10628A853274L9269k2536n5859L242P6021N0980l2442l9114L9090O4584j9080
$$ 1853274 1892543 1870007 1814148 1817390 1893411 1944391 1911949 1872835 1911925 1976509 1957429
10617A957429r0655m2965N7424Q6546L7678j0190j8480K832M6890Q9255P5416
$$ 1957429 1866774 1823809 1881233 1967779 2005457 1995267 1976787 1979619 2026509 2115764 2191180
10606B191180M340l4689J5046P6926M7073m9101r5211m4255M1976R0092Q0476
$$ 2191180 2195520 2160831 2175877 2252803 2299876 2250775 2155564 2111309 2153285 2243377 2323853
10595B323853L5431Q89J7310O2645O1232m992m8285P60P8777Q0102J4441j9308
$$ 2323853 2359284 2360173 2377483 2440128 2501360 2496368 2448083 2448843 2527620 2607722 2622163 2602855
10583B602855J1954M3374K9209N430K0152O1872P8587M2332r935L13R7842J84626
$$ 2602855 2614809 2658183 2687392 2692822 2712974 2774846 2853433 2895765 2885830 2886143 2983985 3168611
10571C168611J35326k1391j09212l6385Q0379R7113M4318M1487R6304J18039P7795
$$ 3168611 3303937 3282546 3173334 3136949 3217328 3314441 3358759 3400246 3496550 3614589 3692384
10560C692384L1513J7531L4604Q0559J19525P5741l4982n6225Q7681K18640J39927
$$ 3692384 3723897 3741428 3776032 3856591 3976116 4051857 4016875 3960650 4048331 4266971 4406898
10549D406898l8890m8960J09141J61921J2459r6670K6081K26963K65405J59681
$$ 4406898 4368008 4319048 4428189 4590110 4602569 4505899 4531980 4758943 5024348 5184029
10539E184029Q3661P5912N7734L4691P4457J42132J43018R9564J18650J94082
$$ 5184029 5267690 5343602 5401336 5436027 5510484 5652616 5795634 5895198 6013848 6207930
10529F207930J99899R7816J2830N5352J69233K16664J55913P9659R4708J96370
$$ 6207930 6407829 6505645 6518475 6573827 6743060 6959724 7115637 7195296 7290004 7486374
10519G486374K73138K38281J37161Q8400J32417J99160K25517K26494K31477K33446
$$ 7486374 7759512 7997793 8134954 8223354 8355771 8554931 8780448 9006942 9238419 9471865
10509I471865K34356K59841K93126K80578K39662K59617L46044L82514L19419
$$ 9471865 9706221 9966062 10259188 10539766 10779428 11039045 11385089 11767603 12087022
10500A2087022K75239L46577M39665M26839L63934L86141M67279M72440M09651
$$ 12087022 12362261 12708838 13148503 13575342 13939276 14325417 14792696 15265136 15674787
10491A5674787M28330N58629O40841N67444M41972M20613N08414N92800O02830
$$ 15674787 16103117 16661746 17302587 17870031 18312003 18732616 19241030 19833830 20436660
10482B0436660N64783N45413N85626O60069O88715O27090N38643N19982N64017
$$ 20436660 21001443 21546856 22132482 22792551 23481266 24108356 24646999 25166981 25730998
10473B5730998N73749N13104M56690M66405M99337M82224M21513L89626M24269
$$ 25730998 26304747 26817851 27274541 27740946 28240283 28722507 29144020 29533646 29957915
10464B9957915M74159M48699L24677J94405J66323K14637K02995Q7165q318J2828
$$ 29957915 30432074 30880773 31205450 31399855 31566178 31780815 31983810 32070975 32062657 32075485
10454C2075485N6024j0112j33303j70442j33847j59735k61570l12845k84216l01710
$$ 32075485 32131509 32121397 31988094 31817652 31683805 31524070 31262500 30949655 30665439 30363729
10444C0363729m23269n34201n31857m62689m09053l82830l97482m99466o48773
$$ 30363729 29940460 29406259 28874402 28411713 28002660 27619830 27222348 26722882 26074109
10435B6074109p07017o31202n48849n56169n80494n41218n02467n39599n84155
$$ 26074109 25367092 24735890 24187041 23630872 23050378 22509160 22006693 21467094 20882939
10426B0882939n47795m93978n31315o17246o22225n33827m57194m52826m91578
$$ 20882939 20335144 19841166 19309851 18692605 18070380 17536553 17079359 16626533 16134955
10417A6134955n28892n24239m43487l34000l17983m11442m53118l39186k10930
$$ 16134955 15606063 15081824 14638337 14304337 13986354 13574912 13121794 12782608 12571678
10408A2571678k41925l49841l31046k00663j55670k36307k79992k21988j88213
$$ 12571678 12329753 11979912 11648866 11448203 11292533 11056226 10776234 10554246 10366033
10399A0366033k35611k40852j41195p1826j39095k35919k21759j39978j12040
$$ 10366033 10130422 9889570 9748375 9676549 9537454 9301535 9079776 8939798 8827758
10390H827758j35340j34810j23180j59995k10870j86823r4233l2337n5753j23075
$$ 8827758 8692418 8557608 8434428 8274433 8063563 7876740 7782507 7750170 7694417 7571342
10380G571342j65577j45312p2013j0703l0966j06310j25561n3381J549m9397j28969
$$ 7571342 7405765 7260453 7188440 7177737 7146771 7040461 6914900 6861519 6863068 6813671 6684702
10369F684702j16048m2098l4829j03393j22182l5809M7587J2779j03472j68773
$$ 6684702 6568654 6526556 6491727 6388334 6266152 6230343 6277930 6290709 6187237 6018464
10359F018464j19754j7403M0953K4573k0913m7135n8799p7981q3117m0939J0463
$$ 6018464 5898710 5881307 5922260 5946833 5925920 5878785 5819986 5742005 5658888 5617949 5628412
10348E628412p890q4957j10625m0394K6765L701m7218k9673J9391N968m2546k6798
$$ 5628412 5620522 5535565 5424940 5384546 5411311 5415012 5367794 5338121 5357512 5363480 5320934 5294136
10336E294136L1410J3261p8618r9752m147O1555j2611j20731j07209j515M9608
$$ 5294136 5325546 5338807 5260189 5160437 5156290 5217845 5205234 5084503 4977294 4975779 5025387
10325E025387J1690k0866l963K719l2948n3804j8024K6318J5780m1227q7942q4030
$$ 5025387 5037077 5016211 5012248 5014967 4982019 4928215 4910191 4936509 4952289 4911062 4823120 4739090
10313D739090k6147M8311O5948j3193j12940j01044L2476J33909P9899n8657j24127
$$ 4739090 4712943 4761254 4827202 4814009 4701069 4600025 4632501 4766410 4846309 4787652 4663525
10302D663525q0746j6473J7102M4158N9527J6343o1213p6922j6387J4097l9370
$$ 4663525 4582779 4566306 4583408 4627566 4687093 4703436 4642223 4565301 4548914 4563011 4523641
10291D523641q1760k8484M6394L1665l9042n5707j7014o117k5686p983L2037J1350
$$ 4523641 4441881 4413397 4459791 4491456 4452414 4396707 4379693 4373576 4347890 4339907 4371944 4383294
10279D383294n2020m6657K9989M3018n0989j11272m0762M4296J382j02421r9063
$$ 4383294 4331274 4284617 4314606 4357624 4306635 4195363 4154601 4198897 4200279 4097858 3998795
10268C998795J2168P2238J0537p0239o8428j1673K5211K8115J8663n352m7362
$$ 3998795 4010963 4083201 4093738 4023499 3955071 3943398 3968609 3996724 4015387 4010035 3962673
10257C962673p2061m0391K9185P0384M3281j9467n2362l7283j9878l2974l9010
$$ 3962673 3890612 3850221 3879406 3949790 3993071 3973604 3921242 3883959 3864081 3831107 3792097
10246C792097O873O4610N1068l2392r3860q0990l3819Q680N9046J04784Q4145
$$ 3792097 3798970 3863580 3914648 3882256 3788396 3707406 3673587 3682267 3741313 3846097 3930242
10235C930242m540o4910m1986p058k5413l6619L1054J12953R8648R426m1934k7903
$$ 3930242 3925702 3860792 3818806 3811748 3786335 3749716 3780770 3893723 3992371 4001797 3959863 3931960
10223C931960j8135m0305m9225k6035k565J1232L4410N4711M0574M976j0779j60
$$ 3931960 3913825 3873520 3824295 3798260 3795695 3806927 3841337 3896048 3936622 3941598 3930819 3930659
10211C930659J7862L7522M5812J8724j3800J6120P7905M5310q0709j10732L6887
$$ 3930659 3948521 3986043 4031855 4050579 4036779 4052899 4130804 4176114 4095405 3984673 4021560
10200D021560J55619O4531p1969n452J62323J40187m8574j03509L2471R2513k1367
$$ 4021560 4177179 4241710 4169741 4164289 4326612 4466799 4418225 4314716 4347187 4439700 4418333
10189D418333p1090O4982J59930N0660o8526l237J00817M7279n1489l329J01871
$$ 4418333 4347243 4412225 4572155 4622815 4554289 4551052 4651869 4699148 4647659 4644330 4746201
10178D746201P2809k5098r524P1573N0552k5224J0336J06698P8371m5571o8989
$$ 4746201 4819010 4793912 4784388 4855961 4906513 4881289 4891625 4998323 5076694 5031123 4962134
10167D962134J9392N0296J219J1425P9866N6875m8487n5925N5445R7502P570n1318
$$ 4962134 4981526 5031822 5033041 5044466 5124332 5181207 5132720 5076795 5132240 5229742 5237312 5185994
10155E185994O191N7551K7384R585M3263K3479o3472o8327M5442J02744J7188
$$ 5185994 5192185 5249736 5277120 5286705 5329968 5353447 5289975 5221648 5267090 5369834 5387022
10144E387022n5475n62O3176K7329j1718K6434K9283p1171j16826J006J07154
$$ 5387022 5331547 5330985 5394161 5421490 5409772 5436206 5465489 5394318 5277492 5278498 5385652
10133E385652L1487p7667j2051J12412N5424j06895r9402P3814J36575J1684p3275
$$ 5385652 5417139 5339472 5327421 5439833 5495257 5388362 5288960 5362774 5499349 5511033 5437758
10122E437758K616P1292O838n6754J3834J14869J00274K3629R048K7211j7593
$$ 5437758 5440374 5511666 5518504 5461750 5475584 5590453 5690727 5714356 5723404 5750615 5733022
10111E733022q1262m5074O7173J07100K7692n0540k3161N8603Q1924L3471j301
$$ 5733022 5651760 5606686 5673859 5780959 5808651 5758111 5734950 5793553 5875477 5908948 5907647
10100E907647K6970O6648N3314J0922J2006O0094Q2035M3871N63O39J2678m262
$$ 5907647 5934617 6001265 6054579 6065501 6077507 6137601 6219636 6263507 6264070 6264709 6277387 6273125
10088F273125j9614J5062P6218R7553O2801J8833J6496O6198J21739J02081j0417
$$ 6273125 6253511 6268573 6344791 6442344 6505145 6523978 6540474 6606672 6728411 6830492 6820075
10077F820075r4789j5439J64005K25704J01467k7130j5106L6904k878m8812L7201
$$ 6820075 6725286 6709847 6873852 7099556 7201023 7173893 7158787 7195691 7192813 7144001 7181202
10066G181202J69285J63182N0514J9349R0265J05454K7912k542O3386J02011N5180
$$ 7181202 7350487 7513669 7564183 7583532 7673797 7779251 7807163 7804621 7868007 7970018 8025198
10055H025198K9883Q6496J28892R1182N2406P5161R6126O7629N2362Q7985J07175
$$ 8025198 8055081 8141577 8270469 8361651 8414057 8489218 8585344 8652973 8705335 8793320 8900495
10044H900495P8929P8715J30201J34447N5949J8531R8424J77389J38649O5200
$$ 8900495 8979424 9058139 9188340 9322787 9378736 9397267 9495691 9673080 9811729 9876929
10034I876929Q7144J55366J39428N8679M1721J12378J73006J68021J34071J12542
$$ 9876929 9964073 10119439 10258867 10317546 10359267 10471645 10644651 10812672 10946743 11059285
10024A1059285J16344J54510K05262K06122J43967R8921J29624J83753J91460
$$ 11059285 11175629 11330139 11535401 11741523 11885490 11984411 12114035 12297788 12489248
10015A2489248J66302J43267J12634R0695J42237K43773K55314J40925P5565J85966
$$ 12489248 12655550 12798817 12911451 13002146 13144383 13388156 13643470 13784395 13859960 14045926
10005A4045926L25733K94508J61086J47428K70697L38141K68902J93053K16603
$$ 14045926 14371659 14666167 14827253 14974681 15245378 15583519 15852421 16045474 16262077
9996A6262077K83555L08090K88545K56160K32822K52971L21824L65488L28429
$$ 16262077 16545632 16853722 17142267 17398427 17631249 17884220 18206044 18571532 18899961
9987A8899961K81510L13679L74532L68716L40711L91084M67713M41906L51477
$$ 18899961 19181471 19495150 19869682 20238398 20579109 20970193 21437906 21879812 22231289
9978B2231289L49321M31365M46987L78974L71123M54192M90944M41273M36650
$$ 22231289 22580610 23011975 23458962 23837936 24209059 24663251 25154195 25595468 26032118
9969B6032118N21875N65193N12719M92473N60149N81378M95194M57245N65073
$$ 26032118 26553993 27119186 27631905 28124378 28684527 29265905 29761099 30218344 30783417
9960C0783417O67397O27055N60751O13703O94033O60584N96853O43215P09842
$$ 30783417 31450814 32077869 32638620 33252323 33946356 34606940 35203793 35847008 36556850
9951C6556850O38972N33603O13195Q08767Q29528O34199N16394O49640Q33795
$$ 36556850 37195822 37729425 38342620 39151387 39980915 40615114 41131508 41781148 42614943
9942D2614943Q26934O98251O71495P71794Q25910P47924O48988O53451P28581
$$ 42614943 43441877 44140128 44811623 45583417 46409327 47157251 47806239 48459690 49188271
9933D9188271P53726P01770O75974P52551Q49920Q27950O94413O09477O64370
$$ 49188271 49941997 50643767 51319741 52072292 52922212 53750162 54444575 55054052 55718422
9924E5718422P64489P85045P35514O91920O68009O53537O88349P80421Q27710
$$ 55718422 56482911 57267956 58003470 58695390 59363399 60016936 60705285 61485706 62313416
9915F2313416P49990O35997O26490P03227P33532O84903O49538O73824P01730
$$ 62313416 63063406 63699403 64325893 65029120 65762652 66447555 67097093 67770917 68472647
9906F8472647O87062O46152O03650N84896O36835P51837Q10614P24165N93478
$$ 68472647 69159709 69805861 70409511 70994407 71631242 72383079 73193693 73917858 74511336
9897G4511336N90190P11642Q03543P98498P67339P48047P03834O62722P16906
$$ 74511336 75101526 75813168 76616711 77415209 78182548 78930595 79634429 80297151 81014057
9888H1014057Q44617R01014Q40399P93312Q58532R58584R76508R19552Q74721
$$ 81014057 81858674 82759688 83600087 84393399 85251931 86210515 87187023 88106575 88981296
9879H8981296Q92782R68659J060011J102128J081522J081360J155224J204280
$$ 88981296 89874078 90842737 91902748 93004876 94086398 95167758 96322982 97527262
9871I7527262J130085J051477J153556J351695J377745J223125J187231J390540
$$ 97527262 98657347 99708824 100862380 102214075 103591820 104814945 106002176 107392716
9863A07392716J559823J474040J325934J389533J574108J611823J511493J497541
$$ 107392716 108952539 110426579 111752513 113142046 114716154 116327977 117839470 119337011
9855A19337011J601713J640992J563273J516591J569791J628504J653064J716185
$$ 119337011 120938724 122579716 124142989 125659580 127229371 128857875 130510939 132227124
9847A32227124J802608J782398J650248J582694J669502J769549J735121J624910
$$ 132227124 134029732 135812130 137462378 139045072 140714574 142484123 144219244 145844154
9839A45844154J581108J617057J643842J621131J574251J518351J454664J405691
$$ 145844154 147425262 149042319 150686161 152307292 153881543 155399894 156854558 158260249
9831A58260249J387175J370932J321563J247467J184553J149107J123544J072648
$$ 158260249 159647424 161018356 162339919 163587386 164771939 165921046 167044590 168117238
9823A68117238R76106Q64239Q00360P96234P77721O80324N41959M42503L88405
$$ 168117238 169093344 169957583 170757943 171554177 172331898 173012222 173554181 173996684 174385089
9814A74385089L26561K40250J57180Q7237J9722m5208j18769k30657l59010m27950
$$ 174385089 174711650 174951900 175109080 175196317 175216039 175170831 175052062 174821405 174462395 174034445
9804A74034445m43951n29099p15460q36088p79490p22158q84111j153858j235755
$$ 174034445 173590494 173061395 172345935 171509847 170730357 170008199 169124088 167970230 166734475
9795A66734475j121298j095397j256408j369894j298003j244048j391638j587964
$$ 166734475 165613177 164517780 163261372 161891478 160593475 159349427 157957789 156369825
9787A56369825j620112j572867j640680j761161j735698j607879j616597j803982
$$ 156369825 154749713 153176846 151536166 149775005 148039307 146431428 144814831 143010849
9779A43010849j947425j906240j801723j793556j864086j903736j877664j831976
$$ 143010849 141063424 139157184 137355461 135561905 133697819 131794083 129916419 128084443
9771A28084443j816300j844574j879234j853005j760965j695866j717037j742334
$$ 128084443 126268143 124423569 122544335 120691330 118930365 117234499 115517462 113775128
9763A13775128j678928j596433j618906j690962j639995j467748j376539j456597
$$ 113775128 112096200 110499767 108880861 107189899 105549904 104082156 102705617 101249020
9755A01249020j540328j462148j299019j224750j249015j246531j168545j082931
$$ 101249020 99708692 98246544 96947525 95722775 94473760 93227229 92058684 90975753
9747I0975753j038995j013595r82983r53684r19419q57162p69813o85378o21080
$$ 90975753 89936758 88923163 87940180 86986496 86067077 85209915 84440102 83754724 83133644
9738H3133644n83558n78581n78874n19523l83306k55670k22896k43597k08442
$$ 83133644 82550086 81971505 81392631 80873108 80489802 80234132 80011236 79767639 79559197
9729G9559197j11714n5571p0126m9649P2028J91595J87580J27758J86963L79667
$$ 79559197 79447483 79391912 79321786 79272137 79344165 79535760 79723340 79851098 80038061 80417728
9719H0417728N22269M95614M13913M55027O20467P63822P96864P65831P56499
$$ 80417728 80939997 81435611 81849524 82304551 82925018 83688840 84485704 85251535 86008034
9710H6008034Q13267R28889J037141J047852R67042R32372J029601J135964J087775
$$ 86008034 86821301 87750190 88787331 89835183 90802225 91734597 92764198 93900162 94987937
9701I4987937R50188R27690J021728J011302Q22698O70053P05343P59883O22617
$$ 94987937 95938125 96865815 97887543 98898845 99721543 100391596 101096939 101856822 102479439
9692A02479439L85495K76541K87870K34446R8906L5000N0318l1601k51802m15227
$$ 102479439 102864934 103141475 103429345 103663791 103762697 103797697 103848015 103816414 103564612 103149385
9682A03149385l96289l26561l66888m80822n64059o35293p47062q37708q38234
$$ 103149385 102753096 102426535 102059647 101578825 101014766 100379473 99632411 98794703 97956469
9673I7956469q32912r42511j107709j162873j103001j103489j250316j408519
$$ 97956469 97123557 96181046 95073337 93910464 92807463 91703974 90453658 89045139
9665H9045139j430755j373701j396596j516260j595131j561517j509401j531222
$$ 89045139 87614384 86240683 84844087 83327827 81732696 80171179 78661778 77130556
9657G7130556j565440j512008j420620j420238j491348j476785j342524j250610
$$ 77130556 75565116 74053108 72632488 71212250 69720902 68244117 66901593 65650983
9649F5650983j295909j341683j244833j094709j058879j108925j095422j012201
$$ 65650983 64355074 63013391 61768558 60673849 59614970 58506045 57410623 56398422
9641E6398422r75055r87973r46653q52697q12219q27095p97875p35102p46440
$$ 56398422 55423367 54435394 53488741 52636044 51823825 50996730 50198855 49463753 48717313
9632D8717313q00644p42562n81144n16022o10878o85105o17764n16455m81501
$$ 48717313 47916669 47174107 46592963 46076941 45466063 44780958 44163194 43646739 43165238
9623D3165238m51334m04032m51684n82448n76942l71443k35388l54353n00472
$$ 43165238 42713904 42309872 41858188 41275740 40698798 40327355 40091967 39737614 39237142
9614C9237142m04978k15096k32838l93803l99578k43518j92197k97380l33984
$$ 39237142 38832164 38617068 38384230 37990427 37590849 37347331 37155134 36857754 36523770
9605C6523770k33060j89012k74352l04217j87141r4080j50113k32448k11675j54360
$$ 36523770 36290710 36101698 35827346 35523129 35335988 35241908 35091795 34859347 34647672 34493312
9595C4493312j50274j50984j10855r7422j42132j58762j13376r6303j32318j11088
$$ 34493312 34343038 34192054 34081199 33983777 33841645 33682883 33569507 33473204 33340886 33229798
9585C3229798n378M2388l6284j06873o9536k3296n4000o2152L2841J06336L2293
$$ 33229798 33224420 33266808 33230524 33123651 33054115 33030819 32976819 32914667 32947508 33053844 33086137
9574C3086137r0655j06399m8493l0802k8079L5977J00426O8501J191J8062Q8574
$$ 33086137 32995482 32889083 32840590 32809788 32781709 32817686 32918112 32986613 32987804 33005866 33094440
9563C3094440J02429O8378O9633R7337R3150Q0790J00206R8386L8057J1086Q3115
$$ 33094440 33196869 33265247 33334880 33432217 33525367 33606157 33706363 33804749 33842806 33853892 33937007
9552C3937007J45541J00871O0830J49263K44570J70340K4685L4992J70377K03074
$$ 33937007 34082548 34183419 34244249 34393512 34638082 34808422 34833107 34868099 35038476 35241550
9542C5241550J03987O2785J31333J61976J13794J11291J64272J35329L8363O0266
$$ 35241550 35345537 35408322 35539655 35701631 35815425 35926716 36090988 36226317 36264680 36324946
9532C6324946K10315K59995J34715N2623J38002K07556J20226M4833J53899L05102
$$ 36324946 36535261 36795256 36929971 36982594 37120596 37328152 37448378 37493211 37647110 37952212
9522C7952212K81715J47284J05309J70042K22356K50207K94436K84975J70049
$$ 37952212 38233927 38381211 38486520 38656562 38878918 39129125 39423561 39708536 39878585
9513C9878585R1265J88260L35096L20940K00129J97193L30867M08300L61443L18072
$$ 39878585 39969850 40158110 40493206 40814146 41014275 41211468 41542335 41950635 42312078 42630150
9503D2630150L40003L50439L41695M04912N12932N15837M13208L95296N28360
$$ 42630150 42970153 43320592 43662287 44067199 44580131 45095968 45509176 45904472 46432832
9494D6432832O27948N64383M83130N60438P10305P26097O05178N39128O27632
$$ 46432832 47060780 47625163 48108293 48668731 49379036 50105133 50710311 51249439 51877071
9485E1877071P68593Q30093Q05416P76523Q05369Q84844R56505R72392R57240
$$ 51877071 52645664 53475757 54281173 55057696 55863065 56747909 57704414 58676806 59634046
9476E9634046R83862J065774J122785J098713J065458J135701J291882J387645
$$ 59634046 60617908 61683682 62806467 63905180 64970638 66106339 67398221 68785866
9468F8785866J340569J251825J277755J423519J543971J547308J505296J516477
$$ 68785866 70126435 71378260 72656015 74079534 75623505 77170813 78676109 80192586
9460H0192586J550873J528283J484129J516264J592538J577678J468669J423125
$$ 80192586 81743459 83271742 84755871 86272135 87864673 89442351 90911020 92334145
9452I2334145J494623J527830J420444J301490J299756J315931J223756J133544
$$ 92334145 93828768 95356598 96777042 98078532 99378288 100694219 101917975 103051519
9444A03051519J202044J307354J215137R98277R58631J134858J231470J102665
$$ 103051519 104253563 105560917 106776054 107774331 108732962 109867820 111099290 112201955
9436A12201955R69652J022725J118437J069804R73858J006734J094922J056510
$$ 112201955 113171607 114194332 115312769 116382573 117356431 118363165 119458087 120514597
9428A20514597R30444R00025R76447J012009R80268J001197J096756J144908J105075
$$ 120514597 121445041 122345066 123321513 124333522 125313790 126314987 127411743 128556651 129661726
9419A29661726J095302J188598J291266J302134J277700J349100J534531J711681
$$ 129661726 130757028 131945626 133236892 134539026 135816726 137165826 138700357 140412038
9411A40412038J770911J756905J826206K046404K282677K366442K346897K432390
$$ 140412038 142182949 143939854 145766060 147812464 150095141 152461583 154808480 157240870
9403A57240870K668313K859643K892366K932646L157177L463932L652918L751317
$$ 157240870 159909183 162768826 165661192 168593838 171751015 175214947 178867865 182619182
9395A82619182L923289M162518M333435M451874M656372M933765N145643N315536
$$ 182619182 186542471 190704989 195038424 199490298 204146670 209080435 214226078 219541614
9387B19541614N601505N966026O183374O239803O405239O783916P109750P175268
$$ 219541614 225143119 231109145 237292519 243532322 249937561 256721477 263831227 271006495
9379B71006495P171211P347966P585358P606214P443031P354452P370014P256373
$$ 271006495 278177706 285525672 293111030 300717244 308160275 315514727 322884741 330141114
9371C30141114O923631O553891O274436N971049N523599N012864M568515M165528
$$ 330141114 337064745 343618636 349893072 355864121 361387720 366400584 370969099 375134627
9363C75134627L697966L154481K614038K132441J710157J320458R17007M66985
$$ 375134627 378832593 381987074 384601112 386733553 388443710 389764168 390681175 391148160
9355C91148160J5771l42635n99261q69585j250067j691216k072499k367081k672133
$$ 391148160 391163931 390821296 390222035 389352450 388102383 386411167 384338668 381971587 379299454
9346C79299454l083457l581683m055379m428444m750438n134606n603760o049558
$$ 379299454 376215997 372634314 368578935 364150491 359400053 354265447 348661687 342612129
9338C42612129o377197o627451o887672p140568p303877p383156p458181p522571
$$ 342612129 336234932 329607481 322719809 315579241 308275364 300892208 293434027 285911456
9330B85911456p475570p306488p153420p106841p063924o874237o555197o259295
$$ 285911456 278435886 271129398 263975978 256869137 249805213 242930976 236375779 230116484
9322B30116484o067618n912063n693210n402123n115353m906535m767260m610063
$$ 230116484 224048866 218136803 212443593 207041470 201926117 197019582 192252322 187642259
9314A87642259m373878m120476l963809l893758l763123l499151l230729l112235
$$ 187642259 183268381 179147905 175184096 171290338 167527215 164028064 160797335 157685100
9306A57685100l096956l010133k807218k619065k535233k478547k346478k170433
$$ 157685100 154588144 151578011 148770793 146151728 143616495 141137948 138791470 136621037
9298A36621037k053029k009002j953344j826708j665357j542213j480704j441042
$$ 136621037 134568008 132559006 130605662 128778954 127113597 125571384 124090680 122649638
9290A22649638j374177j277185j192048j148284j120185j059905r62686q69144
$$ 122649638 121275461 119998276 118806228 117657944 116537759 115477854 114515168 113646024
9282A13646024q04969p53411o94389o34419n81203n21606m49961l93146l77522
$$ 113646024 112841055 112087644 111393255 110758836 110177633 109656027 109206066 108812920 108435398
9273A08435398l84008l62417k85377j72320o9352j9093l3021p0167n7374L7257
$$ 108435398 108051390 107688973 107403596 107231276 107161924 107142831 107109810 107039643 106982269 107019526
9263A07019526J55124K04127J67988J24331J42604K02084K38149K34799K25679
$$ 107019526 107174650 107378777 107546765 107671096 107813700 108015784 108253933 108488732 108714411
9254A08714411K25733K22444K31111K86886L60461L58462K61290J90832K54111
$$ 108714411 108940144 109162588 109393699 109680585 110041046 110399508 110660798 110851630 111105741
9245A11105741L68771L61918K29467J58735K53941L73913L36739J84188J12015
$$ 111105741 111474512 111836430 112065897 112224632 112478573 112852486 113189225 113373413 113485428
9236A13485428J88920K84162K71886J81803J13831J01390J11483J14535J01831
$$ 113485428 113674348 113958510 114230396 114412199 114526030 114627420 114738903 114853438 114955269
9227A14955269P3558M7196M8847P4721R1875Q8231Q3645Q4889P8991Q1197J30671
$$ 114955269 115028827 115076023 115124870 115199591 115291466 115379697 115463342 115548231 115627222 115708419 115839090
9216A15839090K17325K71641K56323K14721K01603K23545K75002L63854M61310
$$ 115839090 116056415 116328056 116584379 116799100 117000703 117224248 117499250 117863104 118324414
9207A18324414M99997M75218M76003N53733O37681O58847O74596P63798Q73107
$$ 118324414 118824411 119299629 119775632 120329365 120967046 121625893 122300489 123064287 123937394
9198A23937394R05481R10029J020341J218097J333096J308011J294230J414941
$$ 123937394 124842875 125752904 126773245 127991342 129324438 130632449 131926679 133341620
9190A33341620J583316J660077J672206J747344J908582K064179K160715K229866
$$ 133341620 134924936 136585013 138257219 140004563 141913145 143977324 146138039 148367905
9182A48367905K301318K370757K450529K564638K687996K764963K798713K857286
$$ 148367905 150669223 153039980 155490509 158055147 160743143 163508106 166306819 169164105
9174A69164105K974072L096957L162053L180094L218116L307254L394345L402658
$$ 169164105 172138177 175235134 178397187 181577281 184795397 188102651 191496996 194899654
9166A94899654L340537L313853L392345L497029L495242L393156L332051L379928
$$ 194899654 198240191 201554044 204946389 208443418 211938660 215331816 218663867 222043795
9158B22043795L444597L437425L396728L372844L320442L217244L166669L232755
$$ 222043795 225488392 228925817 232322545 235695389 239015831 242233075 245399744 248632499
9150B48632499L277295L142292K916981K818219K853500K828478K675021K528858
$$ 248632499 251909794 255052086 257969067 260787286 263640786 266469264 269144285 271673143
9142B71673143K453258K335224K131742J979345J943970J883099J698221J516197
$$ 271673143 274126401 276461625 278593367 280572712 282516682 284399781 286098002 287614199
9134B87614199J451475J387605J200112J015266J001470J050738R46414P42959
$$ 287614199 289065674 290453279 291653391 292668657 293670127 294720865 295667279 296410238
9126B96410238O75165P45160P20460N45134M29848M69884M81881L39860J94631
$$ 296410238 297085403 297830563 298551023 299096157 299526005 299995889 300477770 300817630 301012261
9117C01012261J92548K14842R8600p4236j31236j10869j80950l49912m78810n23213
$$ 301012261 301204809 301419651 301518251 301444015 301312779 301201910 301020960 300671048 300192238 299669025
9107B99669025n59193o06360o21761o49962p82273r61086j017427r38252r13980
$$ 299669025 299109832 298503472 297881711 297231749 296449476 295488390 294470963 293532711 292618731
9098B92618731j054414j221826j245108j168983j168213j297000j446233j514294
$$ 292618731 291564317 290342491 289097383 287928400 286760187 285463187 284016954 282502660
9090B82502660j520614j553744j669387j841860j986636k044497k059337k139119
$$ 282502660 280982046 279428302 277758915 275917055 273930419 271885922 269826585 267687466
9082B67687466k319434k511551k619541k661471k723649k832075k934772k998410
$$ 267687466 265368032 262856481 260236940 257575469 254851820 252019745 249084973 246086563
9074B46086563l057056l150941l262273l337510l352210l332609l320849l335030
$$ 246086563 243029507 239878566 236616293 233278783 229926573 226593964 223273115 219938085
9066B19938085l366720l407179l458333l509291l519523l454896l343811l270732
$$ 219938085 216571365 213164186 209705853 206196562 202677039 199222143 195878332 192607600
9058A92607600l295283l387431l455027l430937l328349l219304l167141l175379
$$ 192607600 189312317 185924886 182469859 179038922 175710573 172491269 169324128 166148749
9050A66148749l194761l175276l106520l009792k907431k811894k731586k666743
$$ 166148749 162953988 159778712 156672192 153662400 150754969 147943075 145211489 142544746
9042A42544746k601284k515187k408329k303535k222593k158388k070667j924343
$$ 142544746 139943462 137428275 135019946 132716411 130493818 128335430 126264763 124340420
9034A24340420j749522j641316j652483j694458j616747j405563j222804j194439
$$ 124340420 122590898 120949582 119297099 117602641 115985894 114580331 113357527 112163088
9026A12163088j238584j192624j050328r50495r51864r55460q77051p74923p43147
$$ 112163088 110924504 109731880 108681552 107731057 106779193 105823733 104946682 104171759 103428612
9017A03428612p67675p66055p13488o54527o21793o05619n88626n66546n45751
$$ 103428612 102660937 101894882 101181394 100526867 99905074 99299455 98710829 98144283 97598532
9008I7598532n42589n62489n69977n24118m58168m59593n38900n92910n54037
$$ 97598532 97055943 96493454 95923477 95399359 94941191 94481598 93942698 93349788 92795751
8999I2795751m99984n32374o12514o28266n80743n73764o29339o56153o28260
$$ 92795751 92295767 91763393 91150879 90522613 89941870 89368106 88738767 88082614 87454354
8990H7454354o51679p81251q96491q71464p77170p77384q76785r29601q89395
$$ 87454354 86802675 86021424 85124933 84253469 83476299 82698915 81822130 80892529 80003134
8981H0003134q80952r75483j054212j002002r10158r36840j046684j067196r74444
$$ 80003134 79122182 78146699 77092487 76090485 75180327 74243487 73196803 72129607 71155163
8972G1155163r30626j012766j093533j066483j014240j035878j064008j009847
$$ 71155163 70224537 69211771 68118238 67051755 66037515 65001637 63937629 62927782
8964F2927782r57781j022087j109935j053219r16315r17762j055624j087676r38927
$$ 62927782 61970001 60947914 59837979 58784760 57868445 56950683 55895059 54807383 53868456
8955E3868456q46687r69579j109192j021853q06566p36922q38046q92311q04114
$$ 53868456 53021769 52052190 50942998 49921145 49114579 48377657 47539611 46647300 45843186
8946D5843186p07660p12904p61493p72635p59175p48789p22729o75918o34600
$$ 45843186 45135526 44422622 43661129 42888494 42129319 41380530 40657801 39981883 39347283
8937C9347283n94462n37719n08489n58963o27909o01512m97400m50019m98738
$$ 39347283 38752821 38215102 37706613 37147650 36519741 35918229 35420829 34970810 34472072
8928C4472072n35346m92855m40140m38158m40551m04268l76129l94800m12573
$$ 34472072 33936726 33443871 33003731 32565573 32125022 31720754 31344625 30949825 30537252
8919C0537252l87213l58154l66019l83614l81497l73647l55470k97846k39960
$$ 30537252 30150039 29791885 29425866 29042252 28660755 28287108 27931638 27633792 27393832
8910B7393832k65520l43052l34864k27162j85871k88662l76667l10103k02969
$$ 27393832 27128312 26785260 26450396 26223234 26037363 25748701 25372034 25061931 24858962
8901B4858962k21535k93584k41145j04093q6385k20797l24287k91449k17691j98610
$$ 24858962 24637427 24343843 24102698 23998605 23912220 23691423 23367136 23075687 22857996 22659386
8891B2659386k00148j82102j83167k16880k22916j85555j75607k14851k20387
$$ 22659386 22459238 22277136 22093969 21877089 21654173 21468618 21293011 21078160 20857773
8882B0857773j51721r9838j48915k42027k69029k17825j59558j36612j37337j46349
$$ 20857773 20706052 20606214 20457299 20215272 19946243 19728418 19568860 19432248 19294911 19148562
8872A9148562j59999j69949j68241j57526j45890j48265j81282k26652k27499
$$ 19148562 18988563 18818614 18650373 18492847 18346957 18198692 18017410 17790758 17563259
8863A7563259j68660j23010j51109j98718j83371j38424j55137k14428k13740
$$ 17563259 17394599 17271589 17120480 16921762 16738391 16599967 16444830 16230402 16016662
8854A6016662j48742j21048j59571j84720j67434j68143j90186j59629r1487j00528
$$ 16016662 15867920 15746872 15587301 15402581 15235147 15067004 14876818 14717189 14625702 14525174
8844A4525174j88100k03570j00149l6642j12674j95393j55323r0609j36183k13517
$$ 14525174 14337074 14133504 14033355 13996713 13884039 13688646 13533323 13442714 13306531 13093014
8834A3093014j79983r2212r2962j43230j08943l4119p1777j89320k04117j00110
$$ 13093014 12913031 12820819 12727857 12584627 12475684 12441565 12369788 12180468 11976351 11876241
8824A1876241n0095j07049j31171p0241n6303j38980j66243n4511L8750l4148
$$ 11876241 11826146 11719097 11587926 11517685 11461382 11322402 11156159 11101648 11140398 11106250
8814A1106250j67752j81119r5730n8206r2929j08952q1615o3178n9834m2539m1024
$$ 11106250 10938498 10757379 10661649 10603443 10510514 10401562 10319947 10256769 10196935 10154396 10113372
8803A0113372r3141j37292r0481n501r340r6437j28886n7667N69m3016j06692
$$ 10113372 10020231 9882939 9792458 9786957 9777617 9681180 9552294 9494627 9495196 9452180 9345488
8792I345488p4996J1167J1791r8863j83554j27946J645M3933m7033j49305j41223
$$ 9345488 9270492 9281659 9293450 9194587 9011033 8883087 8884732 8928665 8881632 8732327 8591104
8781H591104n2156M387o623k7883l1107n1131r1244r5092m7860j6650m2493p3235
$$ 8591104 8538948 8543335 8536712 8508829 8477722 8426591 8335347 8240255 8192395 8175745 8133252 8060017
8769H060017n8679l2799l5721l3945o30R01q0637j58751j11246K2088P4872j1616
$$ 8060017 8001338 7968539 7932818 7898873 7898243 7899144 7818507 7659756 7548510 7570598 7645470 7633854
8757G633854j13317j09176l2214J3685m14k9232m0658l8372k9151j8325k1232
$$ 7633854 7520537 7411361 7379147 7392832 7392418 7363186 7322528 7284156 7255005 7236680 7215448
8746G215448m4424o7681o8513n2714m2258m3136m1336k7951j7969l5736p4576
$$ 7215448 7171024 7103343 7034830 6982116 6939858 6896722 6855386 6827435 6809466 6773730 6699154
8735F699154q3529k6020N0168N3310k3607p8132m5748l035m6697j27528j14830
$$ 6699154 6615625 6589605 6639773 6693083 6669476 6591344 6545596 6542561 6495864 6368336 6253506
8724F253506p06Q2147N4424j5226l9702k7348j8673j0977p756m7919j12970j00676
$$ 6253506 6252800 6334947 6389371 6374145 6334443 6307095 6288422 6277445 6269689 6221770 6108800 6008124
8712F008124J5294R3484J6946j03111p7759N4875P3608p1098j62911n7883Q7481
$$ 6008124 6023418 6116902 6133848 6030737 5952978 6007853 6081461 6010363 5847452 5789569 5877050
8701E877050P2030l4522l4751N3276M3318p2374r2275M1926J22318J3580j16113
$$ 5877050 5949080 5914558 5879807 5933083 5976401 5904027 5811752 5853678 5975996 5989576 5873463
8690E873463p1304N3595M9629n2116n2194O4252J07570Q274q2200n2686J9448
$$ 5873463 5802159 5855754 5905383 5853267 5801073 5865325 5972895 5981169 5898969 5846283 5865731
8679E865731L8989K3060j096n1204q4690k0764P5524L6935j08133j20369N8097
$$ 5865731 5904720 5927780 5926684 5875480 5790790 5770026 5845550 5882485 5774352 5653983 5712080
8668E712080J61458K2813j31168n4357R8428M5873j22152j03287Q0539J17687
$$ 5712080 5873538 5896351 5765183 5710826 5809254 5855127 5732975 5629688 5710227 5827914
8658E827914n5309j59795n8514N2737K9416m449M3624M8724n1040r1552R762O4450
$$ 5827914 5772605 5612810 5554296 5607033 5636449 5632000 5675624 5724348 5673308 5581756 5591518 5655968
8646E655968n5349j58915n5840J01989P2779p4699j05131j0265L6460M697l064
$$ 5655968 5600619 5441704 5385864 5487853 5560632 5485933 5380802 5370537 5406997 5411694 5408630
8635E408630J063o2807j16332k7724J07947Q1527o6856r4683L2791Q4633l8815
$$ 5408630 5409693 5346886 5230554 5202830 5310777 5392304 5325448 5230765 5263556 5348189 5309374
8624E309374j47145q9792J9513L0886j3703j7754r260m2040o7692l6339m061k8703
$$ 5309374 5162229 5072437 5091950 5122836 5109133 5091379 5082119 5040079 4972387 4936048 4931987 4903284
8612D903284o4890n4602k1588j537J9336L7449J4664k5849j2913K5632j7740j19074
$$ 4903284 4838394 4783792 4762204 4760667 4780003 4817452 4832116 4806267 4793354 4818986 4801246 4682172
8600D682172j14412K3975J02091N867j10457q4450m831k6529r1879n3131N1090
$$ 4682172 4567760 4591735 4693826 4699693 4589236 4504786 4499955 4473426 4381547 4328416 4379506
8589D379506O9502L221k4667m637k8186p8334m7775M5182O1990k5136r1905p0861
$$ 4379506 4449008 4452229 4427562 4422925 4394739 4316405 4268630 4313812 4375802 4350666 4258761 4187900
8577D187900l1950k9768k8997j1484j0184j0126L9150Q9531K9148j13875j65858
$$ 4187900 4155950 4126182 4097185 4085701 4075517 4065391 4104541 4194072 4223220 4109345 3943487
8566C943487o2610N0051M8353P558L9064Q8413L9187p2351j00188r810P6635N8316
$$ 3943487 3880877 3930928 3979281 3986839 4025903 4114316 4153503 4081152 3980964 3971154 4047789 4106105
8554D106105k2418o0429k4412K2421J3129m0583o7820l4529J1038J0615k2924
$$ 4106105 4083687 4023258 3998846 4021267 4034396 3993813 3925993 3891464 3902502 3913117 3890193
8543C890193m0897m0373m8566n4777l1524j226k848j4884J133R623l8521q2744
$$ 3890193 3849296 3808923 3760357 3705580 3674056 3672830 3669982 3655098 3656231 3665854 3627333 3544589
8531C544589k7355P2177O0306o3017j17555k9480M3602k3851j13333o3965N6347
$$ 3544589 3517234 3589411 3649717 3586700 3469145 3439665 3483267 3459416 3346083 3282118 3338465
8520C338465O6078l6106q7608k9398K7602K496m9653n8451l7441k5436k3193k0537
$$ 3338465 3404543 3368437 3280829 3251431 3279033 3281529 3231876 3173425 3135984 3110548 3087355 3066818
8508C066818j7386m253J8588J1070m8497r4779n1841L6386N2395j9363p0168l6199
$$ 3066818 3049432 3045179 3063767 3074837 3026340 2931561 2879720 2916106 2968501 2949138 2878970 2842771
8496B842771J6953J4321k0779l0966j9454k3406m7173o7976o6010k3687N3455
$$ 2842771 2859724 2874045 2853266 2822300 2802846 2779440 2732267 2664291 2598281 2574594 2628049
8485B628049R9665M5031o6421j01053k1433M6792K989o9830m2072M3853L7326
$$ 2628049 2727714 2772745 2706324 2605271 2583838 2630630 2633619 2563789 2521717 2565570 2602896
8474B602896o9575j16510k4568P8752N5951m0759p1074k1522P801j4649j9249
$$ 2602896 2533321 2416811 2392243 2470995 2526946 2486187 2415113 2393591 2401392 2386743 2367494
8463B367494J8148K6034l2057q4189o1316L544M4920N6104M9286M249o7223q4218
$$ 2367494 2385642 2411676 2379619 2295430 2234114 2237658 2282578 2338682 2387968 2392217 2324994 2240776
8451B240776j6400L6314m774m6448K7427J26213O8659j00288j40191O854J10784
$$ 2240776 2224376 2260690 2255916 2209468 2236895 2363108 2431767 2331479 2191288 2198142 2308926
8440B308926J9099j05397o6329N1313N4091k9811l4028L4589K2544p8427j12631
$$ 2308926 2328025 2222628 2156299 2207612 2261703 2231892 2197864 2232453 2254997 2176570 2063939
8429B063939l1056M5147N0982N3140O5112K289j16764j34684j2461P4687J4434
$$ 2063939 2032883 2078030 2129012 2182152 2247264 2249553 2132789 1998105 1985644 2060331 2074765
8418B074765n7194K850Q7658J9602j34834j52109rJ16808O6210m2990n3710K2489
$$ 2074765 2017571 2020421 2108079 2127681 1992847 1840738 1840729 1957537 2023747 1980757 1927047 1949536
8406A949536O3225K0703l8717m5929j1597P947q696k8501k3716j6178l0003l3398
$$ 1949536 2012761 2033464 1994747 1948818 1937221 1945168 1936472 1907971 1884255 1868077 1838074 1804676
8394A804676Q394M4918n58q4588p4607M0851J03978K1919p9925n2074M3393M2517
$$ 1804676 1813070 1857988 1857430 1772842 1698235 1739086 1843064 1864983 1785058 1732984 1776377 1818894
8382A818894n2043q7777j7303M2341J9664q379K3859N0873o06p5015p3496q434
$$ 1818894 1766851 1679074 1661771 1704112 1723776 1715397 1739256 1790129 1789523 1714508 1641012 1632578
8370A632578K5170k564k8462r449J6510N771j4029P461M5066J7369p8683j23084
$$ 1632578 1657748 1655184 1626722 1617273 1633783 1639554 1625525 1632986 1678052 1695421 1616738 1493654
8358A493654k8096J11856J28222J6974o0534l0389l776n5445p4111K9938J18096
$$ 1493654 1465558 1577414 1705636 1722610 1662076 1631687 1627911 1572466 1498355 1528293 1646389
8347A646389K5468j32712j03879R0219J57740q712j55755o8426R8397Q5163n8768
$$ 1646389 1671857 1539145 1435266 1525485 1683225 1674513 1518758 1450332 1548729 1633892 1575124
8336A575124q0617N1880J08585j5934j29476n2263R8491R3980n5133j24509k1522
$$ 1575124 1494507 1546387 1654972 1639038 1509562 1457299 1555790 1649770 1594637 1470128 1448606
8325A448606Q6085M0452o7746n7604M7893O3513m8452j07121p354R8603M0766
$$ 1448606 1534691 1575143 1507397 1449793 1497686 1561199 1512747 1405626 1398272 1496875 1537641
8314A537641r2902r9232J5856O6817M832k1700N2400Q8504j1482j27975j13947
$$ 1537641 1444739 1345507 1361363 1428180 1433012 1411312 1463712 1552216 1540734 1412759 1298812
8303A298812j6060L2035K2626L1939N0602J3016n1885m8975K0955N8393K3993
$$ 1298812 1282752 1314787 1337413 1369352 1419954 1432970 1381085 1332110 1353065 1411458 1435451
8292A435451j4757p076J2776N683o158J1512M3294M2530j2415q7049j06388k8098
$$ 1435451 1420694 1413618 1426394 1432077 1425919 1437431 1480725 1523255 1510840 1423791 1317403 1289305
8280A289305Q2215J00591P930o3555j4257O4715K5014r9321j28301p192J08106
$$ 1289305 1371520 1472111 1480041 1416486 1402229 1466944 1491958 1392637 1264336 1257144 1365250
8269A365250Q2269j4106l7363R050Q580n7852o9821L7337J44032R8112n8034j24783
$$ 1365250 1447519 1433413 1396050 1405100 1413680 1355828 1286007 1323344 1467376 1565488 1507454 1382671
8257A382671j9693J00674O5062o2984q8815J3118P1040l402q3358m4271M6427
$$ 1382671 1362978 1463652 1528714 1465730 1376915 1390033 1461073 1457671 1374313 1330042 1376469
8246A376469O7899M1350M9582O7471K8915j6287J9760Q2364M6306o0747q6462
$$ 1376469 1444368 1485718 1535300 1602771 1631686 1615399 1635159 1717523 1763829 1703082 1616620
8235A616620k324N4650J1691m0318k5294o83k6469n2739k3361J8384J2608j8491
$$ 1616620 1614296 1668946 1680637 1640319 1615025 1614342 1587873 1535134 1511773 1530157 1542765 1524274
8223A524274l0595l4487m3098k1262L7867N9798p136r2664r0572n144N9684L6020
$$ 1524274 1493679 1459192 1416094 1394832 1432699 1492497 1485361 1392697 1302125 1296981 1356665 1392685
8211A392685l6478o4828k709R2345J06346M562j03786r6221k925M6598J7910n361
$$ 1392685 1356207 1291379 1288670 1381015 1487361 1491923 1388137 1291916 1288991 1335589 1353499 1348138
8199A348138J3775J6554j4816j3874L3106M4923l785k5416K1407N2142J1692k8221
$$ 1348138 1361913 1378467 1363651 1349777 1382883 1427806 1424021 1398605 1420012 1472154 1483846 1455625
8187A455625j3595r376n5546o5241J2830O8495O063q2005p0803j4243l2544r2575
$$ 1455625 1442030 1432654 1377108 1311867 1324697 1393192 1399255 1317250 1246447 1232204 1199660 1107085
8175A107085q0811j2314J3659k396N039J5667j8845l8280K2432O9345r763j16156
$$ 1107085 1026274 1013960 1027619 1025223 1030262 1045929 1027084 988804 1011236 1080581 1070818 954662
8163I54662p7700M8685O4711k3284k6175P0187O9542p2945j51665n8774M5629
$$ 954662 876962 925647 990358 967074 940899 1011086 1080628 1007683 856018 797244 842873
8152H42873K4792l0004j7962j0104o0889o3090M1662J12578M5177l5545k24N4320
$$ 842873 867665 837661 819699 809595 748706 685616 727278 839856 885033 849488 849264 903584
8140I03584q44q0477n2530J0652j6584o0363M09O5240k1117j44031p5617J13257
$$ 903584 902740 822263 769733 780385 763801 703438 703847 769087 747970 603939 528322 641579
8128F41579J34684l7970j20152R541J24306M9019o5208l4406N2235K7770n4355
$$ 641579 776263 738293 618141 627682 751988 801007 735799 701393 753628 781398 727043
8117G27043m4445K6552K3363l6006k1640N9738O6881l4228j15575r4220l5790
$$ 727043 682598 709150 732513 696507 674867 734605 801486 767258 651683 557463 521673
8106E21673j2664K239M1782O1058K3280j8066m115K7926J2901k3985j3046K8590
$$ 521673 509009 511248 553030 614088 637368 619302 615187 643113 656014 632029 618983 647573
8094F47573K2126k3058r137P0456Q2746l5465j41116q2645N9717R2174M020m6074
$$ 647573 669699 646641 637504 707960 790706 755241 614125 531480 591197 683371 687391 641317
8082F41317j6347l1220j12536j00103N8771J63809O3209r0143p8663M2185P1322
$$ 641317 624970 593750 481214 381111 439882 603691 666900 576757 498094 540279 611601
8071F11601K903j2181L6676K7937k7051J807Q7361N6522q7673j26457J5600J29741
$$ 611601 614504 602323 638999 666936 639885 641692 729053 785575 697902 571445 587045 716786
8059G16786N6298p5318q5138j6010m80k4953o588K7470J1780j3481J0808L1168
$$ 716786 773084 697766 612628 596618 596138 571185 564597 592067 603847 590366 601174 632342
8047F32342j3013n3000j3788K8839j7658o9246K677J23752J11787k2940q6849
$$ 632342 619329 566329 552541 581380 563722 494476 497153 620905 732692 709752 622903
8036F22903o448Q0527O1305q198m1818m6544m8611k7249J7111L2623L616j9403
$$ 622903 616455 696982 758287 750089 708271 661727 613116 585867 602978 635601 639217 619814
8024F19814r085M245N334J1649J0150k3855m3256J7258R8518O8339n8946j09980
$$ 619814 610729 614974 620308 631957 642107 618252 574996 592254 690772 759111 700165 590185
8012E90185j4453P9461M0690m6343m4993M254j8832p9765m0955Q7659J37031L8004
$$ 590185 575732 655193 695883 649540 604547 608801 589969 510204 469249 556908 693939 731943
8000G31943p1347n7289K1474K7521m3403p3357o456P9895R1741K9984l7491o0266
$$ 731943 660596 603307 624781 652302 608899 535542 529086 608981 700722 730706 693215 632949
7988F32949l3185J7537M2954L033p1572q5878J81R4110Q3092l493l7198J3559
$$ 632949 599764 617301 660255 663288 591716 505838 506019 600129 683221 679728 642530 656089
7976F56089M5966J681m2456j8363J9004M280k0939m549N184l5975n2003K3381
$$ 656089 702055 703736 661280 642917 661921 666201 645262 640713 645897 609922 557919 581300
7964E81300R2098L5750o3213m0754O3977O7298l8755p0573K2441P1667o432o8549
$$ 581300 673398 709148 645935 605181 669158 736456 697701 627128 649569 721236 714804 646255
7952F46255j4243L6865k0265p9044k9135L2549p691n4628J2015Q3948M829j19986
$$ 646255 632012 668877 648612 569568 540433 572982 565291 510663 522678 606626 611455 491469
7940D91469p4207Q7912J09336m4333j27740j8102J07531Q0881k0148n8466n0867
$$ 491469 417262 505174 614510 570177 442437 424335 531866 612747 592599 534133 483266
7929D83266n9381m6272J8268M8915r808n5512Q721R1628N1317o8766j05244k3467
$$ 483266 423885 377613 395881 444796 434988 379476 388197 479825 531142 462376 357132 333665
7917C33665N7462O2252L4728J9367L08k6018k7485n839R76k466K1524M7622M633
$$ 333665 391127 453379 488107 507474 507782 481764 454279 448440 449416 446950 468474 516096 520729
7904E20729q6930j05341q627P8465L9529n7752o8641N626L4277k2034n2146R965
$$ 520729 433799 328458 319831 398296 437825 380073 311432 317058 351335 329301 277155 287120
7892B87120O7598K3592m9852k7271N5723N5768l5843p0295J1856P4409N341r8115
$$ 287120 354718 378310 328458 301187 356910 412678 376835 306540 318396 392805 398146 300031
7880C00031q3935K1313P6308N0306K7902K7123k0262j03518j08814l079R2355
$$ 300031 216096 237409 313717 364023 391925 419048 398786 295268 186454 183375 275730
7869B75730P4089m889l6718r794J3701L906k0623l5403j9860L0278O9120L6359
$$ 275730 349819 344930 308212 298418 312119 316025 295402 259999 240139 270417 339537 375896
7857C75896m5675q1178l8540K979j3905l6174n756L6723L2364R082J7421L0944
$$ 375896 330221 249043 210503 213482 199577 163403 157647 194370 226734 235816 253237 284181
7845B84181O410j8220J0305M8079J8421m9525o0740q371K5117P692j1886r735
$$ 284181 290591 272371 282676 330755 349176 299651 238911 230540 255657 263349 251463 241728
7833B41728j5163k7880r401L0803L6359M369q377Q456L514l0361l7886j0783o892
$$ 241728 226565 198685 189284 220087 256446 260815 252438 260894 264408 234047 196161 185378 178486
7820A78486k8663m76Q2630J05842J1548q7133p0292Q105K1921k3946l0540Q150
$$ 178486 149823 149347 231977 337819 349367 262234 191942 200047 221968 198022 167482 175632
7808A75632Q958k7180m346Q3105J04856l065j16160r4939J2124N0243j4065o7176
$$ 175632 184590 157410 153064 236169 341025 337960 221800 126861 138985 189228 175163 107987
7796A07987l2552L5197N9583M7180L7209K0882k5270p1268o5212j1665L7191N3275
$$ 107987 75435 110632 170215 217395 254604 275486 250216 178948 113736 102071 139262 192537
7784A92537M3317N508n9414j00242n5137M5298R0983M1009j5594J660L9520N059
$$ 192537 235854 241362 181948 81706 26569 71867 162850 203859 188265 189925 229445 234504
7772B34504p0887p1675K0900R1549O1195n989j4495K0002J2921m6606p7007k7506
$$ 234504 163617 91942 112842 204391 265586 259597 245102 265104 278025 231419 154412 126906
7760A26906M6326N9317R496k9460j6486P049n192k4453L550N5806N3373j1905
$$ 126906 173232 232549 242045 212585 196099 203148 197956 173503 177053 232859 286232 274327
7748B74327n3616k2753J7316P7l5609k1031K1485K4930j377J836K7069J6216k2025
$$ 274327 220711 197958 215274 215351 179742 158711 180196 205126 203749 205585 232654 248870 226845
7735B26845k0023K3537L2493k0394p3037p5800m4289r24M4906N6293R941k6212
$$ 226845 206822 230359 262852 242458 169421 93621 49332 48408 93314 149607 159548 133336
7723A33336K3070Q5883K7052j05506j11231L7115J15520L203j07017k4926J11886
$$ 133336 156406 242289 269341 163835 52604 89719 205239 208442 101425 76499 188385
7712A88385O6586r3402j05951N0582J31019K8662p8395m4886L0094J4090m2518
$$ 188385 254971 161569 55618 106200 237219 265881 187486 142600 172694 186784 144266
7701A44266l1906K4344M3302K1165m927l7284o5864l4521N0744Q0547L912p1146
$$ 144266 112360 136704 180006 201171 196244 158960 93096 58575 109319 189866 193778 122632
7689A22632m3697J6676j950n6477l0198N5671P6459J6934j3987K2220M0852j607
$$ 122632 78935 95611 93661 37184 6986 62657 139116 156050 142063 164283 205135 203528
7677B03528l4737j1748Q224j9862l5117J7806P2956L7453n4919q6713k7133L7537
$$ 203528 168791 157043 165267 145405 110288 128094 201050 238503 183584 96871 69738 107275
7665A07275M1402J5802P271P06k6893l9124K395M9902K3743n3064o7353J3562
$$ 107275 148677 164479 171750 172456 145563 106439 108834 158736 182479 129415 62062 75624
7653G5624P8939M0661k6793r366N3054L0616o9318r6734j350P6134K3001p2520
$$ 75624 154563 195224 168431 159065 212119 242735 173417 76683 75333 151467 174468 101948
7641A01948o9749J1565N0062J8186j1150n663K945P564K3166J9804l0928o7744
$$ 101948 32199 43764 93826 112012 100862 95199 98144 105708 128874 148678 117750 50006
7629E0006j6465O7545O5585r377l2659J3633R969p6475j12395k1529P4862N2727
$$ 50006 33541 101086 166671 157294 124635 138268 148237 71762 -40633 -62162 12700 65427
7617F5427j8346q188N7752O5519J1048k2972k5485l9460l8760J8488N8215j3466
$$ 65427 47081 38893 96645 162164 173212 150240 124755 85295 46535 65023 123238 109772
7605A09772j12677p1350P6902J19487M573p2771l859N2373l4959j14988j1054
$$ 109772 -2905 -74255 2647 122134 126707 53936 50077 102450 67491 -47497 -58551
7594e8551J45266J05423p6201j12505N2409J52636K8795j32117j11183J8669N8348
$$ -58551 86715 192138 115937 3432 55841 208477 237272 105155 -6028 12641 70989
7583G0989J494j3648L4200L8612k8805p8572o0472j7790J6159N3083P7312N0144
$$ 70989 72483 58835 93035 131647 102842 24270 -36202 -53992 -37833 15250 92562 142706
7571A42706l734j3905K2467L6817L656l2549m6727n4198m2555J1695N5551R608
$$ 142706 138972 125067 147534 184351 188007 155458 108731 54533 11978 23673 79224 88832
7559H8832p9082p0193M6330J06200J9859q0086m7839M8113M9900l2587n6430J1147
$$ 88832 9750 -60443 -14113 92087 111946 31860 -15979 32134 82034 49447 -6983 4164
7547D164N4737J3387l2657j1358L0872K4163j3113k2607m320k656k6763l8921
$$ 4164 58901 72288 39631 28273 59145 83308 70195 47588 43268 40612 13849 -25072
7535b5072j4340K3680L6021J8915N970J5505K0299k450j8377Q681K8723l4468
$$ -25072 -39412 -15732 20289 39204 45174 60679 80978 78528 60151 68832 97555 63087
7523F3087j29735j05070O2572J87216J16431n1505j12609l5291M4204M3519M018
$$ 63087 -66648 -171718 -109146 78070 194501 142996 30387 -4904 39300 82819 86837
7512H6837k5787l5236l002O5048P9458j4066j00663m4119P1710N1294p9946r2530
$$ 86837 61050 25814 22812 87860 167318 153252 52589 8470 80180 131474 51528 -41002
7500d1002O3565J51401K4068j33854j01060M5554Q5752l057o6067l5971J5464
$$ -41002 22563 173964 198032 64178 -36882 8672 94424 91367 25300 -10671 4793
7489D793L3196K4364q223m8286l5432L6015O3700m809o0294q530N6974J8980m6011
$$ 4793 37989 62353 54130 5844 -29588 6427 70127 65318 5024 -3506 53468 72448 26437
7476B6437r258O0675J8683p5443n3200M7546M4328m6497l3541P8027O7781q9804
$$ 26437 17179 77854 96537 21094 -32106 15440 59768 13271 -20270 57757 125538 35734
7464C5734j36613K7123J44036K6761j21684n7176R8312Q9197l8915n8018K9012
$$ 35734 -100879 -73756 70280 97041 -24643 -81819 16493 105690 66775 8757 37769
7453C7769K7291p2723q3760K6843P7313n041p1072k2791L9799K7918R435M4393
$$ 37769 65060 -7663 -91423 -64580 12733 7692 -63380 -86171 -46372 -18454 -9019 35374
7441C5374N6327j6266q5006m7170N0249Q6788L1360m9578q1750l2294O1559R1380
$$ 35374 91701 75435 -9571 -56741 -6492 80296 111656 62078 -19672 -51966 9593 100973
7429A00973m246j14428p4636P8839J36002L0034o6121l5993J120n9827r3938J9071
$$ 100973 96727 -17701 -92337 -13498 122504 152538 86417 50424 51544 -8283 -102221 -83150
7417h3150J28495M0083j20861p5438J41555K03536L97j89267j28889M9844J01169
$$ -83150 45345 85428 -35433 -110871 30684 234220 234617 45350 -83539 -33695 67474
7406F7474J8441m9871o1927o2121k7445O5888J14237K0750j07304q8554M8677
$$ 67474 85915 36044 -25883 -88004 -115449 -49561 64676 85426 -21878 -110432 -61755
7395f1755J08442L3398l2310j707L0221k3392r5456q9774k0291N0279R8790J04388
$$ -61755 46687 80085 47775 46068 76289 52897 -42559 -132333 -152624 -102345 -3555 100833
7383A00833L6228n7860o7603P903L1245n3002j10809l7278O3388N7630M931K4494
$$ 100833 137061 79201 11598 19501 50746 -2256 -113065 -150343 -86955 -29325 -24394 100
7371A00O0138q625j09655p4936N3859P5938k0660l6822P2963J00780m6565j55164
$$ 100 60238 51613 -58042 -132978 -79119 -3181 -23841 -60663 12300 113080 66515 -88649
7359h8649m8270J14290R6937l8927o9194J9988N4680r646m9186j8204J720p287
$$ -88649 -136919 -22629 74308 35381 -33813 -13825 40855 31209 -17977 -36181 -34461 -41748
7347d1748K0856N8940O501r1188o7307P5419J25063m490j20668n9121N9923M7805
$$ -41748 -20892 38048 44549 -46639 -113946 -38527 86536 82046 -38622 -97743 -37820 9985
7335I985m9435o1395J5084M4740P22k1332K57p452m7115m0595J1393K2501j2341
$$ 9985 -39450 -100845 -85761 -41021 -40299 -61631 -61374 -68826 -115941 -156536 -145143 -122642 -134983
7322a34983m733M8086M1257l3100l5653Q0224J47297L3259j29883j30270Q484
$$ -134983 -139716 -91630 -50373 -83473 -119126 -38902 108395 141654 11771 -118499 -110015
7311a10015Q1523J9268m3521j2336L8170K3925j5052j1662J8395L6635M9443M8284
$$ -110015 -28492 -9224 -52745 -65081 -26911 -2986 -18038 -29700 -11305 25330 74773 123057
7299A23057j2205j01312r4182L1989J04225k733j39415q7699Q4496J11738m3979
$$ 123057 110852 9540 -84642 -52653 51572 48839 -90576 -178275 -93779 17959 -26020
7288b6020j22567J8042J74598J26757l0083p8299l1188m9422j15271o3758R2090
$$ -26020 -148587 -130545 44053 170810 140727 62428 31240 -18182 -133453 -197211 -105121
7277a05121J37400M01j15057l9313J09421J12729l7987j59718j31330n888R4796
$$ -105121 32279 32680 -82377 -121690 -12269 100460 62473 -97245 -228575 -234463 -139667
7266a39667J04424M4073j2495j4023Q648j0006o0799o1762J5444R4476R7016K8011
$$ -139667 -35243 8830 -3665 -17688 -9040 -19046 -79845 -141607 -126163 -31687 65329 93340
7254I3340o2447j25917j09318K060J12148R6009j3035m6455M2244R5840J0227
$$ 93340 30893 -95024 -204342 -202282 -90134 5875 -7160 -53615 -11371 84469 94696
7243I4696r2454p4456p940j9054m6437L0322J26072O5305r1147j04814M9573J23219
$$ 94696 2242 -72214 -80154 -99208 -145645 -115323 10749 76054 -15093 -119907 -70334 52885
7231E2885j0185j50185q6873Q6979J44625N3010m2935o1022l7842n463L5487M9844
$$ 52885 42700 -107485 -194358 -107379 37246 90256 47321 -13701 -51543 -57006 -21519 28325
7219B8325J499o3344o7513j8249J7705K7070M4200N7658K5724k5646k5538J6986
$$ 28325 29824 -33520 -101033 -119282 -101577 -74507 -30307 27351 53075 27429 1891 18877
7207A8877J5925m1945n6321K6966J07952O6049n7786j10088l7251M8616L6186
$$ 18877 34802 -7143 -63464 -36498 71454 137503 79717 -30371 -67622 -19006 17180
7196A7180l6544n5933N11M8882L2168j1516k7269k0013k0241k7601k7561k1724
$$ 17180 -19364 -75297 -74786 -25904 6264 -5252 -32521 -52534 -72775 -100376 -127937 -149661
7184a49661q313K2618M5978J4879m5812l9194N0647R8115K1874o3387j5563R3533
$$ -149661 -157974 -135356 -89378 -74499 -120311 -159505 -108858 -10743 11131 -52256 -67819 25714
7172B5714Q0270n0412j07441k0429O1115K3210n1026n5470k1651n358K7685Q6898
$$ 25714 105984 55572 -51869 -72298 -11183 12027 -38999 -94469 -116120 -121478 -93793 -6895
7160f895P5471m2800j26881n5150P5203R9068L1061k946P265k0129p0045n1152
$$ -6895 68576 25776 -101105 -156255 -81052 18016 49077 46131 53396 33267 -36778 -87930
7148h7930K5569N9136L0071M175j0902n5010q6956l5511M0500K4325l8453M007
$$ -87930 -62361 -3225 26846 31021 20119 -34891 -121847 -157358 -116858 -92533 -130986 -126979
7136a26979J23201J11270o9689j74646l7658J57157J43039m1325j37463n5272
$$ -126979 -3778 107492 37803 -136843 -174501 -17344 125695 84370 -53093 -108365
7126a08365L9486J4123m9256k2188N7287N0179n8362j16245j8520J19840J03305
$$ -108365 -68879 -54756 -104012 -126200 -68913 -18734 -77096 -193341 -211861 -92021 11284
7115A1284n7540j37104j9628J17862P3417o1054m9326R8711J36957j6481j47880
$$ 11284 -46256 -183360 -202988 -85126 -11709 -72763 -122089 -23378 113579 97098 -50782
7104e0782r0246L8365O2196J1544K565J8455j1492l9036J3046P7352L7109o6196
$$ -50782 -141028 -102663 -40467 -28923 -26358 -7903 -19395 -58431 -45385 31967 69076 2880
7092B880r0016j6258L7867J3387k7928k8307j472K3382L1245P315l1059k3634
$$ 2880 -87136 -103394 -65527 -52140 -80068 -108375 -109847 -86465 -55220 -47905 -78964 -102598
7080a02598L7948O3434j113o5805l3265L5894K6930l1365k7710K8567L4642j1324
$$ -102598 -64650 -1216 -2329 -68134 -101399 -65505 -38575 -69940 -97650 -69083 -34441 -45765
7068d5765j7263J9987J4999k8238j7121M2218L9178l5585o0245J382L3297k1907
$$ -45765 -63028 -43041 -28042 -56280 -73401 -31183 7995 -27590 -87835 -86453 -53156 -75063
7056g5063o0157n566N6757L6044j4414q738K6288K1859j2229k9872k8413j2555
$$ -75063 -135220 -140786 -84029 -47985 -62399 -71137 -44849 -22990 -35219 -65091 -93504 -106059
7044a06059L4354Q1297N1668m4108q8168l2058K7292K0162J5484O5272Q0140j4066
$$ -106059 -71705 9592 61260 17152 -71016 -103074 -75782 -55620 -40136 25136 105276 91210
7032I1210j20052j10710k3002K9174L7266M9435L7237l1212p1549l403Q4192N8495
$$ 91210 -28842 -139552 -162554 -133380 -96114 -46679 -9442 -40654 -112203 -115606 -31414 27081
7020B7081l5341n8059j6373k0908n5868j0316Q3835P5086l6337p6868J3146Q8143
$$ 27081 -8260 -66319 -82692 -103600 -159468 -169784 -85949 -10863 -47200 -124068 -110922 -22779
7008b2779N1678p237r696j7164o7625p1499J0483N9348j239n7978n606O2058K2577
$$ -22779 28899 21662 11966 -5198 -72823 -144322 -133839 -74491 -75730 -133708 -139314 -77256 -54679
6995e4679n2805l3577L1138J4172m0441M248J05728Q7782n0334j09312j1871P6096
$$ -54679 -107484 -141061 -109923 -95751 -136192 -131944 -26216 61566 11232 -98080 -109951 -33855
6983c3855K5910n6758l5190L0399J3920m4687j7345P4867Q5133j6059q8710m0855
$$ -33855 -7945 -64703 -99893 -69494 -55574 -100261 -117606 -42739 42394 26335 -62375 -103230
6971a03230M1901M2542k0801n3609l4035j2148k629K7735P3695P6961J6779m8231
$$ -103230 -61329 -18787 -39588 -93197 -127232 -139380 -142009 -114274 -40579 36382 53161 4930
6959D930n7794k3076O631R384p444l1075l4950J0606P6014O9366l8380j29000
$$ 4930 -52864 -75940 -69309 -59925 -67369 -98444 -133394 -122788 -46774 22592 -15788 -144788
6947a44788p1934P7123J27782J9017r1464n8489M4065M9799m7342r9273l5192
$$ -144788 -216722 -139599 -11817 7200 -84264 -142753 -98688 -48889 -96231 -195504 -230696
6936b30696M8143N0380P870Q638M4343L1170m8893j05412n5363O2223J22260N8171
$$ -230696 -182553 -132173 -124303 -115665 -71322 -40152 -89045 -194457 -249820 -187597 -65337 -7166
6924g166n7364r6357k8620M6851L7602j9509k0937M4355P6447K0165m2352j5981
$$ -7166 -64530 -160887 -189507 -142656 -105054 -124563 -145500 -101145 -24698 -4533 -46885 -62866
6912f2866M9492K5328q5826j23837k114J40533J21217k0875p9783J0217Q3112
$$ -62866 -13374 11954 -73872 -197709 -199823 -59290 61927 41052 -38731 -28514 54598
6901E4598O866j12323j04677J79M0226j5634m6210k927K1566k1037m5608M701
$$ 54598 61464 -50859 -155536 -155357 -115131 -130765 -176975 -179902 -158336 -179373 -224981 -220280
6889b20280N1390K4013j2457K0351O7330L6056l7256m5334J6612N6259L1673j4950
$$ -220280 -168890 -144877 -157334 -136983 -69653 -33597 -70853 -116187 -99575 -43316 -11643 -26593
6877b6593m5951n1787j3799N8977Q7425J9834o2343m9856J9056K2332l4399l0231
$$ -26593 -72544 -124331 -138130 -79153 8272 28106 -34237 -84093 -65037 -42705 -77104 -107335
6865a07335M7121O5499k3373r0187l7860M5654M2568j4808l0782o714L763J3845
$$ -107335 -60214 5285 -18088 -108275 -146135 -100481 -57913 -72721 -103503 -110217 -106454 -92609
6853i2609N6035Q2624L3635m6096o8902l9605k4298k9200j8290p676k7678l2140
$$ -92609 -36574 46050 79685 33589 -35313 -74918 -99216 -128416 -146706 -154382 -182060 -214200
6841b14200K9567Q6884L6930o2773n1412P7001J40406L8907r8361j12714k7116
$$ -214200 -184633 -97749 -60819 -123592 -175004 -98003 42403 81310 -17051 -129765 -156881
6830a56881L8094M8609M4822L1384p332l7364k3832n498k8228m9556p275N8115
$$ -156881 -118787 -70178 -25356 6028 -1304 -38668 -62500 -67998 -96226 -145782 -153057 -94942
6818i4942N7564J848j8792R319Q467l9933n1932J3883P4911M7721k9188o1193
$$ -94942 -37378 -35530 -54322 -45003 -36536 -76469 -128401 -114518 -39607 8114 -21074 -82267
6806h2267k5710K6106M8497K8242k5074o8022m5980K7518O3274J8957k8599j082
$$ -82267 -107977 -81871 -33374 -5132 -30206 -98228 -144208 -116690 -53416 -34459 -63058 -64140
6794f4140N0332K6400m9144n6171L0978R6162N1818m2590p8568l9278R791J6971
$$ -64140 -13808 12592 -36552 -92723 -61745 34417 86235 43645 -34923 -74201 -64410 -47439
6782d7439j4539m4884k9450L1589O9133K4628m7888m0567M0261P1825R236m3974
$$ -47439 -61978 -106862 -136312 -104723 -35590 -10962 -58850 -99417 -59156 12669 21905 -22069
6770b2069j9060L099m0845n6086L6392J10868J7949j35036j17971M9219J14511
$$ -22069 -41129 -38030 -78875 -134961 -98569 12299 30248 -104788 -222759 -173540 -59029
6759e9029j955q9523q822Q8187L9007n7285l6516M6097M3885j1037P37L1089m4660
$$ -59029 -60984 -150507 -159329 -71142 -32135 -89420 -125936 -79839 -35954 -46991 -46254 -15165 -59825
6746e9825j47349p8471J22996J83564R293j56256r4733Q0972J27794J5595r1356
$$ -59825 -207174 -285645 -162649 20915 30208 -126048 -220781 -139809 -12015 3580 -87776
6735h7776q4665O085J04810J35484M4113j11135j60191k8319J25586J06935m0908
$$ -87776 -172441 -166356 -61546 73938 118051 6916 -153275 -181594 -56008 50927 10019
6724A0019j10755l6152M8410M5710J7118K6861K7364k1503n0375J589O4693M3294
$$ 10019 -100736 -136888 -88478 -42768 -25650 1211 28575 7072 -43303 -41714 22979 66273
6712F6273k8978n0359j6219m241k2093L023P5897R6380J3233q3948q7715j2091
$$ 66273 37295 -13064 -29283 -33524 -55617 -52594 23303 119683 132916 48968 -38747 -50838
6700e0838N6633Q1342O9347Q121r2453j35903m1936R6606R6621n0261j39282m5973
$$ -50838 5795 87137 156484 164605 72152 -63751 -105687 -9081 87540 37279 -102003 -147976
6688a47976Q4635O1565n8813p3787M0064J03522L3403l8099j199N4964J2214p2023
$$ -147976 -63341 -1776 -60589 -134376 -94312 9210 42613 4514 3315 58279 70493 -1530
6676a530p0593j206J8135k4302k6430M0453Q0127L1404l9019m9340j6978m579
$$ -1530 -72123 -73329 -55194 -79496 -105926 -65473 14654 46058 7039 -42301 -59279 -63858
6664f3858j9044k3169n004J7112L2222L7958K3913j1532m3379m8530l7717l0414
$$ -63858 -82902 -106071 -111075 -93963 -61741 -23783 130 -11402 -54781 -103311 -141028 -171442
6652a71442j3597L6047R2339Q7723K144r0597j03002m1366J4117K8137M1961O9505
$$ -171442 -185039 -148992 -56653 31070 33214 -57383 -160385 -201751 -187634 -159497 -117536 -48031
6640d8031M6662n0942j14871l8498R7749J13186n071p5290k066P8023K5307p5830
$$ -48031 -1369 -52311 -167182 -205680 -107931 5255 184 -75106 -77172 851 26158 -49672
6628d9672o4758K7568L8133n3560r6798j6167Q0764P9326N372n3900o8294n0625
$$ -49672 -114430 -86862 -48729 -102289 -199087 -215254 -134490 -55164 -49792 -103692 -171986 -222611
6616b22611j0578L0541M5567M7732O4748O4383l372q8434q1495Q239M6926j2109
$$ -222611 -233189 -202648 -157081 -109349 -44601 19782 16410 -72024 -153519 -145280 -98354 -110463
6604a10463n0039J6237R3519P1261k302k2315j763j1696l2046m190L2521K950
$$ -110463 -160502 -144265 -50746 20515 18213 -4102 -5865 -17561 -49607 -53797 -21276 -18326
6592a8326n2186l4928L1971L7786k0542l2283K8823N4619j2695q6109q0878l4977
$$ -18326 -70512 -105440 -73469 -35683 -56225 -88508 -59685 -5066 -17761 -103870 -184748 -219725
6580b19725j2585R248P1078J23610Q4270l2398j16746r1056P842P2875L8459m8728
$$ -219725 -232310 -223062 -151984 -28374 55896 23498 -93248 -184304 -176462 -103587 -65128 -113856
6568a13856p9609j6301N7196N3840N386k998K4747J7085k7270l7899l582J4482
$$ -113856 -193465 -209766 -152570 -98730 -93344 -96342 -71595 -54510 -81780 -119679 -123261 -108779
6556a08779O785K6621O0567K6346o4461q8628j3410L5442j1922m4305K7513R5423
$$ -108779 -101994 -75373 -14806 11540 -52921 -141549 -154959 -119517 -131439 -175744 -148231 -52808
6544e2808L4612p0601o4462J6092J8400n0594m4975M8772Q2550O332n1617j4032
$$ -52808 -18196 -88797 -153259 -137167 -118767 -169361 -214336 -165564 -83014 -76682 -128299 -142331
6532a42331K6718p054m6695k1696J5183R721J7378P8759J06290K4078q0344q1186
$$ -142331 -115613 -122667 -169362 -191058 -175875 -166154 -148776 -70017 36273 60351 -19993 -101179
6520a01179j0001J4866j1317j60N1125N5781K57l2244q827J0074p702j7918J992
$$ -101179 -111180 -96314 -107631 -107791 -56666 -885 -628 -32872 -41699 -31625 -39327 -57245 -55253
6507e5253J3005J63q36J2099k725l1800q367N2522M5464m2859p6131J7539J03382
$$ -55253 -42248 -42085 -42921 -30822 -33547 -65347 -73714 -21192 24272 -18587 -94718 -77179 26203
6494B6203M0147q5849q9821J9429O1945k2967r7607n9733J8785M3308L2900K8472
$$ 26203 66350 -19499 -109320 -89891 -27946 -50913 -148520 -208253 -189468 -146160 -113260 -84788
6482h4788J151n3536n2819L1082P6835p162j06679o0203P9274J19416K5723m9401
$$ -84788 -83637 -137173 -189992 -158910 -82075 -89237 -195916 -256119 -176845 -57429 -31706 -81107
6470h1107l1255j4103m8620m0723M9507R3476P892p5004j2534J00004P5914n5020
$$ -81107 -112362 -126465 -175085 -215808 -166301 -72825 -64933 -139937 -152471 -52467 23447 -31573
6458c1573r5673J01P2496K8760l1795j5982K0149N554k0061p288M071j7580j6382
$$ -31573 -127246 -127145 -54649 -25889 -57684 -73666 -53517 -47963 -68024 -75312 -71241 -88821 -105203
6445a05203L2921M2957l5408r2021k5717O7591M1551m6897k8330P9280Q5462m7082
$$ -105203 -72282 -29325 -64733 -156754 -182471 -114880 -73329 -120226 -148556 -69276 16186 -30896
6433c0896j21060k1503R4804N2707o9362q4741P150N7352K6401J4495N2962M9686
$$ -30896 -151956 -173459 -78655 -25948 -95310 -180051 -172901 -115549 -89148 -74653 -21691 27995
6421B7995k9011q0550l2534L8006L2128j9244k2983K1762L5431n756l7369j2081
$$ 27995 -1016 -81566 -114100 -76094 -43966 -63210 -86193 -64431 -29000 -34756 -72125 -84206
6409h4206L3212L5502j2402n9843n7175n129M4427L8282j7853n8909l5477K5240
$$ -84206 -50994 -15492 -27894 -87737 -144912 -150041 -105614 -67332 -85185 -144094 -179571 -154331
6397a54331N6923L9629J3912J1535J1163j8748n9709n6951P895P9925Q2408M630
$$ -154331 -97408 -57779 -43867 -32332 -21169 -39917 -99626 -156577 -148682 -68757 13651 18281
6385A8281p5943p5100j81N8360L9780j6368l6853j7809j1705k8480j6990L9662
$$ 18281 -57662 -132762 -132943 -74583 -34803 -51171 -88024 -105833 -117538 -146018 -163008 -123346
6373a23346P3685K2556o9666r7430k7692O1049P7912J9327m2812m6100M178M8345
$$ -123346 -49661 -27105 -96771 -194201 -221893 -160844 -82932 -63605 -106417 -152517 -148339 -99994
6361i9994L5622j9653n0182j5848M1872N1564P402k6533r832K2178K1001k676
$$ -99994 -64372 -84025 -134207 -150055 -108183 -56619 -49217 -75750 -85582 -63404 -42403 -45079
6349d5079p845M372k270k8129k6866J9709N8721L0722m4968q6908n2198J1081
$$ -45079 -52924 -48552 -50822 -78951 -105817 -86108 -27387 3335 -41633 -128541 -180739 -169658
6337a69658K6855j3384m3679j1246N3624P3610K1130m4496m6524J6328O6065L8194
$$ -169658 -142803 -156187 -199866 -211112 -157488 -83878 -62748 -107244 -153768 -137440 -71375 -33181
6325c3181l8212p3571k9149L3964L8939J36k672M7749P1097J3973n5183m2685
$$ -33181 -71393 -144964 -174113 -140149 -101210 -101074 -103746 -55997 15100 29073 -26110 -68795
6313f8795K2234K7334m6507r1309l7721M1533M8251P74j5180J5742L2847M378
$$ -68795 -46561 -19227 -65734 -157043 -194764 -153231 -104980 -104206 -119386 -103644 -70797 -66419
6301f6419l7112n3850l7135P379N6463O6282K2717k5259l1431j8471j9738m311
$$ -66419 -103531 -157381 -194516 -187137 -130674 -64392 -41675 -66934 -98365 -116836 -136574 -140885
6289a40885N2247P2463k2299j43459j21140L4445J25053O0510j5343J8303N7351
$$ -140885 -88638 -16175 -38474 -181933 -303073 -268628 -143575 -83065 -98408 -80105 -22754
6278b2754k4004j22504o3283Q6527R4961o7897j69591o2045J11134J41525L5042
$$ -22754 -46758 -169262 -232545 -146018 -51057 -118954 -288545 -350590 -239456 -97931 -62889
6267f2889m8787l1300K9055N7934M2022N483k3912l0933k4435j9760r609J2487
$$ -62889 -111676 -142976 -113921 -55987 -13965 -8482 -32394 -63327 -87762 -107522 -117131 -104644
6255a04644J4191k7979n8537r139P1209O4177k6293n9735K2535R9995O3794k3953
$$ -104644 -90453 -118432 -176969 -186108 -114899 -50722 -77015 -136750 -114215 -14220 49574 25621
6243B5621n4627l8550l7418l7810j0891q65l1362k4453N3872Q1875j9774r8987
$$ 25621 -29006 -67556 -104974 -142784 -153675 -154540 -185902 -210355 -156483 -74608 -94382 -193369
6231a93369L556J45678P2663j42720j71562M1600J65756J1832j57566n4452J72544
$$ -193369 -189813 -44135 28528 -114192 -285754 -244154 -78398 -66566 -224132 -278584 -106040
$$ [...]
##END NTUPLES=NMR SPECTRUM
##END=
