##TITLE=31P ikalashn
Eze 1511H
15.11.2024
##JCAMPDX= 6.0         $$ Bruker NMR JCAMP-DX V2.0
##DATA TYPE= NMR SPECTRUM
##DATA CLASS= NTUPLES
##ORIGIN= UXNMR, Bruker Analytische Messtechnik GmbH
##OWNER= root
$$ TOPSPIN		Version 1.3
$$ 2024-11-15 16:30:38.250 +0400  Irina@DPX200
$$ Compression mode = diff/dup
##.OBSERVE FREQUENCY= 81.01967998063
##.OBSERVE NUCLEUS= ^31P
##.ACQUISITION MODE= SIMULTANEOUS
##.ACQUISITION SCHEME= undefined
##.AVERAGES= 32
##.DIGITISER RES= 17
##SPECTROMETER/DATA SYSTEM= spect
##.PULSE SEQUENCE= zgpg
##.SOLVENT NAME= D2O
##.SHIFT REFERENCE= INTERNAL, D2O, 1, 298.5841
##AUDIT TRAIL= $$ (NUMBER, WHEN, WHO, WHERE, WHAT)
$$ ##TITLE= Audit trail, TOPSPIN		Version 1.3
$$ ##JCAMPDX= 5.01
$$ ##ORIGIN= Bruker BioSpin GmbH
$$ ##OWNER= Irina
$$ $$ F:/spectra/data/iren/nmr/P31dec/1/pdata/1/auditp.txt
$$ ##AUDIT TRAIL=  $$ (NUMBER, WHEN, WHO, WHERE, VERSION, WHAT)
(   1,<2024-11-15 16:29:19.359 +0400>,<Irina>,<DPX200>,<TOPSPIN 1.3>,
      <acquisition in progress>)
(   2,<2024-11-15 16:30:13.109 +0400>,<Irina>,<DPX200>,<TOPSPIN 1.3>,
      <Start of raw data processing
       efp BC_mod = 2 LB = 10 FT_mod = 6 PKNL = 1 PHC0 = 205.9424 PHC1 = 63.70457 SI = 32K 
       data hash MD5: 32K
       0C EE 14 41 2A AC 38 95 75 3B C3 26 F5 C6 71 9A>)
(   3,<2024-11-15 16:30:15.593 +0400>,<Irina>,<DPX200>,<TOPSPIN 1.3>,
      <apk 
       data hash MD5: 32K
       8F 71 68 07 72 5C 6D 57 47 80 57 A5 CD 45 13 77>)
$$ ##END=
$$ 
$$ $$ hash MD5
$$ $$ 16 44 2B EC 7E 07 22 B6 AA 42 87 2F B9 20 BB 3B
##$RELAX= 
##$RELAX= 
##$RELAX= 
##$RELAX= 
##$RELAX= 
##$RELAX= 
##$RELAX= 
##$RELAX= 
##$RELAX= 
##$RELAX= 
##$RELAX= 
$$ Bruker specific parameters
$$ --------------------------
##$DU= <F:/spectra>
##$EXPNO= 1
##$NAME= <P31dec>
##$PROCNO= 1
##$TYPE= <nmr>
##$USER= <iren>
##$AMP= (0..31)
100 100 100 100 100 100 100 100 100 100 100 100 100 100 100 100 100 100 
100 100 100 100 100 100 100 100 100 100 100 100 100 100 
##$ANAVPT= -1
##$AQSEQ= 0
##$AQ_mod= 1
##$AUNM= <au_zg>
##$AUTOPOS= <>
##$BF1= 81.014009
##$BF2= 200.13
##$BF3= 200.13
##$BF4= 200.13
##$BF5= 200.13
##$BF6= 200.13
##$BF7= 200.13
##$BF8= 200.13
##$BYTORDA= 1
##$CFDGTYP= 0
##$CFRGTYP= 5
##$CHEMSTR= <none>
##$CNST= (0..63)
1 1 145 1 1 1 1 1 1 1 1 1 1 1 1 1 1 1 1 1 1 1 1 1 1 1 1 1 1 1 1 1 1 1 
1 1 1 1 1 1 1 1 1 1 1 1 1 1 1 1 1 1 1 1 1 1 1 1 1 1 1 1 1 1 
##$CPDPRG= <waltz16>
##$CPDPRG1= <>
##$CPDPRG2= <waltz16>
##$CPDPRG3= <>
##$CPDPRG4= <mlev>
##$CPDPRG5= <mlev>
##$CPDPRG6= <mlev>
##$CPDPRG7= <mlev>
##$CPDPRG8= <mlev>
##$CPDPRGB= <>
##$CPDPRGT= <>
##$D= (0..63)
0 1 0 0 0 0 0 0 0 0.06 0 0.03 2e-005 3e-006 0 0 0.0002 0 0 0 0 0 0 0 0 
0 0 0 0 0 0 0 0 0 0 0 0 0 0 0 0 0 0 0 0 0 0 0 0 0 0 0 0 0 0 0 0 0 0 0 
0 0 0 0 
##$DATE= 1731673810
##$DBL= (0..7)
120 120 120 11 120 120 24 19 
##$DBP= (0..7)
150 150 150 150 150 150 150 150 
##$DBP07= 0
##$DBPNAM0= <>
##$DBPNAM1= <>
##$DBPNAM2= <>
##$DBPNAM3= <>
##$DBPNAM4= <>
##$DBPNAM5= <>
##$DBPNAM6= <>
##$DBPNAM7= <>
##$DBPOAL= (0..7)
$$ [...]
0 1 3 0 0 0 0 0 0 0 0 0 0 0 0 0 
##$SW_h= 37037.037037037
##$TD= 32768
##$TD0= 1
##$TE= 300
##$TE2= 300
##$TE3= 300
##$TEG= 300
##$TL= (0..7)
0 120 53 12 22 120 120 120 
##$TP= (0..7)
150 150 150 150 150 150 150 150 
##$TP07= 0
##$TPNAME0= <>
##$TPNAME1= <>
##$TPNAME2= <>
##$TPNAME3= <>
##$TPNAME4= <>
##$TPNAME5= <>
##$TPNAME6= <>
##$TPNAME7= <>
##$TPOAL= (0..7)
0.5 0.5 0.5 0.5 0.5 0.5 0.5 0.5 
##$TPOFFS= (0..7)
0 0 0 0 0 0 0 0 
##$TUNHIN= 0
##$TUNHOUT= 0
##$TUNXOUT= 0
##$USERA1= <user>
##$USERA2= <user>
##$USERA3= <user>
##$USERA4= <user>
##$USERA5= <user>
##$V9= 5
##$VALIST= <valist>
##$VCLIST= <CCCCCCCCCCCCCCC>
##$VD= 0
##$VDLIST= <DDDDDDDDDDDDDDD>
##$VPLIST= <PPPPPPPPPPPPPPP>
##$VTLIST= <TTTTTTTTTTTTTTT>
##$WBST= 1024
##$WBSW= 4
##$XGAIN= (0..3)
0 0 0 0 
##$XL= 0
##$YL= 0
##$YMAX_a= 3266
##$YMIN_a= -4462
##$ZGOPTNS= <>
##$ZL1= 120
##$ZL2= 120
##$ZL3= 120
##$ZL4= 120
##$ABSF1= 0
##$ABSF2= 0
##$ABSG= 0
##$ABSL= 0
##$ALPHA= 0
##$AQORDER= 0
##$ASSFAC= 0
##$ASSFACI= 0
##$ASSFACX= 0
##$ASSWID= 0
##$AUNMP= <proc_1d>
##$AXLEFT= 0
##$AXRIGHT= 0
##$AXTYPE= 0
##$AXUNIT= <>
##$AZFE= 0.1
##$AZFW= 0.5
##$BCFW= 0
##$BC_mod= 2
##$BYTORDP= 0
##$COROFFS= 0
##$CY= 12.5935478210449
##$DATMOD= 1
##$DC= 0
##$DFILT= <>
##$DTYPP= 0
##$F1P= 47.1127640792319
##$F2P= -24.0371245302204
##$FCOR= 0.5
##$FTSIZE= 32768
##$FT_mod= 6
##$GAMMA= 0
##$GB= 0
##$INTBC= 1
##$INTSCL= 7.269226e-011
##$ISEN= 30
##$LB= 10
##$LEV0= 0
##$LPBIN= 0
##$MAXI= 12.09355
##$MC2= 0
##$MEAN= 0
##$ME_mod= 0
##$MI= 0.7550151
##$NCOEF= 0
##$NC_proc= -11
##$NLEV= 6
##$NOISF1= 298.5841
##$NOISF2= 270.0111
##$NSP= 0
##$NTH_PI= 0
##$NZP= 0
##$OFFSET= 298.5841
##$PC= 1.4
##$PHC0= 141.076
##$PHC1= 139.8143
##$PH_mod= 1
##$PKNL= yes
##$PPARMOD= 0
##$PPDIAG= 0
##$PPIPTYP= 0
##$PPMPNUM= 100
##$PPRESOL= 1
##$PSCAL= 0
##$PSIGN= 0
##$REVERSE= no
##$SF= 81.014009
##$SI= 32768
##$SIGF1= 270.0111
##$SIGF2= -158.5842
##$SINO= 77.54984
##$SIOLD= 32768
##$SREGLST= <31P.CDCl3>
##$SSB= 0
##$STSI= 32768
##$STSR= 0
##$SW_p= 37037.037037037
##$SYMM= 0
##$S_DEV= 0
##$TDeff= 32768
##$TDoff= 0
##$TI= <>
##$TILT= no
##$TM1= 0
##$TM2= 0
##$TOPLEV= 0
##$USERP1= <user>
##$USERP2= <user>
##$USERP3= <user>
##$USERP4= <user>
##$USERP5= <user>
##$WDW= 1
##$XDIM= 32768
##$YMAX_p= 299812244
##$YMIN_p= -15258219
$$ End of Bruker specific parameters
$$ ---------------------------------
##NTUPLES= NMR SPECTRUM
##VAR_NAME=  FREQUENCY,     SPECTRUM/REAL,   SPECTRUM/IMAG
##SYMBOL=    X,             R,               I
##VAR_TYPE=  INDEPENDENT,   DEPENDENT,       DEPENDENT
##VAR_FORM=  AFFN,          ASDF,            ASDF
##VAR_DIM=   32768,         32768,           32768
##UNITS=     HZ,            ARBITRARY UNITS, ARBITRARY UNITS
##FACTOR=    1.13031516577767, 1,            1
##FIRST=     37037.037037037, -6556928,      -438539
##LAST=      0,             -6401960,        -1071952
##MIN=       0,             -15258219,       0
##MAX=       37037.037037037, 299812244,     0
$$ Real data points
##PAGE= N=1
##DATA TABLE= (X++(R..R)), XYDATA
$$ [...]
15830e183753k27877k76407k61590k12723j50500q9016m6247m7488j13425k30368
15820f839394l42329l84764l28732k04377p7236O211M6146P7805J22684J58655
15810g765331J58130J18983N0178m2634j40711j97777j75292q0214N0703J75917
15800g848048K56415K76440K51063J97229J28286O7629L2219K0464J0130m4254
15790f652427j88269m17024o45386p68724p37717n61712k96387k7763J80476L23490
15780i791443M15165M47824M27671L84920L27673K54044J94392J76450J80102
15771f983202J75847J59773J28340Q5401N5190M0914J7156k6999p4422r6303o3766
15760f582071K4217J27920J88978J65244P2983j3128k6271L2972J05935J27390
$$ plain form
15830 -5183753 -5411630 -5688037 -5949627 -6162350 -6312850 -6401866 -6448113 -6495601 -6609026 -6839394
15820 -6839394 -7181723 -7566487 -7895219 -8099596 -8176832 -8170621 -8124475 -8046670 -7923986 -7765331
15810 -7765331 -7607201 -7488218 -7438040 -7480674 -7621385 -7819162 -7994454 -8074668 -8023965 -7848048
15800 -7848048 -7591633 -7315193 -7064130 -6866901 -6738615 -6670986 -6638767 -6618303 -6608173 -6652427
15790 -6652427 -6840696 -7257720 -7903106 -8671830 -9409547 -9971259 -10267646 -10295409 -10114933 -9791443
15780 -9791443 -9376278 -8928454 -8500783 -8115863 -7788190 -7534146 -7339754 -7163304 -6983202
15771 -6983202 -6807355 -6647582 -6519242 -6433841 -6378651 -6337737 -6320581 -6347580 -6422002 -6518305 -6582071
15760 -6582071 -6557854 -6429934 -6240956 -6075712 -6002729 -6015857 -6042128 -6009156 -5903221 -5775831
15750e775831O9962m0050j35825j59286j05877j5363O5632J17721J56678J97613
15740e624626K23152K04245J31859J2729j42024k88725l59868l30750k31281j05974
15730f511263R900J00167J64866J99034J92163J41023N9867j2900m2538k8047
15720e727728J3042O3278R7881R8381P8768N9393L4146n263l7765l6642j816N6935
15708e307390J33968K06279K43506K42577K18882J78329J19334M5205l6490j08001
15698d063801j55901j87057k03064j92813j57807j20825r7878p5823l0374M2408
15688e242935J16258J54595J30007M1089q3791k11832l14914l76396m09148m33837
15678f630904m35624l65226k07119k3614J00771J36093R1020k0007j63431k96609
$$ plain form
15750 -5775831 -5705869 -5745919 -5881744 -6041030 -6146907 -6162270 -6096638 -5978917 -5822239 -5624626
15740 -5624626 -5401474 -5197229 -5065370 -5052641 -5194665 -5483390 -5843258 -6174008 -6405289 -6511263
15730 -6511263 -6501363 -6401196 -6236330 -6037296 -5845133 -5704110 -5644243 -5657143 -5699681 -5727728
15720 -5727728 -5714686 -5651408 -5553527 -5455146 -5376378 -5316985 -5282839 -5288102 -5325867 -5362509 -5364325 -5307390
15708 -5307390 -5173422 -4967143 -4723637 -4481060 -4262178 -4083849 -3964515 -3919310 -3955800 -4063801
15698 -4063801 -4219702 -4406759 -4609823 -4802636 -4960443 -5081268 -5179146 -5254969 -5285343 -5242935
15688 -5242935 -5126677 -4972082 -4842075 -4800986 -4884777 -5096609 -5411523 -5787919 -6197067 -6630904
15678 -6630904 -7066528 -7431754 -7638873 -7662487 -7561716 -7425623 -7334603 -7354610 -7518041 -7814650
15668g814650l83783l84507k73829q5805J01564K29524K77251K47570J70727Q8344
15658g827594K6430L249K8468P8877J12335J16547J24737J75736K64575L35813
15648f560827L39273K86627K51375K83087L20414K65101J12343p2717k52585m21655
15638e449564n55942o11234n49624l73350j50543K8514J20322J38954J01686R574
15628g291207r7910j41981q4519L7117J45493J86108J81302K02545K69464L03361
15618f290227K22019M5189j36007k41922k32374j15302M4756J54597J55652N7066
15608f336553q4919k01388k44664k08595j06172M8453K19864L62236M46365M66597
15598e638776M40343L86835L06285J85976L3060j05333j75847j59786p4464L2387
$$ plain form
15668 -7814650 -8198433 -8582940 -8856769 -8942574 -8841010 -8611486 -8334235 -8086665 -7915938 -7827594
15658 -7827594 -7801164 -7797915 -7769447 -7690570 -7578235 -7461688 -7336951 -7161215 -6896640 -6560827
15648 -6560827 -6221554 -5934927 -5683552 -5400465 -5080051 -4814950 -4702607 -4775324 -5027909 -5449564
15638 -5449564 -6005506 -6616740 -7166364 -7539714 -7690257 -7661743 -7541421 -7402467 -7300781 -7291207
15628 -7291207 -7389117 -7531098 -7615617 -7578500 -7433007 -7246899 -7065597 -6863052 -6593588 -6290227
15618 -6290227 -6068208 -6023019 -6159026 -6400948 -6633322 -6748624 -6703868 -6549271 -6393619 -6336553
15608 -6336553 -6421472 -6622860 -6867524 -7076119 -7182291 -7133838 -6913974 -6551738 -6105373 -5638776
15598 -5638776 -5198433 -4811598 -4505313 -4319337 -4286277 -4391610 -4567457 -4727243 -4801707 -4769320
15588d769320J07012J32044J24229R3696L2120o2794j69766k40640k26150j35884
15578e115453m9217l3586o8816q7530o3189k4088q013k8353o8236r0830o6557
15567e703868k149N4668M7582m3151j80820k96047l39868l06470k23727j27012
15557g120862k4856P5716J38925J39625R1646K0061n8938j18345j13625k8497
15547f999150Q2290J38676J22629O6560l595n6476n7543k014Q2465J42600J30287
15536f353271M7100n8683j35650j59856j28962m9900N7057J49316J76982J24156
15526f331711K6014o2313r6920o1215J2903O8995Q3408O6305K6649k8818q3355
15515f380058j06590o7073L2903J46961K21749K32180J76400O8498n6851j68835
$$ plain form
15588 -4769320 -4662308 -4530264 -4406035 -4312339 -4280219 -4343013 -4512779 -4753419 -4979569 -5115453
15578 -5115453 -5164670 -5198256 -5267072 -5354602 -5417791 -5441879 -5449892 -5478245 -5546481 -5637311 -5703868
15567 -5703868 -5706017 -5651349 -5603767 -5646918 -5827738 -6123785 -6463653 -6770123 -6993850 -7120862
15557 -7120862 -7145718 -7070002 -6931077 -6791452 -6699806 -6679745 -6738683 -6857028 -6970653 -6999150
15547 -6999150 -6916860 -6778184 -6655555 -6588995 -6592590 -6649066 -6706609 -6708623 -6626158 -6483558 -6353271
15536 -6353271 -6306171 -6364854 -6500504 -6660360 -6789322 -6839222 -6782165 -6632849 -6455867 -6331711
15526 -6331711 -6305697 -6368010 -6464930 -6526145 -6513242 -6444247 -6360839 -6294534 -6267885 -6296703 -6380058
15515 -6380058 -6486648 -6553721 -6520818 -6373857 -6152108 -5919928 -5743528 -5675030 -5731881 -5900716
15505e900716k67380l51554l94776l86006l46767l04878k80892k80971k89945
15496h803885k69931j87365o1229N7101J43461K01479K44801K91317L48793M13739
15486g621719M83441N43590N46151M46229K70406J03578P662k0109k2236l6730
15476e299737q1034j51010k15233k32480j79624p1276L6428P5498J6362j08956
15466f211062k34356l00262k84062k05742j08110l1263R01j8685p5615j40413
15456g608669j93821k24952k25846k02484j64560j30107j27171j56887j71139
15447i205636j08188L8978K05942L10951L05409J99080O6688n41L1196J19728
15437h036393J95854K19164J98948J69754J50359J29607P4035l9339j86352l06436
$$ plain form
15505 -5900716 -6168096 -6519650 -6914426 -7300432 -7647199 -7952077 -8232969 -8513940 -8803885
15496 -8803885 -9073816 -9261181 -9322410 -9265309 -9121848 -8920369 -8675568 -8384251 -8035458 -7621719
15486 -7621719 -7138278 -6594688 -6048537 -5602308 -5331902 -5228324 -5220662 -5240771 -5263007 -5299737
15476 -5299737 -5380771 -5531781 -5747014 -5979494 -6159118 -6230394 -6193966 -6118468 -6102106 -6211062
15466 -6211062 -6445418 -6745680 -7029742 -7235484 -7343594 -7374857 -7373956 -7392641 -7468256 -7608669
15456 -7608669 -7802490 -8027442 -8253288 -8455772 -8620332 -8750439 -8877610 -9034497 -9205636
15447 -9205636 -9313824 -9274846 -9068904 -8757953 -8452544 -8253464 -8186776 -8187317 -8156121 -8036393
15437 -8036393 -7840539 -7621375 -7422427 -7252673 -7102314 -6972707 -6898672 -6938011 -7124363 -7430799
15427g430799l44732k86312j54653M170J26740J71600J64365J68151K05212K27995
15417g148263J83748Q6269p911p4812j40705k28364l24795l94241l94956k99313
15407h743343j25635N8795J99017L05599M04608M72764M79649M34425L61241K76320
15397e876560J95279J27210O0719j7261q9859j21057r5248j9138P8800J48858
15387e608257J60467J18462M1019n1136j33893j88295k08707k05371j99754k03089
15377f478554k01902j59270n6189P6424J94662K65093K66571K03439J00733k908
15367e791901m7860k558R6756J90442K33331K18893J77340J33108Q6018L0817
15357d675614k3967o3757r3413j27521j49422j31398q6640o0078p6288j13478
$$ plain form
15427 -7430799 -7775531 -8061843 -8216496 -8212326 -8085586 -7913986 -7749621 -7581470 -7376258 -7148263
15417 -7148263 -6964515 -6878246 -6886157 -6960969 -7101674 -7330038 -7654833 -8049074 -8444030 -8743343
15407 -8743343 -8868978 -8810183 -8611166 -8305567 -7900959 -7428195 -6948546 -6514121 -6152880 -5876560
15397 -5876560 -5681281 -5554071 -5493352 -5510613 -5600472 -5721529 -5816777 -5835915 -5757115 -5608257
15387 -5608257 -5447790 -5329328 -5288309 -5339445 -5473338 -5661633 -5870340 -6075711 -6275465 -6478554
15377 -6478554 -6680456 -6839726 -6895915 -6819491 -6624829 -6359736 -6093165 -5889726 -5788993 -5791901
15367 -5791901 -5839761 -5842319 -5745563 -5555121 -5321790 -5102897 -4925557 -4792449 -4706431 -4675614
15357 -4675614 -4699581 -4763338 -4856751 -4984272 -5133694 -5265092 -5351732 -5411810 -5488098 -5601576
15347e601576j27000q9706J76J27708K39119K69454K30241J87796J63079J27046
15337d473663O3017j3797p5958r4007o0306j8306k1426o9899j28891j74419j96094
15326e263749j93254j74497j56022j46375j28685p8303N140Q3020J08401Q2029
15316e862295M0771J4597K5996Q2387J52158J83305J49817P3620M403l2113m8360
15305e215714o2712p9037j05079j58846k31482k85599k97775k76750k50606k37536
15295g201136k32641k20873j84275j03370L0788K04688L68606M51570M17430K92419
15285f176794J44058L7096j7525o6948j54860k80599l99977m53915m36469l97273
15275h203206l66462l34122k84466k24164j68945j08386k1352R4420K27340L43913
$$ plain form
15347 -5601576 -5728576 -5818282 -5818106 -5690398 -5451279 -5181825 -4951584 -4763788 -4600709 -4473663
15337 -4473663 -4410646 -4424443 -4500401 -4594408 -4654714 -4673020 -4694446 -4764345 -4893236 -5067655 -5263749
15326 -5263749 -5457003 -5631500 -5787522 -5933897 -6062582 -6140885 -6135745 -6052725 -5944324 -5862295
15316 -5862295 -5821524 -5806927 -5780931 -5698544 -5546386 -5363081 -5213264 -5139644 -5135241 -5167354 -5215714
15305 -5215714 -5278426 -5357463 -5462542 -5621388 -5852870 -6138469 -6436244 -6712994 -6963600 -7201136
15295 -7201136 -7433777 -7654650 -7838925 -7942295 -7911507 -7706819 -7338213 -6886643 -6469213 -6176794
15285 -6176794 -6032736 -5995640 -6013165 -6080113 -6234973 -6515572 -6915549 -7369464 -7805933 -8203206
15275 -8203206 -8569668 -8903790 -9188256 -9412420 -9581365 -9689751 -9711103 -9616683 -9389343 -9045430
15265i045430L91468L38158J97266K1731j17084j60785j02480l915N3303L7719
15255h390049k3497q2746j12548j24169j38296j43513j11847l6019O7738J63541
15245h931405K09875J98845J66894J55028J67953J84523J84360J65820J64810
15236g333297K12197K82293L23400L16065K83913K59306K55697K63905K63895
15227d872626K34078J60965N7889m8175j56450k76216l77694l96724k91680r9549
15217f066182Q0217J69079J51030N8877m6083j20138j56768j53207j06582k7188
15207f216945O3996J32016J27261K0576j43109k63122k79313k19594j49009j02176
15197g029419o3091R449J24495K32219K84438K79706K15605Q7838m4402r5811
$$ plain form
15265 -9045430 -8653962 -8315804 -8118538 -8096807 -8213891 -8374676 -8477156 -8481071 -8427768 -8390049
15255 -8390049 -8413546 -8496292 -8608840 -8733009 -8871305 -9014818 -9126665 -9162684 -9094946 -8931405
15245 -8931405 -8721530 -8522685 -8355791 -8200763 -8032810 -7848287 -7663927 -7498107 -7333297
15236 -7333297 -7121100 -6838807 -6515407 -6199342 -5915429 -5656123 -5400426 -5136521 -4872626
15227 -4872626 -4638548 -4477583 -4419694 -4467869 -4624319 -4900535 -5278229 -5674953 -5966633 -6066182
15217 -6066182 -5985965 -5816886 -5665856 -5606979 -5653062 -5773200 -5929968 -6083175 -6189757 -6216945
15207 -6216945 -6152949 -6020933 -5893672 -5873096 -6016205 -6279327 -6558640 -6778234 -6927243 -7029419
15197 -7029419 -7092510 -7083061 -6958566 -6726347 -6441909 -6162203 -5946598 -5858760 -5903162 -5998973
15187e998973o7327m0129o1189r9858j00959n5427k0833o9621k04883l32679l56864
15176g408742k89437k26451k34328k85342l04450k49498j23551O2088K94588N14223
15166h250900O25844N92568M68903L38886K41058J53242M8764n2896j04730r0310
15156f029571m9063l3257m3621l5859P173M7572M7468J4478m712L8030J42530
15145e898832K43672K72521K18667J09044j5971j07573j32438r8345l7865K6866
15135e420254R0275J41838J58328J36440J03636P9733O0109L8750L1557O1754
15125d517834J28922K10768K62465K37376J46650N0735j2211m8390p1820o5960
15115c679299n922Q6286J42219J15096K0875r0581j87916k74485l41730l52311
$$ plain form
15187 -5998973 -6066300 -6106429 -6167618 -6267476 -6368435 -6423862 -6444695 -6514316 -6719199 -7051878 -7408742
15176 -7408742 -7698179 -7924630 -8158958 -8444300 -8748750 -8998248 -9121799 -9059711 -8765123 -8250900
15166 -8250900 -7625056 -7032488 -6563585 -6224699 -5983641 -5830399 -5781635 -5834531 -5939261 -6029571
15156 -6029571 -6078634 -6111891 -6155512 -6191371 -6184198 -6136626 -6089158 -6074680 -6079392 -6041362 -5898832
15145 -5898832 -5655160 -5382639 -5163972 -5054928 -5070899 -5178472 -5310910 -5409255 -5447120 -5420254
15135 -5420254 -5329979 -5188141 -5029813 -4893373 -4789737 -4710004 -4649895 -4611145 -4579588 -4517834
15125 -4517834 -4388912 -4178144 -3915679 -3678303 -3531653 -3480918 -3493129 -3541519 -3613339 -3679299
15115 -3679299 -3685221 -3598935 -3456716 -3341620 -3320745 -3411326 -3599242 -3873727 -4215457 -4567768
15105d567768l07040k59780k29628j82188j08601m6447k0519j0666r66k6592j20021
15094e880216k55834l72248m06222l20078j33875P6583K25383K64401K02075Q5806
15084f514225k7063j00948j39779j64331j82426j79042j31206m6915M4881J28496
15074g312558J75964J50406P5359J7451j8211q6973j94135k65758k34592j02748
15064g795795O4942J91354K46205K58818K62235K38836J69025Q1798Q187m8754
15054f323149q7830j11271j40345j92333k61282l26524l58079l40570k93769k51780
15044h686932k28224k04822j65455j22531r6411q3851n6021m462L8616O3462J05484
15033i441147J72577K00230J24232k8757j67359k21693j77933o8120M1448P5244
$$ plain form
15105 -4567768 -4874808 -5134588 -5364216 -5546404 -5655005 -5701452 -5721971 -5732637 -5733603 -5760195 -5880216
15094 -5880216 -6136050 -6508298 -6914520 -7234598 -7368473 -7291890 -7066507 -6802106 -6600031 -6514225
15084 -6514225 -6541288 -6642236 -6782015 -6946346 -7128772 -7307814 -7439020 -7485935 -7441054 -7312558
15074 -7312558 -7136594 -6986188 -6910829 -6893378 -6911589 -6998562 -7192697 -7458455 -7693047 -7795795
15064 -7795795 -7730853 -7539499 -7293294 -7034476 -6772241 -6533405 -6364380 -6282582 -6274395 -6323149
15054 -6323149 -6410979 -6522250 -6662595 -6854928 -7116210 -7442734 -7800813 -8141383 -8435152 -8686932
15044 -8686932 -8915156 -9119978 -9285433 -9407964 -9504375 -9588226 -9644247 -9648709 -9610093 -9546631 -9441147
15033 -9441147 -9268570 -9068340 -8944108 -8972865 -9140224 -9361917 -9539850 -9607970 -9566522 -9491278
15023i491278k738j52428k71762k79106j82255n6363K3439K2226n6792j81769
15013a0628826k99995l46602k68637o2026J97940L89346M55023M29191L60093
15004i774493K87482K51255K69589L20087L54848L49124L12978K52939J72508
14995g203683R6292N5449N4471P8087J17643J73819K52400L41164M05069M16112
14985e213177L65695K65922J37886j637j25819j88892j54532m9888L6380N1614
14975d876448M3378Q6500J83686K68798K78406K17280J40377P5628K4596O144
14965c551655L0088O1746N8989K2463k5266o9290j06334j44822j95500k71596
14955d191177l71639m55186m64642l77829k30200p9921L3568J03113J34036J11678
$$ plain form
15023 -9491278 -9494016 -9646444 -9918206 -10197312 -10379567 -10435930 -10412491 -10390265 -10447057 -10628826
15013 -10628826 -10928821 -11275423 -11544060 -11606086 -11408146 -11018800 -10563777 -10134586 -9774493
15004 -9774493 -9487011 -9235756 -8966167 -8646080 -8291232 -7942108 -7629130 -7376191 -7203683
14995 -7203683 -7107391 -7051942 -6997471 -6919384 -6801741 -6627922 -6375522 -6034358 -5629289 -5213177
14985 -5213177 -4847482 -4581560 -4443674 -4445311 -4571130 -4760022 -4914554 -4964442 -4928062 -4876448
14975 -4876448 -4833070 -4746570 -4562884 -4294086 -4015680 -3798400 -3658023 -3582395 -3557799 -3551655
14965 -3551655 -3521567 -3459821 -3400832 -3378369 -3403635 -3472925 -3579259 -3724081 -3919581 -4191177
14955 -4191177 -4562816 -5018002 -5482644 -5860473 -6090673 -6170594 -6137026 -6033913 -5899877 -5788199
14945e788199J5262j40144k97162l95467l95280k78172q4068R2255J78639J64849
14935f927487Q4032K293r30J00943K43421L24553K87591J53640J500q8366j04158
14924e922968j01046j24404j60644j60052j01973j0273R5894K02378K68246K60596
14914e754246J99349J37550R6532M4071m2474j40429k21313k89845l54370l73217
14904f698392k90360j26022K8015J08304J27096J29820J51906K18050L34557M53493
14894e563533M74767L35692R5344j31471k84896l55517l50722k90294k07940j37468
14884f416038p4277J9830J54458K83615L57285L63518L08494K16543J41497J17167
14874d527908J13837O9756m7417k18390m05685n84284p31926q17953q19503p44561
$$ plain form
14945 -5788199 -5772937 -5913081 -6210243 -6605710 -7000990 -7279162 -7363230 -7270975 -7092336 -6927487
14935 -6927487 -6843455 -6841162 -6842092 -6741149 -6497728 -6173175 -5885584 -5731944 -5730444 -5818810 -5922968
14924 -5922968 -6024014 -6148418 -6309062 -6469114 -6571087 -6581360 -6485466 -6283088 -6014842 -5754246
14914 -5754246 -5554897 -5417347 -5320815 -5276744 -5319218 -5459647 -5680960 -5970805 -6325175 -6698392
14904 -6698392 -6988752 -7114774 -7086759 -6978455 -6851359 -6721539 -6569633 -6351583 -6017026 -5563533
14894 -5563533 -5088766 -4753074 -4657730 -4789201 -5074097 -5429614 -5780336 -6070630 -6278570 -6416038
14884 -6416038 -6490315 -6470485 -6316027 -6032412 -5675127 -5311609 -5003115 -4786572 -4645075 -4527908
14874 -4527908 -4414071 -4344315 -4391732 -4610122 -5015807 -5600091 -6332017 -7149970 -7969473 -8714034
14864h714034o28176m95213l52477k20212j29216q9143p4854l7102N6097J84225
14854a0500105K93705L39094K92167J41938o8866k30491k42968j18102L0805J07263
14844i955560J02377O4817L6764K3560J3562J4139O1951J89761L72746N26741
14834h549142N86994N72521N53153N60863N65602N28983M44265L43449K68619
14825d124693K26515J88894J36469Q4462M5414j4534j29122k67184l60300l78852
14815d592931l44647k80412j96829j10988l6690J2058J5884j5365m9966q3751
14805e683637j30625j69883j49017m6584R3022J96321K18794J63693O0585o1392
14795e508723j67032k11468j82777j23758q4517q4156j21040j78282k19098k04410
$$ plain form
14864 -8714034 -9342210 -9837423 -10189900 -10410112 -10539328 -10628471 -10703325 -10740427 -10684330 -10500105
14854 -10500105 -10206400 -9867306 -9575139 -9433201 -9502067 -9732558 -9975526 -10093628 -10062823 -9955560
14844 -9955560 -9853183 -9788366 -9751602 -9728042 -9714480 -9700341 -9638390 -9448629 -9075883 -8549142
14834 -8549142 -7962148 -7389627 -6836474 -6275611 -5710009 -5181026 -4736761 -4393312 -4124693
14825 -4124693 -3898178 -3709284 -3572815 -3488353 -3442939 -3457473 -3586595 -3853779 -4214079 -4592931
14815 -4592931 -4937578 -5217990 -5414819 -5525807 -5562497 -5550439 -5534555 -5549920 -5599886 -5683637
14805 -5683637 -5814262 -5984145 -6133162 -6179746 -6086724 -5890403 -5671609 -5507916 -5447331 -5508723
14795 -5508723 -5675755 -5887223 -6070000 -6193758 -6278275 -6362431 -6483471 -6661753 -6880851 -7085261
14785g085261j17951K1948J58710K21908J98000J49155J33854J44929J31933N8906
14775e983869o9051k17552l47859m25008m21965l32781j70798L0043K12856L26265
14765g399719L67543L75400L80604L94935M19212M30442M03739L39395K53610
14756d034839J69217J08663Q6960R2704O4266o2939k76050m89292o27540o73582
14746e642432o40520n36226l70124j84450l0433P6130J39713J60157J40436R8855
14736f788894O7146P2681J06469J14592N2872n0599j20952j31262j29321j65889
14726f973157k32863k70400k29592j28387k2541P2857J76970K76832L28142L11980
14716f690159K55704J90581J34353J08655J22678J54426J74130J58792Q7520k5414
$$ plain form
14785 -7085261 -7203212 -7181264 -7022554 -6800646 -6602646 -6453491 -6319637 -6174708 -6042775 -5983869
14775 -5983869 -6052920 -6270472 -6618331 -7043339 -7465304 -7798085 -7968883 -7938840 -7725984 -7399719
14765 -7399719 -7032176 -6656776 -6276172 -5881237 -5462025 -5031583 -4627844 -4288449 -4034839
14756 -4034839 -3865622 -3756959 -3669999 -3577295 -3513029 -3575968 -3852018 -4341310 -4968850 -5642432
14746 -5642432 -6282952 -6819178 -7189302 -7373752 -7404185 -7328055 -7188342 -7028185 -6887749 -6788894
14736 -6788894 -6721748 -6649067 -6542598 -6428006 -6375134 -6425733 -6546685 -6677947 -6807268 -6973157
14726 -6973157 -7206020 -7476420 -7706012 -7834399 -7856940 -7784083 -7607113 -7330281 -7002139 -6690159
14716 -6690159 -6434455 -6243874 -6109521 -6000866 -5878188 -5723762 -5549632 -5390840 -5303320 -5328734
14706e328734j24529j71988j69335j30346o8516K893P5970J41809J66541J15443
14696e490792J0419r6736j78669k27864k37707j94302r7903J6851J08001J43981
14686f244721J07541N796j31754k63004l54086m01434m23528m25594l90856l17922
14676h839562k24925j17089O475J41294K81640M03713M80738N21272N49650N47950
14666f248844M79129L70820K94800K75512K78412K67943K43355K09134J48626
14657c681113N6190l7740j01751j26955j09948n8964j0499O37k8382o9450o8727
14646d236702J7680J70058L20121M11325M21279L49054J98361o729j86918k30486
14636b772957r5030J34460L19052L66499K59519L5966k36467m78897o24587o50075
$$ plain form
14706 -5328734 -5453263 -5625251 -5794586 -5924932 -5993448 -5990555 -5914585 -5772776 -5606235 -5490792
14696 -5490792 -5480373 -5577109 -5755778 -5983642 -6221349 -6415651 -6513554 -6496703 -6388702 -6244721
14686 -6244721 -6137180 -6131384 -6263138 -6526142 -6880228 -7281662 -7705190 -8130784 -8521640 -8839562
14676 -8839562 -9064487 -9181576 -9175101 -9033807 -8752167 -8348454 -7867716 -7346444 -6796794 -6248844
14666 -6248844 -5769715 -5398895 -5104095 -4828583 -4550171 -4282228 -4038873 -3829739 -3681113
14657 -3681113 -3624923 -3662663 -3764414 -3891369 -4001317 -4060281 -4070780 -4070143 -4098525 -4167975 -4236702
14646 -4236702 -4219022 -4048964 -3728843 -3317518 -2896239 -2547185 -2348824 -2355553 -2542471 -2772957
14636 -2772957 -2867987 -2733527 -2414475 -2047976 -1788457 -1752491 -1988958 -2467855 -3092442 -3742517
14626c742517n89318n00292m09061l09951k20420j79449j82769j79914j52581
14617f466272j36197j59636k07541k22456j49998o066J36552K27994K87409L66636
14607f329575M68754N31716M94718L64042K00649N5778m1681q1651r5414j23579
14597d556243j59663j77085j74798j51966q8560J1692Q7236O3159o3421k04424
14587e414073k69937k51760k15901k19163k38702k23363j68222j09146q3264r9230
14577g292761j44582k04950k48020k25675j29204o457Q0952Q1079j3067j33988
14567h236673j99547j85723j25046m2759P5037K20364L28099L40935K68070J64997
14557g392246P9996L7578M9924J09790J85885K48328K93446L28437L39141L11192
$$ plain form
14626 -3742517 -4331835 -4832127 -5241188 -5551139 -5771559 -5951008 -6133777 -6313691 -6466272
14617 -6466272 -6602469 -6762105 -6969646 -7192102 -7342100 -7348166 -7211614 -6983620 -6696211 -6329575
14607 -6329575 -5860821 -5329105 -4834387 -4470345 -4269696 -4213918 -4255599 -4337250 -4432664 -4556243
14597 -4556243 -4715906 -4892991 -5067789 -5219755 -5308315 -5296623 -5209387 -5146228 -5209649 -5414073
14587 -5414073 -5684010 -5935770 -6151671 -6370834 -6609536 -6832899 -7001121 -7110267 -7193531 -7292761
14577 -7292761 -7437343 -7642293 -7890313 -8115988 -8245192 -8251649 -8170697 -8089618 -8102685 -8236673
14567 -8236673 -8436220 -8621943 -8746989 -8789748 -8714711 -8494347 -8166248 -7825313 -7557243 -7392246
14557 -7392246 -7312250 -7274672 -7224748 -7114958 -6929073 -6680745 -6387299 -6058862 -5719721 -5408529
14547e408529K48491J42745j8017k12294l99193n47373o37902o48767n54754l56363
14537h391956r5654J51573K98848K79911R4586j60642l52908m12725l58445k39499
14527i186911q5381Q0297K24068L27167L93454M17331L78542K91117K15009J88866
14517f756441J82057J35214K2455j39114l08462m37157m85248m38556l13269j51487
14507h690008l322J12448K20754L45579M67516N43742N48436M82826L75170K74208
14497e322651K07602J53923R1486M4738M2201O3429N6059j3269j33854k60077
14487e070413l43923l72661l62062l15792k25754r2290P3517K45226L85602M47480
14477e631070L93399K30626R960k10621l92195n05858n26430m50582l09851j45027
$$ plain form
14547 -5408529 -5160038 -5017293 -5035310 -5247604 -5646797 -6194170 -6832072 -7480839 -8035593 -8391956
14537 -8391956 -8487610 -8336037 -8037189 -7757278 -7662692 -7823334 -8176242 -8588967 -8947412 -9186911
14527 -9186911 -9272292 -9191995 -8967927 -8640760 -8247306 -7829975 -7451433 -7160316 -6945307 -6756441
14517 -6756441 -6574384 -6439170 -6416715 -6555829 -6864291 -7301448 -7786696 -8225252 -8538521 -8690008
14507 -8690008 -8693330 -8580882 -8360128 -8014549 -7547033 -7003291 -6454855 -5972029 -5596859 -5322651
14497 -5322651 -5115049 -4961126 -4869640 -4824902 -4782701 -4719272 -4663213 -4676482 -4810336 -5070413
14487 -5070413 -5414336 -5786997 -6149059 -6464851 -6690605 -6782895 -6709378 -6464152 -6078550 -5631070
14477 -5631070 -5237671 -5007045 -4997085 -5207706 -5599901 -6105759 -6632189 -7082771 -7392622 -7537649
14467g537649R576J17234J53883J23286N2001j8055l9779J5480J35298K74372
14457f714353L80890M08517L48104K64051K39520K68948K71225J95246M4411j49028
14447d442469l25561m32075m64861m56367m37474m11312l44395k11864l7239J38696
14437g424921K88135L90723M36929M41422M29541L96780L11865J72424K8178o2439
14427d591363p9323n2306m2163p8713j25238j32908r9387m8503j321K5105J7015
14416e209105j4911k7889J0366R5408K02383L04367L67797L51858K45295R1494
14406c582937n0485j54107k22597k56984k40260j66078p8416m6594r0753j68666
14396e057877k28107k30285j56251l2871Q4215J67377K24336K52584K32957J80417
$$ plain form
14467 -7537649 -7528073 -7410839 -7256956 -7133670 -7081669 -7099724 -7139503 -7124023 -6988725 -6714353
14457 -6714353 -6333463 -5924946 -5576842 -5312791 -5073271 -4804323 -4533098 -4337852 -4293441 -4442469
14447 -4442469 -4768030 -5200105 -5664966 -6121333 -6558807 -6970119 -7314514 -7526378 -7563617 -7424921
14437 -7424921 -7136786 -6746063 -6309134 -5867712 -5438171 -5041391 -4729526 -4557102 -4528924 -4591363
14427 -4591363 -4670686 -4722992 -4765155 -4843868 -4969106 -5102014 -5201401 -5249904 -5251225 -5226120 -5209105
14416 -5209105 -5224016 -5251905 -5241539 -5146131 -4943748 -4639381 -4271584 -3919726 -3674431 -3582937
14406 -3582937 -3633422 -3787529 -4010126 -4267110 -4507370 -4673448 -4751864 -4798458 -4889211 -5057877
14396 -5057877 -5285984 -5516269 -5672520 -5705391 -5621176 -5453799 -5229463 -4976879 -4743922 -4563505
14386d563505J40682J29556J25957J19728J21783J33525J43359J49092J46824
14377c352999J05484M521j30113k60312l61541m04206l68825k92836k33688j97100
14367e491615j63244j35353j14424p7856j1495N9624Q2549K3160r2626j98570
14357f119850k46717k21431j37313m2990J0019N580k9347n7826q1537j16805j46898
14346g185115j43271j06782o4926l6281k1296o729L5342J22112K34056L23133
14336f849757L54337L33338K72000J63326J3578j37678k44778k84812k65732k25841
14326f872019k12669k39774k66170k33966j34601k3624L9844L6094j2849p1323
14316g991057j31216j91833k24539k07181j54643r2369k1317P9086K05865L23379
$$ plain form
14386 -4563505 -4422823 -4293267 -4167310 -4047582 -3925799 -3792274 -3648915 -3499823 -3352999
14377 -3352999 -3247515 -3242994 -3373107 -3633419 -3994960 -4399166 -4767991 -5060827 -5294515 -5491615
14367 -5491615 -5654859 -5790212 -5904636 -5982492 -5993987 -5934363 -5851814 -5828654 -5921280 -6119850
14357 -6119850 -6366567 -6587998 -6725311 -6768301 -6758282 -6752702 -6782049 -6839875 -6921412 -7038217 -7185115
14346 -7185115 -7328386 -7435168 -7500094 -7536375 -7557671 -7564400 -7529058 -7406946 -7172890 -6849757
14336 -6849757 -6495420 -6162082 -5890082 -5726756 -5713178 -5850856 -6095634 -6380446 -6646178 -6872019
14326 -6872019 -7084688 -7324462 -7590632 -7824598 -7959199 -7982823 -7942979 -7906885 -7919734 -7991057
14316 -7991057 -8122273 -8314106 -8538645 -8745826 -8900469 -8992838 -9014155 -8935069 -8729204 -8405825
14306h405825M04634M42207M28805L58906K49026J44531Q5648O3495L8260j3573
14296f203886r2853j82133k55217k95521k87901k08636n7306J16530K33995K36474
14286f996454J29146k0750j32279j62756j10822N582J48133K75174L70665M35804
14276f058557M68864M56005L81885K60520J37759N0095j3331q7639j81189k80934
14266d866522l72718m21484l84797k77985j75180j21630r1076n7120l6790l1936
14256f837238n714N7636J24798J42028Q5028j7106j23224k17536k81791k74353
14246g347472j76848j7147J39007K18428K10796J59913Q8440n209j02530j57221
14236f989843j34511m4547P6557J77639K01261J22224l1346j97315l13982l33730
$$ plain form
14306 -8405825 -8001191 -7558984 -7130179 -6771273 -6522247 -6377716 -6292068 -6228573 -6190313 -6203886
14296 -6203886 -6296739 -6478872 -6734089 -7029610 -7317511 -7526147 -7583453 -7466923 -7232928 -6996454
14286 -6996454 -6867308 -6888058 -7020337 -7183093 -7293915 -7288333 -7140200 -6865026 -6494361 -6058557
14276 -6058557 -5589693 -5133688 -4751803 -4491283 -4353524 -4303429 -4316760 -4404399 -4585588 -4866522
14266 -4866522 -5239240 -5660724 -6045521 -6323506 -6498686 -6620316 -6711392 -6768512 -6805302 -6837238
14256 -6837238 -6842952 -6785316 -6660518 -6518490 -6433462 -6450568 -6573792 -6791328 -7073119 -7347472
14246 -7347472 -7524320 -7541467 -7402460 -7184032 -6973236 -6813323 -6724883 -6730092 -6832622 -6989843
14236 -6989843 -7124354 -7168901 -7092344 -6914705 -6713444 -6591220 -6622566 -6819881 -7133863 -7467593
14226g467593k49771j15910O669Q2404Q4167J3054q1195j40342j30543n0101P2292
14215g976869K05898L32609M34359M82775M53168L47782J84241k4368k47010m22141
14205f229556m94239m49575l22169j71693n7148k2519p1231j57241k37665l04858
14195h517894l41688l10749k11948r0148K4781J41445K75492M08470M83453M62937
14185g675849L84451L21836L10105L51025M37299N26306N47013M59601K87510
14176d050703R0259r3673k65337m25036n42314n74186m98991l48799j97811q6479
14166f993070P829J07098K02536K84536L34822L12137K04460Q1937L5222Q9865
14156e332628K06805L04982L02224J87659K2678j33678k56947l16105k87854k05190
$$ plain form
14226 -7467593 -7717364 -7833274 -7826605 -7744201 -7660034 -7646980 -7728175 -7868517 -7999060 -8049161 -7976869
14215 -7976869 -7770971 -7438362 -7004003 -6521228 -6068060 -5720278 -5536037 -5560405 -5807415 -6229556
14205 -6229556 -6723795 -7173370 -7495539 -7667232 -7724380 -7746899 -7818130 -7975371 -8213036 -8517894
14195 -8517894 -8859582 -9170331 -9382279 -9472427 -9447646 -9306201 -9030709 -8622239 -8138786 -7675849
14185 -7675849 -7291398 -6969562 -6659457 -6308432 -5871133 -5344827 -4797814 -4338213 -4050703
14176 -4050703 -3960444 -4054117 -4319454 -4744490 -5286804 -5860990 -6359981 -6708780 -6906591 -6993070
14166 -6993070 -6985241 -6878143 -6675607 -6391071 -6056249 -5744112 -5539652 -5457715 -5422493 -5332628
14156 -5332628 -5125823 -4820841 -4518617 -4330958 -4308280 -4441958 -4698905 -5015010 -5302864 -5508054
14146e508054j10106m248J15190K14997K41175J71095M1306q6506j69908j94164
14136e289223j58808p0333M4940J30724J24140J7286j17743j89994j73086j15996
14126e798093p2556o9686j23115k15608l02396l61612l87360l66742l03554k21088
14116h221810j25011j5037P0094Q5133M3387R131J4319J2106l6630q2516n3718
14105h300552L9884J31399J82372J90711J68874J36990J00211M2664l7775j06446
14095g451668j21390o8680L0095J11952J06815K2980l8377Q781J37612K49131
14085g012749K92095L01889L25765L57560L64933L42247L07966K65450J92474
14076d262370Q1707l2827j19447j79988k15057k05368j45325p1404l5836m7416
$$ plain form
14146 -5508054 -5618160 -5622408 -5507218 -5292221 -5051046 -4879951 -4838645 -4925151 -5095059 -5289223
14136 -5289223 -5448031 -5518364 -5473424 -5342700 -5218560 -5201274 -5319017 -5509011 -5682097 -5798093
14126 -5798093 -5870649 -5940335 -6063450 -6279058 -6581454 -6943066 -7330426 -7697168 -8000722 -8221810
14116 -8221810 -8346821 -8361858 -8291764 -8206631 -8163244 -8154113 -8139794 -8127688 -8164318 -8246834 -8300552
14105 -8300552 -8260668 -8129269 -7946897 -7756186 -7587312 -7450322 -7350111 -7307447 -7345222 -7451668
14095 -7451668 -7573058 -7641738 -7611643 -7499691 -7392876 -7369896 -7408273 -7399492 -7261880 -7012749
14085 -7012749 -6720654 -6418765 -6093000 -5735440 -5370507 -5028260 -4720294 -4454844 -4262370
14076 -4262370 -4180663 -4213490 -4332937 -4512925 -4727982 -4933350 -5078675 -5150079 -5185915 -5233331
14066e233331n5742k3377L0462P5789R9797J00356Q8926Q2927P4635L2951m6133
14055d772740j14062j14745m7437J9658J8890k7322m1346K399P4653J42321J70229
14044d689502J44440R7750N4062L285m7716o5736l8451J2356N2982N6800Q635
14033d411095q9223k00503k70962k69205k06039j14508k6421K4559R922o2479
14023e615954j46673k05239k35316k34548j88570j16726p8762j02108j41458j24427
14013g189781k2275J24078K53887L37570L66209L41989K89867K44528K23917K09762
14003d820249J57753M5448r2673j86938j92543j35983r8315j35719k16924k61802
13993e937945k29130j29965j892J08606J70893J71179J18874O5482O1863J05524
$$ plain form
14066 -5233331 -5289073 -5312450 -5281988 -5206199 -5106402 -5006046 -4917120 -4834193 -4759558 -4726607 -4772740
14055 -4772740 -4886802 -5001547 -5048984 -5029326 -5010436 -5037758 -5079104 -5076705 -5002052 -4859731 -4689502
14044 -4689502 -4545062 -4447312 -4393250 -4389965 -4437681 -4503417 -4541868 -4529512 -4476530 -4419730 -4411095
14033 -4411095 -4500318 -4700821 -4971783 -5240988 -5447027 -5561535 -5587956 -5563397 -5553475 -5615954
14023 -5615954 -5762627 -5967866 -6203182 -6437730 -6626300 -6743026 -6821788 -6923896 -7065354 -7189781
14013 -7189781 -7212056 -7087978 -6834091 -6496521 -6130312 -5788323 -5498456 -5253928 -5030011 -4820249
14003 -4820249 -4662496 -4617048 -4709721 -4896659 -5089202 -5225185 -5323500 -5459219 -5676143 -5937945
13993 -5937945 -6167075 -6297040 -6298932 -6190326 -6019433 -5848254 -5729380 -5663898 -5602035 -5496511
13983e496511J57622J86150J75067J14519r0j60671l28882m44931m75958m33733
13973f707418l39400k00022l2547J13880J90977J90041J35933P5608P7139J80247
13963f315562L38625M50180M49807L46664J77428j6467j76757k68254l10243l31620
13953e656199l29948k82850j91999r4074j9532K8249N9232Q8546J36143K24836
13943f037596L51323M60533M84690L97573K19424k314k13924l73325m67120n06955
13933e687691m97404m35892l41020k48845j74937r5725K1977J68419K75251K86272
13923f729595K20971J34439O0231J6511K7303J05872K27235L35110L93840L91922
13913d816161L05992J36302o3563k36396l54401m05545l94391l49066k87795k04772
$$ plain form
13983 -5496511 -5338889 -5152739 -4977672 -4863153 -4863243 -5023914 -5352796 -5797727 -6273685 -6707418
13973 -6707418 -7046818 -7246840 -7279387 -7165507 -6974530 -6784489 -6648556 -6572948 -6495809 -6315562
13963 -6315562 -5976937 -5526757 -5076950 -4730286 -4552858 -4569325 -4746082 -5014336 -5324579 -5656199
13953 -5656199 -5986147 -6268997 -6460996 -6555070 -6574602 -6546353 -6487121 -6398575 -6262432 -6037596
13943 -6037596 -5686273 -5225740 -4741050 -4343477 -4124053 -4126367 -4340291 -4713616 -5180736 -5687691
13933 -5687691 -6185095 -6620987 -6962007 -7210852 -7385789 -7481514 -7459537 -7291118 -7015867 -6729595
13923 -6729595 -6508624 -6374185 -6313954 -6297443 -6270140 -6164268 -5937033 -5601923 -5208083 -4816161
13913 -4816161 -4510169 -4373867 -4437430 -4673826 -5028227 -5433772 -5828163 -6177229 -6465024 -6669796
13903f669796j08837l8783l3867q9517j46881j51472j12746o3311p693O1272J40974
13892g220657K07008K40987K54843K55578K34197J86551J19785M4022m0459j37785
13882e855930k32760k94747l06745k76841k24012j49103m0346Q1478J61092J59362
13872f978552R3246J5612m4518r9967j58306j83663j26460J1662J60607K50886
13862g059453K66610K17780J28571N5211M9987J01546J37234R4215q883p4854
13852f092036k9469R6872K07703K24647J36826q85j21053j89253j95357j41400
13842f103405l8960J07059K83391M40200N06709M46976K98297J30542k0245j67285
13832d116721l24338m59986n38389n47935m64740k76578m5593J19973J66513J33764
$$ plain form
13903 -6669796 -6778633 -6817416 -6851283 -6940800 -7087681 -7239153 -7351899 -7415210 -7422903 -7361631 -7220657
13892 -7220657 -7013649 -6772662 -6517819 -6262241 -6028044 -5841493 -5721708 -5677686 -5718145 -5855930
13882 -5855930 -6088690 -6383437 -6690182 -6967023 -7191035 -7340138 -7380484 -7299006 -7137914 -6978552
13872 -6978552 -6885306 -6869694 -6914212 -7014179 -7172485 -7356148 -7482608 -7470946 -7310339 -7059453
13862 -7059453 -6792843 -6575063 -6446492 -6391281 -6341294 -6239748 -6102514 -6008299 -6017182 -6092036
13852 -6092036 -6121505 -6024633 -5816930 -5592283 -5455457 -5456342 -5577395 -5766648 -5962005 -6103405
13842 -6103405 -6142365 -6035306 -5751915 -5311715 -4805006 -4358030 -4059733 -3929191 -3949436 -4116721
13832 -4116721 -4441059 -4901045 -5439434 -5987369 -6452109 -6728687 -6774280 -6654307 -6487794 -6354030
13822f354030R0727O4588L7580m651n1333q9031j07765p9715J6308J51711K69209
13811f056402L23324K97700K04484P8900l1227j03265j55171j99949k33497k67494
13801f142597l08961l22691k66437j44792j631J17610J77833J67718J13660O3120
13791f547168N8803J11874J82237K12485J82436J06551J22j09911j73013j68307
13781f143891j36354j14849r7067p7756n5430j4362L7871P9225J15224J54548
13771f252841J92476K37504K84397K89982K24548J06042j7532q9614q1837m018
13761e110893J26779K77754L78450L69324K64126J21921j5634j29361k04100k37304
13751d158938k42287k29591k12295k05515j98687j70595j22232o5946j4706R185
$$ plain form
13822 -6354030 -6263303 -6198715 -6161135 -6165786 -6217119 -6306150 -6413915 -6493630 -6477322 -6325611 -6056402
13811 -6056402 -5733078 -5435378 -5230894 -5151994 -5183221 -5286486 -5441657 -5641606 -5875103 -6142597
13801 -6142597 -6451558 -6774249 -7040686 -7185478 -7187109 -7069499 -6891666 -6723948 -6610288 -6547168
13791 -6547168 -6488365 -6376491 -6194254 -5981769 -5799333 -5692782 -5692660 -5802571 -5975584 -6143891
13781 -6143891 -6280245 -6395094 -6492161 -6569917 -6625347 -6639709 -6601838 -6522613 -6407389 -6252841
13771 -6252841 -6060365 -5822861 -5538464 -5248482 -5023934 -4917892 -4935424 -5025038 -5106875 -5110893
13761 -5110893 -4984114 -4706360 -4327910 -3958586 -3694460 -3572539 -3588173 -3717534 -3921634 -4158938
13751 -4158938 -4401225 -4630816 -4843111 -5048626 -5247313 -5417908 -5540140 -5606086 -5620792 -5611607
13741e611607p181m2072n9067m2559j1390P69k4001p7622j28572j49718j42483
13730f295503j15321o0031K6223J13056J62466J69544J60835J69423K15686K90492
13720e163130L58102L71259K99916J59493N026r8628j27306j16148j12266j30078
13710d553760j49757j47331j22663q6841m1381J9406R4153J59686J76822J18793
13700d532873k900j43289k57472l15065l03754k45080j74330r8287j1508P1139
13690f013419J32031J73362K00587J98416J48116O2376j9480o3228m9751J9183
13680e211807J04556J45998J21014O9800L7545K6951K2532J9415K2892L8052M4634
13669d558418K3389l984k4234o0355j13775j41252j04948k5184L0600J7924n0426
$$ plain form
13741 -5611607 -5618788 -5660860 -5719927 -5762486 -5773876 -5773107 -5797108 -5874730 -6003302 -6153020 -6295503
13730 -6295503 -6410824 -6470855 -6444632 -6331576 -6169110 -5999566 -5838731 -5669308 -5453622 -5163130
13720 -5163130 -4805028 -4433769 -4133853 -3974360 -3969334 -4067962 -4195268 -4311416 -4423682 -4553760
13710 -4553760 -4703517 -4850848 -4973511 -5060352 -5101733 -5082327 -4988174 -4828488 -4651666 -4532873
13700 -4532873 -4535773 -4679062 -4936534 -5251599 -5555353 -5800433 -5974763 -6073050 -6084558 -6013419
13690 -6013419 -5881388 -5708026 -5507439 -5309023 -5160907 -5098531 -5118011 -5181239 -5230990 -5211807
13680 -5211807 -5107251 -4961253 -4840239 -4770439 -4732894 -4705943 -4683411 -4663996 -4641104 -4603052 -4558418
13669 -4558418 -4535029 -4539013 -4563247 -4623602 -4737377 -4878629 -4983577 -5008761 -4978161 -4960237 -5010663
13658e010663j45011k50442l42902l91379l83801l26225k35785j27892J0733J87436
13648g015931L38765L89155L38304K24292P8044n9877j47658j75351j65270j43100
13638f338627j20289q6814j7688R5084K16583K89404K78318J85994M7460q1672
13628e532247j51832j51696j11504o0607r022J5335j2716n1400k4324Q8589K24227
13617e777197K87105K27538R1686k0711m4639K5397J58973L12396M40408M97058
13607c801986M48398L01208J07119o9982j84568k24013k21056k26557k34773j86981
13597d293191o6531P0504J59910J78634J41719P6474O342n5642j07227j43516
13587d032524j63291j86796k38726l08104l38358k76613j34049J6841J17882J84834
$$ plain form
13658 -5010663 -5155674 -5406116 -5749018 -6140397 -6524198 -6850423 -7086208 -7214100 -7203367 -7015931
13648 -7015931 -6677166 -6288011 -5949707 -5725415 -5647371 -5707248 -5854906 -6030257 -6195527 -6338627
13638 -6338627 -6458916 -6545730 -6563418 -6468334 -6251751 -5962347 -5684029 -5498035 -5450575 -5532247
13628 -5532247 -5684079 -5835775 -5947279 -6007886 -6016908 -6001573 -6014289 -6065689 -6090013 -6001424 -5777197
13617 -5777197 -5490092 -5262554 -5170868 -5191579 -5236218 -5210821 -5051848 -4739452 -4299044 -3801986
13607 -3801986 -3353588 -3052380 -2945261 -3015243 -3199811 -3423824 -3644880 -3871437 -4106210 -4293191
13597 -4293191 -4359722 -4289218 -4129308 -3950674 -3808955 -3732481 -3726139 -3781781 -3889008 -4032524
13587 -4032524 -4195815 -4382611 -4621337 -4929441 -5267799 -5544412 -5678461 -5661620 -5543738 -5358904
13577e358904K71247L84335M57152M20047K79669R8155p4035k24641l51036m24031
13567d522042m19897l61922k93950k48198k22649j74708p2080N6865J51476J82917
13557e924188J55121Q4711Q334k6146O202Q5756J73509K31617K10139O6235j84488
13546e113198m54601o42331o99400o28441m40045j65625J22169L45820M65344
13537g210308M83733M20109K92886J32333K331l4647J3691P7768R5673O3165K9158
13526e634108M0146Q6425J29120J57545J87355K21671K45442K46879K21411J76621
13516c921493J34473J09376R8064R8457R6612O0489n398n4561o9682q9953j50055
13505c693671k35074l16223l88641m45456m49114l87142l04701k38072j80363
$$ plain form
13577 -5358904 -5087657 -4703322 -4246170 -3826123 -3546454 -3448299 -3522334 -3746975 -4098011 -4522042
13567 -4522042 -4941939 -5303861 -5597811 -5846009 -6068658 -6243366 -6315446 -6258581 -6107105 -5924188
13557 -5924188 -5769067 -5684356 -5676022 -5702168 -5695966 -5610210 -5436701 -5205084 -4994945 -4928710 -5113198
13546 -5113198 -5567799 -6210130 -6909530 -7537971 -7978016 -8143641 -8021472 -7675652 -7210308
13537 -7210308 -6726575 -6306466 -6013580 -5881247 -5878916 -5913563 -5899872 -5822104 -5726431 -5663266 -5634108
13526 -5634108 -5593962 -5507537 -5378417 -5220872 -5033517 -4811846 -4566404 -4319525 -4098114 -3921493
13516 -3921493 -3787020 -3677644 -3579580 -3481123 -3384511 -3324022 -3329420 -3383981 -3453663 -3543616 -3693671
13505 -3693671 -3928745 -4244968 -4633609 -5079065 -5528179 -5915321 -6220022 -6458094 -6638457
13496f638457j11658j5395J02930K04171K59673K85640L14460L50289L45497K45504
13486d657346Q3980l4286m9098J4942R7845J48545J40062Q4507J8432k6657j9965
13475d199039N2854J42763J70440J04763k5447j74104l05221l80737l74762l10642
13465e299132k25191j13150L1406J71845K64582K94488K70157K04102J12171K5633
13455d263089l4966q5875j45167k00177k28435k24577k00002j69265j43519j42802
13445e837874j86889k67058l42773l69120l28478k39640j40774m8639N9849K01000
13435g500396L30865L83641L50816K83636K24435J70670J16049Q2952R0382J23485
13425e343465J41182J04823J4688q8358j48989j25261k4209R4483J63719J56565
$$ plain form
13496 -6638457 -6750115 -6765510 -6662580 -6458409 -6198736 -5913096 -5598636 -5248347 -4902850 -4657346
13486 -4657346 -4573366 -4607652 -4656750 -4641808 -4543963 -4395418 -4255356 -4170849 -4152417 -4179074 -4199039
13475 -4199039 -4146185 -4003422 -3832982 -3728219 -3753666 -3927770 -4232991 -4613728 -4988490 -5299132
13465 -5299132 -5524323 -5637473 -5606067 -5434222 -5169640 -4875152 -4604995 -4400893 -4288722 -4263089
13455 -4263089 -4298055 -4383930 -4529097 -4729274 -4957709 -5182286 -5382288 -5551553 -5695072 -5837874
13445 -5837874 -6024763 -6291821 -6634594 -7003714 -7332192 -7571832 -7712606 -7761245 -7701396 -7500396
13435 -7500396 -7169531 -6785890 -6435074 -6151438 -5927003 -5756333 -5640284 -5557332 -5466950 -5343465
13425 -5343465 -5202283 -5097460 -5082772 -5171130 -5320119 -5445380 -5469589 -5375106 -5211387 -5054822
13415e054822R2619R608m6973l8305K0512P9259J23707J80567K52430K88578K46210
13404c846610J39816J6751q9221j65357j99263j84303j35333p9117l3478J811
13394d574304M5867J19025K04670K51743K34256J81492J33656J04280R0497Q8386
13384c120432Q7401O7224J7043l2950j7286J03867L03221M97018O04970O01104
13374h88820M89552K84409M8599j07332j10890j912J14780J83835K18908K42971
13364D74100K67930K88991K88782K51707J66762N5979j1851M523N2938N1788r394
13353A882255p6993j16936j32633j24116p8123J669Q5121J58191K42632L56134
13343B197201M74368N58209O06995O43836O49852N61816L49788P0505j78723l41634
$$ plain form
13415 -5054822 -4962203 -4952595 -4999568 -5037873 -5017361 -4938102 -4814395 -4633828 -4381398 -4092820 -3846610
13404 -3846610 -3706794 -3690043 -3779264 -3944621 -4143884 -4328187 -4463520 -4542637 -4576115 -4574304
13394 -4574304 -4528437 -4409412 -4204742 -3952999 -3718743 -3537251 -3403595 -3299315 -3208818 -3120432
13384 -3120432 -3033031 -2965807 -2948764 -2981714 -2999000 -2895133 -2591912 -2094894 -1489924 -888820
13374 -888820 -399268 -114859 -66260 -173592 -284482 -286394 -171614 12221 231129 474100
13364 474100 742030 1031021 1319803 1571510 1738272 1794251 1782400 1786923 1839861 1891649 1882255
13353 1882255 1805262 1688326 1555693 1431577 1353454 1355123 1440244 1598435 1841067 2197201
13343 2197201 2671569 3229778 3836773 4480609 5130461 5692277 6042065 6112570 5933847 5592213
13333E592213m19926m38584m07644l09826j43061M6910J95394K66617K85109L03020
13323D970222L32107L39545K93124J81532J7918j63315l28419m45784m76096l99392
13313D321442k34483k9864J57713K90091L55533L61491L35382L03093K71824K48693
13303F380915K42090K43276K19647J40424R805j38404k62813l20949k89001j91927
13293F033063r4646m1608l0476m4578o2596n7357k4230J9957P6682J44288J77003
13282F095502J38091O6151K7211L2589N2760P9629J28510J90902K32007K37379
13272G280731K38691K81277L70503M55072M66852L77458K03160n323j54676j72613
13262I341132r7538l0632k2768n8925j03568j26649j05307k9183P0283J29411
$$ plain form
13333 5592213 5172287 4733703 4326059 4016233 3873172 3920082 4115476 4382093 4667202 4970222
13323 4970222 5302329 5641874 5934998 6116530 6134448 5971133 5642714 5196930 4720834 4321442
13313 4321442 4086959 4057095 4214808 4504899 4860432 5221923 5557305 5860398 6132222 6380915
13303 6380915 6623005 6866281 7085928 7226352 7236157 7097753 6834940 6513991 6224990 6033063
13293 6033063 5938417 5896809 5866333 5821755 5759159 5701802 5677572 5697529 5774211 5918499 6095502
13282 6095502 6233593 6299744 6326955 6359544 6412304 6491933 6620443 6811345 7043352 7280731
13272 7280731 7519422 7800699 8171202 8626274 9093126 9470584 9673744 9668421 9513745 9341132
13262 9341132 9243594 9212962 9190194 9131269 9027701 8901052 8795745 8766562 8836845 8966256
13252H966256J11661K9464q4501j99906k87221l21388l04883k64908k22021j86360
13242G236193j69618j71250j71208j58243j37652j05347n2268K6440J37151K67475
13232F701673L92591N16633O47952P44636P39665O23551M57022L00601J85236
13223A1309560J11948N5516k172o7338j36133j75094j46699p8130m9574r5685
13213A0726199j74733k20078j78645m1411J38330K87603L81472M51895N25817
13204A1896449N89466O11995N88271N53521N40556N46461N53447N57553N71660
13195A7009379N93226N87320N33556M62681M22929M31897M79386N53373O39168
13186B1712915P28322Q33232R66793J144365J399905J754941K188838K658211
$$ plain form
13252 8966256 9077917 9107381 9022880 8822974 8535753 8214365 7909482 7644574 7422553 7236193
13242 7236193 7066575 6895325 6724117 6565874 6428222 6322875 6270607 6297047 6434198 6701673
13232 6701673 7094264 7610897 8258849 9003485 9743150 10366701 10823723 11124324 11309560
13223 11309560 11421508 11477024 11474852 11407514 11271381 11096287 10949588 10871458 10821884 10726199
13213 10726199 10551466 10331388 10152743 10111332 10249662 10537265 10918737 11370632 11896449
13204 11896449 12485915 13097910 13686181 14239702 14780258 15326719 15880166 16437719 17009379
13195 17009379 17602605 18189925 18723481 19186162 19609091 20040988 20520374 21073747 21712915
13186 21712915 22441237 23274469 24241262 25385627 26785532 28540473 30729311 33387522
13178C3387522L146162L676624M275190M964794N783873O752487P864061R101427
13170G8952140J0418551J1750437J3040918J4222166J5167872J5657941J5425618
13163A74635643J4314736J2405596R957838P248709M497792J873020n11672k583512
13155B21838150m275626n511332o200394o267788n695783m525221k830049o94297
13147A85837660J793072M508030P260067R833055J2038897J3692275J4575970
13140B49539026J4481955J3275577J0953367P700429L861890j91644m159090p802342
13132B87659168j0938748j3447460j5263377j6383910j6876091j6849894j6415595
13125A81484093j5667449j4695559j3601612j2494746j1444452j0450547r485893
$$ plain form
13178 33387522 36533684 40210308 44485498 49450292 55234165 61986652 69850713 78952140
13170 78952140 89370691 101121128 114162046 128384212 143552084 159210025 174635643
13163 174635643 188950379 201355975 211313813 218562522 223060314 224933334 224421662 221838150
13155 221838150 217562524 212051192 205850798 199583010 193887227 189362006 186531957 185837660
13147 185837660 187630732 192138762 199398829 209231884 221270781 234963056 249539026
13140 249539026 264020981 277296558 288249925 295950354 299812244 299620600 295461510 287659168
13132 287659168 276720420 263272960 248009583 231625673 214749582 197899688 181484093
13125 181484093 165816644 151121085 137519473 125024727 113580275 103129728 93643835
13118I3643835q548853p659848o838183o105963n483379m954108m466473l998076
13110D5588952l585234l270237l040642k830003k571384k253446j933705j679652
13102B4424649j497419j337104j153326r51458p79371o87085o74206o80607o52206
13093A6011867n93665n46996n24985n04584n01228n61625o68508p46063p51774
13084A0612439p03463o35195n57272m52308l05686j30186L4377J28328J05043
13075H096077l0695k24777l91297m70963m95788n31058n75913n76765m97292l42284
13065C959245j57081k486R4055J44055J63244J42123P4067J1649K4483R6348J39341
13054D689043Q5041o1963k27755l41582l84046l69025l28226k89674k54276k02447
$$ plain form
13118 93643835 85094982 77435134 70596951 64490988 59007609 54053501 49587028 45588952
13110 45588952 42003718 38733481 35692839 32862836 30291452 28038006 26104301 24424649
13102 24424649 22927230 21590126 20436800 19485342 18705971 18018886 17344680 16664073 16011867
13093 16011867 15418202 14871206 14346221 13841637 13340409 12778784 12110276 11364213 10612439
13084 10612439 9908976 9273781 8716509 8264201 7958515 7828329 7862706 7991034 8096077
13075 8096077 8065382 7840605 7449308 6978345 6482557 5951499 5375586 4798821 4301529 3959245
13065 3959245 3802164 3799678 3893733 4037788 4201032 4343155 4417222 4428871 4453354 4549702 4689043
13054 4689043 4774084 4712121 4484366 4142784 3758738 3389713 3061487 2771813 2517537 2315090
13044B315090j23194k4997P5346J54305J95425K06841J99087J74130J52719J62949
13034C487701K01158K28104K10890J54425Q5155K2271k3579l8518j6015K1079
13024D332671K5374k6244j00673j62876k24618l00103l60952l59829k71848j22081
13014B428821J6664Q9084J22030J96892L42246M92779N76016N75489N07802M09481
13004E757304L28707K89941K81367K69766K10945O9930j32116l14108m09381m25666
12994E926689m19437m41966n07303n70954n59409m48419k85846j46784q1978r1706
12984B372887j52806k39667l16487l38038k68667j19593N0491J73525J88983O1753
12974A412381j75086m10071n22911m82126l57197k38771j72127j58974j82331
$$ plain form
13044 2315090 2191896 2166899 2242245 2396550 2591975 2798816 2997903 3172033 3324752 3487701
13034 3487701 3688859 3916963 4127853 4282278 4367433 4389704 4366125 4327607 4311592 4332671
13024 4332671 4358045 4331801 4231128 4068252 3843634 3543531 3182579 2822750 2550902 2428821
13014 2428821 2445485 2534569 2656599 2853491 3195737 3688516 4264532 4840021 5347823 5757304
13004 5757304 6086011 6375952 6657319 6927085 7138030 7207960 7075844 6761736 6352355 5926689
12994 5926689 5507252 5065286 4557983 3987029 3427620 2979201 2693355 2546571 2464593 2372887
12984 2372887 2220081 1980414 1663927 1325889 1057222 937629 988120 1161645 1350628 1412381
12974 1412381 1237295 827224 304313 -177813 -535010 -773781 -945908 -1104882 -1287213
12965a287213k13378k22139k00317j63032j31584j24453j37958j33379o7985N8163
12955b623275J93647K75022K72634K18832J88099K25664L09944L87157M21093
12946a31183M12808L79831L27247K68845K46704K78642L19146L15194K80322K86360
12936B983916L87840N66864P38061Q03399P07141M59335J41166j29778k62458
12927F395486k34578q6110J15387K90157L77844L80071L47645L30307L15304K15411
12917H446924l1460l73463o89730q80425r11893q25594p05841o15455n56450m85821
12907B370792l66051k30010j82200k77431m39385n45265n37170m41417l27698
12898i75835k42147j82806j45887j20343o1540N9354K24737L88690N00197N25820
$$ plain form
12965 -1287213 -1500591 -1722730 -1923047 -2086079 -2217663 -2342116 -2480074 -2613453 -2681438 -2623275
12955 -2623275 -2429628 -2154606 -1881972 -1663140 -1475041 -1249377 -939433 -552276 -131183
12946 -131183 281625 661456 988703 1257548 1504252 1782894 2102040 2417234 2697556 2983916
12936 2983916 3371756 3938620 4676681 5480080 6187221 6646556 6787722 6657944 6395486
12927 6395486 6160908 6074798 6190185 6480342 6858186 7238257 7585902 7916209 8231513 8446924
12917 8446924 8415464 8042001 7352271 6471846 5559953 4734359 4028518 3413063 2856613 2370792
12907 2370792 2004741 1774731 1592531 1315100 875715 330450 -206720 -648137 -975835
12898 -975835 -1217982 -1400788 -1546675 -1667018 -1728558 -1669204 -1444467 -1055777 -555580 -29760
12888b9760M59690L26711J81673P7853K4844q966m6730o0567j2234O5901P4486
12877A052901m8622k52824m20508m69940m15786l35494k97041l09522l29640l15256
12867b141732k65066k11922j86184j98204k43665l00265l16529k44711r1252R9457
12857d100073K79966M05078M43810L95152K82513J36777j7251j58815k60780k84219
12847b877842k07791o8155O2237J32925J28668N6319n2405j60463k58752l44647
12837c589906l78943l14395j64135j4382M1532M086l3380j628Q4119J67217K06373
12826c993442J96131J58391J11360M6456m3324j31613j92859k32133k65181l04844
12816d651058l30198k90090j72256j9779J20669K33239L11870L44930L27944K60115
$$ plain form
12888 -29760 429930 756641 938314 1016167 1041011 1032045 985315 924748 912514 978415 1052901
12877 1052901 1004279 751455 330947 -138993 -554779 -890273 -1187314 -1496836 -1826476 -2141732
12867 -2141732 -2406798 -2618720 -2804904 -3003108 -3246773 -3547038 -3863567 -4108278 -4199530 -4100073
12857 -4100073 -3820107 -3415029 -2971219 -2576067 -2293554 -2156777 -2174028 -2332843 -2593623 -2877842
12847 -2877842 -3085633 -3153788 -3091551 -2958626 -2829958 -2773639 -2826044 -2986507 -3245259 -3589906
12837 -3589906 -3968849 -4283244 -4447379 -4461761 -4420229 -4416143 -4449523 -4451151 -4367032 -4199815 -3993442
12826 -3993442 -3797311 -3638920 -3527560 -3481104 -3524428 -3656041 -3848900 -4081033 -4346214 -4651058
12816 -4651058 -4981256 -5271346 -5443602 -5463381 -5342712 -5109473 -4797603 -4452673 -4124729 -3864614
12806c864614J42496N211j01261j58816j83688j86485j73768j49485r8556l591
12796d772557J36179K83749L76937L79914K95970J66389M9535j8580l0998p175
12786c140637M819m1395j49126k74388l54030l50259k77625j89630j39085j48027
12776e059383j89711k03875j67953j08663l2067Q6112K42474L87366M61841M34417
12766d149442L13028J40849l4228j84827l01201l74442l88048l29776k03719m8246
12756e560052P8899J54642K04098K53435K92339K90065K29970J22780J0534n3907
12746c977197n9486l9184l4883o7663j18594j52260j45119r1283j7621K1129K423
12735d679738k8487j2992M7417R9705J02386N5487j7323r6488j67073k16728k59336
$$ plain form
12806 -3864614 -3722118 -3716907 -3818168 -3976984 -4160672 -4347157 -4520925 -4670410 -4768966 -4772557
12796 -4772557 -4636378 -4352629 -3975692 -3595778 -3299808 -3133419 -3083884 -3102464 -3133462 -3140637
12786 -3140637 -3135818 -3177213 -3326339 -3600727 -3954757 -4305016 -4582641 -4772271 -4911356 -5059383
12776 -5059383 -5249094 -5452969 -5620922 -5729585 -5761652 -5675540 -5433066 -5045700 -4583859 -4149442
12766 -4149442 -3836414 -3695565 -3729793 -3914620 -4215821 -4590263 -4978311 -5308087 -5511806 -5560052
12756 -5560052 -5481153 -5326511 -5122413 -4868978 -4576639 -4286574 -4056604 -3933824 -3923290 -3977197
12746 -3977197 -4036683 -4075867 -4110750 -4178413 -4297007 -4449267 -4594386 -4685669 -4703290 -4682161 -4679738
12735 -4679738 -4708225 -4721217 -4673800 -4574095 -4471709 -4416222 -4433545 -4530033 -4697106 -4913834 -5173170
12724e173170l22105l92655m13243l40602k01161o3516M2022J42787K51915L32694
12714f137034L64037L77523M04151M26893L89028K51271O9381l2952n407R0245
12704c802864J77699K22350K18737J72322R8317K4948k1637l6378m6675r3210
12694c086391j78960k57338k73449k11109j08186k2798O374l1037j05670j57183
12684d425747j40121n0197Q2580K02970K53237K14978J25268M4552N422L544K1536
12673c661978L6647K3709j5110m5308m4692k7859j5002j4716m9071j32413k35505
12662d181298l22610l76160l67200k70349r8403J16383L38667N16598O06579O15591
12652c422202N89052N56244N02685M01483K63205J46072J02019J24959J59868
$$ plain form
12724 -5173170 -5495275 -5887930 -6301173 -6641775 -6842936 -6906452 -6864430 -6721643 -6469728 -6137034
12714 -6137034 -5772997 -5395474 -4991323 -4564430 -4175402 -3924131 -3854750 -3887702 -3893109 -3802864
12704 -3802864 -3625165 -3402815 -3184078 -3011756 -2913439 -2888491 -2910128 -2946506 -2993181 -3086391
12694 -3086391 -3265351 -3522689 -3796138 -4007247 -4115433 -4138231 -4131857 -4162894 -4268564 -4425747
12684 -4425747 -4565868 -4616065 -4533485 -4330515 -4077278 -3862300 -3737032 -3692480 -3687058 -3683514 -3661978
12673 -3661978 -3625331 -3601622 -3616732 -3662040 -3706732 -3734591 -3749593 -3764309 -3813380 -3945793 -4181298
12662 -4181298 -4503908 -4880068 -5247268 -5517617 -5616020 -5499637 -5160970 -4644372 -4037793 -3422202
12652 -3422202 -2833150 -2276906 -1774221 -1372738 -1109533 -963461 -861442 -736483 -576615
12643e76615J45955O2217o4221j97856l09876l74867l88675l64545l03859j93759
12633b566101k9323J64954L37304M36698M40951L74436K99730K74654L20617M40503
12623D94423O42233R38443J324293J745381K078445K167334J926720J404582P41353
12614A3463207R2450m18409p26944q57659q95398q92067q25505o63703m26615
12605G849357j73576K5895J29699J59120J79160K47389L84871N80149Q13317J079392
12595A1274773J378663J680241J911423J979397J819734J446431R34615L43928
12587B2769205k88851q86691j347934j624998j748014j779914j761970j687237
12579A1643596j535317j331103j131664r67335q27677p00434n87011m84049l97670
$$ plain form
12643 -576615 -430660 -368443 -432664 -630520 -940396 -1315263 -1703938 -2068483 -2372342 -2566101
12633 -2566101 -2595424 -2430470 -2093166 -1656468 -1215517 -841081 -541351 -266697 53920 494423
12623 494423 1136656 2075099 3399392 5144773 7223218 9390552 11317272 12721854 13463207
12614 13463207 13555657 13137248 12410304 11552645 10657247 9765180 8939675 8275972 7849357
12605 7849357 7675781 7701676 7831375 7990495 8169655 8417044 8801915 9382064 10195381 11274773
12595 11274773 12653436 14333677 16245100 18224497 20044231 21490662 22425277 22769205
12587 22769205 22480354 21593663 20245729 18620731 16872717 15092803 13330833 11643596
12579 11643596 10108279 8777176 7645512 6678177 5850500 5150066 4563055 4079006 3681336
12570C681336l55451l61014l74930l79384m09137m86682n91925o86190p16360
12561f79737o42161m81908k96300j35083n495J06293J78171J70572R2184M231
12551a689233k5152J1550M3560J3424o5260j62334k64006l50203l90319l75769
12541c253742l32088k75995j92410q1475J0471L1803j7389q0721j18116j46985
12531d456647j86883k26230k55798k73905k60591j86370n6356O7251J23346J13353
12521e598830Q4252P2761P9119J08750J96548L47313M92005N46132M82209L35430
12511b854311J63556J1106j02691j79949k20696k22683k10334k29808l05991m00705
12501d552506m33195l74158k70489j40528M1711K43664L77599L84805K68165Q6007
$$ plain form
12570 3681336 3325885 2964871 2589941 2210557 1801420 1314738 722813 36623 -679737
12561 -679737 -1321898 -1803806 -2100106 -2235189 -2240684 -2134391 -1956220 -1785648 -1693464 -1689233
12551 -1689233 -1714385 -1702835 -1659275 -1645851 -1711111 -1873445 -2137451 -2487654 -2877973 -3253742
12541 -3253742 -3585830 -3861825 -4054235 -4135710 -4125239 -4093436 -4110825 -4191546 -4309662 -4456647
12531 -4456647 -4643530 -4869760 -5125558 -5399463 -5660054 -5846424 -5902780 -5835529 -5712183 -5598830
12521 -5598830 -5514578 -5441817 -5362698 -5253948 -5057400 -4710087 -4218082 -3671950 -3189741 -2854311
12511 -2854311 -2690755 -2679649 -2782340 -2962289 -3182985 -3405668 -3616002 -3845810 -4151801 -4552506
12501 -4552506 -4985701 -5359859 -5630348 -5770876 -5729165 -5485501 -5107902 -4723097 -4454932 -4368925
12491d368925p9707j65910j50197o7212K842M639m0073o7623l1910O1867J52191
12480d750018J73630J10516k4313k10344l88793m76286m52176l82217l20965k56634
12470f977600j77739j01065j3463J17785K73473L96607M64226M97596N20026N26868
12460d473286M90131L91088K33806L9804j54366l11553m05607m30991m07566l65054
12450e393594l24387k97171k83684k80653k97171l23898l08183k12622o6975P0194
12440g718144J74776K60147L30129L66549L60116L17440K36906J04679o2978k01153
12430e831533k49917j94759n8912J18169K85446L85487M08776M05398M05097L93947
12420c932801L66320L27216K65240J71829O3864l6766j17849j62186j49694r1977
$$ plain form
12491 -4368925 -4448632 -4614542 -4764739 -4831951 -4829109 -4824470 -4864543 -4932166 -4964076 -4902209 -4750018
12480 -4750018 -4576388 -4465872 -4490185 -4700529 -5089322 -5565608 -6017784 -6400001 -6720966 -6977600
12470 -6977600 -7155339 -7256404 -7269867 -7152082 -6878609 -6482002 -6017776 -5520180 -5000154 -4473286
12460 -4473286 -3983155 -3592067 -3358261 -3318457 -3472823 -3784376 -4189983 -4620974 -5028540 -5393594
12450 -5393594 -5717981 -6015152 -6298836 -6579489 -6876660 -7200558 -7508741 -7721363 -7788338 -7718144
12440 -7718144 -7543368 -7283221 -6953092 -6586543 -6226427 -5908987 -5672081 -5567402 -5630380 -5831533
12430 -5831533 -6081450 -6276209 -6335121 -6216952 -5931506 -5546019 -5137243 -4731845 -4326748 -3932801
12420 -3932801 -3566481 -3239265 -2974025 -2802196 -2738332 -2775098 -2892947 -3055133 -3204827 -3296804
12410c296804n3419q4721j43363j57222j26482r7275r0855j00545j15294j21871
12400d387851r8573m5362n683o786r319M4665J57300K71254L28452L08465K27069
12389c216369J24469M2426K511r534l4524q0171j03019q4109p9924j55819k97857
12378c891920m18484m36739l51865k31952j41683r9210o7424J8258J79079L52857
12368e089083M47827M33789L50735K55981J86140J49952J37805J27633J04750
12359b894471P8382N8217L2847m361l6871m0059j2714O376j8777p5527j20150
12348c027108j29024j22422j37234j93494k80343l65998m17132m00537k94549
12339e367841j21300N7668J92336K65606K81559K68286K57366K49254K33640J99848
$$ plain form
12410 -3296804 -3350223 -3434944 -3578307 -3735529 -3862011 -3959286 -4050141 -4150686 -4265980 -4387851
12400 -4387851 -4486424 -4531786 -4537469 -4544255 -4553574 -4508909 -4351609 -4080355 -3751903 -3443438 -3216369
12389 -3216369 -3091900 -3049474 -3046963 -3056497 -3091021 -3171192 -3274211 -3358320 -3438244 -3594063 -3891920
12378 -3891920 -4310404 -4747143 -5099008 -5330960 -5472643 -5571853 -5639277 -5621019 -5441940 -5089083
12368 -5089083 -4641256 -4207467 -3856732 -3600751 -3414611 -3264659 -3126854 -2999221 -2894471
12359 -2894471 -2816089 -2757872 -2725025 -2729386 -2766257 -2806316 -2819030 -2812654 -2831431 -2906958 -3027108
12348 -3027108 -3156132 -3278554 -3415788 -3609282 -3889625 -4255623 -4672755 -5073292 -5367841
12339 -5367841 -5489141 -5431473 -5239137 -4973531 -4691972 -4423686 -4166320 -3917066 -3683426 -3483578
12329c483578J24648j2450k02552l98455n29398n39869m38500k91525j58408n2624
12319e982711K6182N9258L3564l4780j26570k46664l85193m83727m78972l58698
12309g978311j78286k4810N7304Q1614P1374M4210K8259L7833N6968P6694J09816
12298g617335J54100J81072J79584J74345J93175K27804K40496K23110K08515
12289e835134K15672K21563J93011J28284N0741j5431m7694l8038q290N535k1164
12278e150945q6025j64381k24994k47810k33819j93362j28385l9739N4972J21715
12268f292773J40754J36642J40080J35731R4653L8277K2457N7292Q0650L3308
12258e412929p4221j85278k59940l00714l06440k40205r5128O1804J59355J80736
$$ plain form
12329 -3483578 -3358930 -3371380 -3573932 -3972387 -4501785 -5041654 -5480154 -5771679 -5930087 -5982711
12319 -5982711 -5956529 -5897271 -5863707 -5898487 -6025057 -6271721 -6656914 -7140641 -7619613 -7978311
12309 -7978311 -8156597 -8181407 -8124103 -8042489 -7971115 -7926905 -7898646 -7860813 -7803845 -7727151 -7617335
12298 -7617335 -7463235 -7282163 -7102579 -6928234 -6735059 -6507255 -6266759 -6043649 -5835134
12289 -5835134 -5619462 -5397899 -5204888 -5076604 -5025863 -5041294 -5088988 -5127026 -5135316 -5129781 -5150945
12278 -5150945 -5236970 -5401351 -5626345 -5874155 -6107974 -6301336 -6429721 -6469460 -6414488 -6292773
12268 -6292773 -6152019 -6015377 -5875297 -5739566 -5644913 -5606636 -5584179 -5526887 -5446237 -5412929
12258 -5412929 -5487150 -5672428 -5932368 -6233082 -6539522 -6779727 -6874855 -6813051 -6653696 -6472960
12248f472960J48000J04654J00413J53526K21660K34726J69863O8772j1967l8750
12238e322063j6652R167j8667j17807k44831l29235l23459k42132j45222q2215
12228f833116n6314l0726K2430P8677R4458O7622M1345P2471J74256K88132L38892
12217e741873L03552K20709J36734N2594m7993j37990j67448j16271M183J38703
12207e355100J92161J03996r9392l24759m64380m58942l35372j77609o8969m6104
12197g034470q1453j06434p3462l581N1271P4818Q6361R8316R4872N9857J0823
12186f823082k1968l7562n7067p3299m1244O1746J87694K58914K57090K36490
12176f052288K38600K52875K57903K36963J84837J17584L4056j05574l06541m76091
$$ plain form
12248 -6472960 -6324960 -6220306 -6119893 -5966367 -5744707 -5509981 -5340118 -5271346 -5283313 -5322063
12238 -5322063 -5338715 -5329548 -5348215 -5466022 -5710853 -6040088 -6363547 -6605679 -6750901 -6833116
12228 -6833116 -6889430 -6920156 -6897726 -6819049 -6724591 -6656969 -6615624 -6543153 -6368897 -6080765 -5741873
12217 -5741873 -5438321 -5217612 -5080878 -5028284 -5076277 -5214267 -5381715 -5497986 -5493803 -5355100
12207 -5355100 -5162939 -5058943 -5158335 -5483094 -5947474 -6406416 -6741788 -6919397 -6988366 -7034470
12197 -7034470 -7115923 -7222357 -7295819 -7299400 -7248129 -7173311 -7086950 -6988634 -6893762 -6833905 -6823082
12186 -6823082 -6845050 -6882612 -6939679 -7012978 -7054222 -6992476 -6804782 -6545868 -6288778 -6052288
12176 -6052288 -5813688 -5560813 -5302910 -5065947 -4881110 -4763526 -4729470 -4835044 -5141585 -5617676
12166e617676n04989l84775j90110l476J19303J62935J35480M2368q7186j71420
12156f499546j35021P294J65636K58343K62698K01378J12660L5508q455l0893
12146e630398p0043j39495j91102j59605k3862J70434L33719M00906L62912K45408
12136d701126R1066n0651j39321j65927j60792j62738j81789k00759j92826j36366
12126f001229k5470J22837K69850L63374L59537K68719J49107L1757q9860k04311
12116d755689k80592l04861k88037k51435k14876j90426j77474j61713j26595
12107f751698o5257M848N1017O4580O0867N5337N9919P1313O2060J4949l7378
12096f409443m0902P137N1522M8948N952m6000p7047o6413o923R4073K14693L16590
$$ plain form
12166 -5617676 -6122665 -6507440 -6697550 -6701026 -6581723 -6418788 -6283308 -6240940 -6328126 -6499546
12156 -6499546 -6634567 -6627273 -6461637 -6203294 -5940596 -5739218 -5626558 -5591050 -5599505 -5630398
12146 -5630398 -5700441 -5839936 -6031038 -6190643 -6214505 -6044071 -5710352 -5309446 -4946534 -4701126
12136 -4701126 -4610060 -4660711 -4800032 -4965959 -5126751 -5289489 -5471278 -5672037 -5864863 -6001229
12126 -6001229 -6026699 -5903862 -5634012 -5270638 -4911101 -4642382 -4493275 -4461518 -4551378 -4755689
12116 -4755689 -5036281 -5341142 -5629179 -5880614 -6095490 -6285916 -6463390 -6625103 -6751698
12107 -6751698 -6816955 -6812107 -6761090 -6696510 -6635643 -6580306 -6520387 -6449074 -6387014 -6372065 -6409443
12096 -6409443 -6450345 -6443208 -6391686 -6342738 -6336786 -6382786 -6459833 -6526246 -6533169 -6439096 -6224403 -5907813
12084e907813L68197L67268L41428L31140L45761L54554L34873K88146J99141
12075b977305L5156k00328m42013n97794o28865n86634n38874m87691l96770k61284
12065g082402j08316L1474J16356J12726M6813j8445m6020l1878K949J2948l3705
12054f997500j17696j87552k05870j78592j49871j60525k07303k60119k91073
12045h756101k73006j97807r0335J3934R4633J55286J94276J92330J53135J15191
12035h398464J21597J86742K83016L59430L82824L68055L64575L97707M28870
12026e505648L89929K57844R7090m460k7296j9556k3254l6241m5677n2133n3487
12015e022889k8315L8470J22731J79856J82675J31451M6440l3745o8637o1885
$$ plain form
12084 -5907813 -5539616 -5172348 -4830920 -4499780 -4154019 -3799465 -3464592 -3176446 -2977305
12075 -2977305 -2942149 -3142477 -3584490 -4182284 -4811149 -5397783 -5936657 -6424348 -6821118 -7082402
12065 -7082402 -7190718 -7159244 -7042888 -6930162 -6883349 -6901794 -6947814 -6979692 -6976743 -6963795 -6997500
12054 -6997500 -7115196 -7302748 -7508618 -7687210 -7837081 -7997606 -8204909 -8465028 -8756101
12045 -8756101 -9029107 -9226914 -9317249 -9303315 -9208682 -9053396 -8859120 -8666790 -8513655 -8398464
12035 -8398464 -8276867 -8090125 -7807109 -7447679 -7064855 -6696800 -6332225 -5934518 -5505648
12026 -5505648 -5115719 -4857875 -4760785 -4765245 -4792541 -4812097 -4835351 -4871592 -4917269 -4969402 -5022889
12015 -5022889 -5051204 -5012734 -4890003 -4710147 -4527472 -4396021 -4349581 -4383326 -4451963 -4513848
12005d513848n3358n0937k7434K6371Q5968J26252J46950J55756J53816J49483
11995c800981J42978J09855L7301n9788j62637k54491l07561k80129j51386L8347
11985d688492K10700K98062K77345J95401J24854Q7256O1884M0816L1144K1555
11975c339475j9234j04018k00129k57154k45032j68114p0952j1323j4081p2147
11965d501659j72909k92472l90423m32479m03479l15363k19898j75454j80543
11956g084679j74770j14122j1363R7807J96762K71639K90376K47805J75889Q2873
11946f021783l9092j59158k35239k67168k57368j69835J0270K32346M14081M85210
11936f007736M23225K73617J21656K3868k7585n8975p2168o6016o1495p2299p0616
$$ plain form
12005 -4513848 -4567206 -4618143 -4645577 -4619206 -4533238 -4406986 -4260036 -4104280 -3950464 -3800981
11995 -3800981 -3658003 -3548148 -3510847 -3570635 -3733272 -3987763 -4295324 -4575453 -4726839 -4688492
11985 -4688492 -4477792 -4179730 -3902385 -3706984 -3582130 -3494874 -3432990 -3392174 -3361030 -3339475
11975 -3339475 -3358709 -3462727 -3662856 -3920010 -4165042 -4333156 -4404108 -4415431 -4429512 -4501659
11965 -4501659 -4674568 -4967040 -5357463 -5789942 -6193421 -6508784 -6728682 -6904136 -7084679
11956 -7084679 -7259449 -7373571 -7384934 -7287127 -7090365 -6818726 -6528350 -6280545 -6104656 -6021783
11946 -6021783 -6060875 -6220033 -6455272 -6722440 -6979808 -7149643 -7139373 -6907027 -6492946 -6007736
11936 -6007736 -5584511 -5310894 -5189238 -5165370 -5192955 -5251930 -5324098 -5390114 -5451609 -5523908 -5594524
11925e594524l5473N862K3487K9658M9271O9811O3023K9730J440J9767R9312K07814
11913e030822K97600L28174K67720J25720l9484j79108k78863l23263k86727j76815
11903e295868m9073L5511M8860N277n6541j02103j06599o5145j026N3644Q3620
11892e449443R4358Q9348N3824l8252j91429l53870m42246m22300l39630k50834
11882g250474j76204j25447j05811r7001o2795P813R4623J82317K74547L60357
11872f898075L95017L34508J89506K8871o8209o3015J5924R1561R9250L4890m7638
11861e887410r3004q6161l8950K0184N3753M5263J1942k8835p8868j27757j46771
11850f356614j24562p4780k0480K2739P4172J66071K87235L85982M21992M05521
$$ plain form
11925 -5594524 -5629997 -5624135 -5600648 -5570990 -5521719 -5451908 -5388885 -5359155 -5357715 -5337948 -5238636 -5030822
11913 -5030822 -4733222 -4405048 -4137328 -4011608 -4051092 -4230200 -4509063 -4832326 -5119053 -5295868
11903 -5295868 -5344941 -5309430 -5260570 -5255293 -5311834 -5413937 -5520536 -5585681 -5586707 -5533063 -5449443
11892 -5449443 -5355085 -5265737 -5211913 -5250165 -5441594 -5795464 -6237710 -6660010 -6999640 -7250474
11882 -7250474 -7426678 -7552125 -7657936 -7754937 -7817732 -7809919 -7715296 -7532979 -7258432 -6898075
11872 -6898075 -6503058 -6168550 -5979044 -5950173 -6018382 -6081397 -6065473 -5973912 -5874662 -5839772 -5887410
11861 -5887410 -5980414 -6066575 -6105525 -6085341 -6031588 -5986325 -5974383 -6003218 -6082086 -6209843 -6356614
11850 -6356614 -6481176 -6555956 -6576436 -6553697 -6479525 -6313454 -6026219 -5640237 -5218245 -4812724
11840d812724L74400L49331L33410L17397K78361K03965J05045J781q0864j07446
11830c037344m4735R8170K66651M21113N59065O74620P69532Q91028J077102J287300
11820B962502J453800J564488J645338J699964J699738J602854J386203J078456
11812A5093343P25565L44700o2800m85947q94126j247407j503418j626349j616732
11803H726829j520000j388917j245954j089693r21637p58505o29882n68036n83112
11794B1093o42658o86656o69183n88918m79509l75859k94593k39231k06835j90799
11784d353148j92437k14920k46128k58579k32702j78350j16546n0885L3204J31591
11774e678900K02834K06789J38909L2733n7234r3246q8192q9650j25963j79131
$$ plain form
11840 -4812724 -4438324 -4088993 -3755583 -3438186 -3159825 -2955860 -2850815 -2849034 -2929898 -3037344
11830 -3037344 -3082079 -2983909 -2717258 -2296145 -1737080 -1062460 -292928 598100 1675202 2962502
11820 2962502 4416302 5980790 7626128 9326092 11025830 12628684 14014887 15093343
11812 15093343 15818908 16163608 16100808 15614861 14720735 13473328 11969910 10343561 8726829
11803 8726829 7206829 5817912 4571958 3482265 2560628 1802123 1172241 604205 21093
11794 21093 -621565 -1308221 -1977404 -2566322 -3045831 -3421690 -3716283 -3955514 -4162349 -4353148
11784 -4353148 -4545585 -4760505 -5006633 -5265212 -5497914 -5676264 -5792810 -5843695 -5810491 -5678900
11774 -5678900 -5476066 -5269277 -5130368 -5097635 -5154869 -5248115 -5336307 -5425957 -5551920 -5731051
11764e731051k19385k46371k68078k60814j89357o4135O1147J42822J65505J47327
11754f462390J52159K31287L42652L76509K64271M7402j53496k33664j75626l3176
11744e644072J22028K32685K70052K37934J65726R1064L3254j5871o7229j13403
11734d687832j29746j03708n7018j1580L9885J04401J51950J31190J4848j67168
11724d714778l39692m49429n05223n42407n59760n10857l65721j54926M9004J73889
11714g919900J94890J50790R4152M4217Q964m51M962m931m0373q0387r5828o6903
11702g710798n545M4588N2578L9455M7266P9511J25651K03051L16912M20446M47555
11691e939330L76032K44575J04456k4525j38876k34581l13288l68198l69852k89238
$$ plain form
11764 -5731051 -5950436 -6196807 -6464885 -6725699 -6915056 -6979191 -6918044 -6775222 -6609717 -6462390
11754 -6462390 -6310231 -6078944 -5736292 -5359783 -5095512 -5048110 -5201606 -5435270 -5610896 -5644072
11744 -5644072 -5522044 -5289359 -5019307 -4781373 -4615647 -4524583 -4491329 -4507200 -4574429 -4687832
11734 -4687832 -4817578 -4921286 -4978304 -4989884 -4949999 -4845598 -4693648 -4562458 -4547610 -4714778
11724 -4714778 -5054470 -5503899 -6009122 -6551529 -7111289 -7622146 -7987867 -8142793 -8093789 -7919900
11714 -7919900 -7725010 -7574220 -7480068 -7435851 -7426887 -7427338 -7422376 -7427307 -7467680 -7548067 -7643895 -7710798
11702 -7710798 -7716343 -7671755 -7619177 -7579722 -7532456 -7452945 -7327294 -7124243 -6807331 -6386885 -5939330
11691 -5939330 -5563298 -5318723 -5214267 -5238792 -5377668 -5612249 -5925537 -6293735 -6663587 -6952825
11681f952825j45105Q9J13232K15336L21168L94448M04735L79179L46759L06938
11671d616046K69482K41681J80006K9628k06843m66259o56522o98287n80229l56893
11661f860282j01795J15610K55928L25005L42805L05409K04203N9702q5270j92829
11651e631514k54233k77039k54563j81434q8121k6534j7210l5650o2461j12675
11641f941434j96135k78895l08099k57715j40587l24J25815K31110L10627L50158
11631g105479L51224L36525L39591L77159M08012L68842K57614J38270O7751L4874
11621d425617k4425j51393l14613m31925m35338l28247j78402m4366N8499J15267
11611f160560J01865K8903n6197j14283j27087p9416K2009J18263J28429J3320
$$ plain form
11681 -6952825 -7097930 -7097841 -6984609 -6769273 -6448105 -6053657 -5648922 -5269743 -4922984 -4616046
11671 -4616046 -4346564 -4104883 -3924877 -3895249 -4102092 -4568351 -5224873 -5923160 -6503389 -6860282
11661 -6860282 -6962077 -6846467 -6590539 -6265534 -5922729 -5617320 -5413117 -5353415 -5438685 -5631514
11651 -5631514 -5885747 -6162786 -6417349 -6598783 -6686904 -6713438 -6730648 -6766298 -6828759 -6941434
11641 -6941434 -7137569 -7416464 -7724563 -7982278 -8122865 -8123189 -7997374 -7766264 -7455637 -7105479
11631 -7105479 -6754255 -6417730 -6078139 -5700980 -5292968 -4924126 -4666512 -4528242 -4460491 -4425617
11621 -4425617 -4450042 -4601435 -4916048 -5347973 -5783311 -6111558 -6289960 -6334326 -6275827 -6160560
11611 -6160560 -6058695 -6029792 -6085989 -6200272 -6327359 -6406775 -6384766 -6266503 -6138074 -6124754
11601f124754j95124m00806m87657m01881k07197l7958R047o6996j84390k36698
11591h334414j76221m6655Q0428J62705J90879J74999J21937L4802o8069j60329
11581h019938k23593k46119k16796j27264Q263J49150K56966L17323L37625L25447
11571g438936K77390J83382M2384j21883k70704l73814m30613m58615m54195m06960
11561i452564l37699k66709j83306q2560J5522Q1084Q0594P740r1496j59389j65240
11550a0554023r8049L5085J99352L40659M19137M37420M18178L71151L00094K16972
11540g914024J39259Q3302O1472Q1278J44359K35917L00023K57682R6866r6358
11530f610224k29569k81010k60530j71256m3728P2498J46449J52814Q1118l3678
$$ plain form
11601 -6124754 -6319878 -6720684 -7208341 -7610222 -7817419 -7855377 -7846330 -7913326 -8097716 -8334414
11591 -8334414 -8510635 -8557290 -8476862 -8314157 -8123278 -7948279 -7826342 -7791540 -7859609 -8019938
11581 -8019938 -8243531 -8489650 -8706446 -8833710 -8825447 -8676297 -8419331 -8102008 -7764383 -7438936
11571 -7438936 -7161546 -6978164 -6935780 -7057663 -7328367 -7702181 -8132794 -8591409 -9045604 -9452564
11561 -9452564 -9790263 -10056972 -10240278 -10322838 -10307316 -10226232 -10145638 -10137898 -10229394 -10388783 -10554023
11550 -10554023 -10652072 -10616987 -10417635 -10076976 -9657839 -9220419 -8802241 -8431090 -8130996 -7914024
11540 -7914024 -7774765 -7691463 -7629991 -7548713 -7404354 -7168437 -6868414 -6610732 -6513866 -6610224
11530 -6610224 -6839793 -7120803 -7381333 -7552589 -7596317 -7523819 -7377370 -7224556 -7143438 -7177116
11520g177116j41873k16292k52720k67019k77542k77458k49101j86533r0509L0688
11510i105475J65752L07877M50272N80150O72130O89842O04290M17593J81943
11501e035626o784q9022r9640j10859j55562k07071k15130j44543P878K12904
11491e843455M08915N16615M99560L93739K55872J06790n1019k00277l17951l75381
11481d606592l54663k79672j90188j07712l2674M8322J42058K30107K77109K56446
11471d617459J70367M5608p9321j61827j99621k38030l11889m18960n18342n55118
11461f884592n15156m16458k57749m0718J84759L58211M68420N53469O40848P01155
11451e207811O81778N64472L86562K15397R0256L226n4349n9935J9797J92518
$$ plain form
11520 -7177116 -7318989 -7535281 -7788001 -8055020 -8332562 -8610020 -8859121 -9045654 -9136163 -9105475
11510 -9105475 -8939723 -8631846 -8181574 -7601424 -6929294 -6239452 -5635162 -5217569 -5035626
11501 -5035626 -5042410 -5131432 -5231072 -5341931 -5497493 -5704564 -5919694 -6064237 -6056359 -5843455
11491 -5843455 -5434540 -4917925 -4418365 -4024626 -3768754 -3661964 -3712983 -3913260 -4231211 -4606592
11481 -4606592 -4961255 -5240927 -5431115 -5538827 -5571501 -5523179 -5381121 -5151014 -4873905 -4617459
11471 -4617459 -4447092 -4401484 -4480805 -4642632 -4842253 -5080283 -5392172 -5811132 -6329474 -6884592
11461 -6884592 -7399748 -7816206 -8073955 -8114673 -7929914 -7571703 -7103283 -6549814 -5908966 -5207811
11451 -5207811 -4526033 -3961561 -3574999 -3359602 -3269346 -3266120 -3320469 -3380404 -3360607 -3168089
11441c168089M13554O07814P26336P70597P70607P49290P12355O62615O13866
11432B858945N86862N99212O67738Q02131R89776J175009J273509J247181J137316
11423A1337679J020569R43032Q83082P78039N90186L44224R3858j37235l54254
11414A5499180n46350o81171p42119p43563p19392p05096p22020p74064q58877
11405I006528r65389j058225j098130j089775j075036j063578j025535r41291
11397F89569q16753o78628n62710m78948m00731l05602k07010j38182j12102j09793
11387c120890j20442j45967j73526j79531j51711r6828k2132O3192J36997J61852
11377c648986J05674j5224j45024k35799k54365j92777r9163l5359j5879k9673
$$ plain form
11441 -3168089 -2754535 -2146721 -1420385 -649788 120819 870109 1582464 2245079 2858945
11432 2858945 3445807 4045019 4712757 5514888 6504664 7679673 8953182 10200363 11337679
11423 11337679 12358248 13301280 14184362 14962401 15552587 15896811 15990669 15853434 15499180
11414 15499180 14952830 14271659 13529540 12785977 12066585 11361489 10639469 9865405 9006528
11405 9006528 8041139 6982914 5884784 4795009 3719973 2656395 1630860 689569
11397 689569 -127184 -805812 -1368522 -1847470 -2248201 -2553803 -2760813 -2898995 -3011097 -3120890
11387 -3120890 -3241332 -3387299 -3560825 -3740356 -3892067 -3988895 -4011027 -3947835 -3810838 -3648986
11377 -3648986 -3543312 -3558536 -3703560 -3939359 -4193724 -4386501 -4485664 -4521023 -4536902 -4566575
11367d566575p1055j16415j33182j14286p2258k5665J5418N6357R8195J17337
11357d812129J00485P9173Q0934R3558Q9465M6918l3575j10083j26003p9898k5184
11346d696339J2490N1122R3391J15110J04719P6804M4621O509j8021Q641Q0211
11335d120742J36438J23145L7619q2283j94671k71223k90486k49668j77245j13646
11325e202762q2148q6648j29947k03898k78568l24639l27300k83160j97562q7244
11315g203876K0618R9048J38956J55585J58412J24362L7160p0379j31031r8005
11305f769150j386Q3592J25526J59604K19854K89394L46481L98128M41956M42581
11295d263420L67631K28365Q1368k3115p3542p6707n0273q855M0760P5480O9848
$$ plain form
11367 -4566575 -4637630 -4754045 -4887227 -5001513 -5073771 -5099436 -5084018 -5027661 -4929466 -4812129
11357 -4812129 -4711644 -4632471 -4551537 -4457979 -4368514 -4321596 -4355171 -4465254 -4591257 -4671155 -4696339
11346 -4696339 -4683849 -4632727 -4539336 -4424226 -4319507 -4242703 -4198082 -4191573 -4209594 -4200953 -4120742
11335 -4120742 -3984304 -3861159 -3823540 -3905823 -4100494 -4371717 -4662203 -4911871 -5089116 -5202762
11325 -5202762 -5284910 -5371558 -5501505 -5705403 -5983971 -6308610 -6635910 -6919070 -7116632 -7203876
11315 -7203876 -7183258 -7084210 -6945254 -6789669 -6631257 -6506895 -6469735 -6540114 -6671145 -6769150
11305 -6769150 -6770536 -6686944 -6561418 -6401814 -6181960 -5892566 -5546085 -5147957 -4706001 -4263420
11295 -4263420 -3895789 -3667424 -3586056 -3609171 -3682713 -3759420 -3809693 -3818548 -3777788 -3702308 -3632460
11284c632460J9744o5927j62147k32450k59840k47128j93181q4941O7634J91781
11274d598915K00035Q2010r3122k41095l09013k90718k17019j25122l2334O2067
11264e563226J48444J96738J83296J23146O6653M3344L1099j4118j27347l02371
11254e214342m75680n70748n54184m65231l85181l55679l51655l17386k07071
11245h897157k4052J75523L30295M09189M08410L45847K53625J64521R3021L1043
11235f709735l0777p4191m5518Q3341K50454L60048L81697L63603L72364M17983
11225d630731M49291M19492L27927J95168L0237j51001k94886l48017l19277k61399
11215d583196j98473j16854j0195J05064J91131K23553K42164L05101L97545M45250
$$ plain form
11284 -3632460 -3612716 -3678643 -3840790 -4073240 -4333080 -4580208 -4773389 -4858330 -4790696 -4598915
11274 -4598915 -4398880 -4316870 -4409992 -4651087 -4960100 -5250818 -5467837 -5592959 -5625293 -5563226
11264 -5563226 -5414782 -5218044 -5034748 -4911602 -4844949 -4801605 -4770506 -4784624 -4911971 -5214342
11254 -5214342 -5690022 -6260770 -6814954 -7280185 -7665366 -8021045 -8372700 -8690086 -8897157
11245 -8897157 -8921209 -8745686 -8415391 -8006202 -7597792 -7251945 -6998320 -6833799 -6740778 -6709735
11235 -6709735 -6740512 -6814703 -6860221 -6776880 -6526426 -6166378 -5784681 -5421078 -5048714 -4630731
11225 -4630731 -4181440 -3761948 -3434021 -3238853 -3208616 -3359617 -3654503 -4002520 -4321797 -4583196
11215 -4583196 -4781669 -4898523 -4908718 -4803654 -4612523 -4388970 -4146806 -3841705 -3444160 -2998910
11205b998910M02468K85540J46364L8000j9237m4673o7964j03354j44533j76486
11195b682785j93309j94203j76136j37266q2572k7372O195O120k3653q0499j57164
11184c742644k35249k95938l21130l05288k66047k26255j87899j40135p8668k971
11174e802224Q1921J50983J72832J51242J20315R4734N4172j4473p6494p7282
11164e144274o265Q6273J39127J39908J09418N7025j9462j26676k54929l53608
11154e373463l63541k77535j44911k4434N2020Q1696O8923J7915o4527j63828
11144f191685k49599l02626l31553l38917l17516k82532k52028k25332k01055
11135h692843j89145j91504j90495j79088j70302j61429j13547Q207J85132L58373
$$ plain form
11205 -2998910 -2596442 -2310902 -2164538 -2126538 -2145775 -2190448 -2258412 -2361766 -2506299 -2682785
11195 -2682785 -2876094 -3070297 -3246433 -3383699 -3466271 -3493643 -3487448 -3481328 -3504981 -3585480 -3742644
11184 -3742644 -3977893 -4273831 -4594961 -4900249 -5166296 -5392551 -5580450 -5720585 -5799253 -5802224
11174 -5802224 -5720303 -5569320 -5396488 -5245246 -5124931 -5030197 -4976025 -4990498 -5066992 -5144274
11164 -5144274 -5150539 -5064266 -4925139 -4785231 -4675813 -4618788 -4638250 -4764926 -5019855 -5373463
11154 -5373463 -5737004 -6014539 -6159450 -6183884 -6131864 -6050168 -5981245 -5963330 -6027857 -6191685
11144 -6191685 -6441284 -6743910 -7075463 -7414380 -7731896 -8014428 -8266456 -8491788 -8692843
11135 -8692843 -8881988 -9073492 -9263987 -9443075 -9613377 -9774806 -9888353 -9880146 -9695014 -9336641
11125i336641M69082M91109M52927M10452L93087L99657M18347M25199L96429
11116e480352L36527K74401K30726K00806J76490J59272J49500J26515M8461q8472
11106c866126k21882k98732l34847l75151m30375m52177l77493k13802m2506P8724
11096f534367J72729K86387M14697N06230N19012M44815K98673J21635k1488q6645
11086c878322q6734o6625o2897q8791j19806j17486q1970l8680J2040Q8481J95781
11075d245009L16843M08120M06012K75493N7451j55566k94399l54500l71409l85341
11065d342305m13994m31905l96571l06462j94563q3070J7096R6595J62859K19310
11055e673010K37860J89157Q3662m5775j78341k90818l51040l28389k11082k4047
$$ plain form
11125 -9336641 -8867559 -8376450 -7923523 -7513071 -7119984 -6720327 -6301980 -5876781 -5480352
11116 -5480352 -5143825 -4869424 -4638698 -4437892 -4261402 -4102130 -3952630 -3826115 -3777654 -3866126
11106 -3866126 -4088008 -4386740 -4721587 -5096738 -5527113 -5979290 -6356783 -6570585 -6613091 -6534367
11096 -6534367 -6361638 -6075251 -5660554 -5154324 -4635312 -4190497 -3891824 -3770189 -3791677 -3878322
11086 -3878322 -3965056 -4031681 -4094578 -4183369 -4303175 -4420661 -4502631 -4541311 -4529271 -4440790 -4245009
11075 -4245009 -3928166 -3520046 -3114034 -2838541 -2781090 -2936656 -3231055 -3585555 -3956964 -4342305
11065 -4342305 -4756299 -5188204 -5584775 -5891237 -6085800 -6168870 -6151774 -6055179 -5892320 -5673010
11055 -5673010 -5435150 -5245993 -5162331 -5208106 -5386447 -5677265 -6028305 -6356694 -6567776 -6591823
11045f591823J83826L50096L96914K86063R7978k5215k9306K5773P4471J26730
11035e104493K19951L34417M15269M26563L53708K02424O355j89950l60240m92047
11025d188043n75213o13534o21524o10525n73910m84555l42443j97884p8217M7113
11015h238735J79419K63133K78361K71506K78200K73739K15397J12365J2163o4204
11005f418656j17220j28866p5679L3380J49984K28173K69207L10153L83944M74491
10995d891089N28922N19698M46383L10694J34227k6943j33831k02185k54834k81584
10985c850542k74372k68295l03076l62531l87785l50456l05584l29279m01022
10976f832942m05538k51416M6496L82641O41061P68026P65516O55283M68999K53712
$$ plain form
11045 -6591823 -6407997 -6057901 -5660987 -5374924 -5276946 -5302161 -5331467 -5305694 -5231223 -5104493
11035 -5104493 -4884542 -4550125 -4134856 -3708293 -3354585 -3152161 -3145806 -3335756 -3695996 -4188043
11025 -4188043 -4763256 -5376790 -5998314 -6608839 -7182749 -7667304 -8009747 -8207631 -8285848 -8238735
11015 -8238735 -8059316 -7796183 -7517822 -7246316 -6968116 -6694377 -6478980 -6366615 -6354452 -6418656
11005 -6418656 -6535876 -6664742 -6740421 -6707041 -6557057 -6328884 -6059677 -5749524 -5365580 -4891089
10995 -4891089 -4362167 -3842469 -3396086 -3085392 -2951165 -2978108 -3111939 -3314124 -3568958 -3850542
10985 -3850542 -4124914 -4393209 -4696285 -5058816 -5446601 -5797057 -6102641 -6431920 -6832942
10976 -6832942 -7238480 -7489896 -7443400 -7060759 -6419698 -5651672 -4886156 -4230873 -3761874 -3508162
10966c508162O9196n5352j44886k34371l36357m36587m86637m40449l05193j27802
10956f006600M2316J70511K48199K85399K86846K56361K09062J57989J06244N2286
10946d191387j679m9593r2774j38762k02864k96800l95915m52146m46802m04613
10936f673335l53134k84395j80297p2017k2076m7746j07378j41711j13200k7922
10926h023211O6326J12451R7238O2666N2156O4686O5181K4972n0551j23486j48089
10915g799661r7975J0007J13763J57939J40030J00944Q5608J01763J27276J40776
10905f919530J19437M5626o2061j34394j07342O143J38342K40539K96042L01412
10895f075786K80866K60000K10044R3848m8133j35728j37608q1564r593N5371
$$ plain form
10966 -3508162 -3438966 -3494318 -3639204 -3873575 -4209932 -4646519 -5133156 -5573605 -5878798 -6006600
10956 -6006600 -5964284 -5793773 -5545574 -5260175 -4973329 -4716968 -4507906 -4349917 -4243673 -4191387
10946 -4191387 -4193066 -4242659 -4335433 -4474195 -4677059 -4973859 -5369774 -5821920 -6268722 -6673335
10936 -6673335 -7026469 -7310864 -7491161 -7563178 -7585254 -7633000 -7740378 -7882089 -7995289 -8023211
10926 -8023211 -7956885 -7844434 -7747196 -7684530 -7632374 -7567688 -7502507 -7477535 -7528086 -7651572 -7799661
10915 -7799661 -7897636 -7887629 -7773866 -7615927 -7475897 -7374953 -7289345 -7187582 -7060306 -6919530
10905 -6919530 -6800093 -6754467 -6816528 -6950922 -7058264 -7052121 -6913779 -6673240 -6377198 -6075786
10895 -6075786 -5794920 -5534920 -5324876 -5231028 -5279161 -5414889 -5552497 -5634061 -5643654 -5588283
10885e588283J00226J04322N3084m2335j42914k04632k24582k38584k61197k69213
10875f714108k41683j86821j35577j09260j01755j05448j27201j59465j55342
10866h036660p8677L8615J34844J76568J62082J21829J09258J41283J76626J77899
10856f876333J52523J31250J35556J62230J95307K29008K56205K58333K25292
10847e130629J51127L0084j25765k81638l85639l98900l32355k31187j33252n3650
10837f891804J3663Q1615J51347K02656K00035J32939M7830M039J7814P0836J33027
10826e836003J65932J40034O0514m4065j40923j94242j94039j72063j60169j66353
10816f541377j92902k38593k87746l15237k89776j75331L1057K58021M04793M27094
$$ plain form
10885 -5588283 -5488057 -5383735 -5330651 -5372986 -5515900 -5720532 -5945114 -6183698 -6444895 -6714108
10875 -6714108 -6955791 -7142612 -7278189 -7387449 -7489204 -7594652 -7721853 -7881318 -8036660
10866 -8036660 -8115337 -8076722 -7941878 -7765310 -7603228 -7481399 -7372141 -7230858 -7054232 -6876333
10856 -6876333 -6723810 -6592560 -6457004 -6294774 -6099467 -5870459 -5614254 -5355921 -5130629
10847 -5130629 -4979502 -4949418 -5075183 -5356821 -5742460 -6141360 -6473715 -6704902 -6838154 -6891804
10837 -6891804 -6878141 -6796526 -6645179 -6442523 -6242488 -6109549 -6061719 -6057680 -6039866 -5969030 -5836003
10826 -5836003 -5670071 -5530037 -5469523 -5513588 -5654511 -5848753 -6042792 -6214855 -6375024 -6541377
10816 -6541377 -6734279 -6972872 -7260618 -7575855 -7865631 -8040962 -8009905 -7751884 -7347091 -6919997
10806f919997L48237K23339J06707R471j03917k47684l71671m16401l80376k95793
10796h048085j73099j6249J46778K73491L30388L14652K53292J94281J81377K07341
10786f335833K22188J97257J49270R8942M5335j4824p6857j36585j90836k14736
10776f256679j50497K2553K17221L08824K52509Q6218j25222l08500l84228l33092
10766f670893k23513j21400m5530N194M2401P3162P4241J1478j07845k13112k21838
10755g397655j25538k342O7569P3030N7508P3516J51434K58595L17183K95417
10745f231283K25746J38758M5481n2632j67139k87187l67375l71421l10299k43271
10735g620622k23249k44428k66261k74559k83735k78649k22194j18444j0430N7510
$$ plain form
10806 -6919997 -6571760 -6348421 -6241714 -6232243 -6336160 -6583844 -6955515 -7371916 -7752292 -8048085
10796 -8048085 -8221184 -8237433 -8090655 -7817164 -7486776 -7172124 -6918832 -6724551 -6543174 -6335833
10786 -6335833 -6113645 -5916388 -5767118 -5668176 -5622841 -5637665 -5714522 -5851107 -6041943 -6256679
10776 -6256679 -6407176 -6384623 -6167402 -5858578 -5606069 -5519851 -5645073 -5953573 -6337801 -6670893
10766 -6670893 -6894406 -7015806 -7061336 -7056142 -7013741 -6940579 -6866338 -6854860 -6962705 -7175817 -7397655
10755 -7397655 -7523193 -7525535 -7457966 -7384936 -7327428 -7253912 -7102478 -6843883 -6526700 -6231283
10745 -6231283 -6005537 -5866779 -5821298 -5873930 -6041069 -6328256 -6695631 -7067052 -7377351 -7620622
10735 -7620622 -7843871 -8088299 -8354560 -8629119 -8912854 -9191503 -9413697 -9532141 -9542571 -9485061
10725i485061O0378L1255M8947J34520K26368K75505K94971L12886L31083L31212
10715g437936K98815K34819J47719L9088q3660j84915k31568k29563k03584j70953
10705g821738j47086j36916j22418q1880j0812P4644J36754J44137J10920R2551
10695g761844J33995K20234K99552L40533L37057K81455J70319K4449j11507j93871
10685f259628k13250j99170j89232j89450j71481j22590p9095q8690j55155k25686
10675g893427k28209j32887L0253K13342L71351M49152M07324K76670J48222R6932
10665f261277J33198K08295K57525K52159K07103J42446O0643l2630j21280k04567
10655e358385k85548l38833l21532k18616p5795M0624Q9383O4099l618p7358j30769
$$ plain form
10725 -9485061 -9424683 -9393428 -9344481 -9209961 -8983593 -8708088 -8413117 -8100231 -7769148 -7437936
10715 -7437936 -7139121 -6904302 -6756583 -6717495 -6801155 -6986070 -7217638 -7447201 -7650785 -7821738
10705 -7821738 -7968824 -8105740 -8228158 -8310038 -8320850 -8246206 -8109452 -7965315 -7854395 -7761844
10695 -7761844 -7627849 -7407615 -7108063 -6767530 -6430473 -6149018 -5978699 -5954250 -6065757 -6259628
10685 -6259628 -6472878 -6672048 -6861280 -7050730 -7222211 -7344801 -7423896 -7512586 -7667741 -7893427
10675 -7893427 -8121636 -8254523 -8224270 -8010928 -7639577 -7190425 -6783101 -6506431 -6358209 -6261277
10665 -6261277 -6128079 -5919784 -5662259 -5410100 -5202997 -5060551 -4999908 -5032538 -5153818 -5358385
10655 -5358385 -5643933 -5982766 -6304298 -6522914 -6598709 -6558085 -6468702 -6404603 -6408221 -6485579 -6616348
10644f616348j31852q1250l3082l3320o9826q3690l0667N8848J12509R2398K2479
10633f793801m8098r3050j21106j53518j92000k10396j80608j00995J2299J27391
10623g753882J95385J91150J38182P9503M0847K2775J3529L23j1980P209Q0295
10612f996664J75102K35514K56297K70598K75783K24954R6125p2224k16888l05391
10602f056794l39365l11815k19566j04327k6244p433j6556j4008P550L9669P4424
10591f974465R6371Q9107N8874K9714P844j6055l9785n2533m9780l6043j4789
10580f901540O693R862j8713o9903j12908j27462j18102q0210O131J41131K92789
10569f972232M12865M50926L77108K17242M8450n3869n9212N705Q4614J34537
$$ plain form
10644 -6616348 -6748200 -6829450 -6862532 -6895852 -6965678 -7049368 -7080035 -7021187 -6908678 -6816280 -6793801
10633 -6793801 -6841899 -6934949 -7056055 -7209573 -7401573 -7611969 -7792577 -7893572 -7881273 -7753882
10623 -7753882 -7558497 -7367347 -7229165 -7149662 -7108815 -7086040 -7072511 -7072188 -7084168 -7076959 -6996664
10612 -6996664 -6821562 -6586048 -6329751 -6059153 -5783370 -5558416 -5462291 -5534515 -5751403 -6056794
10602 -6056794 -6396159 -6707974 -6927540 -7031867 -7058111 -7065544 -7082100 -7096108 -7088558 -7048889 -6974465
10591 -6974465 -6878094 -6788987 -6730113 -6700399 -6692555 -6708610 -6748395 -6800928 -6850708 -6886751 -6901540
10580 -6901540 -6894847 -6884985 -6903698 -6973601 -7086509 -7213971 -7332073 -7412283 -7406152 -7265021 -6972232
10569 -6972232 -6559367 -6108441 -5731333 -5514091 -5465641 -5519510 -5578722 -5573017 -5488403 -5353866
10559e353866J44042J25365Q8936K6701o4580j41005j35338k8869J36626K92330
10549d909658L62193L10117J76773J8125j56238l48091n12673n73156n04907l76577
10539f514092k81524k33032j59024k2452J21081K07383K11521J20678o2301k92604
10529f904366m88770n67015m91254l06958j01648O4232J73716K28819K45440K48118
10519g899686K40356J97276J09488J4524l7523l1136L2J2129Q934Q778l046l3856
10507g413730n6508l7894L8295J59762K82383L52564L34137K28858Q7541l2863
10497f057455j27421k27275l49629m78187n67289n76818n16941m25529l22113
10488i648657k07228p1244Q8860K43224L37526L34710K47675J26663J5989n4829
$$ plain form
10559 -5353866 -5209824 -5084459 -4995523 -4968822 -5033402 -5174407 -5309745 -5338614 -5201988 -4909658
10549 -4909658 -4547465 -4237348 -4060575 -4042450 -4198688 -4546779 -5059452 -5632608 -6137515 -6514092
10539 -6514092 -6795616 -7028648 -7187672 -7210124 -7089043 -6881660 -6670139 -6549461 -6611762 -6904366
10529 -6904366 -7393136 -7960151 -8451405 -8758363 -8860011 -8795779 -8622063 -8393244 -8147804 -7899686
10519 -7899686 -7659330 -7462054 -7352566 -7338042 -7375565 -7406701 -7406669 -7394540 -7385606 -7376828 -7379874 -7413730
10507 -7413730 -7470238 -7508132 -7469837 -7310075 -7027692 -6675128 -6340991 -6112133 -6024592 -6057455
10497 -6057455 -6184876 -6412151 -6761780 -7239967 -7807256 -8384074 -8901015 -9326544 -9648657
10488 -9648657 -9855885 -9927129 -9838269 -9595045 -9257519 -8922809 -8675134 -8548471 -8532482 -8587311
10478h587311n2075L9609J80675L00516L50488L35132K93750K59767K50963K61973
10468f366513K53257J83450O2177m7278q9795o2930R255J12204K22405K77118
10458e446650K21589R3304P011L5210J42145K44481K92452K88776K57951K11740
10448c651991J48335N2005q4002k27377l34783l81907l63594k97353k15055j36619
10438e492341n4378N5455J89175K97504L38132L20515K65810J55102l1089k50925
$$ plain form
10478 -8587311 -8639386 -8599777 -8419102 -8118586 -7768098 -7432966 -7139216 -6879449 -6628486 -6366513
10468 -6366513 -6113256 -5929806 -5867629 -5914907 -6004702 -6067632 -6058377 -5946173 -5723768 -5446650
10458 -5446650 -5225061 -5131757 -5124746 -5089536 -4947391 -4702910 -4410458 -4121682 -3863731 -3651991
10448 -3651991 -3503656 -3451651 -3535653 -3763030 -4097813 -4479720 -4843314 -5140667 -5355722 -5492341
10438 -5492341 -5546719 -5491264 -5302089 -5004585 -4666453 -4345938 -4080128 -3925026 -3956115 -4207040
$$ [...]
##END NTUPLES=NMR SPECTRUM
##END=
