##TITLE=1H ikalashn
Pr-3
20.12.2024
##JCAMPDX= 6.0         $$ Bruker NMR JCAMP-DX V2.0
##DATA TYPE= NMR FID
##DATA CLASS= NTUPLES
##ORIGIN= UXNMR, Bruker Analytische Messtechnik GmbH
##OWNER= root
$$ TOPSPIN		Version 1.3
$$ 2024-12-20 15:19:32.781 +0400  Irina@DPX200
$$ Compression mode = diff/dup
##.OBSERVE FREQUENCY= 200.131300845
##.OBSERVE NUCLEUS= ^1H
##.DELAY= (6, 6)
##.ACQUISITION MODE= SIMULTANEOUS
##.ACQUISITION SCHEME= undefined
##.AVERAGES= 8
##.DIGITISER RES= 18
##SPECTROMETER/DATA SYSTEM= spect
##.PULSE SEQUENCE= zg
##.SOLVENT NAME= Acetone
##.SHIFT REFERENCE= INTERNAL, Acetone, 1, 17.49637
##AUDIT TRAIL= $$ (NUMBER, WHEN, WHO, WHERE, WHAT)
$$ ##TITLE= Audit trail, TOPSPIN		Version 1.3
$$ ##JCAMPDX= 5.01
$$ ##ORIGIN= Bruker BioSpin GmbH
$$ ##OWNER= Irina
$$ $$ F:/spectra/data/iren/nmr/1H/4/audita.txt
$$ ##AUDIT TRAIL=  $$ (NUMBER, WHEN, WHO, WHERE, VERSION, WHAT)
(   1,<2024-12-20 15:19:03.500 +0400>,<Irina>,<DPX200>,<TOPSPIN 1.3>,
      <created by zg
	started at 2024-12-20 15:18:26.125 +0400,
	POWCHK disabled, PULCHK disabled
       configuration hash MD5:
       BE 6D 3F 07 2A EA 11 49 91 17 2B D3 AF B3 58 0D
       data hash MD5: 16K
       4A 22 E4 E6 64 25 53 08 FC C4 A4 B2 C9 E2 F0 90>)
$$ ##END=
$$ 
$$ $$ hash MD5
$$ $$ 5B BD FD 03 A6 29 75 D6 29 80 1E 64 12 50 38 64
##$RELAX= 
##$RELAX= 
##$RELAX= 
##$RELAX= 
##$RELAX= 
##$RELAX= 
##$RELAX= 
##$RELAX= 
##$RELAX= 
$$ Bruker specific parameters
$$ --------------------------
##$DU= <F:/spectra>
##$EXPNO= 4
##$NAME= <1H>
##$PROCNO= 1
##$TYPE= <nmr>
##$USER= <iren>
##$AMP= (0..31)
100 100 100 100 100 100 100 100 100 100 100 100 100 100 100 100 100 100 
100 100 100 100 100 100 100 100 100 100 100 100 100 100 
##$ANAVPT= -1
##$AQSEQ= 0
##$AQ_mod= 1
##$AUNM= <au_zg>
##$AUTOPOS= <>
##$BF1= 200.13
##$BF2= 200.13
##$BF3= 200.13
##$BF4= 200.13
##$BF5= 200.13
##$BF6= 200.13
##$BF7= 200.13
##$BF8= 200.13
##$BYTORDA= 1
##$CFDGTYP= 0
##$CFRGTYP= 5
##$CHEMSTR= <none>
##$CNST= (0..63)
1 1 145 1 1 1 1 1 1 1 1 1 1 1 1 1 1 1 1 1 1 1 1 1 1 1 1 1 1 1 1 1 1 1 
1 1 1 1 1 1 1 1 1 1 1 1 1 1 1 1 1 1 1 1 1 1 1 1 1 1 1 1 1 1 
##$CPDPRG= <>
##$CPDPRG1= <>
##$CPDPRG2= <>
##$CPDPRG3= <>
##$CPDPRG4= <mlev>
##$CPDPRG5= <mlev>
##$CPDPRG6= <mlev>
##$CPDPRG7= <mlev>
##$CPDPRG8= <mlev>
##$CPDPRGB= <>
##$CPDPRGT= <>
##$D= (0..63)
0 2 0 0 0 0 0 0 0 0.06 0 0.03 0 0 0 0 0.0002 0 0 0 0 0 0 0 0 0 0 0 0 0 
0 0 0 0 0 0 0 0 0 0 0 0 0 0 0 0 0 0 0 0 0 0 0 0 0 0 0 0 0 0 0 0 0 0 
##$DATE= 1734693539
##$DBL= (0..7)
120 120 120 120 120 120 120 120 
##$DBP= (0..7)
150 150 150 150 150 150 150 150 
##$DBP07= 0
##$DBPNAM0= <>
##$DBPNAM1= <>
##$DBPNAM2= <>
##$DBPNAM3= <>
##$DBPNAM4= <>
##$DBPNAM5= <>
##$DBPNAM6= <>
##$DBPNAM7= <>
##$DBPOAL= (0..7)
0.5 0.5 0.5 0.5 0.5 0.5 0.5 0.5 
##$DBPOFFS= (0..7)
0 0 0 0 0 0 0 0 
##$DE= 6
##$DECBNUC= <off>
##$DECIM= 32
##$DECNUC= <off>
##$DECSTAT= 4
##$DIGMOD= 1
##$DIGTYP= 9
##$DL= (0..7)
0 120 120 120 120 120 120 120 
##$DP= (0..7)
150 150 150 150 150 150 150 150 
##$DP07= 0
##$DPNAME0= <>
$$ [...]
##$SW= 21.9926040160658
##$SWIBOX= (0..15)
0 0 2 0 0 0 0 0 0 0 0 0 0 0 0 0 
##$SW_h= 4401.40845070422
##$TD= 16384
##$TD0= 1
##$TE= 300
##$TE2= 300
##$TE3= 300
##$TEG= 300
##$TL= (0..7)
0 120 120 120 120 120 120 120 
##$TP= (0..7)
150 150 150 150 150 150 150 150 
##$TP07= 0
##$TPNAME0= <>
##$TPNAME1= <>
##$TPNAME2= <>
##$TPNAME3= <>
##$TPNAME4= <>
##$TPNAME5= <>
##$TPNAME6= <>
##$TPNAME7= <>
##$TPOAL= (0..7)
0.5 0.5 0.5 0.5 0.5 0.5 0.5 0.5 
##$TPOFFS= (0..7)
0 0 0 0 0 0 0 0 
##$TUNHIN= 0
##$TUNHOUT= 0
##$TUNXOUT= 0
##$USERA1= <user>
##$USERA2= <user>
##$USERA3= <user>
##$USERA4= <user>
##$USERA5= <user>
##$V9= 5
##$VALIST= <valist>
##$VCLIST= <CCCCCCCCCCCCCCC>
##$VD= 0
##$VDLIST= <DDDDDDDDDDDDDDD>
##$VPLIST= <PPPPPPPPPPPPPPP>
##$VTLIST= <TTTTTTTTTTTTTTT>
##$WBST= 1024
##$WBSW= 25
##$XGAIN= (0..3)
0 0 0 0 
##$XL= 0
##$YL= 0
##$YMAX_a= 479506
##$YMIN_a= -631880
##$ZGOPTNS= <>
##$ZL1= 120
##$ZL2= 120
##$ZL3= 120
##$ZL4= 120
##$ABSF1= 10
##$ABSF2= 0
##$ABSG= 5
##$ABSL= 3
##$ALPHA= 0
##$AQORDER= 0
##$ASSFAC= 0
##$ASSFACI= 0
##$ASSFACX= 0
##$ASSWID= 0
##$AUNMP= <proc_1d>
##$AXLEFT= 0
##$AXRIGHT= 0
##$AXTYPE= 0
##$AXUNIT= <>
##$AZFE= 0.1
##$AZFW= 0.1
##$BCFW= 1
##$BC_mod= 2
##$BYTORDP= 1
##$COROFFS= 0
##$CY= 7568.61572265625
##$DATMOD= 1
##$DC= 2
##$DFILT= <>
##$DTYPP= 0
##$F1P= 17.9538593292236
##$F2P= -4.03888763876832
##$FCOR= 0.5
##$FTSIZE= 32768
##$FT_mod= 4
##$GAMMA= 1
##$GB= 1
##$INTBC= 1
##$INTSCL= 1
##$ISEN= 128
##$LB= 0.02
##$LEV0= 0
##$LPBIN= 0
##$MAXI= 945.577
##$MC2= 0
##$MEAN= 0
##$ME_mod= 0
##$MI= -402.1523
##$NCOEF= 0
##$NC_proc= 0
##$NLEV= 6
##$NOISF1= 8.587773
##$NOISF2= 6.764455
##$NSP= 1
##$NTH_PI= 0
##$NZP= 0
##$OFFSET= 17.49637
##$PC= 1
##$PHC0= 358.5127
##$PHC1= -17.70145
##$PH_mod= 0
##$PKNL= yes
##$PPARMOD= 0
##$PPDIAG= 0
##$PPIPTYP= 0
##$PPMPNUM= 100
##$PPRESOL= 1
##$PSCAL= 0
##$PSIGN= 0
##$REVERSE= no
##$SF= 200.13
##$SI= 32768
##$SIGF1= 18.5376
##$SIGF2= -6.396296
##$SINO= 400
##$SIOLD= 32768
##$SREGLST= <1H.CDCl3>
##$SSB= 3
##$STSI= 0
##$STSR= 0
##$SW_p= 4401.40845070422
##$SYMM= 0
##$S_DEV= 0
##$TDeff= 0
##$TDoff= 0
##$TI= <>
##$TILT= no
##$TM1= 0
##$TM2= 0
##$TOPLEV= 0
##$USERP1= <user>
##$USERP2= <user>
##$USERP3= <user>
##$USERP4= <user>
##$USERP5= <user>
##$WDW= 1
##$XDIM= 8192
##$YMAX_p= 0
##$YMIN_p= 0
$$ End of Bruker specific parameters
$$ ---------------------------------
##NTUPLES= NMR FID
##VAR_NAME=  TIME,          FID/REAL,        FID/IMAG
##SYMBOL=    X,             R,               I
##VAR_TYPE=  INDEPENDENT,   DEPENDENT,       DEPENDENT
##VAR_FORM=  AFFN,          ASDF,            ASDF
##VAR_DIM=   8192,          8192,            8192
##UNITS=     SECONDS,       ARBITRARY UNITS, ARBITRARY UNITS
##FACTOR=    0.0002272,     1,               1
##FIRST=     0,             0,               0
##LAST=      1.8609952,     17,              -10
##MIN=       0,             -631880,         -631880
##MAX=       1.8609952,     479506,          479506
$$ Real data points
##PAGE= N=1
##DATA TABLE= (X++(R..R)), XYDATA
0@%%%%%%%QrRj6J7k5L3l6M5o0P6r3J12j37J62j95K36k72L15l70M30m94N70o54
31c48P47q50R61j088J232j384J548j735J937k158K403k667K956l273L618l995
47b096M407m859N353n896O496p157P892q715R640j0685J1878j3255J4866j6783
61h914J9103k1982K5669l0579L7476m7942O5882j04691L26694l18323n44017P62493
73A60869J19238m33671J35488K71846m66287p1634N15319L8333l96094Q901M2577
84g5115j762L03177L4881n65448K10N86928r0618m31867K94743J51617n19166
95c12420R5803O96123k56001p02968K90533N28847k63185k12302K14250j07096
105b8416j83092L08440J42703l08273o4836J32064p1940J30498K29158l57650
$$ plain form
0 0 0 0 0 0 0 0 0 8 -1 8 -8 9 -16 17 -19 26 -34 42 -51 61 -76 86 -109 127 -145 170 -200 230 -264 306 -348
31 -348 399 -451 510 -578 654 -730 818 -917 1020 -1138 1265 -1402 1554 -1719 1899 -2096
47 -2096 2311 -2548 2805 -3091 3405 -3752 4140 -4575 5065 -5620 6258 -6997 7869 -8914
61 -8914 10189 -11793 13876 -16703 20773 -27169 38713 -65978 260716 -57607 -601624 160869
73 160869 280107 -153564 -18076 253770 -212517 -284151 231168 269501 -126593 -117692 -75115
84 -75115 -76877 226300 261181 -304267 -304057 282871 192253 -239614 55129 206746 -312420
95 -312420 -216617 479506 223505 -479463 -188930 339917 76732 -135570 78680 -28416
105 -28416 -211508 96932 239635 -68638 -133474 -1410 -73350 57148 286306 -71344
115g1344l35698M72828L14215m63974j42146L81260j31197k87491L97165K19007
125C52625n43704j67770N12168J01545l27455o59Q1004j14259J19586J87289k05399
136e029j61054J72948J9013p2608J94589l1828l90147J02482M77785j42435m15415
147b51699J79791K30878k35439o061K99034j67114l30608K32315K87899j91649
157D7347j59340R3143j8366M005J73573o4426k35806Q9950J74775j06325j7893
168a9363J34954j63774j71231K93239J84816l25981j42284K68189L4812j64968
178g1591J07306O9320k25197j2217K62660q937j98001J7664N8123l4204R5058
189E9984N6926j96860o2903K12307K6223j50137N8612N1767j65514L5744K46867
$$ plain form
115 -71344 -407042 65786 380001 -83973 -226119 155141 23944 -263547 133618 352625
125 352625 -191079 -358849 153319 254864 -72591 -73250 7754 -106505 13081 200370 -5029
136 -5029 -166083 6865 25878 -46730 147859 116031 -274116 -171634 306151 163716 -251699
147 -251699 -71908 158970 -76469 -82530 216504 49390 -281218 -48903 238996 47347
157 47347 -111993 -18850 -37216 -33211 140362 75936 -159870 -69920 104855 -1470 -19363
168 -19363 115591 -48183 -219414 73825 258641 -67340 -209624 58565 93377 -71591
178 -71591 35715 105035 -120162 -132379 130281 121344 -76657 -58993 -870 -35074 59984
189 59984 116910 -79950 -142853 69454 95677 -54460 4152 55919 -109595 -73851 173016
200A73016q5426k59168R9113J89068r7297o2681R8369o6829j03572J47029R7068
211A28690j52054o0780R2888p813o812Q7773o5609j42952J01614J42226j03355
222A3816p8931Q9147k2954p6634J20221O9602j72188n7893J61394K8095j00351
233b6676K2163K2225p7896L8811J12823o4673j04824N8961N0822l9288K8790K2675
245D3913r9766j4196J31514O455j12981J1461N7215m2551P455P6606n3658r4906
257h3439O8319Q2281n6384l8062L3646k1277j5047P0437N626q8166k74O8600r404
270A6856k3661K6573k4340m5442N5266N4063o0441m2862M5023J1998k2404K7094
282A7723N064n7331K490O4910m000m7005O593J3247j4306K0086K4502l8975k9698
$$ plain form
200 173016 87590 -171578 -72465 116603 19306 -43375 54994 -11835 -115407 31622 128690
211 128690 -23364 -84144 8744 931 -5881 81892 16283 -126669 -25055 117171 13816
222 13816 -65115 24032 1078 -75556 44665 114267 -57921 -115814 45580 73675 -26676
233 -26676 -4513 17712 -60184 -21373 91450 26777 -78047 -19086 31736 -7552 21238 43913
245 43913 -55853 -70049 61465 67920 -45061 -33600 23615 -18936 -11481 65125 11467 -83439
257 -83439 -15120 67161 10777 -27285 6361 -14916 -29963 40474 46100 -42066 -42340 26260 16856
270 16856 -6805 19768 -4572 -50014 5252 59315 -1126 -43988 1035 13033 -9371 17723
282 17723 22787 -34544 -32054 32856 28856 -18149 -11556 1691 -12615 7471 31973 -7002 -36700
295c6700L8453K3112k3747m425N779j9194O098L6682q955l9439O336K6334m378
308E956m248O761j5978j2363K5925J6057k3120j3347J2038L452j05R553o711j9250
322a5380O937K0655l370j3253M57J102q48R600M102j4250p187J1801P123n059
336B430l071j471l185M552Q273l653r457O65O386J638j026j580l680n20N497K944
352D742m197l965J283K899J203l93j943k022R13L085Q08k538j877J029J711L50
368A088n44q72q34N35J627J94j587p00R97O89l10k95k6k59k7O83K46r14l71J066
388C86K64j227J26J325p27j181J392O38k072M09K404j650k233K853J269l620M66
405a178L622k607k674M547P33n558J905N230m634l371O645J65p102L702N580p266
$$ plain form
295 -36700 1753 24865 1118 -3307 2472 -16722 -10624 26058 17103 -22336 -16000 10334 5956
308 5956 1708 8469 -7509 -19872 6053 22110 -1010 -14357 -2319 1133 1028 10581 3870 -15380
322 -15380 -8443 12212 8842 -4411 -3954 -2852 -3700 5900 10002 -4248 -11435 366 7489 2430
336 2430 -641 -2112 -5297 -745 7528 3875 -5582 -4917 1469 3107 2081 501 -3179 -3699 1798 4742
352 4742 545 -3420 -2137 762 1965 1572 -371 -2393 -1480 1605 2413 -125 -2002 -973 738 1088
368 1088 544 -328 -1162 -627 1000 1194 -393 -1093 -96 593 283 -12 -38 -297 -324 359 605 -309 -680 386
388 386 650 -577 -451 874 147 -1034 358 996 -1076 -667 1737 87 -2146 707 1976 -1644 -1178
405 -1178 2444 -163 -2837 1710 2443 -3115 -1210 4020 -614 -3985 2660 2825 -4277 -575 5005 -2261
421b261k266R482k103r361O437O447r600j055J0687n510r268J1266N375j4258
435e988N20J3225p324q282J3439Q19j6920P034J6002j3219r882J6206l08j5659
449a0337J1800J1826k0768n267K3777l231j9455J2446R014k0279M014K4086j5545
462B081k1228K2312J0909k3221M954J9012k1648j1237L3161J351l4718R538K5163
475A6429k0198p623K8475j1652l1227K6250K5431l2024j0410K8611j0760j8700
487a7398L1448N885m3664P140M1650j9086k5142K9274l23l6004K5559L6274m1949
500f336k6981M4939P704l5772J7522J9734m0610k558N1997j1902m5637K2689K2273
513A7062l0061J0007L3451l9416l0316N5533J7612n3887N166L7467l3485j4187
$$ plain form
421 -2261 -4527 4955 2852 -6509 -72 6375 -3225 -4280 6407 897 -8371 2895 8270 -5988
435 -5988 -5468 7757 433 -7849 5590 6409 -10511 -3477 12525 -694 -10576 5630 5322 -10337
449 -10337 1463 13289 -7479 -12746 11031 7800 -11655 791 9805 -10474 -6460 17626 2081
462 2081 -19147 3165 14074 -9147 -4193 14819 -6829 -18066 15095 16446 -18272 -8734 16429
475 16429 -3769 -11392 17083 5431 -25796 454 25885 -6139 -16549 12062 1302 -17398
487 -17398 14050 19935 -23729 -16589 25061 5975 -19167 10107 9784 -26220 -661 35613 -6336
500 -6336 -33317 11622 19326 -16446 1076 20810 -19800 -22358 29639 17737 -27900 -5211 17062
513 17062 -12999 -2992 30459 -8957 -39273 16260 33872 -20015 -14849 22618 -10867 -25054
525b5054N8081p677o8335K3291N7669l2101k7875L5972j0675l5803M3317K9764
537D0574n7774j4750M9784r920k4582L9319o758o3034L3386O9281m9520n1508
549d5502N5504J3121n4777L2634M9788o8514l9434Q0983K0973o6879N960L4107
561A7964l5781L126N7379l1853n8823M5747L4472m6133J0299L8451n9970k6848
573e1970R5340J1524j02573R880P9921l7802l8187O6903n342q5986L5524Q3246
585F0478m5973n3793L9817M811k5139M5937Q462p7740R124P6701k9919m3234N4859
598B4391q521p8899N8031R1208q8726q0618R4591M3795q0967J0210N8605o1844
610a8744l6410Q9857J7009q1691J525M0443k0567J6423L6447o5999m0093R0713
$$ plain form
525 -25054 33027 25350 -42985 -19694 37975 5874 -22001 13971 3296 -32507 10810 40574
537 40574 -17200 -31950 17834 7914 -16668 22651 15893 -47141 -13755 55526 6006 -45502
549 -45502 10002 23123 -31654 980 50768 -17746 -57180 23803 44776 -22103 -16143 17964
561 17964 -17817 -14691 42688 10835 -47988 -2241 32231 -13902 -3603 34848 -25122 -51970
573 -51970 43370 54894 -47679 -37799 42122 4320 -33867 33036 27694 -58292 -22768 60478
585 60478 14505 -39288 529 5340 -19799 26138 34600 -43140 -34016 42685 12766 -30468 24391
598 24391 15870 -63029 -4998 86210 -2516 -83134 11457 55252 -25715 -15505 43100 -18744
610 -18744 -55154 34703 51712 -29979 -28454 11989 -8578 7845 44292 -21707 -61800 28913
622B8913K2413q5605J8125N8800p1317k4627J17573n146j36432K6158J17649m0884
634B5620o7127N2796N152o1096M3632N9254o1820l9781M6750J704j0219M5241
646D0106k9902q2607N9577R1764p4530o4360P9159Q436q0187N4437P9689r9470
658a7888p2885J10386N2997q7358j8148M4899k3134l378N4189k2516n8036K9470
670a1402K8029k4070K6610J5616q4129q038J20226j976j20581K1156Q7506n1772
682b825l7875Q6752o975j10927L2239J09131l5601p6258K5522K2258j3163L1228
694B3506M371o1418L381N5677j6664j8367L8929l2398o4861P4649Q1267r3782
706e710p4668Q8778M0623p0072J1242N0978o0427l8818Q5519L1652p5585k2197
$$ plain form
622 28913 51326 -34279 -16154 42646 -28671 -53298 64275 59129 -77303 -51145 66504 25620
634 25620 -41507 11289 16441 -44655 -1023 58231 -3589 -43370 3380 5084 -5135 40106
646 40106 10204 -72403 -12826 78938 4408 -59952 19207 27643 -52544 1893 81582 -17888
658 -17888 -90773 19613 72610 -14748 -32896 12003 -11131 -14509 39680 17164 -40872 -11402
670 -11402 16627 -7443 19167 34783 -49346 -57384 62842 60866 -59715 -38559 48947 -2825
682 -2825 -40700 46052 39077 -71850 -39611 69520 33919 -42339 -16817 5441 -7722 23506
694 23506 27877 -33541 -30160 25517 8853 -9514 29415 -2983 -67844 6805 88072 -5710
706 -5710 -80378 8400 49023 -21049 -9807 41171 -19256 -58074 27445 59097 -16488 -38685
718c8685L6313N542J3325J4906n1407k7792O4292K0871n2343R799K7419n5230
730c2990l842R6373j0382j13744J6816R8311k2983n6457L4444O979m9339K9215
742g599N8383l9686n0973K5448K3744J240J5262k5462m9168L8274O0815m0391
754I887m2517L9148R66m1464M5755M7645p7572n0583Q2556M1348o2731j6299L1077
767G216j7789l683M6408r784n4519R856L5761m371K767J551m3821l618O8990N390
781D0354o8167J114M4350j9360j1166M4514j5904o4554K7595O7237k4702m7768
793b6457J5300J2872q309K2403P168m2304q309L8636M940j5050O854j5644k4163
806c2063L8994L7751m6444l7677L8950K0075k4814R407J3464l8072r170N2454
$$ plain form
718 -38685 -2372 3170 16495 31401 -20006 -47798 16494 37365 -14978 -5179 22240 -32990
730 -32990 -36832 59541 49159 -64585 -47769 50542 27559 -28898 5546 12525 -36814 -7599
742 -7599 50784 11098 -39875 -14427 9317 10557 25819 357 -48811 -10537 50278 9887
754 9887 -32630 6518 7484 -33980 11775 59420 -18152 -68735 13821 55169 -7562 -23861 7216
767 7216 -10573 -14256 32152 22368 -32151 -22295 13466 9095 11862 13413 -30408 -34026 34964 40354
781 40354 -27813 -26699 17651 -1709 -12875 31639 15735 -48819 -21224 46013 21311 -26457
793 -26457 -11157 1715 -6594 15809 22977 -19327 -27636 11000 15940 890 7744 -7900 -32063
806 -32063 6931 44682 -1762 -39439 -489 19586 -5228 4179 17643 -20429 -29599 22855
818B2855R554m6041q308K2655R99N691J1191k5910k1226L0382K1195k0634p676
831e273M984j4853P234L5963j1305m4900R150L6639o602j5065Q609r352j5276
844b0047K5383K1696k7137k1331J6473J1164j350N718r746k1318J2515K7303q668
857A0655k0001L805K718k811J5947O611k7122j1483K6283J2136j5561n588J782
870b629o240P702J7527r436k1732M960J5903P16k601k846j1590L15J9559M259
884A3867j7891o320Q472K981K994M836j0382j2848J0834J5909n891j1550m7J584
898c452K820Q820j116j4348k923J2522N386m865l856l790j406Q876P253q452r764
913h295L776P133J433m48l828o647K420J0226J199q661l889L031L597L168j75
$$ plain form
818 22855 32409 -13632 -21940 715 1714 7405 18596 -7314 -28540 1842 23037 2403 -5273
831 -5273 -289 -15142 -7908 28055 16750 -28150 -19000 17639 11037 -4028 4581 -4771 -20047
844 -20047 5336 27032 -105 -21436 -4963 6201 4851 10569 823 -20495 -7980 19323 10655
857 10655 -9346 -5541 -2823 -5634 10313 16924 -10198 -21681 4602 16738 1177 -4411 -2629
870 -2629 -8869 -1167 16360 6924 -14808 -9848 6055 6771 4170 1324 -10266 -9951 9608 13867
884 13867 -4024 -10344 -1872 1109 4103 8939 -1443 -14291 -3457 12452 6561 -4989 -5036 -3452
898 -3452 -632 8188 7072 -7276 -10199 2323 7709 2844 -1012 -4802 -6208 2668 9921 1469 -8295
913 -8295 -4519 2614 4047 3599 -229 -6876 -4456 5770 6969 -1692 -5581 -2550 1047 4215 4040
928D040o636m177N887O550j989n322k184J031M039L837k670o490n56N489L300
943D149j716l557k551J216M803K110l946m275R62L819K118j151l305k116K124
958a316L975M17l454k545J048K891J647j361k983j020K368K681l69k628j664J045
974a268K429J060j633k307j19K068J632n61j993j192J105K097L45j696j374L13
990a094J381J131m35j834p25J493J333n14r53m95j39R73J297q64j840M64J449
1007F28j84l30K27r26n52J828P36k023m65J549l00p14J334k21k090R93K176j575
1025I1j412J925M1j963J472J606k646p24L056n42k661J955J526l024Q5L362j798
1042C49k715L160J229l850P84L545k748k278M107K52m456K003L634l878j766M887
$$ plain form
928 4040 -2596 -6773 -886 5664 3675 -1647 -3831 -2800 1239 5076 2406 -4084 -4640 849 4149
943 4149 2433 -1124 -3675 -2459 2344 4454 508 -3767 -2805 1014 3132 1981 -1324 -3440 -1316
958 -1316 2659 3076 -378 -2923 -1875 1016 2663 1302 -1681 -2701 -333 2348 1979 -649 -2313 -1268
974 -1268 1161 2221 588 -1719 -1838 230 1862 1301 -692 -1884 -779 1318 1663 -33 -1407 -1094
990 -1094 287 1418 983 -851 -1576 -83 1250 736 -217 -712 -851 122 1419 555 -1285 -821 628
1007 628 444 114 341 -585 -1137 691 1427 -596 -1061 488 188 -526 808 587 -1503 -510 1666 91
1025 91 -1321 604 645 -1318 154 1760 -886 -1610 1446 904 -1757 198 1724 -1300 -1215 2147 349
1042 349 -2366 794 2023 -1827 -1043 2502 -246 -2524 1583 1835 -2621 -618 3016 -862 -2628 2259
1058B259p74m630L256L142n058o69N556k135m626M598K385n994O38N849l688m102
1074c993N913J195o740K229N793n213l255O999l48o964M074N078o920j746Q036
1089D138k193o994N735M008q033K88Q331m677o454P969K654r115K136P855o755
1104a107m516R834q3j0306M763P858q475k995J0257k909r617Q135O493j1114j423
1119e205J0985m452p904R585K797j2325K916J1600p861p279J0911N24j1511O792
1133d27R440j2372m932J4451j197j2472P612P245j2636m85J4656n930j2553J0410
1147H10O467j2069J905J0896j0031p195J5229J506j5639N149J1192j1448l500
1160f728J5757m923j6470J1662J2589j5076m723J4819n009j1486J3447O134j7671
$$ plain form
1058 2259 1485 -3145 111 3253 -1805 -2474 3082 947 -3679 919 3304 -2690 -2052 3797 109 -3993
1074 -3993 1920 3115 -3625 -1396 4397 -816 -4071 2928 2580 -4384 -310 4768 -2152 -3898 4138
1089 4138 1945 -5049 686 4694 -3339 -3051 5280 603 -5851 2118 4772 -4343 -2207 5648 -1107
1104 -1107 -5623 4211 4128 -6178 -1415 6443 -2032 -5027 5230 2321 -7296 839 7332 -3782 -5205
1119 -5205 5780 1328 -6576 3009 5806 -6519 -3603 7997 136 -7143 3768 4292 -7219 -427
1133 -427 9013 -3359 -8291 6160 4963 -7509 103 7348 -5288 -5773 8883 2953 -9600 810
1147 810 7277 -4792 -2887 8009 -2022 -9217 6012 7518 -8121 -2972 8220 -3228 -6728
1160 -6728 9029 4106 -12364 -702 11887 -3189 -7912 6907 1898 -9588 3859 9993 -7678
1173g678K88J5995o673q951J1826r11j4476J0352J3255j6424p594J7723j583j4658
1187i509J1846Q774j9791j896K2457m661j8506R988R258j3439J921J4286j1178
1200d50j1607J5529N119j4149M067Q389j3488o50J9835o776k0329J2500J4185
1213A2175j6104l251J7544q653j6625J7375J2909k0142o299J6706k313r066J0552
1226D808M55j5475O508J4486j0468p094J1529m474j0513J6181P824k3623l323
1239a3179K4210l122j8257J0880Q592j7945R53K1494p441j9249R844J1040q956
1252a136O19O216j1417k608J7105j767j5539P164P628j3248L185J8456j2842k0267
1266a8451J8340J6735j9008p995J6352l541j2313J3574Q387j8200m571J5450M87
$$ plain form
1173 -7678 -7390 8605 1932 -7019 4807 3896 -10580 -228 13027 -3397 -10991 6732 5149 -9509
1187 -9509 2337 11111 -8680 -10576 11881 7220 -11286 -1298 7960 -5479 -3558 10728 -450
1200 -450 -12057 3472 8591 -5558 -1491 6898 -6590 -7240 12595 5819 -14510 -2010 12175
1213 12175 -3929 -7180 10364 1711 -14914 2461 15370 -4772 -11071 5635 3322 -5744 4808
1226 4808 5263 -10212 -3704 10782 314 -6780 4749 275 -10238 5943 13767 -9856 -13179
1239 -13179 11031 7909 -10348 532 9124 -8821 -7868 13626 6185 -13064 -3220 7820 -1136
1252 -1136 -517 5699 -5718 -8326 8779 7012 -8527 -1363 6265 -6983 -3798 14658 1816 -18451
1266 -18451 -111 16624 -2384 -10379 5973 2432 -9881 3693 12080 -6120 -10691 4759 5246
1279E246o760M040m116p809J2863Q650j6550m860J5041l644j0230J4399M708k3249
1293a2271j24K6326l362k2085O572J2147r880p88J2637p626j2915J0329R075p449
1307E86j188J433q414M771J5651r109j7061J1477J1375j2859p19J4221j0623j5179
1321a5638J8121J4285j9337j0039J4806K552p496N957Q58j1882K977J2172m004
1334C332o034L714m381l289J4546L066k0274j837J9505j815j3188P918M710j4756
1348h783K259J9236n630j8575N623J2131l977k243K612o982k060J1501J387r663
1362c164Q96K712n195N739J0229j1951j3256J3939J1750j2152n354Q916l812o289
1376f992J1731N163j4939m567J2057L013m746J96l312m092Q573O343r306m906
$$ plain form
1279 5246 -1514 2526 -1590 -9399 3464 12114 -4436 -9296 5745 2101 -8129 6270 10978 -12271
1293 -12271 -12395 13931 10569 -11516 -4944 7203 -2677 -3465 9172 1546 -11369 -1040 8035 586
1307 586 -602 831 -7583 -2812 12839 3730 -13331 -1854 9521 -3338 -4057 10164 -459 -15638
1321 -15638 2483 16768 -2569 -12608 2198 4750 -2746 3211 4069 -7813 -4836 7336 3332
1334 3332 -2702 1012 -3369 -6658 7888 10954 -9320 -11157 8348 6533 -6655 1263 5973 -8783
1348 -8783 -6524 12712 7082 -11493 -5870 6261 2284 41 2653 -4329 -6389 5112 6499 -3164
1362 -3164 -2268 444 -4751 988 11217 -734 -13990 -51 11699 -453 -5807 3109 -703 -6992
1376 -6992 4739 9902 -5037 -9604 2453 5466 720 916 -2396 -6488 2085 8428 -878 -5784
1390e784O352n85k115Q163j028j4365K110J6144j987j2440K241N113m097K556
1404B78O780p046q590O975P487l309l050j253l158M131Q276m530r408L279N848
1419B710k332Q34K940p371m808J0654O356r711n552N555K005r35L194j842p348
1434e651J881Q128k37m922j181p92J008O155O29q553k241P064K208k937L58j491
1450e74m304L841P539l494q032J448N123M23j25o98m449o77O320K407m805k783
1466b840R44J046K943K126m828m817M046N317j685l004m52j063R39M771K44o122
1482b435j939M546K640j112j421k209j146L628L530k735m096M59K290J554R33
1497B487j965l844P79M794R76l335j887L94J092K361Q91l362k861K374L389k20
$$ plain form
1390 -5784 568 -17 -2132 6031 5003 -9362 -7252 8892 6905 -5535 -3294 1819 -2278 278
1404 278 7058 12 -8578 -1603 5884 2575 -475 -1728 -4886 -755 7521 2991 -6417 -3138 2710
1419 2710 378 1212 4152 -3219 -8027 2627 8983 -728 -6280 -725 1280 345 3539 1697 -5651
1434 -5651 -3770 4358 4121 -801 -1982 -2774 -1766 4389 5018 -3535 -5776 1288 3496 559 917 -574
1450 -574 -4878 -1037 6502 3008 -5024 -3576 1547 1970 1845 1147 -3302 -3979 2341 4748 -57 -2840
1466 -2840 -1896 -850 2093 4219 -609 -5426 -1380 3937 2252 -752 -1204 -2267 -1328 3443 3687 -2435
1482 -2435 -4374 172 2812 1700 279 -1930 -3076 552 4082 1347 -2749 -2290 0 1554 2487
1497 2487 522 -3322 -2543 2251 3227 -108 -1995 -1601 -509 1852 2743 -619 -3480 -1106 2283 2063
1513B063k094j542m60J913K796q44l536q45K355J850J8j422k176j69K924J851
1529B682j974k500P2J644J515K97j845k138Q72K747O72j844j623m5J387J729j32
1546A516k190j359J382J974J69j361j423r7J609J495p16j978n84J308J384J01
1562A230j228j362K43J696R31j016j496k06J100J183k2j320j066O30J480M07r86
1579A98j116r4J069J044l04j333n90Q08J057J83q40r31J6J114P62o09j028j94
1597g88O28P73J52p62q72K84J067K95o19o13j51M22Q07N4r57n17O15O29l8k86
1617A23m53l17N85Q19l77q96L2N20J69J39q6p27j73R39L57p46k69K83p7J98N57
1638F00m71q81N23Q33m49l86L49k33l18P95K71j055j31R41j44n47N55j4q50M76
$$ plain form
1513 2063 -31 -1573 -2033 -120 2676 1832 -1704 -2549 -194 1656 1674 252 -1924 -2093 831 2682
1529 2682 708 -1792 -1720 -76 1439 1736 -109 -2247 -1375 1372 2044 200 -1423 -1468 -81 1648 1516
1546 1516 -674 -2033 -651 1323 1492 131 -1292 -1389 220 1715 999 -979 -1563 -255 1129 1230
1562 1230 2 -1360 -1117 579 1510 494 -1002 -1208 -108 1075 1053 -267 -1333 -703 777 1184 198
1579 198 -918 -1012 57 1101 797 -536 -1126 -318 739 922 82 -849 -833 281 1043 434 -594 -788
1597 -788 -160 613 765 3 -869 -585 482 777 158 -455 -606 -184 623 677 -280 -797 -182 447 409 123
1617 123 -330 -647 -62 757 380 -516 -484 36 205 344 258 -469 -642 297 654 -92 -361 -78 -155 43 600
1638 600 129 -752 -229 604 155 -231 118 -115 -433 362 633 -422 -553 388 244 -303 252 238 -612 -136
1658a36R37q22o71R16J40q61N48O23j124k39J344k25j189P12O85j108L2J265o90
1677A37j094J193N31j374K43J207r72p67J499O5j608O99J274j346n48J678l44
1694D73j590J191J067j753k31J888p44j467J528O39j936L63J862j350j210J942
1710F72K61k096Q64J675j812p77K295l86k145J453J423k217k40K374j028j897
1726a581K066Q68k582M62K364j675j501K515J76k686J247K097k345r26K838n36
1742H01k577J904J622k752k23K913j350k220K543R60l103N98K782k012j699K938
1758A125J20l101J508K408k697j089L193o47k782K220J683l228j34L385j502k580
1774b118K755J041l339P94L082k389k035L331M24l377J407K469k868r41L558q05
$$ plain form
1658 -136 801 -21 -692 224 364 -497 51 674 -450 -689 655 430 -759 -47 638 -470 -438 827 137
1677 137 -957 236 767 -607 -364 843 -129 -896 603 668 -940 -241 1033 -313 -861 817 473
1694 473 -1117 74 1141 -612 -843 1045 301 -1166 362 1001 -935 -572 1290 -60 -1270 672
1710 672 933 -1163 -299 1376 -436 -1213 1082 696 -1449 4 1427 -790 -1030 1344 316 -1581
1726 -1581 485 1353 -1229 -767 1597 -78 -1579 936 1112 -1574 -327 1770 -575 -1501 1337 801
1742 801 -1776 128 1750 -1002 -1225 1688 338 -1882 661 1621 -1482 -884 1898 -114 -1813 1125
1758 1125 1245 -1856 -348 2060 -637 -1726 1467 820 -1962 258 1941 -1287 -1421 1964 462 -2118
1774 -2118 637 1678 -1661 -867 2215 -174 -2209 1122 1546 -1831 -424 2045 -823 -1764 1794 989
1790I89l241K312J958l246rL373j994k665L453J285l962N37L380k347j948L629
1806A504J43m016J587L224k763j487L248p70k904K799J793l904k38L886j629k630
1822b157L237O56m199J409M177l015l046L845R74l739J416K916l412j567M306
1837A801k3l751J596J981k884L97L473k553l109L914J628m176O90L459l184k105
1853b846N046M73n566J161M471k514k198L460n01l709K671L002l665j269L266
1868A282j099j866L487n8n003J902M958l313l209M184L30m554K742M283m911l200
1884d045N398J416m327R16K214l090Q2M229j796l755K699J576k838J615K452m634
1900a888j659O383M01o229J350M361l417j574N183j003n921K564N127l006k712
$$ plain form
1790 989 -2252 60 2018 -1228 -1237 2136 142 -2523 930 2215 -1747 -1210 2170 -177 -2125 1504
1806 1504 1647 -2369 -782 2442 -321 -1808 1440 670 -2234 565 2358 -1546 -1784 2102 473 -2157
1822 -2157 1080 1736 -2463 -1054 3123 108 -2938 907 1881 -1858 -442 2474 -938 -2505 1801
1837 1801 1778 -1973 -377 1604 -1280 -883 2590 37 -3072 842 2470 -1706 -1016 2443 -741 -2846
1853 -2846 2200 2673 -2893 -1732 2739 225 -1973 1487 986 -2723 -52 2950 -715 -1984 1282
1868 1282 183 -1683 1804 1746 -3257 -1355 3603 290 -2919 1265 1595 -2959 -217 4066 -845 -4045
1884 -4045 1353 2769 -1558 -642 1572 -1518 -1436 2793 997 -2758 -59 1517 -1321 294 2746 -1888
1900 -1888 -3547 2836 3237 -2992 -1642 2719 -698 -2272 2911 1908 -4013 -1449 3678 672 -2040
1915b040K530n27j620L401N24m698O19L909j954j392L451j848m582M444M798n639
1931f24l631N377J063m120K185K590m799j361N698M16m387L98J473j286J892J962
1947B846m222j939M767P58l668J663J587m516M22O602j694o894K210N138k448
1962F12j932K802j490l114L566L049l652k095J997J02M20K276k401l964L304L989
1978C469l219k091K760j142k437M281K445n995k354N629J621l568J1R11k061J120
1994f20L524j746l520J182J723k09J281m43m059M77N360l43m571O39K143j804
2010i86P55L392k649m580K974M453k025k662O30j46J81K721j66l749l11K757M29
2027A018k36K78k479j567M040K641l926k571K503J036q24J511k28l727J72M551
$$ plain form
1915 -2040 490 -37 -1657 1744 2268 -2430 -1811 2098 144 -1248 2203 355 -4227 217 5015 -624
1931 -624 -4255 1122 2185 -1935 250 2840 -1959 -3320 2378 2794 -1593 -1195 278 -1008 884 2846
1947 2846 -1376 -3315 1452 2210 -1458 205 1792 -2724 -2302 4300 2606 -4288 -2078 3060 612
1962 612 -1320 1482 -8 -3122 444 3493 -159 -2254 -257 -155 265 2541 140 -3824 -520 3469
1978 3469 250 -1841 919 -223 -2660 1621 4066 -1929 -4283 1346 2967 -601 -590 321 -1740 -620
1994 -620 2904 1158 -2362 -1180 543 334 1615 1172 -2887 -2410 2950 2607 -1964 -1325 818 -986
2010 -986 -231 3161 512 -4068 -1094 3359 1334 -1328 -698 -844 -663 2058 1892 -1857 -2168 589 1018
2027 1018 782 1060 -1419 -2986 1054 3695 -231 -2802 -299 737 -87 1424 1196 -2531 -2359 2192
2043B192M94l472r15J004N10J563O36k986j734K656J939j062p23p82j392J760
2059c12L378j597l996O47K863J34n02j6j903r36L076K026k600k304Q68J320R54
2076A100N81j853k339J486K884l11j851o62l14P27K440J21l375j209K675J678
2092A778q50r74r58o63J803K257j340k791O6J908J023K7j237j896M37K670P63
2109B023k024j416L19J001J372L29k090j743J541K313k27j610r51oJ190J646m53
2126A214k338p11J709J456j86j186j295J9J892J270j296j854kJ300J132Q5j338
2143a29j494O09K049N47j452j302R0J127J209j17j690j040J138J595O7j227j071
2160a091N4J297J166o60j661m06J206J150q9j095j056K92J499P33j025j308NJ035
$$ plain form
2043 2192 2686 -786 -1701 -697 -187 1376 2012 -974 -2708 -52 1887 825 102 -680 -2072 -312
2059 -312 3066 1469 -2527 -1880 983 1117 615 599 -1304 -2240 836 2862 262 -2042 -1174 146 1100
2076 1100 1681 -172 -2511 -1025 1859 1548 -303 -965 -1279 -552 1888 2009 -1366 -2575 100 1778
2092 1778 928 -46 -1004 -1667 136 2393 1053 -1738 -1672 236 1259 1286 49 -1847 -1410 1260 2023
2109 2023 -1 -1417 -1098 -97 1275 1604 -486 -2229 -688 1625 1398 -212 -1163 -1169 21 1667 1214
2126 1214 -1124 -1835 -126 1330 1144 -42 -1337 -1318 574 1844 548 -1306 -1308 -8 1124 1209 -129
2143 -129 -1623 -1014 1035 1582 130 -1172 -1082 45 1254 1137 -553 -1593 -455 1140 1207 -20 -1091
2160 -1091 -1037 260 1426 766 -895 -1301 -95 1055 966 -129 -1185 -893 606 1339 314 -994 -989 46
2178D6R43j19j201r08O77J377K59j006r68N2R76Q88l00j274n50Q65J033L3q29
2197fq11O7J042P41o17j091j47P82P18K6p48q38K84J133L77q03p54N0N82O87j2
2218F62r40o18O23R02j9n98n20q8O40P59l44j032j24P47M00p7k95n98r3Q76N34
2239G97o94o82K34L90K29J85m04p38L26R13j01o31n3K5jN94K29r05m11Q28L59
2260D89m58l6rm43L20Q00l64q86L35M90k42J01K31o69k74J000J98r20K4N45m01
2281a69k1P40l82r40O08Q05o36l78N97k56m29P79K36j050L9R30l41n07O69o3q67
2302f36N91Q31r02n50J000Mq47N88N27j010j65J178k72r84O73M71r15J56R44p23
2322d1p20J053K64j115L57Q72q92m28J183j02j176O17Q56j015k94J167l41j024
$$ plain form
2178 46 989 870 -331 -1239 -562 815 1074 68 -900 -848 128 1016 716 -558 -1108 -243 790 823 -6
2197 -6 -817 -750 292 1033 416 -675 -822 -40 678 704 -44 -882 -598 535 912 109 -645 -595 -13 674 662
2218 662 -278 -896 -273 629 610 12 -508 -596 44 803 459 -573 -697 50 450 373 78 -520 -613 263 797
2239 797 103 -579 -345 45 274 459 55 -683 -357 556 455 -176 -229 -204 -205 389 618 -287 -698 130 489
2260 489 31 -5 -14 -457 -137 663 299 -587 -252 238 -4 97 328 -341 -615 385 583 -337 -313 232 -169
2281 -169 -190 550 168 -772 -164 641 5 -373 224 -32 -461 318 554 -496 -457 473 132 -375 294 231 -636
2302 -636 -45 786 -116 -666 334 338 -509 79 606 -404 -569 609 337 -647 26 497 -418 -262 682 -41
2322 -41 -761 292 556 -559 -202 670 -222 -650 533 431 -745 -128 728 -287 -581 586 245 -779
2340g79Q92O00j167j4J140n74q11J064K29j240L90J105r47o35J229Nj216O51Q80
2359H02j118l47J302k78j149Q78O60j202l1J199o06r18J105L71j308K91J127q80
2377a02o61J225O7j294O01R96j074m69J270k00j147Q25P28j210j43J268m80r96
2395g96J026M40j250J83J190p85p79J163J74j248M58J024r86n02J219r8j179P35
2413a1P73j143j88J227m13r97R07N09j162R8J094o78p77J083K28j164L49R56q67
2432a76m89J171j05j135O49P66r73k39J111l77r45Q44N72j095lJ014n25o68R02
2451B99J94j041L06Q76p19m52R26j15q60O03O38r56k13J011k31q14O46L99q92
2470c95N8Q84m07o85O67K47p13K24N65o14k91P87k5p28L90M15o38k3P51l67o75
$$ plain form
2340 -779 113 713 -454 -468 672 98 -713 351 580 -660 -270 835 -112 -747 482 487 -729 -78 802
2359 802 -316 -663 639 361 -788 90 750 -452 -483 716 110 -808 297 668 -640 -349 778 -102
2377 -102 -763 462 529 -765 -164 832 -242 -711 559 359 -788 37 765 -445 -588 680 200 -796
2395 -796 230 670 -580 -397 793 8 -771 392 566 -682 -224 800 -186 -688 531 433 -746 -11
2413 -11 762 -381 -569 658 245 -752 155 664 -498 -400 694 16 -761 322 550 -614 -265 691 -176
2432 -176 -665 506 401 -734 -85 681 -292 -531 580 203 -742 102 674 -421 -424 590 65 -603 299
2451 299 493 -548 -242 634 -85 -537 389 274 -586 17 655 -301 -514 497 266 -548 98 497 -395
2470 -395 -337 547 140 -545 122 369 -344 -120 445 -169 -460 327 302 -426 -36 379 -259 -282 469 102 -573
2491e73O05M19o72l8N91l42l75N99J40o60J14M92l15j75M16j74l96M26K59n12
2511a71l6M52k29k66M37M8n57J67M95k78l20L17P0l27J90K37l32j14L48n3j87
2532a09J55ok42K13K42l44j40L26J4k44K03P3l23K3M00j32l16J87J35j78P2J21
2554A30k08n7K64k0j99Q6L7j49J71J85l36j48L81L9l05J25J27k87N0L91j74m00
2576b97K12K54j74k5J09k10n8L88l6l66J21J61j73J19K51l90k99N39K63n17r4
2597b22L40j50j18M13k0o07R2N81j04l02Q0r9p3M34J02n74p9M36m8j21K89k35
2619A5n27M49O79m97o05L89K71k70K23J78n90j98P19K24n31j58J02m2L45L05o00
2640a19m79N52M09l19k9N4m87J02R00p7r71k1O87K7j58J27l72l74O16N98n16n36
$$ plain form
2491 -573 32 451 -221 -259 332 -10 -385 214 354 -306 -192 300 -15 -190 226 52 -344 82 341 -171
2511 -171 -207 245 16 -250 187 235 -322 -155 340 62 -258 59 129 -198 -8 229 -103 -217 131 78 -109
2532 -109 46 40 -202 11 253 -91 -231 95 109 -135 68 141 -182 -159 241 109 -207 -20 115 -63 9 130
2554 130 -78 -135 129 109 -90 -4 33 -116 55 240 -96 -244 137 176 -129 -4 123 -164 -114 277 103 -297
2576 -297 -85 169 -5 -30 79 -131 -189 199 163 -203 -82 79 -94 25 276 -114 -413 126 389 -128 -222
2597 -222 118 -32 -150 263 243 -364 -272 309 205 -97 -17 -116 -189 245 347 -227 -306 130 82 -39 250 15
2619 15 -512 -63 616 119 -486 -97 174 -96 127 305 -285 -483 236 460 -71 -229 -127 -169 176 481 -119
2640 -119 -598 -46 363 44 15 69 -418 -316 584 507 -464 -485 202 229 71 198 -174 -548 68 666 150 -386
2662c86J48J76K13L67l87p95L06Q36j05m73k2j27q5O89L59r19n83P03N69k39k02
2683D3k22l21L58P99k41q54o5M79K55K01k13p77q4R50L93o76m14J05J12M13M27
2704F68n95q69L91R15M0n14l51j45K67P53P6r05m39N40N81N1k60o23k80P41P85
2725H27m56q42q1M35M27K74l78q51m9J008M82n90o48j09L80O37K14p33p40L59
2745d34Q48J99m28n92k52N39Q36r0r61m28N37O57J55l63p46j89Q02P48m03q87
2765d52j97M63O56K34n93q36R5R64M30n13o85k09M18P78J89q63p25L94Q43K73
2785F64m34o98k60O26Q53j49r54l99M80O67K78m63q22j33Q84O90m31q30k14M23
2805b22O93K58o53q48K22R07L47m56o20k89M52Q63N5r31n54N05O58J78l12o66
$$ plain form
2662 -386 -238 -62 151 518 131 -664 -358 478 373 -100 -122 -249 -334 355 714 -205 -788 -85 484 245 43
2683 43 -179 -500 -142 657 416 -438 -503 -24 231 432 219 -558 -642 308 701 25 -389 -284 -172 241 668
2704 668 73 -796 -405 510 550 36 -315 -460 -193 560 636 -269 -708 -168 413 464 204 -419 -699 42 827
2725 827 371 -471 -552 -117 310 584 206 -645 -694 314 796 206 -442 -551 -171 466 680 -53 -793 -434
2745 -434 414 613 185 -407 -659 -120 716 626 -335 -763 -226 431 586 223 -523 -712 90 838 435 -452
2765 -452 -649 -186 470 704 111 -725 -630 334 764 251 -434 -643 -225 553 742 -121 -846 -452 391 664
2785 664 230 -468 -728 -102 751 602 -352 -751 -271 396 674 211 -611 -744 140 830 399 -431 -645 -222
2805 -222 471 729 76 -772 -550 357 704 248 -372 -661 -209 654 709 -222 -776 -271 387 565 253 -413
2825d13l41P18Q45l12r13k01M20N21L09m19q76mR31M30m77n22k12J69P55L74q17
2846c5p90M65P67L9k69l87m24L78R14m0r55k57M78L27K32r2p68l48R06O41o25
2867A57n11J15L2K79N85l82j003K19R59K1m91r8k06n9P70K97r23m24O46K69j32
2888A20J78l15p16N42R97m76q91L39L49k32L41K66q57l85J026L62p60j15K35k90
2908b82K66P14n77q71O36O41n36n0L72o11k88J090K09j188n5R11k48l58N85j95
2928A65q52N96Q34p29n19O46o6m51O80K20j099L5J153l40q03O54K04q74L61J003
2948H18q10q30R64M34r22J96O47p71k92J123j17j066M97O78q13n6R83n96q97J048
2968B18N76j237k9J103n80p58J109K32j305K70J165p37o72J011Mj067O59Q38j119
$$ plain form
2825 -413 -754 -36 809 497 -416 -617 -197 324 633 214 -662 -666 265 695 218 -304 -516 -347 408 782 -35
2846 -35 -825 -360 407 446 177 -210 -634 -256 658 618 -337 -594 -116 211 443 351 -417 -765 141 782 157
2867 157 -354 -239 -207 72 657 275 -728 -509 450 471 -20 -118 -324 -383 387 684 -239 -663 -17 252 120
2888 120 298 -17 -733 -191 806 330 -561 -222 127 -105 236 502 -355 -740 286 648 -112 -227 8 -282
2908 -282 -16 698 121 -750 -114 527 -9 -59 313 -298 -586 504 713 -475 -530 381 133 -225 360 165
2928 165 -687 -91 743 14 -505 141 75 -376 304 524 -575 -540 613 273 -530 124 328 -546 -185 818
2948 818 8 -822 142 576 -346 -150 497 -274 -566 557 440 -626 -129 549 -264 -320 663 67 -830 218
2968 218 794 -443 -472 631 51 -707 402 634 -671 -401 764 27 -645 366 370 -697 -38 800 -319
2987c19l65J268k65j067Q61O23j302L0J368o41j082J100M84j307K43J196q64p79
3005h18J282J44j339N27J026j083m13J323k26j284Q88Q53j311k23J431n28j161
3022i12J120N98j429J02J371p76r56J263K82j409M45J205j082o53J405m5j396
3039h67P66J003j290l41J478m04j272J032P37j402k1J422p10j041J247M24j471
3056g10L24J283r96p31J386L9j427O50J096j186m63J436k84j324R58Q35j346j39
3074e99J385n89j082J133N26j423J58J346q22q78J229K11j331M75J128j044o00
3091g77J316q1j229P30Q39j222k46J392l91j205R63O51j259M5J310p17j004J114
3109B29N25j296J76J103q27o30J205P4j262N09R26r23l53J152l57j106R36P88
$$ plain form
2987 -319 -684 584 319 -748 113 736 -566 -536 832 191 -891 209 693 -614 -371 825 -39 -818
3005 -818 464 608 -731 -204 822 -261 -674 649 423 -861 27 880 -431 -654 777 249 -912
3022 -912 208 806 -623 -521 850 74 -882 381 663 -746 -301 904 -178 -831 574 529 -867
3039 -867 -101 902 -388 -729 749 345 -927 105 842 -560 -581 841 131 -910 337 761 -710
3056 -710 -386 897 -99 -830 556 595 -832 -182 914 -272 -735 701 417 -907 51 886 -460 -599
3074 -599 786 197 -885 248 774 -649 -491 855 33 -845 384 595 -736 -261 867 -177 -777
3091 -777 539 458 -771 -41 798 -424 -670 722 331 -874 89 740 -519 -474 836 119 -885 229
3109 229 754 -542 -366 737 -90 -720 485 559 -703 -194 732 -191 -544 608 251 -855 81 869
3127H69j277k14J234l98r53R65M71j299O1J270n05q92Q31K56r62M18Q55r27n18
3146g15J107J5r44N57N59j062p7J335l85j211P25P75r55q0R83n31q91R19O25j011
3166b62j75P85l59l47Q43j37j025M66Q81p03l74P92l09p70R06O43j220m02J166
3185C99J6q18M60L35q87J00J048l71q44M37L42m12L21L41q73k33J085M4q99K65
3205a44M24o31R5R92m65j095O02Q84n65l57M28k75l01P08K80q62j79N95j2j23
3225aL38l90o14O88P01o94n11N23L0l22N38K15r65k00J006K00p02o6J88j99K91
3246E4M82m96o07M16M13j47J1p7n39J86Q60j02q44L2M92j00L7K89m44n41N95O45
3268F15m19n11J11J32J26L25j74o27N0O20Q1k56j10k38p5O16K98o53m59M35L59
$$ plain form
3127 869 -408 -622 612 214 -739 226 697 -602 -541 729 224 -668 163 419 -543 -125 730 -197 -715
3146 -715 392 407 -537 20 579 -483 -560 775 390 -821 -96 679 -276 -356 627 96 -795 124 749 -262
3166 -262 -437 348 -11 -358 485 348 -677 -211 670 -33 -407 385 76 -694 212 855 -365 -767 399
3185 399 415 -403 57 392 -495 -395 653 282 -562 -125 217 -195 126 467 -406 -639 446 490 -409 -144
3205 -144 280 -351 -256 736 271 -824 -222 662 97 -260 168 -107 -408 300 580 -282 -461 134 122 -1
3225 -1 337 -53 -667 21 722 28 -483 40 70 -252 286 501 -464 -664 342 542 -160 -226 -38 -237 54
3246 54 536 40 -567 -151 262 115 126 49 -490 -304 556 454 -390 -358 134 34 71 360 -84 -625 -30 615
3268 615 196 -315 -204 -72 54 379 205 -422 -372 248 329 73 -37 -275 -350 266 564 -89 -548 -113 246
3289B46j08kj51m08J55O96j0o47j82L00K39J54p1m71k21N06M11k61l11j07J0L42
3311A09L72l00o34J10N46J49k33k14k00K3N11K41m88m29K12L94J38j13l48k67
3331d21K97N07o0m34k16J59K58K58j17n22j65M74L69k05l40j20N7L51K56k82m70
3352c66K7M58K04j56k88k18J47M51J28m15l29J48L37J72q4l74k40L24M43q2l87
3373a00j82J11K86K44j92m35q5M06K66j30k91j92J03L62J83l14l74Q8L61J52j29
3394A38k59j98J94M06jl63k20J30K71J72j13l64j32L41L18j36l09j24J17K88J58
3415C14k34l40K2L33J75j19k41j70J51L59L5l40k00J15K31J20n4l07j70K92L19
3436B91r4l46q1J25K00J45j75l03nL10J58j39j83j31R9L07Q9l36k22J89K15L9
$$ plain form
3289 246 138 136 -15 -423 -268 428 418 -229 -411 -111 128 282 211 -260 -481 25 436 175 -136 -243 -233 109
3311 109 481 181 -453 -343 203 352 119 -95 -295 -272 239 480 -8 -437 -225 169 307 194 -154 -421
3331 -421 -124 383 323 -111 -327 -168 90 348 231 -291 -456 18 387 182 -158 -278 -221 130 386 104 -366
3352 -366 -339 119 323 167 -121 -339 -192 259 387 -28 -357 -209 128 300 216 -158 -398 -74 369 287 -100
3373 -100 -282 -171 115 359 167 -268 -353 53 319 189 -102 -294 -191 171 354 40 -334 -246 115 267 138
3394 138 -121 -319 -125 281 280 -83 -303 -173 98 270 157 -207 -339 2 320 184 -125 -249 -132 156 314
3415 314 80 -260 -238 95 270 151 -90 -260 -109 250 285 -55 -255 -140 91 211 157 -150 -320 -28 291
3436 291 197 -149 -230 -105 95 240 65 -238 -243 67 225 86 -97 -228 -129 178 267 -69 -291 -102 113 152
3458A52p0j80j63J89L33p2l50m5J52J54J00j26k73LL06J27j91j47k9L2K30J29
3480B61k71k85K13K70m3j49p5j06J08K97k3l63p6K26J34J2r1k18o5L16J81k59
3502fj85J16L9O9J65j75l19J70L69o1k90L3L3j8K10O2l49j06K99J12j15j9j11
3525g7j42K70K75k98l07K33J65j16Q3L9l48j8M70K3m12j1J91m3O3J59k88k10L38
3548C9J96k76l5J02k16P3M28j79n03K24M00k03j63K47j63k66M16K31m74j49L66
3569I5j0j39K18j07l87K84M07l46k49L38o5k71L93J63o03o2O35q5m73K52J80m16
3591b48J60M64l65m04M45J91m06J54K29m67k7O33j76n93L67L53m92kN42l56m97
3612d95O26L07o74kN22k95k82N63l5o29K81N22m70k10N41j85n07N66L02p53l4
$$ plain form
3458 152 82 -98 -261 -72 261 189 -161 -206 -54 100 200 74 -199 -196 110 237 46 -101 -130 -98 132 261
3480 261 -10 -295 -82 188 145 -4 -79 -185 -77 220 197 -166 -242 -16 118 130 39 -179 -244 72 253 -6
3502 -6 -191 -75 -36 33 198 23 -296 -126 243 182 -108 -75 -42 -60 150 212 -137 -243 56 168 53 34 -77
3525 -77 -219 51 326 28 -279 -46 119 3 86 125 -223 -241 229 252 -160 -171 20 -23 40 199 -89 -299 39
3548 39 235 -41 -76 26 -190 -117 311 132 -371 -147 253 50 -113 134 -29 -295 121 352 -122 -271 95
3569 95 85 -54 164 57 -330 -46 361 15 -234 104 39 -232 161 324 -279 -341 294 209 -264 -12 168 -248
3591 -248 -88 376 11 -393 52 243 -163 -9 220 -247 -274 359 183 -410 -43 310 -182 -184 358 2 -495
3612 -495 131 438 -236 -238 284 -11 -293 270 235 -394 -113 409 -61 -271 270 85 -422 144 446 -307 -341
3633c41P46l03n24N62J86p18J76P03m92m75O63J15o65L24M78o46j92P77j70o65
3653d61M58M35p32QP85m40o25P29L07q21J02P44n11m69P91N5q42L50O67o57k96
3674d23Q21j69p67N98M68q38o7Q73l64o71P13K85q92J47Q50n85n40Q44R9q72L55
3695a35O99p57k93Q87j24q59N80N26q32r4R26l99p37P57L80r46J07Q71n67n73
3715e83Q83J43r52L24P96p32l85R14r2q91N47O43q96j74R47l16p67P29M04r63
3735d21P9R33n20o69Q39K13r85K99Q72p34n23R60K5r21M73O40q22k32R49k08q24
3756e77O27M23q62Q6Q83n52o76Q62K75r56K71P85p06m71R97N1j012L66P44o77
3776a19k88Q28k15p74N98N34q07j13P49l69n02P90J36j001K42R14n72n50P89M0
$$ plain form
3633 -341 405 102 -422 140 326 -392 -216 487 -5 -480 183 298 -367 -43 435 -211 -403 374 204 -461
3653 -461 -3 432 -300 -292 493 53 -572 157 464 -357 -255 489 -22 -491 300 355 -487 -137 530 -127 -423
3674 -423 398 229 -538 60 528 -310 -377 496 132 -539 174 459 -433 -286 564 -21 -561 283 382 -490 -135
3695 -135 564 -193 -486 401 277 -582 -2 524 -308 -402 524 125 -612 145 525 -421 -314 557 -10 -583
3715 -583 300 443 -509 -185 611 -121 -506 408 316 -575 -28 615 -281 -455 492 176 -591 138 542 -421
3735 -421 -342 591 71 -598 241 454 -531 -232 640 -94 -617 343 368 -553 -80 560 -262 -494 455 247 -577
3756 -577 50 473 -389 -303 580 28 -648 214 489 -467 -196 589 -117 -588 409 460 -552 -186 558 -119
3776 -119 -407 421 206 -568 30 564 -243 -356 393 24 -478 312 448 -553 -311 603 31 -519 270 310
3796C10q65M54P62p89m89Q59J02p16L75L72p08j4Q47l19o75N28K59o29K81O16
3816E61p39m84R68K40r22J56O23n72k07Q64j31r31L14P30m10k63L90k61l52O85
3836B59K49p92j10O24k11k00N48k21p95M82Q65n79o31N10J54m10L80L37p38l33
3856f12Q28K47n73k0J11k74L17N41n62n89N12L95l23N6J52o00o7R35J07r35j00
3877d54O05k7j01L11l50n88M97O91l54n15Q3N4J18M73j66p96Q1P21M8l32%k12
3899b13k41O29N25p03p01M76N40j30n0j65m43J57P79N8p46k29L09K58K62l3o69
3920c30l04P14N06l88m25kk6L02N67l21q79Q0Q03J87l54k69k15L6O20L31o47n70
3942e84K98M79J69p0m64m64M36P67j10o97k06K07L06L98q8p87k85P31N76l13n24
$$ plain form
3796 310 -555 -101 661 -128 -617 242 344 -372 3 375 -333 -347 500 181 -494 34 293 -336 -55 561
3816 561 -178 -662 306 546 -376 -220 403 -169 -376 488 357 -574 -260 470 60 -203 187 -74 -426 259
3836 259 508 -284 -394 230 19 -181 367 146 -649 -167 698 119 -512 -2 152 -258 122 459 -279 -612
3856 -612 216 463 -110 -130 -19 -293 24 565 3 -586 -74 321 -2 54 206 -394 -461 474 581 -354 -454
3877 -454 151 124 23 334 -16 -604 -107 584 230 -285 -202 -148 -30 443 277 -519 -438 283 331 -1 -1 -213
3899 -213 -454 175 700 -3 -704 -228 312 182 132 -33 -476 -319 460 518 -228 -457 -148 110 372 339 -330
3920 -330 -634 80 586 198 -227 -229 -255 47 614 293 -586 -506 297 484 130 -139 -354 -318 302 633 -14 -584
3942 -584 -286 193 362 292 -172 -636 -200 567 457 -240 -446 -239 67 465 377 -410 -695 36 612 299 -225
3963b25j80P7N16M38m28p67P0O97L09k18m22m16K26P74J93p12n19K78M92K68p9
3984C72o10m39N23P52j42o67k61J89M23M13k43p88j61P15M95k58m78l04J22O22
4004B75L73n40p01J47N68L39j05n10m69L03Q07J24o98m49K35L98L81p5o68m04
4024f69N38P03j30n77l38J28N13M33l30p34o3N92M01q1m30m80J03P65L24o34n80
4045e46J92M67K54j5m44n21K84Q05P2o34l79J32L92M39j50o91k58N60M67j13l27
4066a4l62o3N35N85m30p64N8N69K52p0k75m45J8O83L09n10m86Q6L13L95Q6o26
4088a56m69M63O37j40l94j68j13J88O46Jq44k85O49L81j69k37k68j49M80M83l53
4109A83n57M1L03K36K12l22o65J67Q34L0n81j45J41l6L35L57n53o01M43O13j45
$$ plain form
3963 -225 -405 -328 188 626 198 -569 -499 198 507 289 -133 -549 -323 451 644 -68 -587 -309 183 451 372
3984 372 -238 -677 -154 598 456 -211 -472 -283 140 553 310 -478 -639 76 571 313 -165 -469 -347 275
4004 275 648 108 -593 -446 122 461 356 -154 -623 -320 487 611 -87 -536 -301 97 478 403 -265 -669
4024 -669 -131 572 442 -135 -473 -345 168 601 271 -463 -526 66 467 386 -44 -524 -421 344 668 34 -546
4045 -546 -354 113 367 352 -92 -613 -329 476 548 -86 -465 -333 59 498 348 -343 -601 -41 426 313 -14
4066 -14 -376 -439 96 681 251 -513 -455 114 366 296 21 -424 -406 277 586 76 -410 -324 -11 384 470 -156
4088 -156 -625 -162 475 335 -59 -227 -340 -152 494 495 -349 -634 15 396 227 -10 -278 -427 53 536 183
4109 183 -374 -333 -30 206 418 96 -569 -402 432 462 -119 -264 -123 -159 176 533 -20 -621 -178 435 290
4130B90l15j47j66K33N66j25o62k9M18N1O4J01n38l31O99N43o03m77L17J39n9
4151c1L44r8o57J3P04J11m30r5o4l3N07K22o95l15N58K02k61J33m7n42K08Q45
4173E79j88q56J41N29j26j5K13m20l45N99L75m76k20J59j13J54M73l28p10L80
4193a95O23l33k67L02j95l67N90M36p50l83O09J74l10J59km99K33O21l11m71K96
4214d0J02k56L69K48p35k28Q58J07o69J09L32m09J7O62k33p40L31N68l30j83K88
4235A68k84k18O08J13o93L9N29k75j81N09j83o87M61O63n88m24N74K9m62L70L15
4256C83o52j43P23o1n50L08J71m76J89N65m65m62N91J96n74J73M75n82k23P73
4276C59J7p88K48N39m44k02O20k24n82M92M31o47r4N63k57l82N65J26p52J67O86
$$ plain form
4130 290 -25 -172 -338 -105 461 336 -326 -355 63 114 178 279 -259 -590 109 652 49 -428 -111 28 -31
4151 -31 313 215 -442 -429 275 386 -44 -139 -203 -236 271 493 -202 -517 41 243 -18 115 68 -474 -266 579
4173 579 391 -465 -324 205 79 64 277 -143 -488 111 486 10 -210 -51 -164 -10 463 135 -575 -195
4193 -195 428 95 -172 130 -65 -432 158 594 -156 -539 70 244 -66 93 91 -408 -175 446 135 -336 -40
4214 -40 62 -194 175 423 -312 -540 318 425 -244 -135 197 -212 -195 467 234 -506 -175 393 63 -120 168
4235 168 -116 -334 274 387 -306 -267 262 -13 -194 315 132 -555 -94 569 -19 -443 131 160 -302 68 383
4256 383 -269 -412 311 250 -300 8 179 -297 -108 457 -8 -470 121 317 -257 -84 391 -191 -414 359
4276 359 376 -412 -164 375 -69 -271 349 125 -457 35 466 -181 -275 288 31 -351 214 340 -412 -245 441
4297D41m13m15N79M2o43L55N54o41l20P05jo31L80L62o08o3P15k70n84N22K99
4318C65o37P5O04m28m21O62J33p11K02N63m86k73O43n1o50L79M73n89j84O65j77
4339A57n83N01L36o82k2O97l39n03N74J76o40J54O11m81l74O22P2o51K98M54n44
4360a67j74O53j14o27M05M08n94q4O55k83n05N57K34o53P7O06m00l87O03Q9o61
4381c62K56N29m90k79O19o4n71L68L92n63j27O17k08m78M54K13n79P1N54l29l76
4402c53N14J14o03J94N17m35l25N81M5n68K51M06m80j72N74j01m84K93L12m45
4422a65%M73k96l71M93J77n37P4M55l56k63N68J7o17K13M80l54k39M31m2m45L14
4444A0L47m64j42M14j11k45L23N5m96J33N05k78l78M14M3m01K29M00m45l14N23
$$ plain form
4297 441 28 -387 192 234 -409 -54 500 -141 -461 244 243 -388 -8 354 -254 -317 398 128 -456 66 365
4318 365 -272 -197 407 -21 -442 220 353 -358 -156 407 -79 -352 291 240 -410 -31 442 -147 -331 334 157
4339 157 -426 75 411 -271 -293 404 65 -438 136 312 -328 -174 437 -44 -418 204 276 -375 -77 377 -167
4360 -167 -341 312 198 -429 -24 384 -210 -294 361 78 -427 130 364 -289 -212 394 -6 -393 210 299 -362
4381 -362 -106 423 -67 -346 273 209 -362 6 398 -165 -292 325 117 -361 93 306 -273 -202 352 23 -353
4402 -353 161 275 -328 -134 383 -52 -377 204 249 -319 -68 338 -142 -314 260 159 -325 -32 280 -165
4422 -165 -165 308 12 -359 134 311 -226 -152 303 -53 -316 252 269 -348 -135 345 -9 -248 183 141 -304 10
4444 10 357 -107 -249 165 54 -191 132 187 -309 -176 329 51 -327 87 130 -271 -42 358 -87 -401 122
4465A22J49m42P2K40k88j7M30j28m22J83K81k19M5K02l33k03N31J47n35j8L51
4486A48j58j14L83j10n47K12N75k36l57J77L5j66L07J18m52j46M15Q3j90O6q4
4507d1k82L23M25l82m13K97K36j97J29P6m18j09N88J38m96j25K16J3J29J74l12
4528c1l71L31L86j48k28j2j36J18M84r7o31j2M92O3j38J4k17k44M50M48m16m83
4550c78J61K94P6J00k28m34J42N79L3m16j59L4J19L66P0n43l34M95L96j97k17
4571d1j38j44L06M89j85o54l9M87K16p2k16l55%N74K95m51m33R0K68K97Q7m54
4593g3m85L51O36m6m45k13j4K38M71k6o84k78N28M46j22l23l11n3M93M69l42o30
4615d13pM38L08K7l68n18J84P22J66n59l52Q7K62L98Q8o22m94M91O58j08m58k68
$$ plain form
4465 122 271 -171 -99 141 -147 -164 266 138 -284 -101 180 -39 6 208 -125 -328 203 350 -185 -203 148
4486 148 -10 -124 259 149 -398 -186 389 153 -204 -27 8 -158 149 267 -185 -331 84 167 -23 43 -41
4507 -41 -323 0 425 43 -370 -73 163 -34 95 171 -247 -356 232 370 -126 -251 -35 -22 107 281 -31
4528 -31 -402 -71 315 167 -61 -73 -209 -91 393 296 -335 -347 145 208 70 84 -133 -377 73 521 105 -378
4550 -378 -217 77 153 253 25 -409 -267 312 345 -71 -230 -196 -77 289 359 -184 -518 -23 373 176 -41
4571 -41 -179 -323 -17 472 287 -367 -406 81 297 225 9 -346 -346 228 523 72 -361 -271 -3 294 381 -73
4593 -73 -558 -207 429 383 -62 -275 -289 -51 420 394 -290 -568 -40 406 284 -39 -350 -403 90 559 217 -413
4615 -413 -420 18 326 353 -15 -533 -349 373 539 -20 -372 -285 -23 375 463 -159 -653 -162 496 388 -70 -338
4637c38nL95M69j60p32j61N22M09k2l85m84M8P38L45n80n24J35L57K98J22m88
4658d1o24L07Q39O8o56l48J05L87M51r5o84l20N07N32l1l59m49p7O58N41n19p33
4680e41J35N13K01L5k61n90M1Q25L41o73n32J59L93L90po41m29M95N83o1l67l36
4702c27j66M71P20k71r86k3P49K35j95j54l93k05O83N89n38p33J12M84L22L7m91
4723h0n69L78P51o6m86j60r9J50O90R9r42m31Q15N33l79k97j05j81L60O50l01
4744C30p84j5N05K85O6l19o50J38R08J00p23j98K48j9K92M13n79q07N28R18k39
4765C98o29k7K7J67M95m3p31j74N49K79n3q7n29k19Q21N39p84n52M71K35j41L14
4787C26n6q14K4J005J29p59k10K41P9L15J69o29l81N67L78k67o5j20m22L29Q55
$$ plain form
4637 -338 -343 52 521 361 -371 -532 -10 399 377 -8 -492 -444 294 639 59 -465 -330 27 325 447 -41
4658 -41 -665 -358 481 549 -107 -455 -350 37 488 393 -291 -611 -104 428 397 38 -411 -488 170 711 192 -541
4680 -541 -406 107 308 343 82 -508 -467 358 699 26 -506 -347 46 436 429 -212 -641 -146 437 376 9 -327
4702 -327 -493 -22 698 427 -559 -582 167 402 207 53 -340 -545 138 727 189 -544 -432 52 374 411 -80
4723 -80 -649 -271 480 414 -72 -232 -331 -181 509 608 -334 -765 50 583 204 -93 -198 -379 -19 631 330
4744 330 -454 -469 36 321 387 68 -582 -444 464 564 -159 -357 -109 -128 164 577 -2 -809 -281 637 398
4765 398 -231 -258 -231 -64 431 388 -343 -517 32 311 258 171 -358 -577 244 783 -1 -553 -82 153 12 326
4787 326 270 -544 -520 485 614 -145 -355 -114 -35 280 449 -180 -561 6 384 117 52 -68 -490 -161 694
4808F94l62r54K52O82j63j56K17l80l89O92N03o28m52L06J68J01K55l90n76M37
4828a43O33l12l61K01j68j89O93K71r60l24Q86K36n52O7J13m44K03P06l11o86
4848d41K37L50r0J23J6n93J3P79J7o93J05L16l36J38N74m55p32N64O41m76l05
4869b48L19j43j88N53J02p28k2N82r6j99K78k48m22N71M84o95l37N85Ql75M06
4890A87J31o97QQ08j21o19K12K38l05J77L96n03l73N75J95m70J08K15m16OO69
4911D21k25o71L58M62m31o6M52l33m26O00L05o46j11N17j56k62M27j6n80K36N63
4932D18l79l16M18n4l52L65K79n93j29O33j07m42L02J85m79R9N47l24m65M56K25
4953B87m73J04L53l92j85N56j6n39J80L66l48q4M63j88m58M03L19n04p4M33j70
$$ plain form
4808 694 332 -622 -370 312 149 -7 210 -170 -559 133 636 8 -444 -138 30 131 386 -4 -580 -143
4828 -143 490 178 -183 18 -150 -339 354 625 -335 -659 227 463 -89 -22 91 -353 -150 556 245 -441
4848 -441 -204 146 56 179 195 -398 -385 394 411 -282 -177 139 -197 -59 515 60 -672 -108 533 57 -248
4869 -248 71 -72 -260 293 395 -333 -355 227 131 -68 210 -38 -460 111 595 -100 -437 148 156 -219 187
4890 187 318 -379 -371 437 316 -303 -91 147 -158 19 415 -88 -461 114 309 -161 -53 162 -254 -248 421
4911 421 196 -475 -117 345 -86 -152 300 -33 -459 141 446 -200 -311 206 50 -212 215 199 -381 -145 418
4932 418 39 -277 141 87 -265 100 379 -214 -343 290 183 -259 43 228 -251 -152 395 71 -394 62 287
4953 287 -186 -82 271 -121 -306 250 234 -305 -125 241 -107 -191 272 84 -374 29 348 -156 -230 203 33
4974C3l21L98J47n19Q2M87k67l11L91M9m43K18L69l87k06M81k2m30K48K64m13
4995a52l9M72j77m06L33K35m22%M02k35k80M07R8m53Q6L71k86j68L85l5m12K52
5017b4K96l80j16M09q4l57L03J94m10l7M23j38k99K84J19l67R3L48k67k29L60
5038A21N2l60J52K69l02j36L84j7l81J91K51l11o4L45j29l12K70K02l28m0L13
5059A70j57k10K94O0l38Q6K84k13j63L21l6l30J75K94k99j47L21k5k81K02J95
5080B03l19m6L08q1k09J79Q2k36P1K46j88j78K56M0k45R3K14k72r7L36J0l21P2
5103h2K34j96n6K68j03k78J81K09j91q6J88j18j16K59J7k94M0K50j15q8J74q5
5125A2k44K17K61k51j90K08O2j37J14R3k74o0L39J9k16J2M6q8J28J59k14j99K18
$$ plain form
4974 33 -288 110 257 -262 -180 307 40 -271 120 169 -274 -56 313 -74 -280 201 179 -251 -3 261 -152
4995 -152 -191 281 104 -302 31 266 -156 -156 246 11 -269 138 236 -217 -131 240 -46 -214 171 136 -276 -24
5017 -24 272 -108 -224 185 101 -256 47 241 -169 -206 217 79 -220 64 183 -184 -91 257 -10 -239 121
5038 121 173 -187 -35 234 -68 -204 180 163 -218 -27 224 -87 -151 194 65 -247 23 225 -103 -143 170
5059 170 13 -197 97 157 -181 -95 189 -24 -187 134 98 -232 -57 237 -62 -209 112 87 -194 8 203
5080 203 -116 -162 146 65 -144 35 117 -119 -48 198 10 -168 88 128 -117 -24 190 -82 -179 157 167 -154 -82
5103 -82 152 -44 -100 168 65 -213 -32 177 -14 -100 88 -30 -146 113 130 -164 -124 126 11 -77 97 12
5125 12 -232 -15 246 -5 -195 13 75 -62 52 145 -129 -189 150 169 -47 -35 11 -77 51 210 -4 -203 15
5148A5J39j56L6K6k09K3L23k2l50PK48l7l4R8j49j97K44K17j82j94N9N1O7J58
5172A81r5l29Q9L02j4j56Jp1o1K74J70l44k45K54K06q3k9o6j73R8L56n3l26q1
5196a95J58J03J12n1k97r8L42J88k15j53j6PJ72K30k23l76R4M00%j68q7j03J6
5219a60L27J13l58k25J73K39O6p5k44j68K77L43j34l08n2R6J55K10j06m35o2M37
5241A09K13k34k03p4N9K60K20k98m08J54L56J01j22k50j86J79M20j3l99j54J59
5262a11J78J66j9m21k32M36M02k34l66l1J00K06K33j72m50l4M39K30j67k70j81
5283b98J44M03J21m32k66J83K58J09Ol24l37L13N47r7n09j06J97J96J64o4m44
5304b36j62M18L54j58l35j94Q5M40K10m10m36J96L69N8n0j84l33P6O08J33n74
$$ plain form
5148 15 154 -2 34 60 -149 -126 197 175 -175 -168 80 43 9 107 -42 -239 5 222 40 -154 -95 -44 23 181
5172 181 86 -243 -154 148 134 -22 -21 -92 -153 121 291 -53 -298 -44 162 79 50 -16 -189 -91 265 212 -114 -195
5196 -195 -37 66 178 127 -170 -268 74 262 47 -106 -122 -115 57 287 64 -312 -218 182 182 14 -73 -176 -160
5219 -160 167 280 -78 -303 -130 109 175 100 -144 -312 -35 308 174 -134 -186 -90 65 275 169 -266 -328 109
5241 109 322 88 -115 -189 -130 130 350 52 -356 -202 154 255 133 -117 -303 -124 296 283 -116 -270 -111
5262 -111 67 233 214 -207 -439 -3 399 165 -201 -232 -132 74 307 135 -315 -349 90 320 153 -117 -298
5283 -298 -154 249 370 -62 -328 -145 113 222 228 -96 -433 -120 427 330 -179 -285 -88 108 272 208 -236
5304 -236 -398 20 374 216 -119 -313 -228 212 422 12 -424 -228 141 199 149 -35 -368 -292 316 449 -125
5325a25k98K84K82R1p7l11k43L25M23q4l62j81L5L46L61l05n62Q4N12J03k19j13
5347c4j75p6M61L50m76n05K06M42J05j32k85k51K69M37m7m01j46M6K30L29p1o02
5369c26j78O16L06l56k41K9m8K12L77k01n73J5N04J83j82k72j94J70M57L2m20
5390i0j82J54J33J99J07m21m20M49N70k79m71O5J53N0K15K3m87j66M40K90j71
5411A61k70j81O2M37J73m44l17K75K20m7R8j11m30P7O68J4o04j34L44J04K8M3
5433A66k68k61L19L62j52k35j26PK53L36k94m91K04M20q0j49P4k27j71M63L32
5454D82m98m07L64K55q6mj32k48J56L80n5l40j4N7O8K65j5n06j05N50J24l58j6
5477h3O9j66J40L88k18n04J57M09l4j25k8j84%L90N1l76n8J83nP9J78l03l24L80
$$ plain form
5325 -125 -423 -139 143 234 157 -154 -397 -72 351 267 -95 -276 -241 105 466 161 -401 -317 195 298 79 -34
5347 -34 -209 -285 176 526 50 -455 -249 193 298 166 -119 -370 -101 336 289 -112 -258 -212 18 347 276 -326
5369 -326 -504 112 418 62 -179 -150 -198 14 391 190 -383 -368 136 319 137 -135 -329 -159 298 330 -90
5390 -90 -272 -118 15 214 321 -100 -520 -71 499 220 -251 -186 -33 17 232 255 -232 -398 42 332 161
5411 161 -109 -290 -228 209 382 -62 -379 -104 116 69 167 56 -374 -297 371 385 -219 -353 -9 95 123 166
5433 166 -102 -363 -44 318 166 -69 -195 -188 65 401 107 -384 -180 240 160 11 85 -142 -313 150 482
5454 482 -16 -423 -59 196 110 106 -26 -274 -118 262 207 -133 -147 -90 -22 243 228 -278 -383 167 291 -67 -83
5477 -83 -14 -180 -40 348 130 -374 -217 192 158 33 5 -179 -179 211 262 -114 -172 11 6 85 263 -40 -364 16
5501A6L53l17k54K00qq2K69L9m38n5M07P5k18k6m0q9K56J78l17k01K55J05j54
5524d6J40j0l49J23M31j15m02J10K20j24L2J82k57k07L25K05k53j16J23r5P2K18
5546B07j28l05J61K55j55p2J24j37j33L19J13l62q6K86mj28J19m1k37J23L02j82
5568C9j99J35M7q1J21N6k55n0L29n2k08J00O7j78J01K33j95k38K33J66k15k2J69
5591A03j45p7K57J1k74M1J83r7m0J39r2j50J87J51k47o3J97p2j18J90K6k55N3
5614i2K43j17j65J56K9j52R7J36j86j14K15K3j85Q5J09j74RK11q0j86J38J03j61
5637e8RJ49j19r7J96L5k07L2J65j02q2J63m1j61J05J54j80l6J43l3j35J39P1k06
5661i6K4J90q8j55J47M0j52O1J44j38r7J69L7j69L2J29j40k4J75o3j51J00J32
$$ plain form
5501 16 369 52 -202 -2 -10 -92 177 216 -222 -277 130 205 -13 -39 -79 -168 88 266 -51 -252 3 108 -46
5524 -46 94 84 -265 -142 289 174 -228 -118 102 -22 10 192 -65 -272 53 258 5 -111 12 -83 -11 207
5546 207 79 -226 -65 190 35 -37 87 -50 -183 136 249 -113 -199 87 83 -45 74 33 -204 -81 221 39
5568 39 -160 -25 22 -59 62 118 -137 -187 142 90 -118 -18 49 -129 -28 205 10 -228 5 171 -44 -66 103
5591 103 -42 -119 138 149 -125 -84 99 2 -38 101 9 -141 46 197 -50 -113 84 12 -106 84 110 -145 -92
5614 -92 151 34 -131 25 54 -98 -1 135 -51 -165 50 73 -112 -27 82 -92 -83 128 48 -138 0 103 -58
5637 -58 -49 100 -19 -116 80 115 -92 -60 105 3 -79 84 43 -118 -13 141 -39 -75 68 35 -100 39 110 -96
5661 -96 -72 118 30 -125 22 62 -90 -29 115 -23 -120 49 86 -83 -51 78 -62 -86 89 26 -125 -25 107
5684A07j43m3J49p3j16J71M8j62oJ61q0q7J26Lj52Q2J23j13o4J41k4j18J05O8
5708A03j39k7J42l9j22J01O0j54L0J21q6r5J13M9j11L5R7j17l9J32oj37N1R1r1
5733c8JJ02l4j33J14P3j27nJ31p4j01J39N7j50mJ27n3p3J09k0j31Q5J00q2l7P3
5759D9m3p0J12M4j53j7J39k5r6P8L4j43N3J43q3j38Q9O6n3ON3q4m4J26J0q5j4
5786d6N3n0M3J11j20j06J14J01j09OM9o8m3J42N8j85n2J30O7p5Nl0q8J02J15r8
5812B6j17N0K2LJ18m3j95L2K03k0j37K4J8o1Q2J43j49j72J27J41l7p5j9n3M4J75
5838A30l1j75k0Q5K5Q2%j87q6K40J23j62j03N7RL9J31r8k09K4K34L0j09q1m9M5
5864e6J69L7k02r9R9J25J6Mj62j42J82K37j02k53L2Q9L4J16j8k77m0K60J50j62
$$ plain form
5684 107 -36 -79 70 -3 -119 52 100 -62 -68 93 13 -74 52 55 -97 -15 108 -5 -69 72 48 -70 35 103
5708 103 -36 -63 79 40 -82 19 79 -75 -45 76 -10 -105 8 57 -54 -19 78 -39 -78 54 48 -89 -38 53 -38
5733 -38 -37 65 31 -102 12 85 -42 -47 84 10 -91 48 105 -45 -49 78 25 -48 61 41 -90 -5 95 13 -24 49
5759 49 6 -64 48 92 -61 -78 61 36 -60 18 52 -91 -38 105 22 -116 -27 39 -14 -8 45 -39 -83 43 53 -32 -46
5786 -46 7 -43 0 111 -9 -115 -1 100 -9 -3 46 -22 -65 77 135 -50 -102 28 95 20 25 -5 -93 9 124 26
5812 26 -91 -41 -19 -16 102 59 -136 -104 99 79 -58 -34 -16 -77 5 148 -1 -173 -46 95 58 -17 -36 -89 -45 130
5838 130 99 -76 -96 -11 14 96 96 -91 -177 63 186 24 -79 -22 -13 26 157 59 -150 -126 108 138 29 -52 -101 -56
5864 -56 113 150 -52 -151 -52 73 89 93 -69 -211 -29 208 106 -147 -115 -26 8 124 106 -171 -211 49 199 37
5888C7j22m4N8J65J23k20k01R4K00L9l6j16k04J34L28k3l17q2J52J12N7K6k54
5911i4j59K28K71r7k61o3J12J54J17j50k64J8K63J05r0j29j82N9L09J22l20k40
5933b91J95K23nj6j47k05J26L45Ql16j60J44K13J21j29l10m3K98J79j13j49j30
5955a62j5K76K59k72m13J33L64K9j44j04j48K9L20J45k85k91J00K75J48q9l18
5976a63j37K99K74j47k20p2kJ30L14p3m66r2M45K19k27k11k5J2K30K29k07l69
5998b59K2K99J93k2l26k45K42L86m1l64o8J04P4J80J03l87l25L88M30j76l68n3
6020b13J11J70J71j10l44o2K83J98j5j99k97O1M66J52m56k36K30J69mJ06j31l85
6042c35R7N25O1m43j89J72K14J08n7l10r6K62J91l2j45k07p9L42L45l21m40J64
$$ plain form
5888 37 -85 -129 -71 94 217 -3 -204 -110 90 129 93 -23 -227 -93 235 212 -105 -187 -35 77 134 160 -94
5911 -94 -253 -25 246 149 -112 -175 -63 91 208 58 -206 -188 75 180 90 -39 -221 -162 147 269 -51 -291
5933 -291 -96 127 122 106 -41 -246 -120 225 233 -83 -243 -99 114 235 106 -204 -247 51 230 117 -32 -162
5955 -162 -177 99 358 86 -327 -194 170 199 55 -49 -197 -168 152 297 12 -279 -179 96 244 155 -163
5976 -163 -300 -1 273 126 -94 -166 -168 -38 276 203 -263 -355 90 309 82 -129 -154 -142 88 317 110 -259
5998 -259 -237 62 255 233 -93 -338 -96 290 249 -115 -183 -79 -5 175 278 -109 -434 -46 384 208 -160 -213
6020 -213 -102 68 239 129 -215 -277 6 204 189 -10 -307 -246 220 372 -84 -320 -90 79 75 181 50 -335
6042 -335 -238 287 348 -95 -284 -112 102 210 153 -157 -253 9 200 168 23 -184 -263 79 424 103 -337 -173
6064a73L36j6o4m1k16q1L83K44l58l33J60K43J27l8k87j64K23K71p6j64p1r8J08
6087h5L91n1n18q1M53J45k17p0l4j06J56L23j58l97K1K78J43j1k02k60J70L47
6109B37k3k99j7M2k6K18J74l58l38L34L67j94k62M6K1L1K06J8l39r9K63J37j7
6132A22j34j86QL11J37k97j78J80O1j7J67p2l54N4M28Pl24o2J40K3Q3P4k07j85
6156b21K04J58n4o3r6p4J52K58j56l30J15K03n1oO5j83j32K68K01k76j91J59Q0
6179C0pO8q6j90Q8K42l5j57rl8QK09M8l10o8K91O1j70L0J4j49Q3K41r1k58P2J50
6206F7k0jK6j49n5K31M9j83m9P9k0N3J23j44j93J56J74j15j23J04l1o7J72L2k24
6231a08k7J99Lq7M3k5j06J09J49j31j50J22N4q0P2K5j72RK15j2j80M5Q7q1L7R7
$$ plain form
6064 -173 163 147 83 42 -174 -255 128 372 14 -319 -159 84 211 173 -114 -278 -55 216 140 -24 -95 -193 -85
6087 -85 306 255 -263 -344 109 254 37 -33 -67 -173 -17 306 148 -249 -228 50 193 182 -20 -280 -110 237
6109 237 214 -85 -102 -60 -86 132 306 -52 -390 -56 311 117 -145 -99 -78 -47 159 177 -162 -261 2 139 122
6132 122 -12 -198 -190 121 258 -39 -217 -37 24 7 174 102 -252 -198 230 237 -87 -149 -9 14 97 171 -36 -221
6156 -221 -17 141 87 24 -72 -146 6 264 108 -222 -107 96 45 39 104 -79 -211 57 258 -18 -209 -50 30
6179 30 23 91 5 -185 -97 145 110 -47 -56 -94 -86 123 171 -139 -207 84 145 -25 5 19 -130 -47 194 103 -155 -83 67
6206 67 47 46 72 -77 -132 99 148 -35 -84 -5 -25 28 151 7 -186 -30 144 29 -94 10 -21 -88 84 116 -108
6231 -108 -135 64 67 -20 23 -2 -108 1 150 19 -131 -9 45 -35 37 62 -110 -101 114 102 -78 -33 54 -27 10 107
6257A07q7j35J50J00j31j7N6o5l3J52k6j66L8J54q3m4O9m0j05J23Q0j45n9J52
6281D5l4n1M1M3j45L3J52o3j07P8N8r0J8R2q7p8J39J2j06L0P0p6MR7m6j11P9R1
6309H8r3k9Q4n8n1Q8K4j07PJ01l1o8N8Po7L2Q8q0o5J06qo9L0N0q6j0R4j8q9N4
6339a8N4q7K9P2n9o8Q7L4o4KO0m6m0P7J3q4NJ08p3l2P8j9q6O9N1q0l3P3J6q4M8
6370CJ5n5JO9j1o1M0J6o6K9O8o7n6R8J9q1J0N8p3pP7lr7M2O2m2LN0l5m9O6J6p1
6403c2K4N0l7l6P0j3q3M4O4j0p1L8J5n3L3L5l7l1M9ol2M2j1n5K0O4m8l6N5j2m1
6434d1L3P1q8o1R7K0o5kL2k5rP4j9l9J0L1JlJ3n3k9R0J5o5j0N4l5mO1pj03K2J12
6467G8k6p7K5nl0M6L3n2n2L9M8j6lm4k3N0P4n4o1QL9pL2Oo8k2Q2M1n4l1OPL4L2
$$ plain form
6257 107 20 -115 35 135 4 -13 43 -22 -55 97 71 -95 -57 97 14 -30 39 -1 -106 17 97 -48 -107 45
6281 45 11 -40 1 44 -101 -68 84 21 -86 -8 50 -40 -22 70 -17 -95 44 56 -50 -20 50 -26 -22 75 29 -82 -3 88
6309 88 -5 -34 50 -8 -59 29 53 -54 -47 54 23 -45 13 20 -47 -15 73 -7 -72 34 26 -43 -13 37 -49 -59 35 17 -72 -18
6339 -18 36 -51 -22 50 -9 -77 10 44 -20 -18 42 -4 -44 33 46 -38 -33 75 2 -30 48 29 -57 12 63 -17 -50 23 39 -45 3
6370 3 18 -37 -36 33 22 -39 1 17 -49 -20 48 -19 -75 23 42 -39 -29 29 -44 -51 26 23 -74 -32 30 -12 -9 41 6 -43 23 39 -32
6403 -32 -8 42 5 -31 39 26 -57 -13 51 41 -30 8 23 -30 3 38 1 -30 19 13 -19 23 12 -43 -23 41 -7 -43 12 0 -41
6434 -41 -8 63 -25 -86 11 31 -34 -36 -4 -29 -38 36 17 -22 -12 19 20 17 30 -23 -52 38 53 -12 -22 32 -3 -7 54 47 -56 -34 78
6467 78 52 -25 0 -5 -35 11 44 -8 -60 -21 27 11 8 -36 -59 -9 65 11 -50 -42 -3 -10 22 28 -40 -62 20 61 7 -24 -18 -11 23 55
6501E5l9p0L9O0qj6l0l4K8Q0qr1j6O4J1J7Om5p1N9R3n3p5lL9K3J6j1p1l0R7N2
6533F8o1m1j7JQ6K5r1m7M5N4Ql3j7o1N8R4mj01k5O3M5Pk5o5k9P4Q0l7q7k1K8Q6
6565F0M2q3r8L7R3Ll7l2m3OJ10K8j20n8O5N8j2j4m2l7O5O8j2r8k0J6R2M4p9q4
6595h2J0J15L2q7j5Nl6J04N1p8j11N9R3J4n7n2KM5O3mq7m0K4M2P9n0j00k4J28
6624D3N5q3o7J2K3L5M1m5j04MJ09O0o7r3RN3O5k4p3k1J9P4L5j7r9n2J15R5n8j02
6654e8J0M6K2K9k0p1k6Q5Q5m9q7j6M9P2j5q6k6L4M7PJ2p8l5L6J23k0j48j0Q0M7
6684C9l2Jo3j6O2O0oj05l4P1J00j3r4l8O5O0j6k9j6o1M3Q5J5j09m0O5P3l6j8n9
6714d6RN3O1k8o4l8M0O3Mm7q7M1J03j9p3j6K7mM6L6p1j01O1J06k2n7k4j3N4L7
$$ plain form
6501 55 16 -54 -15 45 37 21 -9 -43 -15 65 57 -34 -50 14 25 42 48 3 -68 -9 84 31 -44 -47 -8 15 31 20 -51 -81 16 68
6533 68 7 -34 -51 -50 36 61 -30 -77 -32 22 30 -3 -20 -81 -23 71 67 -34 -59 4 49 56 31 -34 -63 11 91 54 -33 -54 -26 60
6565 60 102 19 -79 -42 51 54 17 -15 -58 -52 58 86 -34 -92 -27 31 19 5 -37 -74 -9 59 47 -51 -71 -55 37 81 2 -82
6595 -82 -72 43 75 -12 -27 -22 -58 46 97 19 -92 -33 60 74 17 -35 -33 12 75 71 -16 -56 -32 10 89 39 -61 -85 43
6624 43 98 15 -52 -40 -17 18 59 14 -90 -86 23 83 16 -77 -68 -15 50 26 -47 -68 -49 25 60 43 -56 -108 7 102 44 -58
6654 -58 -48 -2 20 49 29 -42 -68 17 102 53 -34 -50 -1 71 56 -30 -56 -22 25 32 44 -34 -69 -33 90 70 -78 -88 -8 39
6684 39 7 8 -55 -71 -9 51 45 -60 -94 -23 77 64 -30 -68 -3 57 41 12 -4 -65 -22 63 78 -31 -71 -6 67 31 13 -46
6714 -46 -37 16 77 49 -15 -53 -13 50 54 7 -80 -39 64 45 -28 -44 -17 -21 25 61 -10 -111 -50 56 34 -23 -47 -60 -6 31
6744C1j9o1qM3K6K9j4r0nJ18L3r0n3N8jJ5N1l7q9J9J14J0j03k9J6O2K6j0p1k6
6774e5N3M3pk2o0l0J02N0p4q6M0P2j2J0j3o1j2Q3M2n9p0K1N7K1Pp1m1O7N5l2j8
6805@j1l2K5R1k6j36K7J15Km0Rl5l2O6N9o0o8J4N6J3Km2o9L1Q0qn7j9J9J5L5K4
6837D8j00k9O4P9n7m3J4j8L2N0k1p9L2L9J2j1j2l7oR1K0r1k7N3J8J3Ll1m8M0P9
6868G7m5n5J8qJ5M6j5p7kO3Nl2Lj2k2K5O7m8o6M1L4j5kkk2qO1J1r0K4J9J3PK2
6902C0m4m2N0O3m1l9L9oj8M3jn8NN7J4o4L9l0k0M5L4o8k2N5ol2K8J9o7LO8op6
6935d8L0N0m1MK5m3j2M8K6o9J8J2k8JO1j8o4N1O2n8l1M3%l9M9J8o6lN1J9m6K0
6967B2mk8J0N6n0m8N0K7m3K5Pl3l5O5ko6K2N1n2KL9j8m6N4J7m3JK9k7j7M7mo2
$$ plain form
6744 31 12 -49 -57 -14 12 41 27 -63 -68 50 83 -7 -60 -2 -3 12 63 26 -63 -44 70 80 -23 -52 -36 26 52 42 -29 -55
6774 -55 -2 41 34 12 -48 -78 24 74 0 -86 -46 26 14 24 11 -50 -62 21 63 4 -66 -45 12 33 40 -31 -72 -5 50 18 0
6805 0 -11 -43 -18 73 47 -89 -62 53 55 15 24 -11 -43 23 82 22 -46 -32 24 37 39 -3 -72 -41 39 31 -26 -45 -26 -11 24 48
6837 48 -52 -81 -17 62 5 -38 -24 -42 -10 40 19 -60 -28 11 23 12 0 -37 -43 48 68 -23 -50 3 21 34 37 6 -42 -2 77
6868 77 32 -23 -5 -13 2 48 33 -44 -46 17 22 -10 -7 -19 -41 -16 51 3 -63 -22 12 -3 -5 -7 -29 -37 24 35 -55 -31 -12 1 8 30
6902 30 -14 -56 -6 57 16 -23 16 10 -8 35 34 -24 -19 38 52 -12 27 -3 -23 22 56 -12 -34 21 15 -17 11 30 -37 -34 34 28 -48
6935 -48 -18 32 -9 -5 20 -23 -35 13 39 -30 -12 0 -28 -27 34 16 -48 3 65 7 -24 19 19 -20 29 47 -19 -22 29 48 2 22
6967 22 18 -10 0 56 6 -42 8 35 -8 17 24 -9 -44 21 19 -47 -25 26 -26 -24 15 -3 -49 5 22 -21 -20 9 -18 -35 12 8 -54
7000e4L5N7o0j6M6Lm5M4M0n4k3N1K0n5K9ml0NN4l6m2O2J7o0J9M1n6l4Q1kn6lM6
7033B0l9NL5j9m1K0K7m0J3K1k9j2O3j4l8j2O7k0l3M5k0l7J2O8k2l7J6J7k5K9P
7064B7m8J6K7Ol2K3Km1K3O3n8n8N9L0n3pO8m7l5N6J5n3j2J6NnK4qo3M5K5l3lL8
7098A2l6n6J05K1q2JM5J3l5K6J0n3QO0rn5K4Oj0K6J4o3nO7Nl9J6j9m1L9N7k0j06
7131g4N9M6k4j6Pm5PP3J8o7k7L8j6J8L0n4n8O6N6k3k8pj5OQ2k3q7QQ7k1nJ1n1
7164b9j7O4P0p5n8M1K1J4J6k0r0L0R0mo8k0NJN8K8r9o0J01N2k5l5j2l8K2J10l4
7195C9r8kM5N6j3j7p9qJ02M6p1m4J0J7M8M5p3j11P3R9%p6jKj7Q6N1j18r0R3P1
7226F5lm8o2J3N2P9n7r4PL4L9M1n3j20K5J35L6j31n0M8K5O0Rn1q7OJ33K3q9l2
$$ plain form
7000 -54 -19 38 -22 -38 8 11 -34 10 50 -4 -27 24 44 -11 18 14 -16 -11 43 7 -35 27 44 -16 3 44 -12 -46 35 33 -23 -26 20
7033 20 -19 -14 21 2 -39 -19 8 -32 -19 2 -27 -39 24 10 -28 -40 27 7 -26 19 -1 -38 -26 42 20 -17 -1 16 -9 20 27
7064 27 -21 -5 22 28 -4 19 21 -20 3 66 8 -50 9 39 -14 -21 47 0 -35 21 36 -17 -29 -13 -8 -13 11 3 -60 -15 10 -23 -26 12
7098 12 -24 -80 25 46 -36 -35 10 23 -12 14 24 -29 -21 39 30 -25 -1 5 -5 21 35 -28 -33 34 39 0 16 -3 -44 -5 52 32 -74
7131 -74 -15 31 7 -9 -2 -47 -40 33 51 -16 -43 -5 -21 -3 27 -27 -85 -19 37 14 -14 -21 -36 -30 52 29 -58 -50 37 16 11 22 -29
7164 -29 -46 18 88 13 -45 -4 17 31 47 27 -63 -33 57 53 -15 -35 -30 -29 29 57 -42 -102 -1 51 26 -9 -21 -59 -37 73 39
7195 39 -59 -61 -16 40 27 10 -69 -77 25 71 0 -44 -34 -17 31 76 3 -108 -35 64 64 -12 -13 -11 -28 58 109 -9 -99 -6 65
7226 65 62 14 -48 -35 17 96 39 -55 -48 -14 25 66 13 -107 -82 53 89 -42 -92 -44 -19 41 50 -1 -88 -82 51 74 -15 -47
7256d7k7Q6Q7m4j17J1N0K5L6Nj30n2J37J36j00j40L6N8N0mk5j00NQ1R1o7r9k2
7284h0M2J32j7j24n2R0L9rj3j9j19P3J50j3j61l8J19O7k8l6p0nO6O7%q4n4L8R9
7313F0O4j21j20R8R6j2o6nk5k5J26O8j28j13O1J20j1n6q6J4P3O9m5p3l0K6M9P7
7341H5n5j37J3J51J7q9k5KoO3O5o4j26K0J17O3o6j12K1O5Q2l2r0lL0L7L9j5r9
7370d9m1J03J18p8j08J7O6jL1rp3n1R1M3j3q1k5L7Q1Mq3n6M3N6j8J0l0p6M3J36
7400H7k5j18k5O3O3k2j6l1m4O7N1j3m3m6K1O7M3n8p9L1Q2ql1qm4mP3M5p4o6N4
7431hL5mjm0l8N4M1j6n2k6K8J1N3k1p0j6P0K1k8k5MqM0M1l4q4J8P1J0j6j9j9J0
7464a8N7Nm6l8N0KJ0Lk9k8L8N0l7l7OKK1J2J6o4KM5J5l8j2j9oL8J8l0j8J8J9K
$$ plain form
7256 -47 -74 12 99 55 -62 -51 -1 24 60 65 -65 -117 20 156 56 -84 -48 10 60 56 31 -69 -64 17 108 41 -58 -80
7284 -80 -38 94 77 -47 -99 -9 30 21 8 -11 -130 -57 93 80 -81 -119 0 67 39 3 -67 -72 -6 61 61 -23 -77 -39 60
7313 60 124 3 -117 -19 77 65 -1 -6 -31 -56 70 138 10 -103 -42 78 67 11 -75 -61 12 81 36 -37 -67 -41 8 85
7341 85 30 -107 -94 57 74 -15 -40 -38 -44 19 84 20 -106 -86 31 94 28 -84 -63 2 84 52 -38 -41 -11 26 65 50 -49
7370 -49 -90 13 131 53 -55 -38 28 27 58 49 -24 -75 16 59 46 -35 -60 -23 58 62 -21 -77 -34 22 4 14 -16 -92 -49 87
7400 87 62 -56 -81 -18 45 23 7 -24 -68 -1 50 37 -6 -52 -31 36 79 21 -58 -27 55 47 16 8 -36 -40 33 78 4 -62 -8
7431 -8 27 23 22 -18 -56 -2 39 23 -29 -55 -27 -16 37 16 -54 -70 0 21 -7 -32 -28 -36 4 45 11 -73 -55 16 26 10 -9 -28 -18
7464 -18 39 44 -2 -40 10 12 22 25 -4 -32 6 56 19 -18 -12 -10 11 23 39 -25 -23 22 37 -1 -13 -32 -38 0 18 -12 -30 -12 7 9
7498Ik0J2m2L7LK8l2k1J0K2j5J3k7j5M0K0%k6nRmL5pl1QK2J0k1J1j8j5M6j3j7
7532Fk1J0LOJ1ol6KM7j0k8mJ9mMkj5j6K1K7l6J0%j8K9qNj5J2J6lk3J6j1MNK7k7
7570coQK5k9K8oqj3L3j2j7J0%pqK0l3J9j1K5k2RNk1kL5l1k7J7PJ1j0%MoOJ6k2
7608a6KNJ1PKqqJ1J2j1nJ2qmJ5kk0NKQMj8J9Rj5j1LK%J2j8J0Jk0J6K%k7J5MJ3
7649A1l5J0J2k2QOj5OJ8QrJ1Nj3J2mkpRK0k9K9pj7LJ6Oj5j2J6rj2K7k1k0K6Nj9
7687dLJ3qk2K2j2J3lpRl4L5Roj6Pnj5K3j0j6K6%j4KK3k2j1J7J4kpNlj2J7nLQj4
7727AJ4j9K3Kj8J3o%Npj3J3J3k0mjOJl4L1j1j6J7NmMJLj6K8k5NNKJlJ2Kl2PK6
7768A1k4J0jJ2oJ1j3nJ0JQJpjpJ6Oj5qJ2rlkJ1l1K2LLj4lPjj0J9j6kMPpJ4J0k2
$$ plain form
7498 9 -11 1 -41 -4 -1 27 -5 -26 -16 6 -9 4 -23 -38 2 22 22 -4 -9 0 -4 31 24 -7 1 23 33 12 23 5 -10 36 23 6
7532 6 -15 -5 -2 4 15 9 -27 -25 22 12 -16 -20 -1 -5 -1 -3 -18 -34 -13 14 -22 -12 -12 -30 -1 -9 -4 -19 -7 9 6 -17 -1 -12 -8 -3 24 -3
7570 -3 -9 -1 24 -5 23 17 9 -4 29 17 0 10 10 3 -5 15 -18 1 -10 15 -7 2 7 -14 -16 19 -12 -39 -22 -15 -4 -14 -14 -10 -16 -10 6 -16
7608 -16 -14 -9 2 9 11 3 -5 6 18 7 2 14 6 2 17 15 -5 0 2 10 14 -4 15 24 9 -2 1 3 3 15 -3 7 8 -12 4 6 6 -21 -6 -2 11
7649 11 -24 -14 -2 -24 -16 -10 -25 -19 -1 7 -2 9 14 1 13 9 7 0 9 29 0 29 22 5 8 24 30 15 3 19 10 -2 25 4 -16 10 15 -4
7687 -4 -1 12 4 -18 4 -8 5 2 -5 4 -30 5 14 8 -8 -1 -6 -21 2 -8 -24 2 2 -12 -10 13 -9 -20 -3 11 9 2 7 4 -8 9 4 7 15 1
7727 1 15 -4 19 21 3 16 10 10 15 8 -5 8 21 1 -3 -4 2 3 -31 0 -11 -27 -10 -5 -9 -5 -4 -1 -17 11 -14 -9 -4 -2 -1 -4 8 10 -22 -15 11
7768 11 -13 -3 -4 8 2 13 0 -5 5 6 14 15 8 7 0 16 22 7 -1 11 2 -1 -3 8 -23 -1 2 5 -9 -12 -5 -6 -16 3 -13 -15 -11 -4 -11 3 13 -9
7810ioJ2J3k6LQK0Jj0j3L0lJ6j0k8L0k9J9Pk4j0J6Opj8J6mMJ1Ok6qLK2oJk2j5
7848c0L5nOk3Rkj0K3Pm1oN9Lk8qlOJ2L1m1lJ8kJ8j4%j9J8K3k0j3J2J2k3Pj0Ll2
7886c1N1J8k1k5j2K7%j5Mj1nJ3mKmj5J0K5J4n2pN7Mj5Kk5pK8J4ok3k2L1J0j0j1
7922a1qJ6J7jroj2oN4Pm4j6L3K6k4j8pj2K3J3Km3NJ2K3J4l8k0lM4j8lj9mOJ4K9
7959A6j8m8NQ1j7m5J5%J0K5rj9k8K0L9j5Jm3MN9Pj3n2M0jJ5Krn2nN7J8k7k6pL5
7995A5J5k0l1kJ6L2k3j2lk2M1L3m3l0lM6Rnj8k8KL8K0k0l7PL5J7j5j4k3J7M0j3
8029B1j2j4pK1L3np7mO9Rk8j4jj9M8K9l4m1oL4oJ1j1l1LN8j1l5j3QOL0K2o0l2
8064e9L7O4k0l1Mj0K5L3k4m6RK3K0j0mk0%M0J4l4j6QK9j8mqm5L1N7l1k6j0PlK1
$$ plain form
7810 -9 -15 -3 10 -16 -13 -5 15 16 6 -7 23 20 36 26 -2 28 -1 18 25 1 -9 7 13 6 -12 4 0 4 15 21 -5 -13 -10 12 6 7 -15 -30
7848 -30 5 0 6 -17 -8 -10 -20 3 10 -31 -37 22 25 -3 -11 -14 -8 4 35 -6 -9 9 7 25 11 11 -8 10 33 13 0 12 24 1 8 -2 1 -31
7886 -31 20 38 17 -8 -20 7 7 -8 -4 -15 -20 -7 -11 -9 -13 -28 -18 7 21 -31 -38 19 23 8 10 -15 -22 6 20 14 -9 -31 0 10 0 -11
7922 -11 -19 -3 14 13 4 -2 -14 -20 34 41 -3 -19 14 40 16 -2 -9 -21 2 15 17 -26 -21 -9 14 28 -10 -30 -33 11 -7 -10 -29 -33 -27 -13 16
7959 16 -2 -50 -45 36 19 -26 -11 -11 -1 24 15 -4 -32 -12 27 12 13 -30 -26 33 40 27 -25 15 14 29 31 22 -30 -35 22 40 13 -13 -20 15
7995 15 30 10 -21 -23 -7 25 2 -10 -13 -35 6 39 -4 -34 -37 9 18 13 -5 -33 -31 7 27 7 -30 -23 12 29 14 0 -23 -6 34 21
8029 21 9 -5 -12 9 42 37 -40 -44 25 34 6 -8 -9 -28 20 49 15 -26 -32 2 -4 7 -4 -35 -32 26 15 -20 -33 -25 -19 11 33 -27 -59
8064 -59 -22 42 22 -9 -5 -15 10 43 19 -27 -18 5 25 15 11 -9 -9 31 45 11 -5 3 32 14 10 2 -43 -12 45 14 -12 -22 -15 -18 3
8099CK7m6k0L4J5k0j5onK8L9n1j8J5K6J9l5%j3J2L1Pl4k0L8qORl7k1M8K4k7k3
8133a8K5qQK0j5l2nO3ql6lOj6L1K3n4k2K5K0k3K1%m1K8M4j7o2L8kjK5j3j2j2J2
8168a1K7k0%Lj2K9K1l8l0M9J8k6j1nnJ6K4nl1J5L2rj4
$$ plain form
8099 3 30 -16 -36 -2 13 -7 -22 -28 -33 -5 34 -17 -35 -20 6 25 -10 -10 -23 -11 20 27 -7 -27 11 3 9 18 -19 -40 8 32 5 -18
8133 -18 7 -1 7 27 12 -20 -25 38 30 -6 -9 -3 -19 12 35 -19 -41 -16 4 -19 2 2 -39 -11 33 16 -46 -8 -10 -11 14 1 -11 -23 -11
8168 -11 16 -4 -4 -1 -13 16 37 -1 -31 18 36 10 -1 -6 -11 5 29 24 -7 8 40 31 17
8191A7
$$ Imaginary data points
##PAGE= N=2
##DATA TABLE= (X++(I..I)), XYDATA
0@%%%%%%%%%%JkRj6J6j7J8j8K6l4L9m8N9o7P6r2J06j17J30j50J74j99K24k50K83
35A51l22L59l97M44m95N46o06O73p44Q22r07R98j098J210j331J466j615J779j966
54a033K181k422K695l016L396l852M407n100O003p224Q950j1569J5968k4606M7247
69C2025k05748m58157P61210L13150n86621o721L57135l25250j53791N14587N0442
80B92261m88466q338K30997j690J33716K1995m59332k3172O02826l1727n31347
91b62277J84288K96029m06865k0009O23131j91939p22743K85235O38969k82473
101A41346l80082K37455M5217j97706K30133J65492l33938j11009K38099K473
111C7480l535J51708k54677k94365M31822L43932m81675k45765M27795J2161l32442
$$ plain form
0 0 0 0 0 0 0 0 0 0 0 0 1 -1 8 -8 8 -9 9 -9 17 -17 22 -26 33 -34 42 -50 56 -61 69 -81 93 -106 118 -132 151
35 151 -171 188 -209 235 -260 286 -320 353 -391 431 -476 522 -576 634 -697 769 -846 933 -1033
54 -1033 1148 -1274 1421 -1595 1801 -2051 2356 -2744 3259 -3965 4985 -6584 9384 -15222 32025
69 32025 -173723 -631880 129330 442480 -144141 -150862 206273 -118977 -272768 241819 292261
80 292261 -196205 -204543 26454 24764 158480 180475 -278857 -302029 300797 269070 -262277
91 -262277 -77989 218040 -188825 -208834 414297 222358 -500385 -215150 423819 141346
101 141346 -238736 -1281 43936 -153770 76363 241855 -92083 -203092 35007 37480
111 37480 33945 185653 -69024 -363389 68433 412365 -69310 -315075 112720 124881 -207561
122b07561K72736K49650m90941j93093N50701J38519m34355n5197K04920n7974
132b2595L0723J60077j78654j88976K01698J03187j27081Q3829J7595l00903P2112
143a48988M51667j24826m65262J59615L34205k05157j17372K68267r1782l21861
153b61494K14509L20356k23034k33159J45721P2635m1317J03730l9537k19522
163a61112Q0182K20377r7535j04516J18664p5030j53611K38928J83260l22570
173g2963j72000L06236R5711k18750L5232J13526j73289l5367K56450j623k42559
184a09396J3232J34071k4415K1251M5888j55594o3852K15857N0935j88807J1073
195d9757J02306j12028m296K12574o5860k63430R5706K33679r8712j29931R6920
$$ plain form
122 -207561 65175 314825 -176116 -369209 181492 320011 -114344 -169541 35379 -22595
132 -22595 8128 168205 -10449 -199425 2273 105460 -21621 62208 79803 -221100 -148988
143 -148988 302679 177853 -287409 -127794 206411 1254 -116118 152149 60367 -261494
153 -261494 -46985 273371 50337 -182822 -37101 35534 -5783 97947 58410 -161112
163 -161112 -80930 139447 41912 -62604 56060 -18970 -172581 66347 249607 -72963
173 -72963 -244963 61273 156984 -61766 -26534 86992 -86297 -121664 134786 133163 -109396
184 -109396 -96164 37907 13492 34743 80631 -74963 -138815 77042 127977 -60830 -49757
195 -49757 52549 -59479 -63775 148799 82939 -180491 -84785 148894 50182 -79749 17171
206A7171n320j01185J15565J03089j59108q3340J28552K9736n0452M8471l3114
217A0065j20797Q8610J50720j05836j17555R6936L0308q2012P5046P2800j53666
228e5381o5280J74550M5778j35391m951O1060n0849J2056R9644n6382j14971O4857
240b5260Q2816m9656j2209K9934o7569j7674J21843J0982j28258P49Q8166k5696
252H168k4038O0291l4140q8903O5031R2902o4812o3432M5268Q756k3236M8742
264C0597R326q4071k991Q2675l622m8002J7208j415l6508M2846N1785o1051n1211
277e4434N4567K9388l3703P567J2555m4379j36O4445l568n8783M765L1128r786
290c74M488J9506l1895k8249M1042K8068l2215j5003J4475p421J276K9354q544
$$ plain form
206 17171 11851 -89334 26231 129320 -29788 -113128 15424 45160 -5292 43179 10065
217 10065 -110732 -22122 128598 22762 -94793 2143 32451 -49561 25485 98285 -55381
228 -55381 -120661 53889 99667 -35724 -40675 20385 -30464 -18408 81236 24854 -90117 -25260
240 -25260 57556 7900 -4309 25625 -41944 -59618 62225 73207 -55051 -54302 33864 8168
252 8168 -15870 44421 10281 -78622 -13591 79311 14499 -48933 -3665 5091 -18145 30597
264 30597 39923 -44148 -47139 35536 31914 -16088 1120 -295 -36803 6043 57828 -3223 -54434
277 -54434 133 29521 -4182 3385 15940 -28439 -28575 35870 32302 -26481 -21716 9412 -374
290 -374 4114 23620 -8275 -36524 4518 32586 371 -14632 -157 -7578 -6302 23052 14508
303A4508m0197P936L4628m940j5770N012o753r459K2581J4775k5982j5655J8185
316a131R108n678L015m146j5192P526K1165n348j7902J614P381j82M774K267j2836
331e565n865J3798P655q688n558J523%L570O098m497r454K227Q394O97l775j960
347a400j567O68N033J815n165l755K832L695J16j704j833r26J578K789q3k972
363h79j463J814J962k71j205p25j77P87J325j66j726n11J337P92o53n31R9oK6
382a71N44J09p90l70R79L67j142j01J297l86j316J072R50j736j67K286j007k412
400a994K302J841l323m74L710j505l278L646J818n203N26N595l308m478N773J912
416C560p122J763O594n614m114Q630J61r781M348Q264q236l990J0441k194j0315
$$ plain form
303 14508 -25689 -17753 16875 11935 -3835 1177 -5576 -15035 7546 22321 -3661 -19316 -1131
316 -1131 7977 2299 5314 1168 -14024 -6498 14667 9319 -8583 -6969 412 230 5004 7271 -5565
331 -5565 -11430 2368 10023 1335 -4223 -2700 -2700 870 6968 2471 -6983 -4756 3638 4335 560 -1400
347 -1400 -2967 -2299 2734 4549 -616 -4371 -1539 2156 2272 568 -1265 -2191 -613 2176 2093 -879
363 -879 -2342 -528 1434 1163 -42 -767 -944 -157 1168 1002 -724 -1235 102 894 241 -290 -191 -197 -171
382 -171 373 482 -308 -678 301 668 -474 -575 722 336 -980 92 1042 -694 -861 1425 418 -1994
400 -1994 308 2149 -1174 -1648 2062 557 -2721 925 2743 -2460 -1934 3661 353 -4125 1648 3560
416 3560 -3562 -1799 4795 -819 -4933 3697 3858 -5923 -1575 6689 -1547 -5537 4904 2710 -7605
431g605Q611P633j3235k629J4312l904j1188J0587M747j5676L232J7103j0471
444A517j3576J5164N161j6359O105J4110j6809q867K3200J199k2525P837J4815
457A0972j6679k571K2867j0208k3574J9621J6962k3494l429K1660j3578j5469
469a6920K8428O475l5366M052L1212j5004j7045K4798k228l0718J9876K9500l0365
482c305j8973L1362K17k4222K1670J2457l9083P41M4604j3325l4961K4474J2948
495A4604l3205J3594L7173l5300l2947M5187J8468m1632M624K8217k9979j0928
507b2124M8247n131n1184J7781L5694k6799o517L2349k5809l2907M9585K5278
519C8463n6894p329M7081j9094k6143M6941K665o5578J6392O5735k8479m4668
$$ plain form
431 -7605 1006 8639 -4596 -7225 7087 3183 -8005 2582 7329 -8347 -5115 11988 1517
444 1517 -12059 3105 8266 -8093 -1988 12122 -4687 -13554 9646 10845 -11680 -3843 10972
457 10972 -5707 -8278 14589 4381 -19193 428 17390 -6104 -9533 12127 -1451 -16920
469 -16920 11508 17983 -17383 -13331 17881 2877 -14168 10630 8402 -22316 -2440 27060 -3305
482 -3305 -22278 9084 9301 -14921 6749 19206 -19877 -19136 25468 12143 -22818 1656 14604
495 14604 -18601 -5007 32166 -3134 -36081 9106 27574 -14058 -9434 18783 -11196 -22124
507 -22124 26123 20992 -30192 -12411 23283 -3516 -10033 22316 -3493 -36400 13185 38463
519 38463 -18431 -25760 21321 2227 -23916 23025 25690 -39888 -23496 42239 13760 -30908
531c0908L4562Q788l6441K8646L3726n3327k3532N6476L488l8739K4579Q930n2652
544c6404K1159O8971m2900o3453N3618L4250n5773R919N2806n2833m5459P8135
556B2036L1367p7014q372N2019k1105j5136M8410j9120o1221M0733M9806m7312
568d909j3865M2982l5763l3027Q0554J9774j02911j719R4583k3211o0415N2803
580A4876J5562p8500K2743Q7894m3197p1751M4517L0822l3033K1689J6854o5341
592c6865R8Q1671j8967o3393M2016J8406o7585L4772Q7356p6458q9237R4652O5239
605G1705q9582j7884P0192l7742m7155P9911K6412r0500p790O4365j1068j2519
617a655K9398m3490m0461Q2101L4296r1639m639P4056m4238m1729R6707Q701j31417
$$ plain form
531 -30908 3654 12442 -23999 4647 38373 -14954 -38486 17990 21478 -17261 7318 16248 -36404
544 -36404 -15245 53726 10826 -52627 991 35241 -20532 -10613 42193 -10640 -56099 22036
556 22036 53403 -23611 -31983 20036 -1069 -16205 32205 13085 -48136 -7403 42403 -4909
568 -4909 -18774 24208 -11555 -44582 35972 55746 -47165 -48884 45699 22488 -37927 14876
580 14876 30438 -48062 -25319 62575 19378 -52373 -7856 22966 -10067 11622 28476 -36865
592 -36865 -36767 44904 25937 -37456 4560 22966 -44619 -9847 77509 1051 -88186 6466 71705
605 71705 -17877 -35761 34431 -3311 -50466 29445 55857 -34643 -42433 21932 10864 -1655
617 -1655 27743 -15747 -56208 25893 60189 -31450 -36089 37967 -6271 -48000 48707 57408 -74009
630g4009J6693J31786l4028r5355M7115L5999n7686K2231O1994n7100n2027N7941
642C554K2759l0077K1681j0442o6435M6584R1586o8792q2510P7680L8860p9853
654c5405K3780Q0280q0559p7521J09612O4895j02480l7158O7294k627k2840M1096
666B8367j2026o0262K8113M7080k7726k615J9814n6629j1798J06126L750j25142
678f2948J0092J07435l5240o3393O9553J3651j01273K2512J13937l6296r6339
689e8309L1506N0727j9077O103Q297n0368p76O3210q983m0048K6762o764n2140
702d9860N5793P5197q7507q1412R3844O0797q0278j5766N9906l7643m3959P7043
714B6155L5004q4964k7671N8662J4755j1325M774l4955k3163O1344K7339o0871
$$ plain form
630 -74009 -57316 74470 40442 -54913 -7798 28201 -29485 -7254 54740 -2360 -54387 3554
642 3554 26313 -3764 17917 7475 -58960 -12376 79210 10418 -72092 5588 44448 -35405
654 -35405 -11625 68655 -11904 -89425 20187 85082 -17398 -54556 12738 10111 -12729 28367
666 28367 16341 -43921 -15808 31272 3546 931 20745 -35884 -47682 58444 62194 -62948
678 -62948 -52856 54579 19339 -44054 25499 39150 -62123 -39611 74326 38030 -58309
689 -58309 -26803 23924 4847 10950 19247 -31121 -31897 31313 22330 -17718 9044 2280 -49860
702 -49860 5933 81130 -6377 -87789 6055 66852 -13426 -29192 30714 -6929 -50888 26155
714 26155 61159 -23805 -51476 7186 21941 10616 15390 -19565 -42728 18616 45955 -14916
726a4916q251M0534l1693j4782P7688m524j08958J4155J10123j9471p9707K7954
738a1848L1293m1944J3866N5336l7948n7195L5079L9627j2690m843j4378l4030
750c9675L3474N8596m0323n5346L9685K3679l9672K3088M4394o4566n0129Q3642
762A6847M7932p5136l0606M7321m07j6008L3821n009n3701J1101M8381p199j8039
775g02K292k4233k160N9324N023p1941l550N8459q870k7911L1707l922n6045K3886
789a8643O8606k7577o0125K0169L1451j1134N800P097l5037p869M3476P562k8696
802d920m9l68j5324K8981L2097m4858l9860M4146L0947l2076o117J8343k4752
815a3810j0449M7681R150n1864r494L5837N470q214M844j7485j7024L0219K2837
$$ plain form
726 -14916 -23167 17367 -14326 -29108 48580 44056 -64902 -50747 59376 39905 -39802 -11848
738 -11848 19445 -22499 -8633 46703 8755 -48440 -13361 26266 13576 8733 -5645 -39675
750 -39675 -6201 52395 12072 -43274 -3589 20090 -19582 3506 47900 -16666 -66795 16847
762 16847 64779 -10357 -40963 6358 5951 -10057 23764 18755 -34946 -23845 24536 17337 -702
775 -702 1590 -22643 -24803 34521 39544 -32397 -35947 22512 13642 -14269 17438 13516 -42529 -18643
789 -18643 49963 22386 -37739 -17570 13881 2747 8547 15644 -19393 -27262 16214 23776 -4920
802 -4920 -4969 -5337 -20661 8320 40417 -4441 -44301 -155 30792 -1284 -7401 10942 -13810
815 -13810 -24259 23422 32572 -19292 -28786 7051 12521 4307 9151 -8334 -25358 4861 27698
828B7698k6852j6017J2888l005J998K6346j0316m2481J0683M2897p566k6937O894
841c770K442j1573J8947J8951k8116k2653K2929J7427q876l120n138j4253J2178
854d625K5918j1103k5283N997J2166k653P033M279k2909r252K8238J2624k1814
867a384r748Q533%L873J2397r569k0811P688K0040j928r817k414m873K087J6670
882A0744K008j9945n851J3844N358k555O04p486r184J1525J5217q792j4662K717
896f458P017K039L860k443j2417q51J4345M570r182n188L79J509P013M507r357
911f57r117O453R054r77m064l148l264L530R031p00j0089k807O169M190K30k170
927A664n424k065O761N736m143o420k36L402L518J541l743n569J178O436K109
$$ plain form
828 27698 846 -15171 -2283 -5288 -3290 23056 12740 -29741 -19058 23839 16273 -10664 -3770
841 -3770 -1328 -12901 6046 24997 -3119 -25772 -2843 14584 5708 2588 -2550 -16803 -4625
854 -4625 21293 10190 -15093 -9096 3070 417 7450 11729 -11180 -20432 7806 20430 -1384
867 -1384 -11132 -2599 -2599 1274 13671 4102 -16709 -9021 11019 9091 -726 -3140 -8013 -5926 10744
882 10744 12752 -7193 -13044 800 6158 3603 4207 -3279 -12463 -938 14279 5487 -9175 -6458
896 -6458 559 2598 6458 4015 -8402 -9253 5092 9662 480 -4708 -4329 -2820 4193 8700 -657
911 -657 -9774 -3321 5733 4756 692 -2456 -5720 -2190 6841 6141 -3948 -6755 -586 3604 3834 1664
927 1664 -3760 -5825 936 6672 2529 -3891 -4127 -725 2793 4334 591 -4978 -3800 2636 4745
942D745l809l784n40K636M042M64m735l471K617M392P06k688l012n42K988L310
958C319r19m012j638K411K980L70k324k562J81K915K028j461k895p27J986K239
974A891M3k214j859P91K405R62j396j996l51J668J790m05k037r54J055J528M32
991A353r69j617j71J788J139j055j255k4M39Q23P83r93j678O71J768k90r75J87
1009g6l07l96J461O78j992o84J863J25j156Q17K34j782O34K244j320j885J780
1026B38P99k011P19J846k123j221K947J33k981J271K163k549p66L293r37l157
1042b336K545K060l619k64L840j786l053L540J348m440Q80M192l031k816M557
1057A617N11m924K074M040m290k009N516p48n285L471L648n454r34O105k194n176
$$ plain form
942 4745 936 -2848 -3388 -752 3290 3754 -981 -4452 -1835 2557 3263 575 -2437 -2979 9 3319
958 3319 2400 -1612 -3250 -839 2141 2511 187 -2375 -2194 721 2749 1288 -1607 -2334 -348 1891
974 1891 1934 -280 -2139 -1348 1057 2019 623 -1373 -1724 -56 1734 1329 -708 -1662 -607 921 1353
991 1353 384 -1233 -1404 384 1523 468 -787 -811 -372 451 1234 241 -1437 -766 1002 712 -263 -76
1009 -76 -383 -779 682 1360 -632 -1316 547 672 -484 333 567 -1215 -581 1663 343 -1542 238
1026 238 1037 -974 -255 1591 -532 -1753 1194 1327 -1654 -383 1780 -769 -1535 1758 821 -2336
1042 -2336 209 2269 -1350 -1614 2226 440 -2613 927 2275 -2165 -1285 2907 -124 -2940 1617
1057 1617 2128 -2796 -722 3318 -972 -2981 2535 1787 -3498 -27 3621 -1833 -2767 3338 1144 -4032
1073d032M955K761o529N20O481l856m689O318J521p225K258O243n675l536P727
1088C242k00p807M100N715p128j938Q462k577p649O547M750q828l25Q772m552
1103E84o399Q571K332j0474K479R449o812n640R624O0j0244N725Q350r994m129
1118f518J1436j523r762P246N494j1328P6J2418n526r879R694M084j1545L212
1132b421J0808r935p430J3895K007j3930M432J0192j0398l944J4110k888j4130
1145i632Q467R936j1599k437J1829o179r331J3154M524j6044J752J3959q426p628
1159g655J3990p94j6647Q623J5097j3835r046J5389q9j3477R578R012j6249k970
1173i073J7582l570j3010R496M158j3578N910J4408j3950j0952J7685L330j6677
$$ plain form
1073 -4032 923 3684 -2845 -2325 4156 300 -4389 1929 3450 -3775 -1517 4726 -949 -4485 3242
1088 3242 3042 -4765 -665 5050 -2078 -4016 4446 1869 -5780 767 5517 -3311 -3636 5136 584
1103 584 -5815 2756 5088 -5386 -2907 6542 -270 -5910 3714 3774 -6470 -745 7605 -2389 -6518
1118 -6518 4918 3395 -6367 879 6373 -4955 -4879 7539 2013 -7866 1828 5912 -5633 -2421
1132 -2421 8387 -1548 -8978 4917 6924 -7006 -2574 7618 -2780 -6724 7386 4498 -9632
1145 -9632 -1165 8771 -2828 -5265 6564 385 -8946 4208 8732 -7312 -5560 8399 -27 -7655
1159 -7655 6335 5541 -11106 -2483 12614 -1221 -10267 5122 5033 -8444 1134 10146 -6103 -9073
1173 -9073 8509 4939 -8071 1425 5583 -7995 -2085 12323 -1627 -12579 5106 8436 -8241
1186h241O790J1968j6344n347K1951j510k1296P515J4375j1998l666J4271p015
1199A453j3447J4072Q825j5523p45J1688q946m621J7272l225k0936R922J8015
1212A3804j4573r099J7092k860j7399J3647J5155j9607r957J9151K122j3225O656
1225I07M701j3637L352J5811q875j1519J1302J636j1242J0586R380k0671n822
1238a4091K4839L61k1956O923J3678j4685l585K0348m702k1176R163J5767r696
1251A188n417P758o422m512J5093N60j7262M334J2204j0210k298J6123q399j9939
1265a7199J6195J9250j9243j2941J7998K321j4391R008J0355j6787o475J7732
1277E823K622j1691J749J337o130Q992Q716j5402p410J6385J059j2851Q971P408
$$ plain form
1186 -8241 -1451 10517 -5827 -11174 10777 9267 -12029 -4514 9861 -2137 -5803 8468 1453
1199 1453 -11994 2078 10903 -4620 -5365 6323 -2623 -7244 10028 6803 -14133 -4211 13804
1212 13804 -769 -9868 7224 4364 -13035 612 15767 -3840 -13797 5354 7476 -5749 907
1225 907 5608 -8029 -4677 11134 2259 -9260 2042 3678 -7564 3022 12402 -8269 -14091
1238 -14091 10748 11109 -10847 -3924 9754 -4931 -8516 11832 7130 -14046 -4883 10884 1188
1251 1188 -4229 3529 -2893 -7405 7688 8248 -9014 -4680 7524 -2686 -4984 11139 2740 -17199
1265 -17199 -1004 18246 -997 -13938 4060 6381 -8010 998 11353 -5434 -11909 5823
1277 5823 8445 -3246 -1497 -160 -6290 2702 11418 -3984 -11394 4991 6050 -6801 2170 9578
1291I578j9346k236K5677j706k5113M975J7602q220o367J1442m024j3232R756
1304a214J1557r441n564M628l622J848J2558p226j7228J0476J5060j2236o414
1317f818J3531n170j4816J5071J5070j9551j2615J7627O597j1244J777L924r498
1330f115J458J2866l753r833L917J068l431R759L233j8167k684K0742L44j6854
1344g450M628Q971j1466q55J7519m452j9647N975J5977m851p400L190k725k265
1358d851J0014J840j1367n33O636k827J577P797r325j2169J3528J3135j3416r087
1372i048J0573Q87p418Q181N542j4079m896J4240L978q776j584N77k205O487N564
1387H023r510o171Q172K616m251M341K69j1662J825J5933k101j4917J941R071
$$ plain form
1291 9578 -9768 -12004 13673 11967 -13146 -8171 9431 1211 -5156 6286 2262 -10970 -1214
1304 -1214 10343 902 -4662 -34 -3656 -1808 10750 3524 -13704 -3228 11832 -404 -6818
1317 -6818 6713 1543 -13273 1798 16868 -2683 -15298 2329 8926 -2318 -541 3383 -6115
1330 -6115 -4657 8209 4456 -5377 -1460 -392 -3823 5936 9169 -8998 -11682 9060 9404 -7450
1344 -7450 -2822 6149 -5317 -6172 11347 6895 -12752 -6777 9200 4349 -3051 139 -2586 -4851
1358 -4851 5163 7003 -4364 -4897 1739 -1088 489 8286 -1039 -13208 320 13455 39 -9048
1372 -9048 1525 2412 -5006 3175 8717 -5362 -10258 3982 7960 -816 -2400 -1823 -4028 2459 8023
1387 8023 -1487 -7658 514 3130 -1121 3220 3489 -8173 -6348 9585 7484 -7433 -5492 3579
1401C579k972j061N422n355p957P596Q475n465n668R90nK996O087m646r436M008
1417c412Q178k669k711K430m349l778R517N762j0693o324P861M133l138N53q00
1432E60n575K196Q230j141p019o08K217J329L726l22p823j569Q267K493n188j219
1448a446O24k266K987O168l992q200K579O962l60k768p88k403J47N843J616n963
1464a260k853L020K194J146M55m213l632M713N411k944m495M75J082R26L133m98
1480B660n838j125N657K506k959k253p00K31L239K459l471m049J644L460O70p57
1496A374j993k553J542M622J23m344j604J949J699J102j64l119j988L097L379
1511C122j368k984p85R06J928J752j512l403k7L170J489j243j812j200P10K760
$$ plain form
1401 3579 607 -454 4968 -387 -8344 -748 7727 2262 -3406 -2416 -2421 575 6662 2016 -7420 -3412
1417 -3412 4766 2097 -614 1816 -2533 -6311 3206 8968 -1725 -8049 -188 3945 807 1360 560
1432 560 -5015 -2819 5411 4270 -2749 -3357 -1140 189 3915 3593 -4230 -5799 2468 4961 -227 -1446
1448 -1446 -822 -3088 -101 6067 2075 -6125 -3546 3416 3056 288 -500 -2903 -2756 3087 4703 -1260
1464 -1260 -4113 -1093 1101 2247 2702 -1511 -5143 -430 4981 2037 -2458 -1983 -901 25 3158 2660
1480 2660 -3178 -4303 1354 3860 901 -1352 -2052 -1821 1418 3877 406 -3643 -1999 1461 2131 1374
1496 1374 -619 -3172 -1630 2992 3115 -1229 -2833 -884 815 1917 1753 -1366 -3354 -257 3122
1511 3122 1754 -1230 -2015 -1109 819 2571 1059 -2344 -2371 799 2288 1045 -767 -1967 -1257 1503
1527A503J077k618k379J068K257Q29p27j875j330J497K645p8k470j310R54J686
1543G29R68q28k139o79J937J821o18j832r08O90J676Q75j263j900N7J786J082
1560A454o39j414q08P97J657L83j488j299M36J413P67o30j365n73J100J360j26
1577A025j323q58N00J207N92p52j284j59J157Q86l06j051o21M63J139M14r47r67
1595h85K10R17N22k44q76n49N77J054j0r05m94K63N52N37k18r29l22Q38O40l40
1615C38n13k24j6N37O34n00r43K02P71Q0j77j62m82oQ75K78q79l60N25J28l4L21
1637C93l62p39N24Q79n14o47M39N3l17N49K96r85k10J029K1p81L59K72p19K71
1657a89R06o65q31Q80M41r11K06P66q83m30J287Oj308M55R63r10l46J221l66j211
$$ plain form
1527 1503 2580 -38 -2417 -1349 908 1737 1010 -865 -2195 -698 1947 1869 -601 -1911 -957 729
1543 729 1697 869 -1270 -1949 -12 1809 1191 -641 -1549 -859 817 1692 429 -1471 -1414 372 1454
1560 1454 815 -599 -1407 -610 1047 1430 -58 -1357 -921 492 1259 629 -736 -1309 -209 1151 1025
1577 1025 -298 -1156 -656 551 1143 391 -893 -1052 105 991 685 -366 -987 -524 615 1029 82 -885
1595 -885 -675 242 764 520 -356 -905 -328 726 716 -189 -683 -420 132 669 451 -478 -800 38 678 338
1615 338 -175 -399 -415 122 756 256 -687 -485 286 366 189 27 -455 -461 414 692 -187 -547 -22 106 72 393
1637 393 31 -708 -184 695 181 -466 -27 26 -291 258 554 -431 -641 388 409 -372 -13 259 -460 -189
1657 -189 717 52 -779 101 542 -369 -163 603 -280 -710 577 583 -725 -270 693 -217 -563 658 292 -919
1677i19R95Q26j326j76J360o37j040J300M22j612L46J466j050r42J560J12j671
1694i86P81J357j521o66J883k65j746J176J121j804j69J961q50j633J726P65k090
1711i60L04J966j391j272K127K21k313R52J853j903q71K390m05k202J594J422
1727A512k402k21K579j108k025K170Q91k698N33K492j859j570K688K19k800J244
1743c55K169k421r38K936n83k665K005J657k931j80L045j357k327K582R39l133
1759a557P11K884k195j831L069K24l086J458K332k821r35L430p04l082K174J908
1775A979l171j33L324j646k655K971J264l457N15L003k208j753L327O8l540J621
1791d91K701k855j044L409j022l124K835K044l860m02L806j473k750L101J046
$$ plain form
1677 -919 76 902 -424 -600 760 123 -917 383 805 -807 -461 1005 -45 -987 573 685 -986
1694 -986 -205 1152 -369 -1035 848 583 -1163 13 1134 -670 -839 1122 272 -1361 365 1130 -960
1711 -960 -656 1310 -81 -1353 774 995 -1318 -366 1487 -416 -1287 1103 698 -1504 90 1512
1727 1512 -890 -1111 1468 360 -1665 505 1396 -1302 -769 1723 -136 -1706 982 1201 -1599 -355
1743 -355 1814 -607 -1545 1391 808 -1857 148 1805 -1126 -1306 1739 382 -1945 637 1576 -1557
1759 -1557 -846 2038 -157 -1988 1081 1305 -1781 -323 2009 -812 -1747 1683 979 -2103 71 1979
1775 1979 -1192 -1325 1999 353 -2302 669 1933 -1524 -1009 1994 -214 -1967 1360 1428 -2112 -491
1791 -491 2210 -645 -1689 1720 698 -2426 409 2453 -1407 -1809 1997 524 -2226 875 1921
1806A921l963P98L748k282k451L117L67l160J840K428l483j060M052o84l369K459
1822B78J701l805L91M350k318l744L536K094l888K11L417k510k307M034P90m191
1838a961Q12L007k303q55L297j523l435L347K503m190n49L925j964k840M266J298
1854B835n502L64N221j901l469L098Q37l690J693L477l336k223L621J23k671K361
1870H38R32m416J019N192k671m250L802J853m451J279M510m005l857N363K419
1885C557n028l07L343k051j037L843j043m212K337K862k854m6K715l250k114N774
1901B489J053o552M11N473k362l009M365K10n729J953N724k954m054K839J131
1916I88k109K118J084m307L6M560j270k808K701k16m086L285M848n255m410N682
$$ plain form
1806 1921 -2042 -1244 2504 222 -2229 888 1255 -1905 -65 2363 -1120 -2180 1872 1188 -2181 278
1822 278 1979 -1826 -1435 2915 597 -3147 389 2483 -1405 -1194 2223 -287 -2594 1440 2230 -1961
1838 -1961 -1149 1858 -445 -1300 1997 474 -2961 386 2889 -1301 -1850 2075 111 -2729 1537 2835
1854 2835 -2667 -2303 2918 1017 -2452 646 1483 -2207 -514 2963 -373 -2596 1025 1148 -1523 838
1870 838 1770 -2646 -1627 3565 894 -3356 446 2299 -2152 -873 3637 -368 -4225 1138 3557
1885 3557 -1471 -1778 1565 -486 -1523 2320 1277 -2935 -598 2264 -590 -636 2079 -1171 -3285 2489
1901 2489 3542 -3010 -2599 2874 512 -2497 1868 2078 -3651 -1698 4026 1072 -2982 -143 988
1916 988 -1121 997 2081 -2226 -2190 2370 1100 -1708 993 777 -3309 -24 4824 -431 -4841 841
1932H41K523m868N40L372l641j934N518Q54n305l2L070q23K55J665l264k071M764
1949A464J488m399L42K671l099n11N712j156p011K019O311k358l685K625J29k964
1965b422K766L163l873k704K991J216q07J083j513l302L046M227l371l252K972
1980B20N77k568K847K390n388k436O062K103m760q95K205j020K46K937j614l759
1996b853J584K819o94k92j72k800N29M973m18n212L95L468j091o58K583j894m108
2013c841L022M733k613l738J299J318j25J554k31l510o3L500M60j626j92j185
2029a238q70L455K201m212k806L358J998j663J95J70k739L15M380J33m252p49
2045b324K315Q31L39K5k502j245L034J998j957j508J09k95J443K475j830l885
$$ plain form
1932 841 3364 -1504 -964 2408 -1233 -3167 2351 3205 -2100 -2132 938 115 370 2035 -1229 -3300 1464
1949 1464 2952 -1447 -1105 1566 -1533 -2044 3668 2512 -4499 -2480 3831 1473 -2212 413 542 -2422
1965 -2422 344 3507 -366 -3070 -79 1137 330 1413 -100 -3402 -356 3871 500 -2752 220
1980 220 797 -1771 1076 3466 -1922 -4358 1704 3807 -953 -1848 357 -663 -417 2520 906 -2853
1996 -2853 -1269 1550 856 564 392 -2408 -1879 3094 2676 -2536 -2141 1327 236 -422 2161 267 -3841
2013 -3841 -819 3914 1301 -2437 -1138 180 55 1609 1378 -2132 -2195 1305 1765 139 -53 -1238
2029 -1238 -2108 1347 3548 -664 -3470 -112 1886 223 418 588 -2151 -1836 2544 2677 -1575 -2324
2045 -2324 -9 822 1161 1186 -1316 -2561 473 2471 514 -994 -885 -1180 263 2738 908 -2977
2061b977J150L634j56j792j93p79l97K692J543l048k289J795J996J08m37j579
2077g29j532J804K807r29k570k63Q48Q22J492m02l085p14L194J589j848j471j25
2094a112K08J566J518j730k679P47K514N54r79j294j044R30K474J80k536j174
2110a857J192J377N78l86j883j091J958K187r14k163m03Q34J238R04r21k187j23
2127a660K179J197r88j469o25O91J713O78j729j680O74J724O35o76j362q57J089
2144d66J893m2j865j028Q45J316O09o84j586m93J546J431n57j542o43O94J302
2161G30O04j073j528J41J569Q46o91j251n32P58J394K50j389j108N36J308N15
2178A079o04j198m45J047J233k23j286o69N60J060M56o86j180j32J150Q79m62
$$ plain form
2061 -2977 -1827 1807 1651 -141 -334 -1113 -1510 1182 2725 -323 -2612 -817 1179 1287 850 -729
2077 -729 -2261 -457 2350 1421 -1149 -1412 -564 258 1750 1348 -1737 -2451 743 2332 484 -987 -1112
2094 -1112 -904 662 2180 450 -2229 -1482 1032 1586 607 -687 -1731 -801 1673 1853 -683 -1857
2110 -1857 -665 712 1290 904 -979 -2070 -112 2075 1161 -1002 -1405 -571 667 1571 650 -1537 -1660
2127 -1660 519 1716 728 -741 -1366 -675 1038 1716 -13 -1693 -1019 705 1340 664 -698 -1555 -466
2144 -466 1427 1385 -480 -1508 -663 653 1262 578 -1008 -1501 45 1476 919 -623 -1266 -572 730
2161 730 1334 261 -1267 -1126 443 1289 598 -653 -1185 -427 967 1217 -172 -1280 -744 564 1079
2178 1079 475 -723 -1168 -121 1112 889 -397 -1066 -506 554 1010 324 -856 -988 162 1041 579
2195E79j015m66M98J014L55r07j019K61J023M77l88q26m60N66J061P2j061o16
2213h52M36P52L63l47q74l18Q29Q33l14q49k79K85O33M52m90r96J11R62L01m51
2233A87m06k70J09Q08L44q55o56M84N88K6j30l79m90M45Q77k25q18j5L50M2L04
2254C20J17q12l41R07M34o62k23K08j96J84O54l66q86L68P32k90k17K37m32k55
2274e19R12K53j009j29P62j85k68N55j62q92N13R22o32o49O23O5m97N17L48r49
2294d21j18J021j55p57N10K17p90L57Q76p96p08R91K94r55K85P09q26l37J146
2313E43r3j110M86P60q21j55R55m49q74R12N13j106M0J016o25o90J089J83j235
2332f61L70J080q47o19J125k0j130O40Q48j084l25J211l00j009Q42N28j177R4
$$ plain form
2195 579 -436 -902 -404 610 965 58 -961 -700 323 800 412 -414 -874 -308 753 825 -236 -852
2213 -852 -416 336 699 352 -522 -840 -11 822 508 -341 -620 -335 298 750 260 -736 -625 337 638 187
2233 187 -219 -489 -380 428 772 -83 -739 -255 333 359 229 -150 -640 -195 682 457 -361 -376 -26 16 320
2254 320 437 -375 -716 191 625 -37 -260 -52 -248 -64 590 224 -662 -294 438 148 -69 168 -264 -519
2274 -519 393 646 -363 -492 270 85 -183 372 210 -682 -169 753 121 -528 95 160 -337 180 528 -421
2294 -421 -539 482 327 -430 80 297 -493 -136 740 -56 -764 227 521 -434 -149 560 -266 -603 543
2313 543 450 -660 -174 586 -235 -390 565 116 -758 154 667 -439 -399 617 -8 -698 391 574 -661
2332 -661 -291 789 -58 -677 448 428 -702 -62 786 -298 -623 588 288 -721 121 649 -528 -434
2350d34J190o75q87J090L44j281L40J099r21o45J273J8j270N88R71j090l54J272
2368F28l35j096Q99O61j257l9J270n92r57J093L94j302K87J172q54p50J207J13
2386E42j236N22R79j044m52J284j96j173P98P43j187j41J260m88j029J018N03
2403G03j254J48J187p66q06J162J88j237M42R97r65n06J219j03j174P10P80j082
2421c57j89J185m04j009R41N10j163O9J100o47p59J073J99j184L88R84q47n31
2439f41J106r1j061O38P82j016k88J070k61q52P33M45j025Q1R85n13o88Q16J85
2458D05r11L53P75p94m40R89jr27M53O36q12j73R38k35q41N58N17p20k4O68m45
2479c1m51P34J53q05K27N82n22k22P12j64p53N02N64o63k34O45j63m93N03K55
$$ plain form
2350 -434 756 81 -806 284 628 -653 -313 786 -135 -780 493 511 -759 -171 800 -290 -644 628
2368 628 293 -803 96 757 -500 -539 731 139 -818 275 669 -633 -346 826 -28 -778 429 542
2386 542 -694 -172 807 -237 -689 595 399 -774 24 767 -420 -561 699 211 -818 200 703
2403 703 -551 -403 784 18 -788 374 562 -675 -233 764 -201 -707 512 409 -765 -55 725 -357
2421 -357 -546 639 235 -774 167 677 -486 -417 683 36 -723 350 549 -635 -247 737 -110 -641
2439 -641 465 374 -687 -49 733 -283 -571 499 238 -614 119 564 -461 -380 605 92 -596 220 405
2458 405 -506 -153 622 -172 -612 377 376 -551 -98 538 -274 -447 491 256 -585 -27 490 -230 -254 414 -31
2479 -31 -482 252 405 -400 -173 409 -113 -335 377 213 -540 -38 526 -137 -371 274 111 -382 121 376
2499C76o56KN84k16l34L48J0m01K93L38m92j49M86p1l83L52J54n14O9N19k20m23
2521c28L36J74l24Q9K52k76j59L59K9k88J22R6k19J20K53k85k00L36P8k83R2J73
2543A47k62l7L63p5l77J57K42j66l6J50j62r8K70Pk48P9R4j30J07J63k96j56L80
$$ plain form
2499 376 -280 -278 306 90 -244 104 114 -287 6 344 -148 -297 189 118 -265 87 241 -273 -204 315 95 -328
2521 -328 8 182 -142 -53 199 -77 -236 123 152 -136 -14 82 -137 -17 236 -49 -249 87 165 -118 -26 147
2543 147 -115 -152 211 136 -241 -84 158 -8 -44 106 -56 -154 116 123 -125 -46 48 -82 25 188 -108 -264 116
$$ [...]
8191a0
##END NTUPLES=NMR FID
##END=
