##TITLE=1H ikalashn
Pr-2
20.12.2024
##JCAMPDX= 6.0         $$ Bruker NMR JCAMP-DX V2.0
##DATA TYPE= NMR FID
##DATA CLASS= NTUPLES
##ORIGIN= UXNMR, Bruker Analytische Messtechnik GmbH
##OWNER= root
$$ TOPSPIN		Version 1.3
$$ 2024-12-20 15:12:04.640 +0400  Irina@DPX200
$$ Compression mode = diff/dup
##.OBSERVE FREQUENCY= 200.131300845
##.OBSERVE NUCLEUS= ^1H
##.DELAY= (6, 6)
##.ACQUISITION MODE= SIMULTANEOUS
##.ACQUISITION SCHEME= undefined
##.AVERAGES= 8
##.DIGITISER RES= 18
##SPECTROMETER/DATA SYSTEM= spect
##.PULSE SEQUENCE= zg
##.SOLVENT NAME= Acetone
##.SHIFT REFERENCE= INTERNAL, Acetone, 1, 17.49637
##AUDIT TRAIL= $$ (NUMBER, WHEN, WHO, WHERE, WHAT)
$$ ##TITLE= Audit trail, TOPSPIN		Version 1.3
$$ ##JCAMPDX= 5.01
$$ ##ORIGIN= Bruker BioSpin GmbH
$$ ##OWNER= Irina
$$ $$ F:/spectra/data/iren/nmr/1H/4/audita.txt
$$ ##AUDIT TRAIL=  $$ (NUMBER, WHEN, WHO, WHERE, VERSION, WHAT)
(   1,<2024-12-20 15:11:47.000 +0400>,<Irina>,<DPX200>,<TOPSPIN 1.3>,
      <created by zg
	started at 2024-12-20 15:11:09.609 +0400,
	POWCHK disabled, PULCHK disabled
       configuration hash MD5:
       BE 6D 3F 07 2A EA 11 49 91 17 2B D3 AF B3 58 0D
       data hash MD5: 16K
       80 62 FE 4A B1 64 47 97 46 4E BB 0C 48 0F E8 8F>)
$$ ##END=
$$ 
$$ $$ hash MD5
$$ $$ BA B4 43 A3 67 09 C2 9E A3 AD 0C 62 1D 6A 12 37
##$RELAX= 
##$RELAX= 
##$RELAX= 
##$RELAX= 
##$RELAX= 
##$RELAX= 
##$RELAX= 
##$RELAX= 
##$RELAX= 
$$ Bruker specific parameters
$$ --------------------------
##$DU= <F:/spectra>
##$EXPNO= 4
##$NAME= <1H>
##$PROCNO= 1
##$TYPE= <nmr>
##$USER= <iren>
##$AMP= (0..31)
100 100 100 100 100 100 100 100 100 100 100 100 100 100 100 100 100 100 
100 100 100 100 100 100 100 100 100 100 100 100 100 100 
##$ANAVPT= -1
##$AQSEQ= 0
##$AQ_mod= 1
##$AUNM= <au_zg>
##$AUTOPOS= <>
##$BF1= 200.13
##$BF2= 200.13
##$BF3= 200.13
##$BF4= 200.13
##$BF5= 200.13
##$BF6= 200.13
##$BF7= 200.13
##$BF8= 200.13
##$BYTORDA= 1
##$CFDGTYP= 0
##$CFRGTYP= 5
##$CHEMSTR= <none>
##$CNST= (0..63)
1 1 145 1 1 1 1 1 1 1 1 1 1 1 1 1 1 1 1 1 1 1 1 1 1 1 1 1 1 1 1 1 1 1 
1 1 1 1 1 1 1 1 1 1 1 1 1 1 1 1 1 1 1 1 1 1 1 1 1 1 1 1 1 1 
##$CPDPRG= <>
##$CPDPRG1= <>
##$CPDPRG2= <>
##$CPDPRG3= <>
##$CPDPRG4= <mlev>
##$CPDPRG5= <mlev>
##$CPDPRG6= <mlev>
##$CPDPRG7= <mlev>
##$CPDPRG8= <mlev>
##$CPDPRGB= <>
##$CPDPRGT= <>
##$D= (0..63)
0 2 0 0 0 0 0 0 0 0.06 0 0.03 0 0 0 0 0.0002 0 0 0 0 0 0 0 0 0 0 0 0 0 
0 0 0 0 0 0 0 0 0 0 0 0 0 0 0 0 0 0 0 0 0 0 0 0 0 0 0 0 0 0 0 0 0 0 
##$DATE= 1734693103
##$DBL= (0..7)
120 120 120 120 120 120 120 120 
##$DBP= (0..7)
150 150 150 150 150 150 150 150 
##$DBP07= 0
##$DBPNAM0= <>
##$DBPNAM1= <>
##$DBPNAM2= <>
##$DBPNAM3= <>
##$DBPNAM4= <>
##$DBPNAM5= <>
##$DBPNAM6= <>
##$DBPNAM7= <>
##$DBPOAL= (0..7)
0.5 0.5 0.5 0.5 0.5 0.5 0.5 0.5 
##$DBPOFFS= (0..7)
0 0 0 0 0 0 0 0 
##$DE= 6
##$DECBNUC= <off>
##$DECIM= 32
##$DECNUC= <off>
##$DECSTAT= 4
##$DIGMOD= 1
##$DIGTYP= 9
##$DL= (0..7)
0 120 120 120 120 120 120 120 
##$DP= (0..7)
150 150 150 150 150 150 150 150 
##$DP07= 0
##$DPNAME0= <>
$$ [...]
##$SW= 21.9926040160658
##$SWIBOX= (0..15)
0 0 2 0 0 0 0 0 0 0 0 0 0 0 0 0 
##$SW_h= 4401.40845070422
##$TD= 16384
##$TD0= 1
##$TE= 300
##$TE2= 300
##$TE3= 300
##$TEG= 300
##$TL= (0..7)
0 120 120 120 120 120 120 120 
##$TP= (0..7)
150 150 150 150 150 150 150 150 
##$TP07= 0
##$TPNAME0= <>
##$TPNAME1= <>
##$TPNAME2= <>
##$TPNAME3= <>
##$TPNAME4= <>
##$TPNAME5= <>
##$TPNAME6= <>
##$TPNAME7= <>
##$TPOAL= (0..7)
0.5 0.5 0.5 0.5 0.5 0.5 0.5 0.5 
##$TPOFFS= (0..7)
0 0 0 0 0 0 0 0 
##$TUNHIN= 0
##$TUNHOUT= 0
##$TUNXOUT= 0
##$USERA1= <user>
##$USERA2= <user>
##$USERA3= <user>
##$USERA4= <user>
##$USERA5= <user>
##$V9= 5
##$VALIST= <valist>
##$VCLIST= <CCCCCCCCCCCCCCC>
##$VD= 0
##$VDLIST= <DDDDDDDDDDDDDDD>
##$VPLIST= <PPPPPPPPPPPPPPP>
##$VTLIST= <TTTTTTTTTTTTTTT>
##$WBST= 1024
##$WBSW= 25
##$XGAIN= (0..3)
0 0 0 0 
##$XL= 0
##$YL= 0
##$YMAX_a= 442729
##$YMIN_a= -411954
##$ZGOPTNS= <>
##$ZL1= 120
##$ZL2= 120
##$ZL3= 120
##$ZL4= 120
##$ABSF1= 10
##$ABSF2= 0
##$ABSG= 5
##$ABSL= 3
##$ALPHA= 0
##$AQORDER= 0
##$ASSFAC= 0
##$ASSFACI= 0
##$ASSFACX= 0
##$ASSWID= 0
##$AUNMP= <proc_1d>
##$AXLEFT= 0
##$AXRIGHT= 0
##$AXTYPE= 0
##$AXUNIT= <>
##$AZFE= 0.1
##$AZFW= 0.1
##$BCFW= 1
##$BC_mod= 2
##$BYTORDP= 1
##$COROFFS= 0
##$CY= 7568.61572265625
##$DATMOD= 1
##$DC= 2
##$DFILT= <>
##$DTYPP= 0
##$F1P= 17.9538593292236
##$F2P= -4.03888763876832
##$FCOR= 0.5
##$FTSIZE= 32768
##$FT_mod= 4
##$GAMMA= 1
##$GB= 1
##$INTBC= 1
##$INTSCL= 1
##$ISEN= 128
##$LB= 0.02
##$LEV0= 0
##$LPBIN= 0
##$MAXI= 945.577
##$MC2= 0
##$MEAN= 0
##$ME_mod= 0
##$MI= -402.1523
##$NCOEF= 0
##$NC_proc= 0
##$NLEV= 6
##$NOISF1= 8.587773
##$NOISF2= 6.764455
##$NSP= 1
##$NTH_PI= 0
##$NZP= 0
##$OFFSET= 17.49637
##$PC= 1
##$PHC0= 363.0132
##$PHC1= -16.71576
##$PH_mod= 0
##$PKNL= yes
##$PPARMOD= 0
##$PPDIAG= 0
##$PPIPTYP= 0
##$PPMPNUM= 100
##$PPRESOL= 1
##$PSCAL= 0
##$PSIGN= 0
##$REVERSE= no
##$SF= 200.13
##$SI= 32768
##$SIGF1= 18.5376
##$SIGF2= -6.396296
##$SINO= 400
##$SIOLD= 32768
##$SREGLST= <1H.CDCl3>
##$SSB= 3
##$STSI= 0
##$STSR= 0
##$SW_p= 4401.40845070422
##$SYMM= 0
##$S_DEV= 0
##$TDeff= 0
##$TDoff= 0
##$TI= <>
##$TILT= no
##$TM1= 0
##$TM2= 0
##$TOPLEV= 0
##$USERP1= <user>
##$USERP2= <user>
##$USERP3= <user>
##$USERP4= <user>
##$USERP5= <user>
##$WDW= 1
##$XDIM= 8192
##$YMAX_p= 0
##$YMIN_p= 0
$$ End of Bruker specific parameters
$$ ---------------------------------
##NTUPLES= NMR FID
##VAR_NAME=  TIME,          FID/REAL,        FID/IMAG
##SYMBOL=    X,             R,               I
##VAR_TYPE=  INDEPENDENT,   DEPENDENT,       DEPENDENT
##VAR_FORM=  AFFN,          ASDF,            ASDF
##VAR_DIM=   8192,          8192,            8192
##UNITS=     SECONDS,       ARBITRARY UNITS, ARBITRARY UNITS
##FACTOR=    0.0002272,     1,               1
##FIRST=     0,             0,               0
##LAST=      1.8609952,     -56,             -63
##MIN=       0,             -411954,         -411954
##MAX=       1.8609952,     442729,          442729
$$ Real data points
##PAGE= N=1
##DATA TABLE= (X++(R..R)), XYDATA
$$ [...]
2052C237q1o006J093K897L563j0280L491J0518j3175J372Q270n022j254j347O533
$$ 3237 3156 -2850 -1757 1140 4703 -5577 -2086 8432 -4743 -3371 4899 -123 -1377 -2724 3809
2067C809j449r830J0881J104r819M575L896j687n877L860O875j0273O14Q141m523
$$ 3809 2360 -7470 3411 4515 -5304 -729 3167 1480 -4397 -537 6338 -3935 -3321 4820 297
2082B97l043J234N849l770p249J1093r08r466O561K718l442l275L394N462r186
$$ 297 -2746 -1512 4337 567 -6682 4411 3503 -5963 598 3316 -126 -3401 -7 5455 -3731
2097c731K56R254o041l797M911K797m836l413Q772j670q071O414K938n081j948
$$ -3731 -3475 5779 -262 -4059 852 3649 -1187 -4600 4172 2502 -5569 845 3783 -1298 -3246
2112c246M706K725q380J902Q098p089k702O221M48m727j099P042k070p192O641
$$ -3246 1460 4185 -4195 -2293 5805 -1284 -3986 2235 2683 -2044 -3143 3899 1829 -5363 1278
2127A278K776o635j7N241j81o444K871O102o601k085O531o36n016Q98N787l185
$$ 1278 4054 -2581 -2598 2643 2462 -3982 -1111 4991 -1610 -3695 2836 2200 -2816 -1918 3869 684
2143F84n429O621J655o742J439M883j945m801L508M409o326j141O567j963m697
$$ 684 -4745 1876 3531 -3211 -1772 3111 1166 -3635 -127 4282 -2044 -3185 3382 1419 -3278
2158c278K739M020l921l356O117L90o172K516M254l307l223M105K440n793K31
$$ -3278 -539 3481 -440 -3796 2321 2711 -3461 -945 3309 2 -3221 884 3324 -2469 -2238
2173b238N723k973l719L659K482m146j648N435p65n217L305L141l853j761M001
$$ -2238 3485 512 -3207 452 2934 -1212 -2860 2575 1810 -3407 -102 3039 -814 -2575 1426
2188A426R79m938J110M705l486k606L919J120l826l91M551j573m086L672J905
$$ 1426 2405 -2533 -1423 3282 -204 -2810 1109 2229 -1597 -1988 2563 990 -3096 576 2481
2203B481l767n61L445P4m180J824L689l935j249L748j91k954L25L587j962l158
$$ 2481 -1286 -1847 1598 1672 -2508 -684 3005 -930 -2179 1569 1378 -1576 -1251 2336 374 -2784
2219b784L985O18l478O90K481n40l201K119K731m176J79L169j368j648M92K659
$$ -2784 1201 1819 -1659 -969 1512 972 -2229 -110 2621 -1555 -1376 1793 425 -1223 -731 1928
2235A928j872k558M196n34l071J902J069o12k070J643K257m095J014K689k295
$$ 1928 56 -2502 1694 1160 -1911 -9 1060 448 -1622 21 2278 -1817 -803 1886 -409
2250d09k78L06J718j223k405M232j301k699K980n30l06r17N58K374l901J225K619
$$ -409 -687 -381 1337 114 -2291 1941 640 -2059 921 391 85 -832 -274 2100 -1801 -576 2043
2267B043l209R92K15N45k38k367L928j586k436L778j984K06R4q01K906l835J214
$$ 2043 -1166 -174 41 586 348 -2019 1909 323 -2113 1665 -319 -113 -19 -820 2086 -1749 -535
2284e35K873m341K391O9r71J509k829L275r33k775M383k776K46J192k080L271
$$ -535 2338 -2003 388 457 -514 995 -1834 1441 508 -2267 2116 -660 -414 778 -1302 1969
2300A969l402Q22L122n037L478k80k131L287l724K824J76l823N208l202k93K783
$$ 1969 -1433 -611 2511 -2526 952 672 -1459 1828 -1896 928 1104 -2719 2489 -713 -1006 1777
2316A777l709L604k278o09L916n227L377J92l205M500m106K084J362m738N731
$$ 1777 -1932 1672 -606 -1215 2701 -2526 851 1043 -2162 2338 -1768 316 1678 -3060 2671
2331B671l364q38M268n339M055j120k495N241n477K760J458m746N558l908O24
$$ 2671 -693 -1531 2737 -2602 1453 333 -2162 3079 -2398 362 1820 -2926 2632 -1276 -652
2346f52L073n608N582k652j822N418o234M002N8m132O402n611J946K814o173O433
$$ -652 2421 -3187 2395 -257 -2079 3339 -2895 1107 1165 -2967 3435 -2176 -230 2584 -3589 2844
2362B844l557r79M994o686N249j267l451O582o509L242J642n760P108n070N44
$$ 2844 -713 -1692 3302 -3384 1865 598 -2853 3729 -2780 462 2104 -3656 3452 -1618 -1074
2377a074M373p231O529k567k707O643p309M479N05n296P573o192J753L572p177
$$ -1074 3299 -3932 2597 30 -2677 3966 -3343 1136 1641 -3655 3918 -2274 -521 3051 -4126
2392d126P320l921j372O085p929N893r02m580P821p271L195K469p018Q186n293
$$ -4126 3194 -727 -2099 3986 -3943 1950 1048 -3532 4289 -2982 213 2682 -4336 3850 -1443
2407a443k05N614q272O916k303l468P713q218M620J266o454Q456o450J425M352
$$ -1443 -1648 3966 -4306 2610 307 -3161 4552 -3666 954 2220 -4234 4222 -2228 -803 3549
2422C549q215Q132l945k231P184q568N949o53n076Q688q106L278L294q070Q729
$$ 3549 -4666 3466 -479 -2710 4474 -4094 1855 1202 -3874 4814 -3292 -14 3280 -4790 3939
2437C939n318m18O105r176P770k143m689Q793q256L981J702o558Q770o918J275
$$ 3939 -1379 -1797 4308 -4868 2902 759 -3930 4863 -3393 588 2290 -4268 4502 -2416 -1141
2452a141N273q881P812l318k220O880q992O933p31o448J0016p921K066M056q095
$$ -1141 4132 -4749 3063 -255 -2475 4405 -4587 2346 1615 -4833 5183 -2738 -672 3384 -4711
2467d711Q865n546j177P784r885O267nn030P382p265M414J222p193R420o179P1
$$ -4711 4154 -1392 -2569 5215 -4670 1597 1592 -3438 3944 -3321 1093 2315 -4878 4542 -1637 -1566
2483a566N083p741P867m753j858Q832j0880N993K025p606Q682o508K136L891r012
$$ -1566 3517 -4224 3643 -1110 -2968 5864 -5016 977 3002 -4604 4078 -2430 -294 3597 -5415
2498e415R180l510l584P111o543M516j941k410P535r146M688K684p508P881n593
$$ -5415 3765 255 -3329 3782 -2761 1755 -186 -2596 4939 -4207 481 3165 -4343 3538 -2055
2513b055J763M022r697J0186l320n919J0123p541K352J850n208P819o933J040
$$ -2055 -292 3730 -5967 4219 899 -5020 5103 -2438 -86 1764 -3444 4375 -2558 -1518
2527a518N870q009M893j144o55K769o533P983l137n098R477p168J988K161n549
$$ -1518 4352 -3657 1236 92 -563 2206 -4327 3656 519 -4579 4898 -2270 -282 1879 -3670
2542c670Q489p541K89Q573j0910N037K361n259M829m722L984M38o386P866l394
$$ -3670 4819 -2722 -2433 6140 -4770 267 2628 -2631 2198 -2524 1460 1898 -4488 3378 -16
2557a6j632K883k800M806o162J790O525j0470N928J823n847N886n371L788J748
$$ -16 -1648 1235 -1565 3241 -2921 -1131 5394 -5076 852 2675 -3172 2714 -2657 1131 2879
2572B879q739R738k514n623P047l259R55j384k92N139p265K857L362m909K778
$$ 2879 -5860 3878 1364 -4259 2788 -471 484 -900 -1192 3947 -3318 -461 2901 -2008 770
2587G70k372L518p07o404R903m304m918Q373m961J132J36k328O635p368Q07P015
$$ 770 -1602 1916 1209 -5195 4708 404 -4514 3859 -1102 30 166 -2162 4473 -2895 -2088 4927
2603D927p533J572K343q48k92l122O108k536m380O411k543m98k98r7M828p846
$$ 4927 -2606 -1034 1309 461 169 -2953 3155 619 -3761 2650 107 -391 -689 -786 4042 -3804
2619c804K676O420r184L369K807l251J712l199M595m07o400P217p63m396K577
$$ -3804 -1128 5292 -3892 -523 2284 -967 745 -2454 2141 1734 -4666 2551 1788 -2608 -31
2634c1R29P44m569K718M178p182K541K865k668L46j968M893j910n745Q460k206
$$ -31 898 1642 -2927 -209 3969 -3213 -672 2193 -475 -129 -2097 2796 886 -4859 3601 1395
2650A395n070N027n49l50k174J092M419o394Q29N169l911j190J527K600k814l077
$$ 1395 -3675 1352 803 453 -1721 -629 3790 -2604 -1775 3394 -517 -1707 -180 2420 -394 -3471
2666c471O771k331m340M596o2j094j974J872L710o876J682N693n730l01L044J59
$$ -3471 3300 969 -3371 1225 1163 69 -1905 -33 3677 -3199 -1517 4176 -1554 -1855 1189 1348
2682A348j953j944N209j415m914M845R48l407l94K917J037n415K522M292n465
$$ 1348 -605 -2549 2660 1245 -3669 1176 2124 -1283 -1677 1240 2277 -3138 -616 3676 -1789
2697a789KL407n08k226q83M852k089m637N737K97m488J502K509n26l771K308L682
$$ -1789 -1787 1620 1112 -1114 -1997 2855 766 -3871 1866 2163 -2325 -823 1686 1160 -2611 -303 3379
2714C379n147k87M380j427k892J091L708k903l187N403k95m409K115K458j504
$$ 3379 -1768 -2055 2325 898 -1994 -903 2805 -98 -3285 2118 1823 -2586 -471 1987 483
2729D83l015K735K917n262K71M754k641k560K417K235k991j981M778n49m465K786
$$ 483 -2532 203 3120 -2142 -1871 2883 242 -2318 99 2334 -657 -2638 2140 1591 -2874 -88
2745h8K450k806j820L258J357m704J088M211l205k074L179J151l226p82M363j317
$$ -88 2362 -444 -2264 994 2351 -2353 -1265 2946 -259 -2333 846 1997 -1229 -2011 2352 1035
2761A035l978L429J856l507o29L281J48l997J607L610l548j570L655J87l246L43
$$ 1035 -2943 486 2342 -1165 -1794 1487 1635 -2362 -755 2855 -693 -2263 1392 1579 -1667 -1324
2777a324L675j864l255L654J241l750K38L171p64l377K164K806l751p78L673o83
$$ -1324 2351 487 -2768 886 2127 -1623 -1385 1786 1022 -2355 -191 2615 -1136 -1914 1759 1076
2793A076k918J107K992k306k471L853M14l712J213K645j541k448K417J924l724
$$ 1076 -1842 -735 2257 -49 -2520 1333 1747 -1965 -752 1893 352 -2096 321 2245 -1479
2808a479K1L476j506k387J773K119k567j540L792n44l243J967J784j798j637K391
$$ -1479 -1458 2018 512 -1875 -102 2017 -550 -2090 1702 1158 -2085 -118 1666 -132 -1769 622
2824F22J304l648P23L148k268j553K078J165k372q56L453j124k731K426J035j867
$$ 622 1926 -1722 -999 2149 -119 -1672 406 1571 -801 -1657 1796 672 -2059 367 1402 -465
2840d65r46K192Q33l550J423K665k923m44J944K79j743n91L097j392k424K923
$$ -465 -1411 781 1614 -1936 -513 2152 -771 -1215 729 1008 -735 -1326 1771 379 -2045 878
2856H78K22j909o1J684L44k995J758K064l210N24J600m69r53n56K765j511k226
$$ 878 1100 -809 -870 814 1158 -1837 -79 1985 -1225 -701 899 430 -523 -1079 1686 175 -2051
2873b051L484p91j818J098N94K23k185J432J817l257J054J459j149k52m65K248
$$ -2051 1433 642 -1176 -78 516 739 -1446 -14 1803 -1454 -400 1059 -90 -342 -807 1441
2889A441j471j915L736j652j424J923o55O17j593P27K154l530J359J681k174P31
$$ 1441 -30 -1945 1791 139 -1285 638 -17 600 -993 -266 1888 -1642 -283 1398 -776 -45
2905d5l14J227p65j765L375j777j166K238j370Q92j185K44K313l769J883J599
$$ -45 -359 868 103 -1662 1713 -64 -1230 1008 -362 530 -655 -411 1902 -1867 16 1615
2921A615l130K042o55K11N40k284L149j357j679K967j917N64j21n19K173l205
$$ 1615 -1515 527 -128 83 623 -1661 1488 131 -1548 1419 -498 66 -55 -574 1599 -1606
2937a606J709J401l296K707j035k81J487k855L150j095k173L845k743M39J182
$$ -1606 103 1504 -1792 915 -120 -401 1086 -1769 1381 286 -1887 1958 -785 -346 836
2952H36k003K595k420N89K109l532K632n45j131K157k844K591o00k356M065l164
$$ 836 -1167 1428 -992 -403 1706 -1826 806 261 -870 1287 -1557 1034 434 -1922 2143 -1021
2968a021N53J878l130L206k054l59L032m105K699R9k398L249k877J522O96k979
$$ -1021 -468 1410 -1720 1486 -568 -927 2105 -2000 699 798 -1600 1649 -1228 294 990 -1989
2984a989L911k693J6K481l610L199j467j123L498m222K595M76l163M093l054P32
$$ -1989 1922 -771 -755 1726 -1884 1315 -152 -1275 2223 -1999 596 1072 -2091 2002 -1052 -320
3000c20J915l793L932k045r45L378m038K803l92k192L895l836J859J181l702M325
$$ -320 1595 -2198 1734 -311 -1256 2122 -1916 887 495 -1697 2198 -1638 221 1402 -2300 2025
3016B025k755j00K855m294L701j262j883M124m270K286P36l334M318l322P55K257
$$ 2025 -730 -830 2025 -2269 1432 170 -1713 2411 -1859 427 1163 -2171 2147 -1175 -420 1837
3032A837m228M154k014j109L659m445L122l03k746M521m078J594J687m107M500
$$ 1837 -2391 1763 -251 -1360 2299 -2146 976 673 -2073 2448 -1630 -36 1651 -2456 2044
3047B044k751k80L183m580L760j088k114M267m324K339P30l486M608l498O77K504
$$ 2044 -707 -987 2196 -2384 1376 288 -1826 2441 -1883 456 1186 -2300 2308 -1190 -513 1991
3063A991m428M193j978j208L834m635L176j30k972M569l956J499J675m099M545
$$ 1991 -2437 1756 -222 -1430 2404 -2231 945 815 -2157 2412 -1544 -45 1630 -2469 2076
3078B076k705m89L376m541L513q86k134M211m267K173J008l625M392l100M52K414
$$ 2076 -629 -1118 2258 -2283 1230 344 -1790 2421 -1846 327 1335 -2290 2102 -998 -546 1868
3094A868m278M177j899j452M006m456K754J11k911M495l929J257K182m390M135
$$ 1868 -2410 1767 -132 -1584 2422 -2034 720 831 -2080 2415 -1514 -257 1925 -2465 1670
3109A670j936q36L077m060L289p65k348M187l719J563R40k949L987l372P72K640
$$ 1670 -266 -1102 1975 -2085 1204 439 -1909 2278 -1441 122 1062 -1887 2100 -1272 -500 2140
3125B140m642L912j192j699L569m031K778J09l327M653l100R4K282l176L023k009
$$ 2140 -2502 1410 218 -1481 2088 -1943 835 944 -2383 2270 -830 -736 1546 -1630 1393 -616
3141f16j90K855m111K859j40k077L030l111K218J79l316M787l023n71L209l652
$$ -616 -806 2049 -2062 797 657 -1420 1610 -1501 717 896 -2420 2367 -656 -1227 1982 -1670
3157a670K667j020j295L632m123J791J618l327K721j414M86P68k680L635k077
$$ -1670 997 -23 -1318 2314 -1809 -18 1600 -1727 994 -420 66 834 -1846 1789 -288
3172b88j051L081k961J869p40r81L353m293J972K113m356L268q29p98J803k892
$$ -288 -1339 1742 -1219 650 -90 -1071 2282 -2011 -39 2074 -2282 986 157 -641 1162 -1730
3188a730L022q18k429L642j990j17O80p35J881k992J650J681l711K701m32q05
$$ -1730 1292 474 -1955 1687 -303 -420 260 -475 1406 -1586 64 1745 -1966 735 303 -502
3204e02J377k541L188j124k757M577k465r52K269j631J387j626L72K284l458J508
$$ -502 875 -1666 1522 398 -2359 2218 -247 -1199 1070 -561 826 -800 -428 1856 -1602 -94
3220i4J199j685O34p34J927j348j680L850k433p96K236j553J166j544M61K530
$$ -94 1105 -580 54 -680 1247 -101 -1781 2069 -364 -1160 1076 -477 689 -855 -394 2136
3236B136m113J748K108l177J228K52K54l76j498K971j342j739K457n88m32p09
$$ 2136 -1977 -229 1879 -1298 -70 182 436 60 -1438 1533 191 -1548 909 321 -111 -820
3252h20J124J211l486K100J629l212J419L87l9k89j493L132j368k376L492q45
$$ -820 304 1515 -1971 129 1758 -1454 -35 352 313 24 -1469 1663 295 -2081 1411 566
3268E66j557Q61N97L17k209J459J613k854P30J352n84q70k50K534j927j594L448
$$ 566 -991 -130 467 784 -1425 34 1647 -1207 -477 875 291 -579 -829 1705 -222 -1816 1632
3285A632j326j477J345K88Q5j855J320J823l309Q47K142j728o62Q16J281j587
$$ 1632 306 -1171 174 462 547 -1308 12 1835 -1474 -627 1515 -213 -875 -59 1222 -365
3301c65j094K863r31j887J612P06q69j354J807J017l171J308K009k192l10J156
$$ -365 -1459 1404 473 -1414 198 904 35 -1319 488 1505 -1666 -358 1651 -541 -851 305
3317C05O91j463q36K798j007k222K278N55j704l16J676K31k489J282J832k263
$$ 305 996 -467 -1303 1495 488 -1734 544 1099 -605 -921 755 986 -1503 -221 1611 -652
3333f52l50J702J45j685o5K469j491j761K561O1j902L73J500k78k068J430J618
$$ -652 -1002 700 845 -840 -905 1564 73 -1688 873 934 -968 -595 905 627 -1441 -11 1607
3350A607k505j06K119o18j569O82J818j600j346K556j56k069Q30J466q68j637
$$ 1607 -898 -1004 1115 497 -1072 -390 1428 -172 -1518 1038 882 -1187 -357 1109 241 -1396
3366a396J687J179k583L17K112j115j322J092J323j689r38K517m65k105J349J222
$$ -1396 291 1470 -1113 -796 1316 201 -1121 -29 1294 -395 -1333 1184 719 -1386 -37 1185
3382A185j344j028J728O52k412O41J998j541j049J525P38j774l23K269q52j818
$$ 1185 -159 -1187 541 1193 -1219 -578 1420 -121 -1170 355 1093 -681 -1004 1265 413 -1405
3398a405J667Q19j571m85J735J55k245J063J708j884n67J654J49j589O8K016j112
$$ -1405 262 1081 -490 -975 760 915 -1330 -267 1441 -443 -1010 644 793 -796 -728 1288 176
3415A76j567J929M68j769L9J651l61j873J370J253j985j49J603j92j473L74J835
$$ 176 -1391 538 1006 -763 -724 927 566 -1307 63 1316 -669 -818 785 593 -880 -506 1329
3432A329j439j231K211j34j682O11J225o05j458J387R78k063K22J603o64j206
$$ 1329 -110 -1341 870 736 -946 -335 890 285 -1173 214 1192 -871 -649 954 290 -916
3448i16P53J371j612o97K143o55j326R00P88o34j178J417P57k217P40J470j249
$$ -916 -163 1208 -404 -1101 1042 387 -939 -39 749 115 -1063 354 1111 -1106 -366 1104 -145
3465a45o26Q86Q04j399m14J978q85j152J138M82p34q74J466L95k179J252J059
$$ -145 -771 115 919 -480 -894 1084 199 -953 185 667 -67 -941 525 920 -1259 -7 1052
3482A052j560N0O43M75j060m38J976j064j168J619k0q55k55J137J16j819J339
$$ 1052 -508 -458 185 660 -400 -838 1138 74 -1094 525 505 -350 -605 532 648 -1171 168
3499A68P48j581M35M52K52q41l89J985j398r27K022q06n85L36L91K93j522J096
$$ 168 916 -665 -230 222 474 -367 -756 1229 -169 -1096 926 120 -465 -129 262 555 -967 129
3517A29Q36j791O86N96k90m92j83J576j393n75J975j244j99M86j29O16j522J009
$$ 129 965 -826 -140 456 166 -326 -509 1067 -326 -901 1074 -170 -369 117 -12 604 -918 91
3535I1R91k216J203N71r89L03k64J009q51o89J828j169k94P54l14M85j257R84
$$ 91 1082 -1134 69 640 -349 -46 -310 699 -152 -841 987 -182 -476 278 -36 449 -808 176
3553A76P86k213J631J78j225J045p74Q55l18j143K077j232n69J414r23L94m78
$$ 176 962 -1251 380 558 -667 378 -396 459 141 -1002 1075 -157 -726 688 -235 159 -319
3570c19K95Q12j805J335K08j251J194q15O47p5j232K140j421m91J813j633P27
$$ -319 -24 788 -1017 318 526 -725 469 -346 301 226 -1006 1134 -287 -778 1035 -598 129
3587A29l6n27J317j729Q98P27j719J397n22l1M46j151J657j053n29J776j745Q19
$$ 129 93 -434 883 -846 52 779 -940 457 -65 -96 350 -801 856 -197 -726 1050 -695 124
3605A24J47r11J584j741P55R86k111J772m78o62J237j458J285l87r84J875j577
$$ 124 271 -640 944 -797 -42 944 -1167 605 127 -535 702 -756 529 142 -842 1033 -544
3622e44M60O14j221J458j308L91J032k007J749m71q72J628j686J086P5j385K049
$$ -544 -84 530 -691 767 -541 -150 882 -1125 624 153 -719 909 -777 309 384 -1001 1048
3639A048j515J51J139j679J453p33l25J378j874J363r3j176J793j544O81N11j579
$$ 1048 -467 -316 823 -856 597 -136 -461 917 -957 406 313 -863 930 -614 67 578 -1001
3656a001J943j264j65J469j937J453l36q86J725j802R82L86j538J877j307J51
$$ -1001 942 -322 -487 982 -955 498 162 -724 1001 -801 181 567 -971 906 -401 -250
3672b50J033j741J692q33m96J612j907J238L1j251J855j606N61P79j750J862j031
$$ -250 783 -958 734 -99 -595 1017 -890 348 379 -872 983 -623 -62 717 -1033 829 -202
3689b02k72J377j809J383l27r02J748j749Q66M44j500J810j274J30J089j809J648
$$ -202 -474 903 -906 477 150 -752 996 -753 113 557 -943 867 -407 -277 812 -997 651
3706F51o50o65J634j766J041J41j246J781j459M12Q68j706J676q36l57J360j742
$$ 651 1 -664 970 -796 245 386 -860 921 -538 -126 742 -964 712 -124 -481 879 -863
3723h63J290j93j015J704j533O65N23j473J703j144qJ178j740J450m81o92J553
$$ -863 427 234 -781 923 -610 55 578 -895 808 -336 -344 834 -906 544 63 -629 924
3740I24j684R76K29j315J706j240K12Q72j569J520p17m46J360j557J027q5q63
$$ 924 -760 216 445 -870 836 -404 -192 680 -889 631 -86 -532 828 -729 298 213 -650
3757f50J479j444O64N06j415J574r44q1J027j565J397m42q22J606j451N84L95
$$ -650 829 -615 49 555 -860 714 -230 -311 716 -849 548 106 -716 890 -561 23 418
3774D18j117J383j060J94Q82j467J199l94m14R50j208J048k63q48J557j315L14
$$ 418 -699 684 -376 -182 700 -767 432 38 -376 574 -634 414 151 -697 860 -455 -141
3791a41O78j212J267q72o0J167j629J021J58r85J128q69M88J48r49J340q80j34
$$ -141 537 -675 592 -280 -340 827 -802 219 377 -608 520 -349 139 287 -662 678 -202 -336
3809c36Q54r59Q15o12J0R71j538J032K39j164J193p24K39L70j157J414o37o26
$$ -336 518 -441 374 -238 -228 743 -795 237 476 -688 505 -219 20 390 -767 647 10 -616
3827f16J277q97K23M9k27P28j107O45M43j091Q19k98R8J18p88J338q04o15J485
$$ -616 661 -236 -13 36 -191 537 -570 75 518 -573 246 -52 46 164 -624 714 -90 -705 780
3846G80j044P9L86m50P43r84L77Q53j400O66L64n42J84k92P45n51n10J236p40
$$ 780 -264 -185 201 -249 494 -490 -113 740 -660 6 370 -172 12 -280 465 -86 -596 640 -100
3865a00k07M86k34M09q82N35P54j573Q76M87r50M31j58M41k69p04J318n59p03
$$ -100 -307 179 -55 354 -528 7 761 -812 64 551 -399 32 -126 315 46 -658 660 101 -602
3884f02R16j47j88l58N41L56j236P48N38r58K79J12L58m80n25J429p65p88J299
$$ -602 314 167 -21 -379 162 518 -718 30 568 -390 -111 1 359 -121 -646 783 18 -770 529
3903E29l67m28J02L17K89j104O00P92j160J47O34j27n61lJ049p96n96J242l44
$$ 529 162 -266 -164 153 442 -662 -62 730 -430 -283 351 224 -337 -340 709 -87 -683 559 215
3922B15n86K40M12N8j024P54P21j438L90Q29n71l54K10P62o95o39J308k89r04
$$ 215 -371 -131 281 339 -685 69 790 -648 -258 571 0 -354 -144 618 -77 -716 592 303 -601
3941f01O08M66m24p08Q70M60j362M61Q87p47l76M89N67q32m39J403n07r83R58
$$ -601 7 473 49 -659 211 671 -691 -230 657 -90 -466 23 590 -242 -681 722 215 -768 190
3960A90L13o84l55Q38K80j310N46R58r90l15P98K51r26q6J235o53q72J081K04
$$ 190 503 -181 -536 302 582 -728 -182 776 -214 -529 269 520 -406 -492 743 90 -782 299 503
3979E03q47r9Q98l6j199P54Q40j220q3R38j16q31J65J070p48p97J254K1j006K68
$$ 503 -344 -443 455 419 -780 -26 814 -406 -489 449 333 -498 -333 737 -11 -808 446 467 -539 -271
3999b71P95l20r49Q46O58j274O6J017l53q01M31R11r58n46J350k52r97N21O71
$$ -271 524 204 -745 101 759 -515 -449 568 215 -586 -155 756 -202 -748 602 350 -647 -126 545
4018E45m69q02R47M99j375K99J096p18o16O66N83r76k87J266l99r46O90N72o81
$$ 545 76 -726 221 720 -655 -356 740 22 -594 72 655 -321 -608 658 259 -687 3 575 -106
4037a06n62J071J73j351O32Q78r17l05O62L37q72j79J267o05r19J047K86q84j19
$$ -106 -668 403 576 -775 -143 735 -182 -487 175 512 -360 -539 728 123 -796 251 537 -347 -466
4056d66R53j20j097P44O66r68j52P35J62r05L2J266r06p06J234j23p78J83O49
$$ -466 487 367 -730 14 680 -288 -440 295 457 -448 -416 850 -56 -762 472 349 -429 -246 403
4075D03r5j003P38O93j171N0Q67k10q01L53R23r91l62J158l71n89K48N58j52j005
$$ 403 308 -695 43 736 -435 -385 482 272 -529 -176 747 -244 -606 552 181 -408 -160 398 246 -759
4095g59R62M92j395N33P09n92l29L23O21p90l44J163m68o43M99M36l91o90J040
$$ -759 203 695 -700 -167 542 -50 -379 -56 565 -225 -569 594 126 -517 -18 418 27 -663 377
4114C77J38j261P95M04o33pJ17N89p29l75J336p43o18R07j1m16k59P04O4j025
$$ 377 515 -746 49 453 -180 -187 -70 519 -210 -585 751 8 -610 297 286 -130 -389 315 379 -646
4134f46P31L69o95L5K31M40q07j21J286j051k94J025n11q6j19L48K88j106P81
$$ -646 85 454 -241 -206 25 465 -342 -463 823 -228 -522 503 -8 -94 -213 135 423 -683 98
4153I8M73j044L73K98k4m83O7Q76r24j08Q80n89N4j16L28K48j131R73K89j226
$$ 98 571 -473 -100 198 174 -309 -242 634 -290 -398 482 -107 -53 -169 159 407 -724 249 538 -688
4173f88Q32P0l08Q4k33P33o16l32J005o15j41K27J36N3p52Q52M4j006R58j82k71
$$ -688 144 214 -94 -10 -243 490 -126 -458 547 -68 -209 18 154 207 -545 307 351 -655 303 121 -150
4194a50K31m19Q32o37l69J215r35o9O20m17K47m41M01K56r18P67j1m34L13k70
$$ -150 81 -338 494 -143 -512 703 -232 -301 319 -98 149 -292 109 365 -553 214 203 -231 82 -188
4214a88N63n60j85J050j035J70N85o66M90m35J99M88j096Q35J03p80O72k73J89
$$ -188 375 -185 -370 680 -355 -185 400 -266 224 -211 -12 476 -620 215 318 -462 210 -63 126
4233A26j06l40Q39p65O3N74o63M53l15J02M20r71Q60j0q01R18n07R1K03n83Q66
$$ 126 20 -320 519 -246 -183 391 -272 181 -134 -32 388 -583 277 267 -534 384 -123 -32 171 -412 454
4254D54o06j69P97p66L30L1k36M88p14N53Q0p31Q65m87K7L44o51P93n16k13Q55
$$ 454 -152 -321 476 -290 40 71 -165 323 -391 162 242 -489 376 -111 -84 260 -391 402 -114 -327 528
4275E28q78L77J80n19O57n92K63L09p95P84l23j95N03o08N51k58k89P70p76L14
$$ 528 -350 27 207 -312 345 -247 16 325 -470 314 -9 -204 299 -309 242 -16 -305 465 -311 3
4295CK80o45O89m97R0M19p90P13k21l39O50o55L95M4m85P36o34J70L86o83O45
$$ 3 283 -362 327 -170 -80 339 -451 262 41 -298 352 -303 92 136 -349 387 -247 -77 309 -374 271
4316B71l53p6N17p27N58r6m12O98o01K59J70n46O63m76K1M62o75N36j54k64N53
$$ 271 -82 -158 359 -368 190 94 -318 380 -221 38 208 -338 325 -151 -130 332 -343 193 39 -225 328
4337C28o05L82N5m93O70n00Q8L51o06N63k72j43N15o29M04Jm12O11m94J79K11
$$ 328 -277 105 160 -333 337 -163 -75 276 -330 233 -39 -182 333 -296 108 109 -303 308 -186 -7 204
4358B04n37O27l79o1M38n81M36j18k55N32n46K88J20m48N45l85N4L06n15M92k23
$$ 204 -333 294 -85 -146 292 -289 147 29 -226 306 -240 48 168 -280 265 -120 -66 240 -275 217 -6
4379fj77M89n35L09L5l26M95m37J21K27m61M46k05r4L44m61L73q6k60M54l99J64
$$ -6 -183 306 -229 80 115 -211 284 -153 -32 195 -266 180 -25 -119 225 -236 137 51 -209 245 -154 10
4401A0J09l63M44k87k8L43m36L30r3k00L80l69K05O8l15L80k44QK07l34L30j71
$$ 10 119 -244 200 -87 -115 228 -208 122 29 -171 209 -160 45 113 -202 178 -66 -58 149 -185 145 -26
4423b6q2L24m08K46J8k25L47l24J49J28l74M02j69j11K70l09K35n0j74L00k54
$$ -26 -108 216 -192 54 72 -153 194 -130 19 147 -227 175 6 -105 165 -144 91 41 -133 167 -87
4444h7O5J10j81K03k01R4J34l09K70o6j53K41k31J70j1k17L58k81MK42k44J39
$$ -87 -22 88 -93 110 -91 3 137 -172 98 32 -121 120 -111 59 48 -169 189 -92 -88 154 -90 49
4466D9n1m5J80k79J85M7j99J77p6L7l0q6K61k34k5K56k28Q4k6k2J52k73J57J47
$$ 49 -2 -47 133 -146 39 86 -113 64 -12 25 -5 -91 170 -64 -89 167 -61 23 -3 -25 127 -146 11 158
4490A58l29K00K6j03N9p3J70j31r7K60j49n6P7J1M9k15J77R5l02K10L3j22O3n4
$$ 158 -171 29 55 -48 11 -62 108 -23 -120 140 -9 -65 12 23 72 -143 34 129 -173 37 70 -52 11 -43
4514d3J57j26j55L36j71j24K11o7k8n7R1Q9k46J51J18j90J2N9Q8j67m2K84j93
$$ -43 114 -12 -167 169 -2 -126 85 18 -10 -67 24 113 -133 18 136 -54 -42 17 105 -62 -104 180 -13
4537a3j20K32p5n2l5J07O9k66J36J72k64N3J20pj15j6K29j47j38K27m9j14K1J13
$$ -13 -133 99 24 -28 -63 44 113 -153 -17 155 -109 -56 64 57 -58 -74 155 8 -130 97 48 -66 -45 68
4561F8j7k23J95J16k61O0J64r0p3OJ90j42j58L02o1k05J27R1m9j53J30J21k55
$$ 68 51 -172 23 139 -122 -62 102 12 -61 -55 135 -7 -165 137 76 -129 -2 89 40 -113 17 138 -117
4584a17O5K09j51q8O7J48j52j24K94q9k16J72O9r5j15J58J08l07J05K18j91q3
$$ -117 -52 157 6 -82 -15 133 -19 -143 151 62 -154 18 87 -8 -123 35 143 -164 -59 159 -32 -115
4606a15J40Q1j46q3K77j05k05J92O2j41p3J81O1k80J17K04k22l6J48L6j53n6K71
$$ -115 25 106 -40 -123 154 49 -156 36 98 -43 -116 65 126 -154 -37 167 -55 -91 57 93 -60 -116 155
4629A55j01k14K36L8j98LJ73Kk20R1K15k27o7J96Oj78J2K32j37j81K41K3j87J6
$$ 155 54 -160 76 114 -84 -81 92 94 -126 -35 180 -47 -114 82 88 -90 -78 154 17 -164 77 100 -87 -71
4653g1J30L6k32J23K02k87j2K39p9j44L1J91r7k09K59L2k39O5J91p2k09J70J54
$$ -71 59 95 -137 -14 188 -99 -111 128 49 -95 -64 127 30 -179 80 112 -127 -62 129 57 -152 18 172
4676A72k91N1K04j08r1L9J65j46j79L05j5k72J66J12j03j11J29J33k75J4K38j14
$$ 172 -119 -68 136 28 -63 -24 141 -5 -184 121 106 -166 0 112 9 -102 27 160 -115 -101 137 23
4698B3j07N5J75j87j27L21p6k46K18L0q9n4P2J44k79L1K84k21r3J81L3j54q2K73
$$ 23 -84 -29 146 -41 -168 153 77 -169 49 79 -10 -64 8 152 -127 -96 188 -33 -126 55 88 -66 -148 125
4722A25q4j86J92M5j26o6J26J31l21J22K36k92NJ77l3o8p0J95m3k53K34O9k19
$$ 125 41 -145 47 92 -34 -100 26 157 -164 -42 194 -98 -93 84 51 -17 -87 108 65 -188 46 115 -104
4745a04L7J44K6k48J14K17k92L0J63q1m0q8K38m7l07L64k0k53J43P2l5j37N4K09
$$ -104 -67 77 103 -145 -31 186 -106 -76 87 6 -34 -122 116 69 -238 126 106 -147 -4 68 33 -104 -50 159
4769A59k44j3J99p5r5jK01j03k22L32q1k05K07l1L3j11qK72l20pK93k12l8R6M4
$$ 159 -85 -98 101 26 -69 -70 131 28 -194 138 57 -148 59 28 61 -50 -58 214 -106 -113 180 -32 -70 26 70
4794G0m7j69K54k5k34J88K1m7r8N4K10l41Q7K53k93Q3O3l1M2j79K17L5l02K39
$$ 70 23 -146 108 83 -151 37 58 11 -87 -33 177 -164 -77 176 -117 -34 29 -2 40 -139 78 113 -189 50
4818E0L2j36K7K7J13k07K7K34k39M3P9m4L0j70K49j5l17L43n5j92J54n4J11j22
$$ 50 82 -54 -27 0 113 -94 -67 167 -72 -29 50 6 36 -134 115 100 -217 126 71 -121 33 -21 90 -32
4842c2p5K86k42k0J90j22J4o4J51k0k34K82q9j22J56r4J14j32o2L20l30M2K37
$$ -32 -107 179 -63 -83 107 -15 -1 -65 86 66 -168 114 25 -97 59 -35 79 -53 -115 205 -125 -83 154
4865A54k67J03qK2Q0k31K21J3k21K00n5J3m9m0K13k36L6K11k65J22j2j6J03k34
$$ 154 -113 -10 -18 4 84 -147 74 87 -134 66 11 24 -25 -65 148 -88 -52 159 -106 16 4 -12 91 -143
4889a43K34j0k53K78r9m7Q8j18J70j52l7K28k19Q8L4q7J17j90J93Rk58K89j20
$$ -143 91 81 -172 106 7 -40 48 -70 100 -52 -89 139 -80 8 42 -45 72 -118 75 84 -174 115 -5
4912eo6J46j75J83j09q1K62k61Q3J10j80J65j31P8P5k35K29n4j18J66j44J08n3
$$ -5 -71 75 -100 83 -26 -107 155 -106 -23 87 -93 72 -59 19 94 -141 88 34 -84 82 -62 46 -7
4935gr5K43k18P4J04k08J90j16K3J13k24K09o2j35K04j41N3K6j27K29k02L6J36
$$ -7 -102 141 -77 -3 101 -107 83 -33 -10 103 -121 88 26 -109 95 -46 7 33 -94 135 -67 -31 105
4958A05k23J62o1l5J62k13J62k1j50K18j68M8P3j61J93j28jJ54k18J54Rj46J90
$$ 105 -118 44 -17 -52 110 -103 59 38 -112 106 -62 -14 59 -102 91 -37 -38 116 -102 52 61 -85 105
4981A05j76J00K3j49J89j19kJ15j74J58o0o5J64j84J09K3j60J79j12K1R1j80J80
$$ 105 -71 29 52 -97 92 -27 -29 86 -88 70 10 -55 109 -75 34 57 -103 76 -36 -15 76 -104 76
5004G6j09k3J34j77J50k7r0J43j42N7P6j66J64r3oJ12j72J40l3r7J63j40M9O9
$$ 76 -33 -56 78 -99 51 24 -66 77 -65 -8 68 -98 66 -27 -33 79 -93 47 14 -83 80 -60 -11 58
5028E8j35J55j23J6J05j53J30m5n0J30j62J01Mj11J75j63O7P0j27J21p6l6J33
$$ 58 -77 78 -45 -29 76 -77 53 8 -42 88 -74 27 31 -80 95 -68 -1 69 -58 63 -13 -49 84
5051H4j68J22j4p8J13j14O0K1r2J17q7LQ9j30J13l9l9J15j53P7L1r2J12r6K9O8
$$ 84 -84 38 24 -54 59 -55 5 26 -66 51 -36 -33 56 -74 39 0 -39 76 -77 0 31 -61 51 -45 -16 52
5077E2j16J04k8n9Q7q2N3Oo3J25j01J6L8q8Q7o7L4L9r8R3j3p5J01n5J6K4p4Q8
$$ 52 -64 40 12 -47 40 -42 11 17 -46 79 -22 -6 32 -56 31 -36 -2 37 -61 32 19 -56 45 -10 6 30 -44 44
5105D4n8j2P9q7K7J0k5M6p2N9K2p7P7k4j5J6m2Q4p1k7J09j09J8M4l8N2o8M7L4
$$ 44 -14 -26 53 -34 -7 3 -22 24 -48 11 33 -44 33 9 -6 10 -32 52 -19 -46 63 -46 -28 16 -22 30 -38 9 43
5134D3r3Q1on5L3j6M5k9m8R8o8oM2k1L0o6N5L2j06P5K3q8M3lOkl5R4p2n4J00l6
$$ 43 -50 31 25 -30 3 -13 32 3 -45 53 -15 -21 21 0 30 -36 19 51 -55 20 43 -45 -2 -5 1 -1 -36 58 -14 -68 32 -4
5166dl7J4L6J1q7P9L3r9N2K7j7j9k6J08q0m0J13n3l0M2qL4q4L7O6j19N5M9p1p
$$ -4 -41 -27 9 20 -67 12 45 -54 -2 25 8 -11 -37 71 -9 -49 64 11 -19 23 15 49 -35 2 68 -51 4 53 -18 -25
5196b5MP3o7l7J10o4l3N5J4j4o4O8M5j48P5N6q7J0MO1n9l9J23p0o5R2nj0n2Q3
$$ -25 -21 52 -15 -52 58 -6 -39 16 30 16 -48 20 65 -83 -8 48 -39 -29 -25 36 -23 -62 61 -9 -74 18 13 3 -49 34
5226C4K3j45Q2O3j00K3K8M4q4j3J36j12n3J32m1l5jM4J9j27Q0O9j38M4P4l3o0
$$ 34 57 -88 -6 57 -43 -20 8 52 -32 -45 91 -21 -74 58 17 -18 -19 25 44 -83 -3 66 -72 -28 46 13 -47
5253d7jJ13r2n1J27l3n4J2O4k5j04R4O0j20N7M6l9n9K3R9q7n7J43o2n0L2N9l6
$$ -47 -48 65 -27 -78 49 16 -38 -26 38 13 -91 3 63 -57 0 46 7 -52 -29 70 -17 -74 69 7 -43 -11 48 12
5281A2q0J12Rj15O4M8n2k6J2R5j09k7J58j06n3R1%k7p7J08K6j58Q4P8j06j8O8
$$ 12 -68 44 53 -62 2 50 -2 -28 -16 79 -30 -57 101 -5 -58 33 33 6 -71 37 63 -95 -11 67 -39 -57 11
5308A1L3j02qJ49q0m7O0K4l5p7J01L2j60J18N0j15L6L9K4q9k0J26p0n9J00jp3
$$ 11 44 -58 -66 83 3 -44 16 40 5 -72 29 61 -99 19 69 -46 -10 29 53 -36 -56 70 0 -59 41 40 -33
5335c3k2J10j3j41J34L3j16L6NM8p2k9J58j24m0J47m9p3M3L1Jj06R5M0j25L4P6
$$ -33 -55 55 42 -99 35 68 -48 -12 -7 41 -31 -60 98 -26 -66 81 32 -41 2 33 34 -72 23 63 -62 -28 48
5362D8j1j05M7J00j30k4J59r4k7K4K6Lr2Q1N8j57R3P5r7k2L5R7j17k2J30q9m4
$$ 48 37 -68 -21 79 -51 -75 84 -10 -37 -13 13 16 -76 5 63 -94 -1 74 -23 -45 -10 87 -30 -52 78 -11 -55
5389e5L9O2oj20J30M4k07J36L4r3M2j9P2r3m4J55p0p7R3J9m2n4R4Qj43J14K4q4
$$ -55 -16 46 40 -80 50 94 -113 23 57 -36 6 -13 59 -34 -78 77 7 -70 23 42 0 -54 40 48 -95 19 43 -41
5417d1K1MP6r3n6J76j01o8J33n4l8QM0K8j18O3Q6j00%N5J2n3k6J23q9o5J42p7
$$ -41 -20 -16 60 -33 -89 87 -14 -82 51 -3 -41 -33 7 35 -83 -20 66 -34 -34 21 33 -20 -46 77 -12 -77 65 -12
5445a2oqL2L8j25R1Q5j77P1N3o2J5k6Q9o3m7J05m3m8J7L9K0j12P6O6j36O0M5n9
$$ -12 -18 -26 6 44 -81 10 95 -82 -11 42 -20 -5 -31 58 -5 -52 53 10 -38 -21 18 38 -74 2 68 -68 -8 37 -22
5474b2K0k7O6k8j05J63n2r3Q5mMl3K3P2j20M4O4q3K1j3N9n1p8J63o8o8J17o3J5
$$ -22 -2 -29 37 9 -96 67 15 -78 7 3 7 -26 -3 69 -51 -7 57 -26 -5 -18 41 -10 -88 75 7 -61 56 -7 8
5503Hl1QQ0j15K6P5r3PL9J9j8m2Q7m0o7Q7m2LnnP3r5QJ03j24M5L3n1N5p9O4Op2
$$ 8 -23 -15 65 -50 -24 51 -42 -35 4 23 5 -37 50 10 -57 30 -12 -9 -14 -19 54 -41 -33 70 -54 -9 24 -27 28 -51 13 19 -53
5536e3J01l7j9K3j5J8m7OR3j08K9M8o5L2l7N7J0r7J16l7m8O5n4N1l7k5P4q6J4
$$ -53 48 11 -8 15 0 18 -29 -23 70 -38 -9 39 -26 6 -31 26 36 -61 55 18 -30 35 -19 32 -5 -30 44 -42 -28
5565b8O6o2kpL1J1o8P6qm4P1n3J9k0k4R3r3%P5q2N6mj3M8q7O7J0o9P6n6K2Ok9
$$ -28 38 -24 -26 -33 -2 9 -59 17 9 -35 36 -17 2 -18 -42 51 -42 -42 33 -49 7 3 -10 38 -49 18 28 -41 35 -21 1 7 -22
5598b2M5l5j6O6o6L7J1m5N5n6M1On9O9l5j4N7n8L8mm2O3n7K3K1n4M0k8RM4o9N2
$$ -22 23 -12 -28 38 -28 9 20 -25 30 -26 15 21 -38 31 -4 -18 39 -19 19 15 -27 36 -21 2 23 -31 9 -19 -10 34 -35 17
5630A7Po5O7n3M6j2m3O6n7L6J5n1L7rk0M8n2M4%m2M8k2jJ8m1N4k6l7N9n6K7nk4
$$ 17 24 -41 26 -27 19 7 -36 30 -27 9 24 -27 10 1 -19 29 -23 21 21 -21 27 5 4 22 -19 35 9 -28 31 -25 2 -3 -27
5663b7M5o0L9K5l7M2n6MN4o4M7j2k8M6m8J4J2l8N9m4ML9m6L5j4rL7l8K4Kk6N0
$$ -27 18 -42 -3 22 -15 27 -29 -25 29 -35 12 0 -28 18 -30 -16 -4 -42 17 -27 -23 16 -30 5 -9 -18 19 -19 5 7 -19 31
5695C1o2L6K2l5M2l5oJ4l0L8j6l7O0l6J5Rn1P4m8kO1p5K6Pk1M0m8M0j8k1L9k9
$$ 31 -31 5 27 -8 34 -1 -7 7 -23 15 -1 -38 22 -14 1 10 -41 33 -15 -17 44 -31 -5 2 -19 21 -27 13 -5 -26 13 -16
5727a6%L4m2M8m3MN6m9LJ9k1L3n8K5K8n2N3j8j6K4l9M6j2m0M4l2J5K1k8L1m7M1
$$ -16 -16 18 -24 24 -19 -15 41 -8 -5 14 -7 26 -32 -7 21 -31 22 4 -12 12 -27 19 7 -33 11 -21 -6 15 -13 18 -29 12
5759A2Qm3L7ok1L8n7N0lm0M6l5QL5m9Qj3K8Pn3N1Nl0J0j4L9m3PM8l6J7J2j5j1
$$ 12 20 -23 14 8 -13 25 -32 18 15 -25 21 -14 -6 29 -20 -12 -25 3 10 -43 8 13 -17 -7 -21 18 -25 -18 30 -6 11 23 8 -3
5793cjrN5o3K1L8n6M8j5orl3O4m2k6M9mmk3K3J3o2P4j0n3L7Jmkk4O1l6m6P2l3
$$ -3 -4 -13 42 -21 0 38 -18 30 15 9 0 -33 31 -11 -37 12 8 4 -19 4 17 -45 29 19 -34 3 4 0 -2 -26 35 -1 -47 25 -8
5828hl3M4J4j7m0L8L8p1L2L3l5k3QO8n5k0Q1o0l5N7J3rn4M1N4r8M4M4p0nL1L2
$$ -8 -41 3 17 0 -40 -2 36 -35 -3 30 -5 -28 -20 48 -7 -27 54 -6 -41 16 29 20 -34 7 61 -37 7 51 -19 -24 7 39
5860C9o5lO0l2n5N0L3l4m0O5K0r7N3N7p8rL4K9n4k3J12o5p0J08Pq7L1N6k8p2O1
$$ 39 -26 -29 31 -1 -56 -6 27 -7 -47 18 38 -59 -6 51 -27 -36 -2 27 -27 -50 62 -3 -73 35 42 -45 -14 42 14 -58 3
5891CO2j00J0O2lp8rJ24q2n8J11j1n5J9M5rp8M5Q2j43J7J04n4m8L4Q1j03m4J08
$$ 3 65 -35 -25 37 34 -44 -53 71 -11 -69 42 31 -24 -5 40 31 -47 -2 80 -63 -46 58 4 -44 -10 71 -32 -76 32
5920C2rp7K7O8l3q6J00M8j55Q0P1p0l9K7P9p6q0J45j4j33J11M4q5l1J04J6j32
$$ 32 23 -54 -27 41 8 -78 22 70 -85 -5 66 -4 -43 -16 63 -13 -93 52 38 -95 16 60 -25 -56 48 64 -68
5947f8N2R3q8m9O9O8j38k0J89j09o6J23j5o6k9Q8L9j65P7J07j33k8J23mj21K9
$$ -68 -16 77 -11 -60 9 77 -61 -81 108 -1 -67 56 41 -25 -54 34 73 -92 -15 92 -41 -69 54 50 -71 -42
5973d2J34j13p2J38k8m4m9R5L9j90J40R8j96M2J13p2n1J4J30q2q8J56j2j20K9
$$ -42 92 -21 -93 45 17 -27 -76 19 58 -132 8 106 -90 -48 65 -7 -58 -44 86 4 -84 72 60 -60 -31
5998c1J09o2j22J58L0j70Q5L8k1o6kJ59j39p8K24q8j23J16K3l8n7P1N1j55N5R8
$$ -31 78 16 -106 52 82 -88 -3 35 14 -52 -54 105 -34 -112 112 24 -99 17 40 2 -55 16 67 -88 -33 65
6024F5p3q1R2Q5j61j4K15j53p4J50l3k2p3J01P8k18J07J33j85pJ16or4lJ52r6
$$ 65 -8 -89 3 88 -73 -87 128 -25 -99 51 18 -4 -77 24 102 -116 -9 124 -61 -68 48 42 -52 -55 97 1
6050Ar4J47j4o3n2J42ok12J89P7k06P0M5ll3n6J74j08j16J94m9j39Q2Q0m2j03
$$ 1 -93 54 40 -23 -75 67 61 -151 38 115 -91 -21 24 21 -12 -68 106 -2 -118 76 27 -112 -30 50 8 -95
6076i5J32K2j44O7O2qj03J0J88j92m7K34j27p6J10k1J0r9Q7R2j87M5J24r8m5N5
$$ -95 37 59 -85 -18 44 36 -67 -57 131 -61 -108 126 -1 -77 33 12 22 -77 10 102 -85 -40 84 -14 -59 -4
6102dR1j41nJ80j24m9P3Lpj04J37L7k32J75O8j88P1M1J5n6o0J63p5j14J31K0r6
$$ -4 87 -54 -59 121 -3 -52 21 24 17 -87 50 87 -145 30 98 -90 -19 22 37 -19 -79 84 9 -105 26 46 -50
6129e0j2J00%j48J49J8j46P5K6K5p0o1K05j15j04J90p0n8M8J4K3j23Q6R0j54N6
$$ -50 -62 38 38 -110 39 57 -89 -14 12 37 -33 -94 111 -4 -108 82 12 -46 2 16 39 -84 2 92 -62 -6
6155fM4k1o3J4J27j32m9J75j00l0M2oN1j31Q4Q7j80Q2O1q5J6NN8p1m5J33p2n3
$$ -6 38 17 -46 -32 95 -37 -86 89 -11 -41 1 -5 46 -85 -1 86 -94 -12 49 -36 -20 -15 43 -28 -73 60 -12 -65
6183f5O5kK2p8O6N4j71J07O1r4M5j8M1n2o4J56p0q0J16l2k4j4L1N3j09M5P7r1
$$ -65 0 -2 20 -58 8 62 -109 -2 59 -35 10 -8 33 -19 -83 73 3 -77 39 7 -17 -31 0 53 -56 -11 66 -25
6211b5J9mL2l1p6J52q7o0J42q7oK0kM2r0N1N6j25Q0J8k4%l6O9l8n4J12n9j8L3
$$ -25 -6 -10 22 -9 -85 67 -20 -80 62 -25 -31 -11 -13 29 -61 -10 46 -79 1 19 -5 -5 -41 28 -10 -64 48 -11 -29 4
6241Dj2L6o3K3O8j01N7K6o5L7l5N7l0n2J02n7k3P5o7L0k9J2L5q9O0L1q4O3k5M2
$$ 4 -8 28 -35 -12 56 -45 12 38 -27 10 -25 32 2 -50 52 -5 -28 47 -20 10 -19 -7 28 -61 -1 30 -54 9 -16 26
6271B6k2n1O9k9l6P0n3K1Pk5M4n7K0M0o4M0nmK3n9O4j7l4P9o6J0J9l2L3j5JN2
$$ 26 4 -47 22 -7 -43 27 -26 -5 2 -23 21 -36 -16 24 -40 0 -5 -9 14 -45 19 2 -32 47 -19 -9 10 -22 11 -4 -3 49
6303D9p0L3Ll8M5l6J6Km0Q5m6j9N7o8N6k7j8O1o1K5J1o8M9k3NL5n8O2o0K4L6n3
$$ 49 -21 12 15 -23 22 -14 2 4 -36 49 3 -16 41 -27 29 2 -16 45 -16 9 20 -48 1 -22 -17 18 -40 22 -38 -14 22 -31
6335c1L8%l7M9m9K4K9o0N2k2OJ3l5M6j3m2O9m2%L0m9M5k2%L1n1M6k3k2M2l5K0
$$ -31 7 7 -30 19 -30 -6 23 -37 15 -7 -1 12 -23 23 10 -32 37 -5 -5 25 -24 21 -1 -1 30 -21 25 2 -20 22 -13 7
6367Gpk2N4o3K3K6m2L3j9j2N5o0M0rj6K3l5K1Ll6N0k7qM3l4J5kk4L1j4j6N2o0
$$ 7 0 -22 32 -31 -8 18 -24 9 -10 -22 33 -27 13 4 -12 11 -24 -3 0 -36 14 -13 -21 22 -12 3 1 -23 8 -6 -22 30 -30
6400c0L8k2K6J0n8O0j2k5M9m6K2qk5M3l9PK1k9J3pnJ9j2K8j0m3N5l6lNj7P2p3
$$ -30 8 -14 12 22 -36 24 12 -13 36 -10 12 4 -21 22 -17 -10 11 -18 -5 -12 -17 2 -10 18 8 -35 20 -16 -19 -14 -31 41 -32
6433c2nP1o7K7J6l6M5k9J2J0n6N5%k9J6mM3o0JP4q8K5L9l7L8n5L6M1j13Q2J1p0
$$ -32 -37 34 -33 -6 10 -26 19 -10 2 12 -44 11 11 -18 -2 -6 37 -23 -22 52 -36 -11 28 -9 29 -26 10 51 -62 20 31 -39
6465c9M4rK0k9j3O7n3j6N3qk6l8O1kj03J05J6q0M4Knjk6J03q8m0J15p5k1L8L2
$$ -39 5 -4 16 -13 -26 41 -12 -28 25 17 -9 -47 14 12 -91 14 30 -50 -6 -4 -9 -10 -36 67 -21 -61 54 -21 -42 -4 28
6496B8j6p0Q6J1j15O8M7k6n8L1Q7j11JJ01r0k4M1K8rq9J09J3j38J18K4p5j3M1
$$ 28 12 -58 28 39 -76 -8 39 13 -45 -14 73 -38 -37 64 -26 -50 -9 19 10 -79 30 43 -95 23 47 -28 -41 0
6524@O0j12PJ17r0m3P0K1n5n1J36k2j47J22L2q2JK6O6j21KJ71j32n7J44k3o4l1
$$ 0 60 -52 -45 72 -18 -61 9 30 -25 -76 60 38 -109 13 45 -37 -36 -10 56 -65 -63 108 -24 -81 63 40 -24 -55
6552e5J07k1j31J24P0j41QQ7Oj41O9J14j70NJ27m5n3k3J28l9j80K08L2k04R8Q3
$$ -55 52 31 -100 24 94 -47 -39 48 54 -87 -18 96 -74 -69 58 13 -40 -63 65 26 -154 54 86 -118 -20 63
6578F3o4r7O4J34j57m2J70l1j49N6J46j21j15K21l1j71J30M0m7r2N8J65k22kK45
$$ 63 -1 -98 -34 100 -57 -99 71 40 -109 -53 93 -28 -143 78 47 -124 6 46 -1 -93 -35 130 -92 -94 151
6603A51j59j19J64M5j14p4J83mj79R8J12r7j17J43P3k52J05J86j94m5J26J7o9
$$ 151 -8 -127 37 82 -32 -106 77 73 -106 -8 104 7 -110 33 106 -146 -41 145 -49 -94 32 49 -20
6626b0j11K15mk66K09J31k66J5J77k8j73R4J58j76o2J38N1j74l3K93j30k40L09
$$ -20 -131 84 80 -186 23 154 -112 -97 80 52 -121 -27 131 -45 -107 31 82 -92 -125 168 38 -202 107
6649A07mk27J16P5qj49K1K29k09j14L08p9k10J21J57j62j06K31l7j54O1R5j0k07
$$ 107 103 -124 -8 67 59 -90 -69 160 -49 -163 145 66 -144 -23 134 -28 -134 97 60 -94 -33 62 52 -155
6673a55J17K57l70M0L07k31q4J30P4p8j40J96O1k92J05K13j67j45K39L4k84J33
$$ -155 -38 219 -151 -111 196 -35 -119 11 85 7 -133 63 124 -168 -63 150 -17 -162 77 111 -173 -40
6695d0J63j66k7P4R6j08j66L29n8l20K85O6k41O0J14j1j30J2K16j49j40K06O3
$$ -40 123 -43 -70 4 100 -8 -174 155 97 -223 62 128 -113 -53 61 50 -80 -68 148 -1 -141 65 128
6718A28k38OK76j71j76K70k6j36K4O4Q1k32L3L22l24m0K95j37j35R0J18r9j38
$$ 128 -110 -104 172 1 -175 95 69 -67 -43 21 102 -130 -97 225 -99 -139 156 19 -116 -26 92 -7 -145
6741a45J99L0j77J9J66k7k37J65J70l13P6K30j73j6J6Q3k1k19K62N5l08J70J18
$$ -145 54 84 -93 -74 92 65 -172 -7 163 -150 -74 156 -17 -33 -17 66 45 -174 88 143 -165 5 123
6764A23j70n3J51N4j94M5J70j50o2P5J08j25j24K85q1k41K67j8j27L5L6J06j94
$$ 123 -47 -100 51 105 -89 -44 126 -24 -86 -11 97 -28 -152 133 52 -189 78 60 -67 -32 4 110 -84
6787h4QK20j89p8K00rj48RJ74q4j36J61Pr5mP1P5k12Q5K08k53RJ87j18k7j8Q9
$$ -84 -76 144 -45 -123 77 68 -80 -71 103 19 -117 44 51 -44 -48 23 98 -114 -29 179 -74 -65 122 4 -23 -41 48
6814D8oj61J84L0j89Q5P8n0j25J02J30k02L3J22r6l4K9O9m2j37K21l1j89J51J8
$$ 48 42 -119 65 95 -94 -9 69 19 -106 -4 126 -76 -43 79 -17 -51 -22 47 5 -132 89 58 -131 20 38
6839C8n9l5N5R0j62J9J43j15k9N8M6n5q1J60k8j52J49j5o4L3oR3j36J4J56j61
$$ 38 -21 -56 -1 89 -73 -54 89 -26 -55 3 49 -6 -87 73 45 -107 42 27 -37 -4 -10 83 -53 -39 117 -44
6865d4LQ2m0qn3J23m3j13J54l5p0M7%K3p3K9J10j39MQ1n9j8J6M5pj08J36j9q3
$$ -44 -41 41 1 -7 -60 63 20 -93 61 26 -44 3 3 26 -47 -18 92 -47 -43 38 -21 -39 -23 22 15 -93 43 24 -59
6894e9P2j6K4n2PR1j08QR0q7K5OJ3Op7Q7jj03J01J5l8kj1O4j01K1Q7r8K9J0j9
$$ -59 13 -3 21 -31 -24 67 -41 -33 57 -30 -5 1 14 20 -57 30 29 -74 27 42 4 2 -9 55 -46 -25 62 -36 -7 3 -16
6925a6N1r1R6k6o7Q7k9n3N2k1K9m1J1N9p3J2L0m0L0l0L9Or5J32n6m7P2l8K7Km9
$$ -16 35 -56 40 14 -53 34 5 -48 4 -17 12 -29 -18 41 -32 -20 10 -30 0 -30 9 15 -80 52 -4 -51 21 -17 10 12 -37
6956c7R3r5L0N2r0N7OmJ5p4Q9m2m1R9p6L1j1k7O4p6K5N6j06O4Km1M8n2M8jn6P4
$$ -37 56 -39 -9 43 -47 10 16 12 27 -47 42 0 -41 58 -18 13 2 -25 39 -37 -12 44 -62 2 4 -37 11 -41 7 6 -50 24
6988B4n0OL4n7N5m2J9N0r6N9J4m8M4m7N7k4m3P8m0k2N6m4L7k1l2O5r1P7J2p6P6
$$ 24 -26 -20 14 -43 12 -30 -11 39 -57 2 16 -32 12 -35 22 -2 -45 33 -7 -29 27 -17 20 -1 -33 32 -59 18 30 -46 30
7019C0n3K7Mo2J02m6n0R3q4L0J4l8M7l2K7J1p8O9j4j1J7o5R0k9n3Q7n5NM6o6P3
$$ 30 -23 4 8 -54 48 2 -48 45 -39 -9 5 -33 14 -18 9 20 -58 11 -3 -14 3 -62 28 -1 -54 33 -22 -17 29 -37 36
7050C6n7JO3q3M5K5l9K9l8L7ln0P8o8J2K1k7O0o5j3Q5r9N5K1o4O4n6K3L3q2P3
$$ 36 -21 -20 43 -40 5 30 -9 20 -18 19 16 -34 44 -24 -12 9 -18 42 -23 -36 49 -50 5 26 -38 26 -30 -7 26 -56 17
7081A7Jo2O5m8K7%m0R3r1L4K2n9N4o8N1N4j29R9np3O2l2K4j0k9Q7o5j6J05q7p
$$ 17 18 -44 21 -27 0 0 -40 53 -38 -4 18 -41 13 -55 -4 50 -79 20 15 -58 4 -28 -4 -14 -43 44 -21 -37 68 -19 -26
7112b6PN2qr6R2j8l8M6l3K8k6j7J06r6m0J26r4J3K9j4K4r8Q2M6j26P2J8j2l7N
$$ -26 -19 33 25 -71 21 3 -35 11 -22 6 -20 -37 69 -27 -67 59 -35 -22 7 -7 17 -81 1 47 -79 -7 11 -1 -38 -33
7142c3R2q3m8J31q8j0J7J9M5j19J01K9j48R0L6n3K4j3Q8j07j9J41r8m2P8Nl4p0
$$ -33 59 -24 -72 59 -29 -39 -22 -3 42 -77 24 53 -95 -5 31 -22 2 -11 77 -30 -49 92 -6 -48 30 35 1 -69
7170f9R6L0j55J00M3r0J4L4P2j38pJ77j39m6J21k4l2o5J21Mj78J41O2j29J8P0
$$ -69 27 57 -98 2 45 -45 -31 3 75 -63 -70 107 -32 -78 43 19 -13 -78 43 47 -131 10 72 -57 -39 31
7196C1mp9PJ42j43k5J26l3p6nJ37m3j74K08J8j98J08L6Lq7%J76j49q2K36j15j02
$$ 31 27 -52 -45 97 -46 -71 55 22 -54 -59 78 35 -139 69 87 -111 -3 33 36 -51 -51 125 -24 -106 130 15 -87
7223h7R8Q1q6j07J71j7j47O6R5l3j34P7J56k52J6K65k13m4J17Lj7j30J80M8k50
$$ -87 11 92 6 -101 70 53 -94 -28 67 34 -100 -23 133 -119 -103 162 -51 -95 22 25 8 -122 58 106 -144
7248a44J37J34j66o9J56L8k14P5J79j66m6R4M8o2j47K72k0k94K70M5k24O6Q6K3
$$ -144 -7 127 -39 -108 48 86 -128 -53 126 -40 -86 8 56 -6 -153 119 99 -195 75 120 -104 -38 48 71
7272G1j47LK16j71j24K21J1k04L5K45j83j28K53m7j49N1O9P3k27N0L01l40m9L34
$$ 71 -76 -73 143 -28 -152 69 80 -124 -89 156 -27 -155 98 51 -98 -47 22 95 -132 -82 219 -121 -170 164
7296A64j38j45J08R2o8j50J86Q1k39L0K04o7k30J83J83l59J00K39k15l0O2J05
$$ 164 26 -119 -11 81 13 -137 49 130 -109 -79 125 58 -172 11 194 -165 -65 174 -41 -71 -9 96
7318I6l6k54L00P6m09K31J69k50l5J76K5j98M8J85j14j43J08J58j76j49L60j01
$$ 96 60 -194 106 182 -227 4 173 -77 -112 64 89 -109 -61 124 10 -133 -25 133 -43 -192 168 67
7340F7l28L43Kj76K7O0J15k13l7L43k27j82L04Rk36N3K19j34j58K16K5j64k2J62
$$ 67 -261 82 84 -92 -65 -5 110 -103 -140 203 -24 -206 98 107 -129 -76 143 9 -149 67 92 -72 -94 68
7364F8O0l19J46K93l76mL04j63q5N2J26m7k39K42J01l14O9K24j10k09K01J44l06
$$ 68 128 -191 -45 248 -128 -132 172 9 -76 -24 102 55 -184 58 159 -155 -86 138 28 -181 20 164 -142
7387a42Q8J75j24r3K2J95r7k44L38%l55K58Q4j64j2R4R4j92l6K54j29j58J46J36
$$ -142 -54 121 -3 -96 -74 121 24 -220 118 118 -237 21 105 -59 -71 23 117 -75 -111 143 14 -144 2 138
7411A38k04p4L03j20k11K15L9j27l0P2J44k60K7K91k50p7K31o5j06k1J71m8j91
$$ 138 -66 -140 163 43 -168 47 86 -41 -71 1 145 -115 -88 203 -47 -124 107 42 -64 -85 86 38 -153
7434a53J78O9j80j5J53L8k36J07K10k61LJ81r5o2OJ51m5k35K47M5k37J05J12o7
$$ -153 25 94 -86 -101 52 90 -146 -39 171 -90 -87 94 -1 -63 -57 94 49 -186 61 106 -131 -26 86 19
7458A9j17R1J34k06J1J72j00n9L7J09r9j32K31j4k15J58M1p1m1M2J38k31M4J87
$$ 19 -98 -7 127 -79 -68 104 4 -55 -18 91 -8 -140 91 77 -138 20 61 -10 -51 -9 129 -102 -58 129
7482A29j69m5J14K2q8o4J71k2j87J85J1j13lO2P8j67K1J80j68j0J09k3m4m5J32
$$ 129 -40 -85 29 51 -37 -101 70 48 -139 46 57 -56 -59 3 81 -86 -65 115 -53 -63 46 23 -21 -66 66
7507F6m2j70J90j0r4O6J3M3j26K7J50j66MJ41r6k0MP5l4j06J39j4j02P9mKo4L1
$$ 66 24 -146 44 34 -60 6 19 62 -64 -37 113 -53 -49 92 -4 -24 -20 55 21 -85 54 40 -62 17 13 15 -49 -18
7535a8J16j87M9J11j10J6NL1mr4J25j2j28J24jn1kJ6O2j17L4J04j20L9J3J3%q5
$$ -18 98 -89 -40 71 -39 -23 -18 13 9 -85 40 28 -100 24 23 -28 -30 -14 48 -69 -35 69 -51 -12 1 14 14 -71
7563g1J28m2j31J86n7m8M6m4O9o8QR5j15K8M5k6J2n3P0k1o9R5n1k5N1n8P1o2J1
$$ -71 57 15 -116 70 13 -35 11 -33 36 -32 -24 71 -44 -16 29 3 15 -38 32 11 -58 37 -14 -39 12 -46 25 -37 -26
7592b6P6j33M8Q9j18N6j0J0K0o6O7j6m1O3m7L6l6J3O5j08O5K0r4J01k7l4N6p1
$$ -26 50 -83 -35 54 -64 -8 -18 -8 12 -54 13 -3 -44 19 -28 8 -28 -15 50 -58 7 27 -67 34 7 -27 29 -42
7620d2P5k0q1J07n4NL1l2N1p5K3N7j00O8k2k5O4o9P6l0p4J32q1l3Q8r2N9j9j2
$$ -42 33 13 -68 39 -15 -10 21 -11 40 -35 -12 45 -55 13 -9 -34 30 -39 37 7 -67 65 -16 -49 39 -53 6 -13 -25
7649b5O6j02P4nm8N7n0L7K6q3J01p4k4J12j06O8Lo4R1r2L6M8r6R4n8oM7p8R6m4
$$ -25 41 -61 13 8 -40 17 -33 4 30 -53 48 -26 -50 62 -44 24 27 -37 54 -38 -2 46 -50 44 -14 -20 27 -51 45 1
7679Al6P8p5L9J4m4N9q7N5L6j30J14l7m3N8m9N7j2m7Q9q2L4Qk9N3n9M0M5j13Q7
$$ 1 -35 43 -32 7 21 -23 36 -51 4 40 -90 24 -13 -56 2 -47 10 -2 -49 40 -42 -8 0 -29 24 -35 5 50 -63 24
7709B4j6n2P9r2R8j4q8J23n9m0P7p2O2m1J1K7m8K4J3n0P0q3P6kp9R5n8l1Q8r5
$$ 24 8 -44 35 -57 41 27 -61 62 3 -37 40 -32 30 -11 0 27 -21 3 16 -34 36 -47 29 27 -52 43 -15 -46 42 -53
7739e3N0J5m6J00j07J8O1p6M2j5KJ2n8Q6m5k8O4l2K6k8l0J13j23N2M5r3P8m5l
$$ -53 -3 12 -34 66 -41 -23 38 -38 4 -11 -9 3 -55 31 -14 -42 22 -10 16 -12 -42 71 -52 0 45 -48 30 -15 -18
7768a8O2j04J03rj04R9j9k7K3j8O9j03J4Q3r2M8ojK8j04J07lj12J06k9k0QoP9
$$ -18 44 -60 43 34 -70 29 10 -17 6 -12 57 -46 -32 51 -41 7 1 0 28 -76 31 28 -84 22 -7 -27 -19 -25 54
7797E4j02%J00q4nM6j2Jm9Q7Kj30J14j1n0L6jN3q4pJ39j32J9O3n2Kk0N6J9j57
$$ 54 -48 -48 52 -32 -37 9 -3 -2 -51 36 38 -92 22 11 -39 -3 -4 49 -35 -42 97 -35 -16 47 -5 -3 -23 33 52 -105
7827a05J36J5j13Q9k3K4m9k5J28j26l4J28n6Ml4Q2j5j25J56j6j15P9rK7p8LJ57
$$ -105 31 46 -67 22 -1 23 -26 -51 77 -49 -83 45 -11 -7 -41 41 26 -99 57 41 -74 5 -4 23 -55 -52 105
7854A05j70k5J83j25oJ4L7Oj19J26L1j42Q4P3n2p6N8R0j77L9J67j66L0K5RJ7j52
$$ 105 -65 -90 93 -32 -38 -24 13 19 -100 26 57 -85 -1 72 20 -56 2 92 -85 -46 121 -45 -15 10 19 36 -116
7881a16J53N4j97J36O3j59J3O5M5j22QJ40j09o0P8O5p0j04K27r1j81K22qj14N0
$$ -116 37 91 -106 30 93 -66 -53 12 57 -65 -57 83 -26 -86 -8 57 -13 -117 110 19 -162 60 52 -62 -12
7906a2lP8j22k3K29j69r1J98m2j28K7J31o4j11J43J3q9mQ1M1j90O6K26k75J4J93
$$ -12 -15 63 -59 -82 147 -22 -113 85 43 -85 -58 73 9 -102 41 54 -35 -39 42 83 -107 -41 185 -90 -76 117
7932A17j39j0QP3rj81J55R3k34Q8J35q1j31J19J12k33P4J14q8l0j5J40m7k07K81
$$ 117 -22 -32 -24 49 40 -141 14 107 -127 -39 96 15 -116 3 115 -118 -44 70 -18 -48 -63 77 30 -177 104
7957A04ok84K10O0j34J2M7Q2j36o3K26j00j30J13J07j62p2K38j03j56K07j7p8
$$ 104 98 -186 24 84 -50 -38 9 91 -45 -108 118 18 -112 1 108 -54 -126 112 9 -147 60 43 -35
7980c5j7M6J24k17qK92k28q8K27o0j01%J47n3j46J25Q6j47n2J54N7k74J49J75
$$ -35 -52 -6 118 -99 -107 185 -43 -131 96 36 -65 -65 82 29 -117 8 94 -53 -105 49 106 -168 -19 156
8004A56k63K2J72p6n1k6J43j2k45K32R0k67J11J17j05r2R0J30j83j3J66n7j11
$$ 156 -107 -85 87 11 -40 -66 77 65 -180 52 142 -125 -14 103 -2 -94 -4 126 -57 -70 96 39 -72
8027g2K5J48r2j60K53j5k43J85M0p4o0M0J43j91m2K38j44j13J58N0j30m5J80l6
$$ -72 -47 101 9 -151 102 87 -156 29 69 -5 -65 -25 118 -73 -115 123 -21 -134 24 74 -56 -101 79 43
8051D3j82J41P2r6m9P0J21k35L5K26k00m2J56k8m6o9J57kk03J60Q1j74K5Q8K8
$$ 43 -139 2 74 -22 -71 -1 120 -115 -80 146 -54 -96 60 32 -14 -83 74 72 -131 29 110 -64 -39 49 77
8076G7j70N1J68j85j3J48n2o1l1J45m0k03K20L5j99R1P9l7j09L9J50j65k3J87
$$ 77 -93 -42 126 -59 -72 76 24 -37 -68 77 37 -166 54 89 -110 -19 60 23 -86 -47 103 -62 -85 102
8100A02j14m5K0O6oj61K05Mj71Q6O8n8o1N4J01j63J2J74j07n2N0M9n4j02J73m
$$ 102 -12 -57 -37 29 23 -138 67 71 -100 -14 54 -4 -65 -11 90 -73 -61 113 6 -46 4 53 -1 -103 70 66
8126F6j98J80No3j2K2Q6j39nJ76j50m0J13k3j4p1J40k9j58J68nj04L9oP1j24L3
$$ 66 -132 48 53 -10 -22 0 86 -53 -58 118 -32 -72 41 18 4 -67 73 44 -114 54 49 -55 -16 -22 49 -75 -42
8153d2J53j65qJ17p3K1k9N5jj22J32J6j21O0K7J1r2M8J10j52J5J15q0J4k7K9N1
$$ -42 111 -54 -62 55 -18 3 -26 29 28 -94 38 54 -67 -7 20 31 -61 -13 97 -55 -40 75 -5 9 -18 11 62
8180F2j49J20L0j54J20K1n9rjR1j28
$$ 62 -87 33 63 -91 29 50 -9 -18 -19 72 -56
8191e6
$$ Imaginary data points
##PAGE= N=2
##DATA TABLE= (X++(I..I)), XYDATA
0@%%%%%%%%%jKrJ6j6J7k5L3l4M2n1O0o9P7r3J10j27J46j68J93k19K47k79L15l54
$$ 0 0 0 0 0 0 0 0 0 0 -1 1 -8 8 -8 9 -16 17 -17 25 -26 34 -35 42 -51 59 -68 78 -90 103 -116 131 -148 167 -187
34a87L97m44M94n50O10o77P52q30R16j010J111j223J345j479J626j787J966k168
$$ -187 210 -234 260 -290 320 -357 395 -435 481 -529 582 -641 704 -775 851 -936 1030 -1138
52a138K396k648K933l259L639m085M615n258O051p055Q365j0136J2647j6445K2711
$$ -1138 1258 -1390 1543 -1716 1923 -2162 2453 -2805 3246 -3809 4556 -5580 7067 -9378 13333
67A3333l4521O3040k27748j62135P90760o11716Q2109K27363k88856L57505l72933
$$ 13333 -21188 41852 -185896 -348031 442729 -168987 -86878 140485 -148371 209134 -163799
78a63799Q6923L56252m76086J58734J34010n1180j23298m9451M26644m55972k926
$$ -163799 -76876 279376 -196710 -37976 96034 44854 -78444 -127895 298749 -157223 -160149
89a60149M65686n02410K40174n590j83578M42484n72413K41583M05547p45564
$$ -160149 305537 -196873 43301 37711 -145867 296617 -275796 -34213 371334 -374230
99c74230M34918J41881m00112K77809j36392J22238k7528k22043L49392j64214
$$ -374230 60688 202569 -197543 80266 -56126 66112 38584 -183459 165933 1719
109A719r2738J09243N646P9365l26544L19419R6939n12314M77154q0695k45954
$$ 1719 -91019 18224 23870 103235 -223309 96110 193049 -319265 157889 77194 -168760
120a68760L23602l05181K51711j3333l80093N53534k51298k41854M24117k15772
$$ -168760 154842 -150339 101372 88039 -292054 261480 10182 -231672 192445 -23327
130b3327j3796K4915R139J13729k55502J74913N8815j68851J05641q4879J74992
$$ -23327 -37123 -12208 -3069 110660 -144842 30071 88886 -79965 25676 -59203 115789
141A15789j43512j47763M31001l47931m7287L49272l26767J39190j227j06648
$$ 115789 -27723 -175486 255515 -92416 -139703 209569 -117198 21992 20765 -85883
151h5883K55841l14025J13993K13835l35447J53869O6558q8348J0852m9802J69199
$$ -85883 169958 -144067 -30074 183761 -151686 2183 68741 -19607 -8755 -58557 110642
162A10642j49491m3877J93605j58038N4714k5463J690J33543k72108J87808J05817
$$ 110642 -38849 -82726 110879 -47159 7555 -17908 -16218 117325 -154783 33025 138842
173A38842l15082K39067j2671j19007J22739j24199J36153m4502j42240K31234
$$ 138842 -176240 62827 50156 -68851 53888 -70311 65842 21340 -120900 110334
183A10334j11673o7661J06446l1724J9278r6671J03319L8049j78695J55457j9118
$$ 110334 -1339 -69000 37446 5722 25000 -71671 31648 69697 -108998 46459 27341
194B7341o6781P0329q7341J28179p7163r5525K25782j58475l2668J44249j10866
$$ 27341 -39440 30889 -56452 71727 -5436 -100961 124821 -33654 -66322 77927 -32939
205c2939M6381l2508R482P6913j43766Q6868M3789j02433N5113j0544L3512m5493
$$ -32939 13442 -19066 -9584 67329 -76437 10431 54220 -48213 6900 -3644 29868 -15625
217a5625l1426J26826j13558k925R2227q4225M2382l1371J3558N9439j27562R0491
$$ -15625 -47051 79775 -33783 -36708 55519 -28706 13676 -17695 -4137 55302 -72260 18231
229A8231L3488j14059Q2194j0070j3080N956l3724P8596o1444k3053Q2570n8271
$$ 18231 51719 -62340 19854 9784 -3296 2660 -31064 47532 -13912 -36965 45605 -12666
241a2666M293O299P093J9285p2010O9429R008q0077P0876j4181j5452J3062k7413
$$ -12666 -8373 -2074 5019 24304 -47706 21723 30731 -49346 21530 7349 -8103 4959 -22454
254b2454N8788m8701j9568P6978o0308J26K9510j7241J3191l4374L5642R979n6780
$$ -22454 36334 -12367 -31935 45043 -15265 -15139 14371 -2870 10321 -24053 11589 21568 -35212
267c5212M9204k752k3389J4698j0669K8822l2263o405N0925m8207M552K6406k1606
$$ -35212 13992 11240 -12149 2549 -8120 20702 -11561 -17966 32959 -15248 -10696 15710 -5896
280e896J1060j7993J9806Q103m1721L7996K36k7122J9715m559P975j4081l270
$$ -5896 5164 -12829 6977 15080 -26641 11355 11591 -15531 4184 -375 7600 -6481 -9751
293i751L0666l1055Q88K3128j7865L132l875J0004J940k4323K5940n91k1515J7436
$$ -9751 20915 -10140 -9252 13876 -3989 -857 -4732 5272 7212 -17111 8829 8238 -13277 4159
307D159j808j122m617j231J7054j9150j75J8235j4796J25M209J557k18j0737J3756
$$ 4159 2351 1229 -3388 -4619 12435 -6715 -6890 11345 -3451 -3326 883 2440 2222 -8515 5241
322E241k25j4107J2067L72n384N17Q52O084r253L26J0480r301q42N743j574j448
$$ 5241 5016 -9091 2976 3348 -2036 -1519 -667 5417 -3836 -3510 6970 -2331 -3173 2570 996 -452
338d52k520N637m59p063O405J222n175J673J892J84l161P36M100l957j150L956
$$ -452 -2972 2665 2206 -4857 1548 2770 -2405 -732 1160 1344 -1817 -1081 3019 -938 -2088 1868
354A868j237j999R92J620r90j873K191P44k532P52J625j258p16J040M35j010k52
$$ 1868 631 -1368 -376 1244 254 -1619 572 1316 -1216 -464 1161 -97 -813 227 662 -348 -600
371f00J237l69j017R17L62r17K28M73l03j71J25K02r2l95N76j16n78Q69n43j72
$$ -600 637 268 -749 168 530 -387 -159 314 11 -160 -35 167 75 -320 256 140 -438 431 -112 -284
391b84Q48j077P33l5p55J413j548P47Q38k246K375j094p85K291k849K163k49k201
$$ -284 564 -513 220 185 -570 843 -705 42 880 -1366 1009 -85 -870 1421 -1428 735 486 -1715
409a715L870l568J206K069m502M752k548j115M407n737M428p92l817P103o772
$$ -1715 2155 -1413 -207 1862 -2640 2112 -436 -1551 2856 -2881 1547 755 -3062 4041 -2731
424b731K471L357p286P546m576l47N887r643Q534j938o254J0576r056L895K222
$$ -2731 -260 3097 -4189 3357 -1219 -1566 4321 -5322 3212 1274 -4980 5596 -3460 435 2657
439B657q150J1990j0007J024R692j4325J0406k370m970J0651j3881J0815M41j3557
$$ 2657 -5493 6497 -3510 -2486 7206 -7119 3287 917 -4053 6598 -7283 3532 3973 -9584
453i584J8148j1211j07Q295j2846J4988j1175j759J7130k2035J2314K571j2105
$$ -9584 8564 -2647 -2754 5541 -7305 7683 -3492 -5251 11879 -10156 2158 4729 -7376
466g376J5666j6460J1425L774k1858K6883j3158o854J8062j9020J6143q919p277
$$ -7376 8290 -8170 3255 7029 -14829 12054 -1104 -7958 10104 -8916 7227 -1692 -8969
479h969K5753k9386J1920J1520k2482K0039j4511P360Q274k7915L2712j3315j4477
$$ -8969 16784 -12602 -682 10838 -11644 8395 -6116 1244 9518 -18397 14315 1000 -13477
492a3477K8072k4228J5073m785j2984L3647l6436J1058K2871l6586K5765q823
$$ -13477 14595 -9633 5440 655 -12329 21318 -15118 -4060 18811 -17775 7990 -833
504h33l382J7138l2771L2842o798k6339L7330k3049N288M085j5252L2607l6649
$$ -833 -4215 12923 -19848 12994 6196 -20143 17187 -5862 -574 3511 -11741 20866 -15783
517a5783J0451K8713m5608L0283n025j1630K4842l8843L6020j910m1459N3609
$$ -15783 -5332 23381 -22227 8056 3031 -8599 16243 -22600 13420 11510 -29949 23660
529B3660k5933r241K3922k5140K8804k5818q24L7436m8120K3079Q033j9677K1950
$$ 23660 -2273 -11514 12408 -12732 16072 -9746 -10570 26866 -21254 1825 9858 -9819 12131
542A2131l1708L4615n449m2823O3519l5160j1516L7149l9498L6001k3109j3749
$$ 12131 -19577 15038 9589 -33234 30285 -4875 -16391 20758 -18740 17261 -5848 -19597
554a9597N7221o3102J8931L2522m6326K8833j4955J0546P795m0654N2362k2437
$$ -19597 37624 -25478 -6547 25975 -20351 8482 -6473 4073 11868 -28786 23576 1139
566A139k0231L7054l0582K6951k3730n691N5283p4392L2014L5268o6581M9425
$$ 1139 -19092 17962 -12620 14331 -9399 -15090 40193 -34199 -2185 33083 -33498 15927
578A5927j8404n127L1723n9594N5251l501n3143O0450k3043p236P876r352L3543
$$ 15927 -2477 -7604 24119 -35475 19776 16275 -36868 23582 539 -6697 1179 -8173 25370
591B5370n0097K2645K9627n4919L9835j6743K912K1931o2129P3191j9100o1771
$$ 25370 -24727 -2082 27545 -27374 12461 -4282 -1370 20561 -41568 31623 12523 -49248
603d9248R1873m9554j1669M1075m4959M6205l3009j2917O2424o3007J4272K6134
$$ -49248 42625 -6929 -18598 22477 -22482 23723 -9286 -22203 40221 -22786 -8514 17620
615A7620k3275R567k4285M5254k2767l7294P3127n0671K950K7873m4379O1066
$$ 17620 -5655 3912 -20373 24881 2114 -35180 37947 -12724 -9774 18099 -26280 34786
627C4786n4358m953Q3034j01513L6058M6674p2732M5840j7448L180K1481n4545
$$ 34786 -19572 -24525 58509 -43004 -6946 39728 -33004 12836 -4612 -1432 20049 -34496
639c4496N4493q259l5828L4065j0920J5194l6428J8589M5146q6762N3404K0455
$$ -34496 19997 11738 -24090 9975 -945 14249 -22179 -3590 41556 -45206 8198 28653
651B8653o4052O0226m1003J6827L0983q6177Q7027j0542p5363Q7536l1137j8603
$$ 28653 -35399 24827 -16176 651 31634 -54543 32484 21942 -53421 34115 2978 -15625
663a5625K3766j8624L3275m0205P840L5998m2055J6710p638K0299o113n0581Q7259
$$ -15625 8141 -10483 22792 -17413 -9573 26425 -15630 1080 -6558 13741 7628 -42953 44306
676D4306m3928m5849R2921o4607R144K7223n0484O9843n4637j4434Q5275q3270
$$ 44306 378 -45471 47450 -17157 -8013 19210 -31274 38569 -16068 -30502 54773 -28497
688b8497J2499M5105l9460J0073j1363K8637j2707l2182N1809k7222p90M668j3231
$$ -28497 -15998 29107 -10353 -280 -11643 16994 4287 -27895 23914 -3308 -4098 570 -12661
701a2661M9541p0521K1952O7043j03935N0808K9756o3599N1378l4032J5129K7331
$$ -12661 36880 -33641 -11689 55354 -48581 2227 31983 -31616 19762 -14270 859 28190
713B8190p2224O3533K832n6206M3379n94o334j8677J6333K7932n7983L2923J4098
$$ 28190 -44034 19499 22331 -33875 9504 8910 2576 -16101 232 28164 -29819 3104 17202
726A7202l2885K8822l4143L6811K992p0082Q9484k6180n7394P8915l7719l930
$$ 17202 -15683 13139 -21004 15807 18799 -51283 38201 12021 -45373 33542 -4177 -8107
738h107J6803k6956M5983l9806q446N2445m1818j649J5868P180j2985k4350N5874
$$ -8107 8696 -18260 27723 -12083 -20529 31916 -9902 -11551 4317 11497 -1488 -25838 30036
751C0036l0400k7518N3979l5082J0919q01j9760N5897o1275M837O5803p5340K0235
$$ 30036 -364 -27882 26097 -8985 1934 1133 -18627 37270 -24005 -19168 46635 -28705 -8470
764h470L0750l3720J7315j8828K2148M261m1120M0476k642k0757O787N151J8118
$$ -8470 22280 -11440 5875 -12953 9195 13456 -27664 12812 10170 -10587 -3800 1351 19469
777A9469m3712K0893L5823o0984K9715J3657k6868K3255k9223K8674O954n4734
$$ 19469 -24243 -3350 32473 -28511 1204 14861 -12007 11248 -17975 10699 17653 -37081
789c7081N7461o091m1014L7314p127j707q637O42K7810l5748O339K3258j9368
$$ -37081 20380 14289 -26725 10589 3462 1755 -6882 -6240 21570 -14178 -7839 15419 -3949
802c949K198p416K3405r406l2887N1576j8622k7871L8365j7695M078m204q372
$$ -3949 -1751 -9167 14238 4832 -28055 23521 4899 -22972 15393 -2302 1776 -2428 -10800
815a0800L4984l8084N49L8443l4774J797J3324r32l665j6233K9352q212k3851
$$ -10800 24184 -13900 -13351 25092 -9682 -7885 5439 4507 842 -15391 13961 5749 -18102
828a8102K7220n714m475m482K590K1937l5506R720K9937l7192J0037J1901r151
$$ -18102 9118 3404 -1071 -5553 -2963 18974 -16532 -6812 23125 -14067 -4030 7871 -1280
841a280M459j5625K2004q05k8648K8853q18j7233P714L596O283j9216P001K0029
$$ -1280 3179 -12446 9558 8753 -19895 8958 8140 -9093 -1379 2217 8500 -10716 -3715 16314
855A6314k6332N271J2449p819l64q026J8160m854k2162K7916m396j7309J3647
$$ 16314 -10018 -4747 7702 -117 -481 -8507 9653 4799 -17363 10553 6157 -11152 2495
868B495k26J442j0133K743J7316k1507J242J6948j1427l152K135R070n844j2798
$$ 2495 2269 3711 -6422 -3679 13637 -7870 -6628 10320 -1107 -4259 -2124 6946 1102 -11696
882a1696K0201l794j4558J2231J136k510o414M316J1613j8220K786J5244j3195
$$ -11696 8505 4711 -9847 2384 3520 1010 -5404 -1088 10525 -7695 -4909 10335 -2860
895b860j559N762K699m231p611J4193k371j3032J1434K182o632j681M947M948
$$ -2860 -4419 1343 4042 -189 -7800 6393 4022 -9010 2424 4606 -2026 -3707 1240 6188
909F188j2238L122J1066j0891j433O919J9m389l011R841k867r611R917J546p556
$$ 6188 -6050 -2928 8138 -2753 -4186 2733 2752 -1637 -4648 5193 2326 -7285 2632 4178 -3378
924c378J244M474P29p561L034P561q548j374P338j793m492Q69N894l352n696P437
$$ -3378 -2134 2340 3069 -4492 -1458 6103 -2445 -3819 3519 1726 -2766 -1897 3997 645 -5051 2386
940B386Q68o728K212M171j958m393L455M068o344m41N997k427l729K599L184l445
$$ 2386 3254 -3474 -1262 2909 951 -3442 13 4081 -2263 -2704 3293 866 -2863 -264 2920 -525
956e25k621N239kn040K387L210k874k232L299J504m294M60L999k233k583K761
$$ -525 -3146 2093 2091 -2949 -562 2648 -226 -2458 841 2345 -1949 -1489 2510 277 -2306 455
972D55J548l011p36L510q08l070K131J825k417r94K554L05k923J104K283k086
$$ 455 2003 -1008 -1744 1766 958 -2112 19 1844 -573 -1567 987 1292 -1631 -527 1756 -330
988c30j014J933N55k017j35K520j319j699K142J58j303k06J283L44k303J390J354
$$ -330 -1344 589 1144 -873 -1008 1512 193 -1506 636 794 -509 -715 568 912 -1391 -1 1353
1005A353k307P05O78j96l26q61K178j209j363K595j494j13O20p67J604k145Q51
$$ 1353 -954 -249 429 233 -93 -954 1224 15 -1348 1247 -247 -360 260 -507 1097 -1048 -197
1022a97J699l124K281l46j169K038k528K138k15k414L802k895M54J979l386L459
$$ -197 1502 -1622 659 313 -856 1182 -1346 792 577 -1837 1965 -930 -476 1503 -1883 1576
1038A576k061n86L366m611L363k93k938M755m359J900J630m656N538l598k77M178
$$ 1576 -485 -1071 2295 -2316 1047 754 -2184 2571 -1788 112 1742 -2914 2624 -974 -1251 2927
1054B927o113N050j474k940O097o400L551J204n577P332n486Q48M377p615P209
$$ 2927 -3186 1864 390 -2550 3547 -2853 698 1902 -3675 3657 -1829 -981 3396 -4219 2990
1069B990l229k503P194q480N614J01n978R142p846K555M174q965R425n341j393
$$ 2990 -239 -2742 4452 -4028 1586 1687 -4291 4851 -2995 -440 3734 -5231 4194 -1147 -2540
1084b540P732j0629Q356j651o131J0886j0229M712K956r508J1984q683N55Q316
$$ -2540 5192 -5437 2919 1268 -4863 6023 -4206 506 3462 -6046 5938 -2745 -2190 6126
1098F126j2921J0861l725m825J1368j3225Q839P46j0773J5180j1423K239P308
$$ 6126 -6795 4066 341 -4484 6884 -6341 2498 3244 -7529 7651 -3772 -1533 5775
1111E775j3460J4143q328k694J3491j7081J1083J17r913J4746j3977P305M235
$$ 5775 -7685 6458 -1870 -4564 8927 -8154 2929 3046 -6867 7879 -6098 1207 5442
1124E442j5322J8439j0930j902J2191j6283J4409o640o164J8241k0773J0580N260
$$ 5442 -9880 8559 -2371 -4273 7918 -8365 6044 -596 -6760 11481 -9292 1288 6548
1137F548j6337J8342j3266L420R555k0295K0512p892q878J8400j7500J0746j644
$$ 6548 -9789 8553 -4713 -1293 8262 -12033 8479 587 -8291 10109 -7391 3355 1711
1150A711r808K0245k1127Q399R908k0893J9878j1533K93J3067k4356K3583o527
$$ 1711 -8097 12148 -8979 -580 9328 -11565 8313 -3220 -2927 10140 -14216 9367 2840
1163B840j5948K6960k1015O793O395j6809K3322j9426K096J8269k5954J7534l775
$$ 2840 -13108 13852 -7163 -370 6025 -10784 12538 -6888 -4792 13477 -12477 5057 1282
1176A282o249J4189k1883K1465n390j8133L0302k2841N247J0224k1067K7218k1479
$$ 1282 -4967 9222 -12661 8804 3414 -14719 15583 -7258 -2011 8213 -12854 14364 -7115
1189g115r02K7399l5843J9499N074j9307K1633j9493J2473M364k3999K9375j5033
$$ -7115 -8017 19382 -16461 3038 8112 -11195 10438 -9055 3418 7782 -16217 13158 -1875
1202a875m709J4834j7144J9704j7915R37K5385l7733K2891N404k4579K8227k3257
$$ -1875 -6584 8250 -8894 10810 -7105 -6168 19217 -18516 4375 9779 -14800 13427 -9830
1215i830J1087J1690l5250L7592j1852j9938L1220k1142Q306j119q773K3488k8035
$$ -9830 1257 12947 -22303 15289 3437 -16501 14719 -6423 1883 764 -8009 15479 -12556
1228a2556J1929J1914k2904J9461j4818J0792M697l0479M1827k0178j8390M0122
$$ -12556 -627 11287 -11617 7844 -6974 3818 8515 -21964 19863 -315 -18705 21417
1240B1417l2817J2516N443k1821L5572l1559K170L1120l7920J6890M624r449R396
$$ 21417 -11400 1116 6559 -15262 20310 -11249 -9079 22041 -15879 1011 5635 -3814 5582
1253E582j8201K4983j1409j5838L0831k3635R307M56j3283L2899l9113J2206L1474
$$ 5582 -12619 12364 955 -14883 15948 -7687 1620 2076 -11207 21692 -17421 -5215 26259
1266B6259n1344L1074M285k4520K7696k5949J7126P173l4119L6338j0039j5593
$$ 26259 -25085 5989 10274 -14246 13450 -12499 4627 11800 -22319 14019 3980 -11613
1278a1613J7289p647J0113j9572J1006J7670l7094K6623q55j5826K2184k8544
$$ -11613 5676 -1971 8142 -11430 -424 17246 -19848 6775 5920 -9906 12278 -16266
1290a6266K7006n53l9528N3681k2983k2427M0451k6972Q977K19j1826K8405k9777
$$ -16266 10740 10187 -29341 24340 1357 -21070 19381 -7591 1386 1605 -10221 18184 -11593
1303a1593N528K1043k2589P006k943J2910r331j8439M0834k7674q714L1784k9410
$$ -11593 -6065 14978 -7611 -605 -3548 9362 31 -18408 22426 -5248 -13962 17822 -11588
1316a1588J8705q706j1287L9244m5581J1793L4150m6914K0861P690j3660J0680
$$ -11588 7117 -1589 -12876 26368 -19213 -7420 26730 -20184 677 8367 -5293 5387
1328E387j6964K1507n591j9681K5595r700j264m292M111J8153l8660K3728J8125
$$ 5387 -11577 9930 4339 -15342 10253 553 -711 -5003 -892 17261 -21399 2329 20454
1341B0454m3457L0942l454j2013J8856k8665K8869j555l6320M4176j2703k0656
$$ 20454 -23003 7939 4485 -7528 11328 -17337 11532 9977 -26343 17833 5130 -15526
1353a5526K2760o726L697j2650P292J5509k7332J2989N971p214K564j3549K8528
$$ -15526 7234 508 4205 -8445 -1153 14356 -12976 13 5984 -1230 1334 -12215 16313
1366A6313j5931k2754M5774k6494j0844K7346k0274J3195j0766l998K9341l5171
$$ 16313 382 -22372 23402 -3092 -13936 13410 -6864 6331 -4435 -8433 20908 -14263
1378a4263P282K4739k5826M139N169N440q308j0764K7175j5882r232J7890r316
$$ -14263 -6981 17758 -8068 -3929 1240 6680 -1628 -12392 14783 -1099 -10331 7559 -1757
1391a757O959j4111O927K1376l9210J8988J9591l4236J6948K063m051M362j6783
$$ -1757 5202 -8909 -1982 19394 -19816 -828 18763 -15473 1475 3538 -513 3849 -12934
1404a2934K4006n816k1964K5675l861j0748J834P415N290k3126J5929J1279k4739
$$ -12934 11072 5256 -16708 8967 5106 -5642 -3808 3607 8897 -14229 1700 12979 -11760
1417a1760J2344K212j102p90j3064K6228j2096k0129L2617j2206j2035J3203k687
$$ -11760 584 2796 1694 904 -12160 14068 1972 -18157 14460 2254 -9781 3422 735
1430G35M504j3424O037J5735k3122N179J2924q525m360J56J5069j2950j0180K4729
$$ 735 5239 -8185 -2148 13587 -9535 -4356 8568 43 -4317 -4161 10908 -2042 -12222 12507
1444A2507j2020q555J1225j998L204j2917P976J4272k5837R161J4634j6534J352
$$ 12507 487 -8068 3157 1159 4363 -8554 -578 13694 -12143 -2982 11652 -4882 -3530
1457c530M071N210p008q228J9133p282j2116J3134R88n081o052R780N803j9951
$$ -3530 541 5751 -1257 -9485 9648 2366 -9750 3384 4372 -709 -6761 3019 8822 -11129
1471a1129J0624J0528j5710K751M907K327o270n867J7377p942j2254J6320j351
$$ -11129 -505 10023 -5687 -2936 1971 4298 -1972 -7839 9538 1596 -10658 5662 4311
1484D311q645J244O530J559j3209P731R375j3989J121Q240j328o852k64J2348
$$ 4311 -4334 -3090 3440 4999 -8210 -479 8896 -5093 -3972 4268 2940 -3912 -4176 8172
1498H172q529q181J4421k564q388L649N122r36r623P258P417j3407K122R255n011
$$ 8172 -357 -8538 5883 3319 -5069 -1420 3702 2766 -6857 401 7818 -5589 -3467 5788 777
1513G77n161L281P112p365n115J1857k579q480N400M674m209n641P368L666j1035
$$ 777 -4384 -1103 6009 -1356 -6471 5386 2807 -5673 -273 4401 192 -5449 1919 5585 -5450
1528e450L245P931o262l669M973L777o780k327R616l287p313O482L176n697k184
$$ -5450 -2205 5726 -536 -4205 768 4545 -2235 -4562 5054 1767 -5546 936 4112 -1585 -3769
1543c769O365Q94q160L444O300o303k577N827J104n930J77O944l628n291O126
$$ -3769 2596 3490 -4670 -1226 5074 -1229 -3806 2021 3125 -2805 -2628 4316 688 -4603 1523
1558A523J862n740j06N358j066n765L743M289n849j176N481p05m754J760M707
$$ 1523 3385 -2355 -2461 2897 1831 -3934 -191 4098 -1751 -2927 2554 1849 -2905 -1145 3562
1573C562l840l260N490M52n039J337M065k215l732L857K319n070K19M405j732
$$ 3562 -278 -3538 1952 2404 -2635 -1298 2767 552 -3180 677 2996 -2074 -1855 2550 818
1588H18l357K357L006l776j573M709q92l672K031K507k213k359L451J089m329
$$ 818 -2539 -182 2824 -952 -2525 2184 1292 -2380 -349 2158 -55 -2414 1037 2126 -2203
1603b203J381K967k183j694J911J867l111p45M018j855k260K318Q10j387j529
$$ -2203 -822 2145 -38 -1732 179 2046 -1065 -1810 2208 353 -1907 411 1221 -166 -1695
1618a695K637O68l850K240J715k536J48P97J160k021p67L702k532j209K691j019
$$ -1695 942 1610 -2240 0 1715 -821 -673 124 1284 -737 -1504 2198 -334 -1543 1148 129
1634A29j67r32J415J045l721K810Q45k986K047o18O57m77j670L806k762r00L384
$$ 129 -38 -970 445 1490 -2231 579 1424 -1562 485 -133 524 47 -1623 2183 -579 -1479 1905
1651A905k814J138l37l76K247l851K690Q56l667L653j901J99J329l168M196k544
$$ 1905 -909 229 -108 -484 1763 -2088 602 1458 -2209 1444 -457 -258 1071 -2097 2099 -445
1667d45j285M380m535K324L22k523M092m230J998J902m902M989k507p52L423m860
$$ -445 -1730 2650 -1885 439 761 -1762 2330 -1900 98 2000 -2902 2087 -420 -1172 2251 -2609
1683b609M397j624k503N606n639K720J377m685N907m503Q09L651o473N941k341
$$ -2609 1788 164 -2339 3267 -2372 348 1725 -2960 2947 -1556 -747 2904 -3569 2372 31
1698C1k362N834o530M216J47m683P113o072J964L205o855P210m085j082N878p952
$$ 31 -2331 3503 -3027 1189 1336 -3347 3766 -2306 -342 2863 -3992 3218 -867 -1949 3929 -4023
1714d023O184j311m399Q026p710L600K261p094Q594n961L67N570q912P936l075
$$ -4023 2161 850 -3549 4477 -3233 367 2628 -4466 4128 -1833 -1466 4104 -4808 3128 53
1729E3l351Q250r231N776N92o838R859q081K319M654r483R780n260j937Q255j0570
$$ 53 -3298 4952 -4279 1497 2089 -4749 5110 -2971 -652 4002 -5481 4299 -961 -2898 5357 -5213
1745e213P765j209o000J0499r992M507L373r655J1109p179j05P341j1258R903
$$ -5213 2552 1343 -4657 5842 -4150 357 3730 -5925 5184 -1995 -2100 5241 -6017 3886
1759C886l532m876J0917j1398O299J584q609J1843r666K494O456j2318J1671n184
$$ 3886 354 -4522 6395 -5003 1296 2880 -5729 6114 -3552 -1058 5398 -6920 4751 -433
1773d33l434J0150j2365R017r22q329J3485j1295L362N494j1146J1942p788l51
$$ -433 -3867 6283 -6082 2935 2013 -6316 7169 -4126 -764 4730 -6416 5526 -2262 -2613
1787b613R274j3871J0955k373o629J1904j2174P551J195j0823J5514j1356P63
$$ -2613 6661 -7210 3745 1372 -5257 6647 -5527 2024 3219 -7604 7910 -3446 -2683
1800b683R406j3897J2048n506l878J2662j5514R383K082j1178J3339r806L558
$$ -2683 6723 -7174 4874 -632 -4510 8152 -7362 2021 4103 -7075 6264 -3542 16
1813A6M176j1801J4837r433j977J1712j4315J0537l447n494J4108j6834R181N194
$$ 16 4192 -7609 7228 -2205 -4182 7530 -6785 3752 305 -5189 8919 -7915 1266 6460
1827F460j5931J6151q260j311R162j4263J3744n052p787J5462j3056M879K327
$$ 6460 -9471 6680 -1580 -2891 6271 -7992 5752 700 -7087 8375 -4681 198 2525
1840B525p276J1694j3159O721O172j6070J5513o794k973J0418j5314J4626m354
$$ 2525 -4751 6943 -6216 505 6677 -9393 6120 -674 -3647 6771 -8543 6083 1729
1853A729j1495K0712j5487J477R584j2998J1983q379J53J0946j6562J1076R4p399
$$ 1729 -9766 10946 -4541 -3064 6520 -6478 5505 -2874 -2721 8225 -8337 2739 2833 -4566
1867d566R020r821J0261m327q956J9311j6235K340J0380j5081J3970r099j520
$$ -4566 4454 -5367 4894 567 -8389 10922 -5313 -2973 7407 -7674 6296 -2803 -4323
1880d323J5523k1798J2244N805j6509J3987o375J378L076j0263J4759r139l261
$$ -4323 11200 -10598 1646 7451 -9058 4929 -1446 -68 3008 -7255 7504 -1635 -4896
1893d896J1179j0355P211n922J163J0638k0163J4809L169j7604J7895r083K48
$$ -4896 6283 -4072 3139 -2783 -1620 9018 -11145 3664 6833 -10771 7124 -1959 -1711
1906a711P580j5692J7766o605j1411J9785j2011o06N474m633O887j0993P395M746
$$ -1711 5869 -9823 7943 1338 -10073 9712 -2299 -2905 2569 -2064 4823 -6170 1225 5971
1920E971j3693J1485m173J72K874j0773J7756j1176q198K2442j8012K083R266
$$ 5971 -7722 3763 -410 -238 2636 -8137 9619 -1557 -9755 12687 -5325 -3242 6024
1933F024j1645J1551j0216J539J2749j8922R150N682j0003M579k500P065o898
$$ 6024 -5621 5930 -4286 -2747 10002 -8920 230 5912 -4091 488 -2012 5053 -1845
1946a845m206J5238j3190J671O146p277R180j2211O204J0858k3016J5354M620
$$ -1845 -6051 9187 -4003 -2332 3814 -3463 5717 -6494 -290 10568 -12448 2906 7526
1959G526j6289J2579m810J811J518j0004J5032o787p710J2195m577j035k845N519
$$ 7526 -8763 3816 -994 817 2335 -7669 7363 576 -7134 5061 484 -551 -3396 2123
1973B123L345j4939J3141J365j2053J0465n178L915p56j0183J8796j0782q968
$$ 2123 5468 -9471 3670 5035 -7018 3447 -1731 2184 1428 -8755 10041 -741 -9709
1986i709J9401j1167k184N628k730M916r816N602P022j2961N423L462j813l241
$$ -9709 9692 -1475 -3659 1969 -761 4155 -5661 -59 6963 -5998 -575 2887 1074 -2167
2000b167j687J2406j1847l288J5706j1983M53M238l121O373j1899O808R270j8446
$$ -2167 -3854 8552 -3295 -6583 9123 -2860 -2407 1831 -1290 5083 -6816 -8 9262 -9184
2014i184R076O553j0021K552K92N001n494m581J2481o706m457N967L96k71p944
$$ -9184 -108 6445 -3576 -1024 -732 4269 -1225 -5806 6675 -31 -4488 1479 1875 1604 -6340
2029f340R107L707j5772J1238L477r956M836j137M460m136o303J4650p422p784
$$ -6340 2767 6474 -9298 1940 5417 -4539 297 -840 3620 -516 -6819 7831 409 -7375
2043g375J1999k616m252l27N028J445j0589P551M663r406K286L020J871o030j723
$$ -7375 4624 2008 -2244 -2571 2457 3902 -6687 864 5527 -3879 -1593 1427 3298 -2732 -4455
2058d455J2451r578m946J2456n240l501J865K695J772r765O650O340j1967L137
$$ -4455 7996 -1582 -6528 5928 688 -2813 -948 1747 3519 -6246 404 6744 -5223 -2086
2072b086O298l443m015J565P499p505l677J0482l846m968L047L634j223p752P797
$$ -2086 4212 769 -3246 -1681 5818 -1687 -5364 5118 1272 -3696 -649 2985 1762 -5990 1807
2087A807L958j1749M975N713n501j945K272N096o243l460J0442l975o496O060
$$ 1807 5765 -5984 -1009 4704 -797 -2742 -470 4626 -1617 -5077 5365 1390 -5106 954
2101I54K513m167l552O746J530r373M707N497o274j715M214K764o457j082R158
$$ 954 3467 -700 -4252 2494 4024 -5349 -642 4855 -1419 -3134 1080 3844 -2613 -3695 5463
2116E463n066n546P321Q59n005r16N644J21p822M682N247p262q47N707q6n638
$$ 5463 397 -5149 2172 3031 -1974 -2890 2754 2875 -4947 -265 4982 -2280 -3127 2580 2494 -3144
2132c144J064O815m996m332P104L05n637Q25N176j627o066N116L788p215K79N739
$$ -3144 -2080 4735 -261 -4593 2511 2816 -2821 -1996 3180 1553 -4513 603 4391 -2824 -2545 3194
2148C194j831m588K408M917n016l026O893p15n622K501M182l109l936N105K086
$$ 3194 1363 -3225 -817 4100 -916 -3942 2951 2236 -3386 -885 3297 188 -3748 1357 3443
2163C443o534J308N261l120l536L523K995m973j326O102j806m789L532K929l795
$$ 3443 -3091 -1783 3478 358 -3178 345 3340 -1633 -2959 3143 1337 -3452 80 3009 -786
2178g86k150M777O39n637K222M251l810k233L795J440m428j74N165k478l756L944
$$ -786 -2936 1841 2480 -3157 -935 3316 -494 -2727 1068 2508 -1920 -2094 3071 593 -3163 781
2194G81J692l804p98M145l86m595K770L091l950j006L471L75l789O82M270l124
$$ 781 2473 -1331 -2129 2016 1630 -2965 -195 2896 -1054 -2060 1411 1786 -2003 -1321 2949 -175
2210a75k525M095K60l180K13L187q92l722L193J950m049L81K797n80k725J021
$$ -175 -2700 1395 1655 -1525 -1312 1875 983 -2739 454 2404 -1645 -1264 1533 953 -1772 -751
2226g51L381l400j390M060j184k155R26J923p72l064L270J167m105J735J786j292
$$ -751 2630 -770 -2160 1900 716 -1439 -513 1410 638 -2426 844 2011 -2094 -359 1427 135
2242A35j272O52K662l115q25L930k226j141J347O05j73k642K969Q44m162K872
$$ 135 -1137 -485 2177 -938 -1763 2167 -59 -1200 147 752 579 -2063 906 1750 -2412 460
2258D60P19j796L63k88K228k362r92M047k992m87J944q73N98k082K183R04m122
$$ 460 1179 -617 -254 -542 1686 -676 -1668 2379 -613 -1100 844 -29 569 -1513 670 1574 -2548
2275b548L569j26k131J910j539K107j498j602M503l745L4K742k725J788j537P55
$$ -2548 1021 895 -1236 674 -865 1242 -256 -1858 2645 -1100 -1066 1676 -1049 739 -798 -43
2291d3J793m215L597k41k648L158k369J720m57k282M678l991L20L225m222L106
$$ -43 1750 -2465 1132 891 -1757 1401 -968 752 295 -1987 2691 -1300 -980 2245 -1977 1129
2307A129j374p33L283m839L486L69l812M559l011Q03J394l544M638l212m70L956
$$ 1129 -245 -978 2305 -2534 952 1321 -2491 2068 -943 -140 1254 -2290 2348 -864 -1334 2622
2323B622n005L496p76k069M422n122L040J146m845N696l528n3L325n175M845k122
$$ 2622 -2383 1113 337 -1732 2690 -2432 608 1754 -3091 2605 -923 -976 2349 -2826 2019 -103
2339a03j978N223n683L238N64l867N482m758J745K439n682O069l301j095M858
$$ -103 -2081 3142 -2541 697 1261 -2606 2876 -1882 -137 2302 -3380 2689 -612 -1707 3151
2354C151o290M827j038l470O414o141K752J980n650O555m381J66M223o693N983
$$ 3151 -3139 1688 650 -2820 3594 -2547 205 2185 -3465 3090 -1291 -1125 3098 -3595 2388
2369B388k299k600O256o902M195N54n073P237n918J609L592p060P028l552j633
$$ 2388 89 -2511 3745 -3157 1038 1592 -3481 3756 -2162 -553 3039 -4021 3007 -545 -2178
2384b178O020p518N405o36m493P464o817K832K531o692P678m961k23N408q003
$$ -2178 3842 -3676 1729 1093 -3400 4064 -2753 79 2610 -4082 3596 -1365 -1588 3820 -4183
2399d183O653k040l562P492p808M303J370o434Q337o153J004M592q027P661l559
$$ -4183 2470 430 -3132 4360 -3448 855 2225 -4209 4128 -2025 -1021 3571 -4456 3205 -354
2414c54k378P229q477N540nn475Q385p397K815L314p893Q492m901r17O165q601
$$ -354 -2732 4497 -3980 1560 1555 -3920 4465 -2932 -117 3197 -4696 3796 -1105 -2022 4143 -4458
2430d458P142k135m234Q640q624M246K024p099Q875o633J094N381r301Q249k908
$$ -4458 2684 549 -3685 4955 -3669 577 2601 -4498 4377 -2256 -1162 4219 -5082 3167 259
2445B59l470P701q347N491p0n875R211p689K128M092p862Q126n148l64O524r927
$$ 259 -3211 4490 -3857 1634 1564 -4311 4900 -2789 -661 3431 -4431 3695 -1453 -1817 4707 -5220
2461e220P855j228n718R109q040L729K225p757R840o395q24P034q728O277k009
$$ -5220 2635 1407 -4311 4798 -3242 487 2712 -5045 4795 -1600 -2424 4610 -4118 2159 150
2476A50k673O959q787N915P46o850Q718o462K185K906p855R918o190k085R120
$$ 150 -2523 4436 -4351 1564 2310 -4540 4178 -2284 -99 2807 -5048 4870 -1320 -3405 5715
2491E715j0104N610M21n289Q326q280L646L900r065Q182l192j474M212o262P206
$$ 5715 -4389 1221 1642 -3647 4679 -3601 45 3945 -5120 3062 -130 -1604 2608 -3654 3552
2506C552m341k480Q541r043M422J146n214P942q275L734M811j1104R587k023m905
$$ 3552 -789 -3269 5272 -3771 651 1797 -3417 4525 -3750 -16 4795 -6309 3278 1255 -3650
2521c650P301o647M781p89n243R070o688J96M438m990M415m564K643L373r214
$$ -3650 3651 -2996 1785 996 -4247 4823 -1865 -1669 2769 -2221 2194 -2370 273 3646 -5568
2536e568Q682j871m944P306o551M710m51o496J1015p530j820Q530p804L333l64
$$ -5568 3114 1243 -3701 3605 -2946 1764 1313 -5183 5832 -1698 -3518 5012 -2792 541 177
2551A77j456M719p424N047J670o266N295k453J745j001l497Q777p754m02P993
$$ 177 -1279 3440 -3984 1063 2733 -3533 1762 -691 1054 53 -3444 5333 -2421 -2823 5170
2566E170q521M068j73k459O097q624M939M023r878O997L8l325K397k577M838m053
$$ 5170 -3351 717 544 -1915 4182 -4442 497 4520 -5358 1639 1677 -1648 749 -1828 3010 -1043
2582a043j832O955n706Q95J235q14K804o836O099J904r520Q550j126m176M413
$$ -1043 -2875 4080 -1626 -731 504 -310 2494 -4342 1757 3661 -5859 2691 1565 -2611 1802
2597A802l927M677k467m352R180n665k437N839k697J15k004L139J291o755N814
$$ 1802 -2125 2552 85 -4267 4913 -752 -3189 2650 -47 68 -1936 1203 2494 -4261 1553
2612A553M00m012K516j449L696l853k349R056p429j335P167n143R53m68P77K879
$$ 1553 1953 -2059 457 -992 2704 -1149 -3498 5558 -1871 -3206 3961 -1182 -229 -697 80 2959
2628B959p049M627L090o884K951J755o50k324k2N599n805q13N894l925j29p1J756
$$ 2959 -4090 537 3627 -3257 -306 1449 799 -1525 -1547 4052 -1753 -2566 3328 -597 -726 -797 959
2645I59J316o762N977K131q062N051J484k848O5m65M257m005k348O815l290k784
$$ 959 2275 -4487 1490 3621 -4441 610 2094 -754 -689 -1154 3103 -902 -3250 3565 275 -2509
2661b509K888J304j316l639N150O97o469M459J601k987k39M97L662m554j630P364
$$ -2509 379 1683 367 -3272 1878 2575 -3894 565 2166 -821 -1060 -563 3099 -1455 -3085 4279
2677D279m592k803M877o01j745j453L473Q66n862L693K878m529r4K623J065m132
$$ 4279 -313 -3116 1761 1160 -585 -2038 1435 2301 -3561 132 3010 -1519 -1613 1010 2075 -2057
2693b057K67N589m581k053M856r32k216m70L400n4n455M349K584n652J216L121
$$ -2057 -1790 3799 -782 -2835 2021 1089 -1127 -1597 1803 1749 -3706 643 3227 -2425 -1209 1912
2709A912r71k897R43M229l997k122N223j015l401J230L110j599l922M443J555
$$ 1912 941 -1956 -1013 3216 -781 -2903 2320 1305 -2096 -866 2244 645 -3277 1166 2721
2724B721n342J672L204j847k504J746L339m157j538N475j827l584K685K134k424
$$ 2721 -2621 -949 2255 408 -2096 -350 2989 -1168 -2706 2769 942 -2642 43 2177 -247
2739b47k356L967R16m996J963L442k976j937K833J787m026l52M810k395l128L369
$$ -247 -2603 1364 2280 -2716 -753 2689 -287 -2224 609 2396 -1630 -1982 2828 433 -2695 674
2755F74J391k998j118L776m3m480K578K972l706j038L287M44l600N33M069k730
$$ 674 2065 -933 -2051 1725 1682 -2798 -220 2752 -954 -1992 1295 1739 -1861 -1328 2741 11
2771A1k661L840O75l368M7L408r23l711K877K341l923l07L378m79l225J292L334
$$ 11 -2650 1190 1865 -1503 -1456 1952 1029 -2682 195 2536 -1387 -1694 1684 1205 -2020 -728 2606
2788B606l089j891L949j37l226Q84K884j539k928L185J535m040O10L133j412k440
$$ 2606 -483 -2374 1575 1438 -1788 -904 1980 441 -2487 698 2233 -1807 -1197 1936 524 -1916
2804a916J802K372l149j073L826r23k881J658K159j996k026L278O10l776J508
$$ -1916 -114 2258 -891 -1964 1862 939 -1942 -284 1875 -121 -2147 1131 1741 -2035 -527
2819e27K420j978j539J886J668l087m35L701j758k298K295J185k025j208K986
$$ -527 1893 -85 -1624 262 1930 -1157 -1592 2109 351 -1947 348 1533 -492 -1700 1286
2834A286j0l371K041J803k259p92J783J106k936J30L476k503j492K619P3j541
$$ 1286 1276 -2095 -54 1749 -510 -1302 481 1587 -1349 -1219 2257 -246 -1738 881 954 -587
2850e87o49K453j79l146K464J263k598J83J469M06k333M41K974k870o37K606r12
$$ -587 -1236 1217 1038 -2108 356 1619 -979 -796 673 1079 -1254 -813 2161 -709 -1346 1260 348
2867C48q88k77J807j18l008K895O84k988J436P99k67j270K08K534k733l76K723
$$ 348 -540 -817 990 872 -2136 759 1443 -1545 -109 690 423 -847 -639 1895 -838 -1214 1509
2884A509j637l79J22J101j4k704L006J91l072K458j41n26j39n87K546k468n70
$$ 1509 -128 -507 -385 716 702 -2002 1004 1195 -1877 581 440 -86 -225 -812 1734 -734 -1304
2901a304L193k451l0Q87j24M06k119K423J33k880K809o86o21N81j116K525k368
$$ -1304 1889 -562 -592 295 171 577 -1542 881 1014 -1866 943 257 -364 217 -899 1626 -742
2918g42n08L472l375P24J363j595J469j923J483Q85l250K996n45j390J603j426
$$ -742 -1250 2222 -1153 -429 934 -661 808 -1115 368 1253 -1997 999 454 -936 667 -759
2934g59J832j520o97L235l456J133J365k321K276k009R03J555l754L381n60k193
$$ -759 1073 -447 -1144 2091 -1365 -232 1133 -1188 1088 -921 -18 1537 -2217 1164 604 -1589
2950a589K971k237J263n9j792L328k884M48K039k926K409j420L3J999l635L212
$$ -1589 1382 -855 408 349 -1443 1885 -999 -551 1488 -1438 971 -449 -416 1583 -2052 1160
2966A160n44k479L726k926J137R43k897L798k659k59L012l837K614n11j463K947
$$ 1160 616 -1863 1863 -1063 74 1017 -1880 1918 -741 -1000 2012 -1825 789 278 -1185 1762
2982A762l438K309K99k932L902k836N95J756l425L755k227p60L518m319K786Q
$$ 1762 -1676 633 932 -2000 1902 -934 -339 1417 -2008 1747 -480 -1240 2278 -2041 745 753
2998G53k556L880l519J494J404l703M116k421l67K812l936L333j183j647L872
$$ 753 -1803 2077 -1442 52 1456 -2247 1869 -552 -919 1893 -2043 1290 107 -1540 2332
3013B332m205K330P11l330M309l241O30K343m271M082j819j358L787m320K800
$$ 2332 -1873 457 1168 -2162 2147 -1094 -464 1879 -2392 1690 -129 -1487 2300 -2020 780
3028G80Ok800M309l788J403J722m017M349k572m32L225m525L671r79k253M407
$$ 780 786 -2014 2295 -1493 -90 1632 -2385 1964 -608 -1040 2185 -2340 1331 352 -1901 2506
3044B506m360K154J044l705M581l277M20K693m502M104j717j450L904m506K973
$$ 2506 -1854 300 1344 -2361 2220 -1057 -637 2056 -2446 1658 -59 -1509 2395 -2111 862
3059H62jl014M578l912J317J898m169M450k620n11L448m691L614p95k356M334
$$ 862 861 -2153 2425 -1487 -170 1728 -2441 2009 -611 -1122 2326 -2365 1249 454 -1902 2432
3075B432m253K151J054l802M636l141J74K762m351L909j613j547M013m442K642
$$ 2432 -1821 330 1384 -2418 2218 -923 -749 2013 -2338 1571 -42 -1589 2424 -2018 624
3090F24L37l019M293l661J276J880m233M427k304q86L482m393L348o86k509M566
$$ 624 961 -2058 2235 -1426 -150 1730 -2503 1924 -380 -1266 2216 -2177 1171 485 -2024 2542
3106B542m185J528J728l795M009k585J04K615m278L731j149j853L636l700K391
$$ 2542 -1643 -115 1613 -2182 1827 -758 -654 1961 -2317 1414 265 -1588 2048 -1652 739
3121G39r7k669M498l906R60K447m225L794j870p43L281m535L275N2l161M060k800
$$ 739 642 -2027 2471 -1435 -475 1972 -2253 1541 -329 -1072 2209 -2326 949 1001 -2160 1900 -900
3138i00Q30J034k741L707k792KK809l742K704r29r04K827m077L081K97l704M507
$$ -900 -70 964 -1777 1930 -862 -860 1949 -1793 911 -18 -922 1905 -2172 909 1206 -2498 2009
3155B009k564j08K082l266L490j882j372L956l730J255J031j876K161k528J846
$$ 2009 -555 -663 1419 -1847 1643 -239 -1611 2345 -1385 -130 901 -975 1186 -1342 504
3170E04O73l333L711j685o56J911k600L032j973j232M355m328J128K096l031K444
$$ 504 1177 -2156 1555 -130 -786 1125 -1475 1557 -416 -1648 2707 -1621 -493 1603 -1428 1016
3186A016j754N85J769l793L106o7k286K180j207J189j175o69L289l559Q71J991
$$ 1016 -738 -153 1616 -2177 929 862 -1424 756 -451 738 -437 -1106 2183 -1376 -505 1486
3202A486k654J939j517Q09J511m057L650O4l401L349j163j55L23j258K790k437
$$ 1486 -1168 771 -746 63 1574 -2483 1167 1231 -2170 1179 16 -139 184 -1074 1716 -721
3218g21m39K899k344L22K12M29L32k595L152l54k914L187j081l31L94j145K839
$$ -721 -1160 1739 -605 -283 -71 358 690 -1905 1247 893 -2021 1166 85 -246 148 -997 1842
3235A842k685o22L840l261j9J827j001L33j409J847L60k937K468K84j504L09K36
$$ 1842 -843 -1465 2375 -886 -905 922 -79 254 -1155 692 1052 -1885 583 867 -637 -328 -92
3252i2J487k545K38L144l321K73J892j231L18j213J777M75l408K935O50k820J377
$$ -92 1395 -1150 -912 2232 -1089 -816 1076 -155 163 -1050 727 1202 -2206 729 1379 -1441 -64
3269f4N95pj364K31K403k553l37K315j033p29j07J719n32k568L102N9k761J812
$$ -64 531 524 -840 -609 1794 -759 -1096 1219 186 -543 -650 1069 537 -2031 1071 1130 -1631 181
3287A81M83m86r08K19K301k584n75L074j657j205J267Q23r18j509K432J12k638
$$ 181 664 178 -730 -511 1790 -794 -1369 1705 48 -1157 110 933 15 -1494 938 1050 -1588
3304a588J593J076j186r01J045J526k669M1K912k099r53J703K93j013j035K206
$$ -1588 5 1081 -105 -1006 39 1565 -1104 -1063 1849 -250 -1203 500 793 -220 -1255 951
3320I51Q8k810J918J288k123k08J499M17k139M04K412k011j004K058P0j495k55
$$ 951 1039 -1771 147 1435 -688 -896 603 1020 -1119 -715 1697 -314 -1318 740 810 -685 -940
3337i40K131n97k389K288Q63k396L70J538k31j786P03K098k135q72K467m50j725
$$ -940 1191 594 -1795 493 1356 -1040 -670 868 637 -1149 -446 1652 -483 -1355 1112 662 -1063
3354a063O05J671j024j778K207O34k443O19J710q42j512J157J576k232m79K513
$$ -1063 -458 1213 189 -1589 618 1252 -1191 -572 1138 296 -1216 -59 1517 -715 -1194 1319
3370A319q76j653J109J277j272j289K197K82k468J033J635j393j044J427R73k159
$$ 1319 443 -1210 -101 1176 -96 -1385 812 1094 -1374 -341 1294 -99 -1143 284 1257 -902
3386i02o1K384j244j500J585P99j547o23K074k15k169J395J282j666n94J562M36
$$ -902 -963 1421 177 -1323 262 1061 -486 -1109 965 750 -1419 -24 1258 -408 -1002 560 996
3403I96k042L97K135j648j090J851K68j537j21J835n24j941J657R93j931j14J637
$$ 996 -1046 -649 1486 -162 -1252 599 867 -670 -791 1044 520 -1421 236 1229 -702 -816 821
3420H21j55j776Q17J694j836o37J864j46j431K00J680q41j700J990N07k047N25
$$ 821 666 -1110 -293 1401 -435 -1072 792 646 -785 -585 1095 254 -1446 544 1051 -996 -471
3437d71J346n45j328Q90J378j846l92J947n92j306O70J302j101j212K034j7j836
$$ -471 875 330 -998 -108 1270 -576 -968 979 387 -919 -249 1053 -48 -1260 774 757 -1079
3454a079R53R12o72r61Q66J198j995j0K004j196r11J034O39r76p98J824k31j703
$$ -1079 -126 786 114 -847 19 1217 -778 -788 1216 20 -891 143 782 -194 -992 832 601 -1102
3472a102J206O56q72o18R15Q76k014M26J839j684l18J075N8o06p03J639k31j795
$$ -1102 104 760 -112 -730 185 1061 -953 -527 1312 -372 -690 385 443 -163 -866 773 542 -1253
3490a253J585M41j255%Q20L82j590N63J499j751L7R95k41l96n86J557m04j735
$$ -1253 332 773 -482 -482 338 720 -870 -307 1192 -559 -522 473 232 -164 -750 807 403 -1332
3508a332K020r4j405Q51J70J92r86K36J479j724M5J271p32k18j80J101m81j399
$$ -1332 688 594 -811 40 210 402 -584 -348 1131 -593 -548 723 -9 -227 -407 694 213 -1186
3526a186K048n17j191J199l41L23p15p3J682j979J88J627j500K34J76K90Mj238
$$ -1186 862 345 -846 353 12 335 -380 -453 1229 -750 -562 1065 -435 -201 -25 265 269 -969
3544i69J656l30j245J335m02R1m26o0J469j969M89J494j928Q77O5k75O81j485
$$ -969 687 357 -888 447 45 136 -290 -350 1119 -850 -361 1133 -795 82 147 -128 553 -932
3562i32J475J6j693J787n08m48M27m39J049j308K33J349j794Q88J43n34Q46j441
$$ -932 543 559 -1134 653 145 -303 124 -315 734 -574 -341 1008 -786 102 245 -289 557 -884
3580h84J408J7j792K185r49n63J212j218J144p26m65J736j826N94O93j104R97
$$ -884 524 541 -1251 934 -15 -578 634 -584 560 -166 -631 1105 -721 -127 566 -538 459
3597D59r80P29K97j599J947r15n55J400j472J181m82p85J978j983O13J034j761
$$ 459 -521 208 505 -1094 853 -62 -617 783 -689 492 10 -775 1203 -780 -167 867 -894
3614h94J464p50m4R76j709J567m28r57J600j394P93Rr91J790j690M75J072j902
$$ -894 570 -180 -224 752 -957 610 182 -775 825 -569 224 233 -758 1032 -658 -183 889 -1013
3632a013J633o76m45J428j897J406l2j411J967j426L68P00j452J665j136q2J346
$$ -1013 620 -56 -501 927 -970 436 404 -1007 960 -466 -98 602 -850 815 -321 -403 943
3649I43j901J427l10q39J611j728J026L06j602K042j370N9J189j811J605o85o14
$$ 943 -958 469 159 -680 931 -797 229 535 -1067 975 -395 -336 853 -958 647 -38 -652
3666f52J673j894J141J63j300J801j494N18P54j732J889j065l19J483j899J382
$$ -652 1021 -873 268 431 -869 932 -562 -44 710 -1022 867 -198 -517 966 -933 449
3682D49k58r88J805j765Q32N33j619J875j211QJ160j779J576o15o94J674j794
$$ 449 191 -797 1008 -757 75 608 -1011 864 -347 -339 821 -958 618 3 -691 983 -811
3699h11J042J95j305J810j486M23Q89j756J742q50m27J463j801J281j69j042J770
$$ -811 231 426 -879 931 -555 -132 757 -999 743 -107 -534 929 -872 409 240 -802 968
3716I68j606O30O21j536J714j070q8J213j772J452l92q12J588j626Q96K64j322
$$ 968 -638 -8 613 -923 791 -279 -367 846 -926 526 134 -678 910 -716 180 444 -878
3733h78J743j297K19R38j646J577p39m77J482j754J106M7j120J634j388N16O25
$$ -878 865 -432 -213 725 -921 656 -83 -560 922 -832 274 321 -799 835 -553 -37 588
3750E88j486J601q79k13J116j493J227l90o84J486j554Q03L50j252J544j156K48
$$ 588 -898 703 -176 -389 727 -766 461 71 -613 873 -681 122 472 -780 764 -392 -144
3767a44Q50j630J504n11o86J392j351P94K8r10J432j214L13P40j272J135o59o
$$ -144 706 -924 580 69 -617 775 -576 218 246 -664 768 -446 -133 607 -665 470 -189 -195
3785a95Q29j455J308l08q93J475j216N18K95j084J503j104r2J235j474Q45l7n31
$$ -195 634 -821 487 179 -714 761 -455 63 358 -726 777 -327 -419 816 -658 187 150 -381
3803c81R09j108Q28P0j017J249p22Q7L48p79J185j008l2J247j552P81J92p33R74
$$ -381 528 -580 248 318 -699 550 -172 -85 263 -516 669 -339 -371 876 -676 105 297 -436 538
3822E38j060O57M32j421J334l09o07P48n62O16n53j77J083j194L72M32n95N36
$$ 538 -522 135 567 -854 480 171 -436 312 -250 366 -187 -364 719 -475 -103 329 -266 270
3840B70p15O85J75j301J456l75p98J018o12L95k52m20J253j123p0J038q64J35
$$ 270 -445 240 415 -886 570 195 -603 415 -197 198 -54 -474 779 -344 -414 624 -240 -105
3858a05PK74O3r20J127j81q70R05k92J15k94j44J117j279P7J242j219K15L17j19
$$ -105 -98 176 239 -681 446 265 -605 300 8 123 -171 -315 802 -477 -400 842 -377 -162 155 36
3878C6J76q12R19J40j220R50J66n55kJ88N54j030J68J061j059K7M97p7p3o41J041
$$ 36 212 -600 319 459 -761 189 355 -200 -202 -14 540 -490 -322 739 -320 -293 204 127 54 -587 454
3899D54m6j328J274R2r14L97J82K31p20K5J141j031k80R85k64m50n1Q31l50r77
$$ 454 408 -920 354 446 -468 -71 111 342 -378 -353 788 -243 -523 462 198 -252 -303 528 178 -799
3919g99J181O5r79M40L58j7p18K43J083j244j84J265o40m87L65N04l42q27J092
$$ -799 382 447 -532 -92 266 249 -469 -226 857 -387 -571 694 54 -433 -68 436 94 -733 359
3938C59J98j246N96O01n06n17N33O98j193qJ213p40n26N91M13n20o53J205oj319
$$ 359 557 -689 -93 508 2 -515 18 716 -477 -485 728 -12 -538 53 466 -54 -707 498 492 -827
3958h27Q72N64q04k73O52M25j110P8J255q70o17R32K18p85k36J105k41j158R74
$$ -827 45 609 -195 -468 184 609 -501 -423 832 -38 -655 277 495 -290 -526 579 338 -820 154
3977A54M93r97q1P95R0j050L26J129j070m51J125q8q06Q0R59m04j047J116L77
$$ 154 647 -350 -431 364 454 -596 -270 859 -211 -662 463 375 -431 -351 608 204 -843 273 650
3996F50j193K02Q50k66q65N12R06j119l18J225k84q60L54Q60o36q21J217J72j264
$$ 650 -543 -341 509 243 -622 -110 796 -323 -641 584 300 -560 -206 654 18 -803 414 586 -678
4015f78M86P65m94o99O35P65j225j12J307n92q15O95N67p59n31J194n7j178O52
$$ -678 -192 573 79 -620 15 780 -445 -557 750 158 -657 38 605 -154 -685 509 452 -726 -74
4034g4O96p02n42Q33M58j286K40J194r20m92P91K66o88l66J140j71j198R05N66
$$ -74 622 -80 -622 211 669 -617 -377 817 -103 -595 196 462 -226 -592 548 377 -821 84 650
4053F50r65j39Q36P7j069M04R75r69l40Q44J19p47j66J164m52j113J233K04j040
$$ 650 -315 -454 382 459 -610 -206 769 -200 -540 304 423 -324 -490 674 222 -891 342 546 -494
4072d94K42O10l2q54L62R54j072k82J082k08p70K19R00o53p44J196r0q72L93M30
$$ -494 -252 358 326 -528 -166 788 -284 -566 516 308 -462 -243 657 4 -740 456 366 -506 -113 317
4092C17o5q36M90R14j322M8J124o83m17M15M49m69o13J084p8r48N84L97l46n82
$$ 317 252 -584 -94 820 -502 -454 670 -13 -430 -15 434 -35 -648 436 358 -590 -6 391 45 -537
4112e37O48N55j293M01Q90q84m3L07K86l15o48J157j78j108R96J52o00o5M36L00
$$ -537 111 666 -627 -226 664 -220 -263 44 330 15 -633 524 346 -762 234 386 -214 -279 157 457
4132D57r80L65P84q72j6L85J65l84m69J194m74r30J231k55n41L17J9L92q20J83
$$ 457 -523 -158 626 -246 -262 123 288 -96 -565 629 155 -775 456 201 -340 -23 -4 388 -432 -249
4152b49R83j111N7O95l10k46j24P73m32o49J094m05l57L31l7L93q62L22R24j378
$$ -249 734 -377 -320 375 65 -181 -305 468 36 -613 481 76 -281 50 13 406 -456 -134 790 -588
4172e88M40O85p63K18j20L72r7p36J023k48o10N60m3O3n27L62N79j159N85M30
$$ -588 -148 537 -226 -8 -128 244 147 -589 434 186 -424 136 93 156 -371 -9 570 -589 -4 426
4192D26p63M41k65L40Qq48J175l68p62J022m17n8J1p2N86q62L01N63p97L78o6
$$ 426 -337 104 -161 179 187 -661 514 146 -616 406 -11 -69 -58 -130 456 -406 -105 458 -339 39 -27
4213b7J23J4o30J035m94n76J062o66R5J76l76P53q35J83P58j064N26J52l41K98
$$ -27 96 110 -520 515 21 -555 507 -159 -64 112 -264 489 -346 -163 595 -469 57 209 -132 166
4233A66m74O07k07n55R06n63RK55l91O45p13J87O84j095O64R7n54O28n97M44O1
$$ 166 -308 299 92 -463 443 -120 -111 144 -247 398 -315 -128 556 -539 125 222 -332 296 -301 143 204
4254B04p41R72m89k13N51n09M41l57k1O16q99N57J31o00O67n46K94J88p45R24
$$ 204 -537 435 -54 -267 284 -225 216 -141 -162 454 -445 112 243 -357 310 -236 58 246 -499 425
4274D25m65k91P52p14M16n6l38O98p54L30L00o82O45l61K8L57o92P27l47l03P56
$$ 425 -40 -331 421 -293 123 67 -271 427 -327 3 303 -379 266 -95 -67 290 -402 325 -22 -325 431
4295D31p38L78R3m86P18o69K12M00p89O99k81j98N49o76N18p8m35P29o39K30K64
$$ 431 -307 71 164 -322 396 -273 -61 339 -450 249 -32 -230 319 -357 161 83 -352 377 -262 -32 232
4316B32n60O42m56K7M65p21N87j42l51O27o35L70Q6n21O99n03N8L67o12N72k69
$$ 232 -328 314 -142 -115 350 -371 216 74 -277 350 -285 85 171 -350 349 -154 -96 271 -341 231 -38
4337c8j52N28o68M63j8m34O53n39J81K43n58O05l51q1M85o35M64j00k95N50n58
$$ -38 -190 338 -330 133 115 -319 334 -205 -24 219 -339 266 -85 -166 319 -316 148 48 -247 303 -255
4358b55K81J48n04O20m11KL69n48M91k11j79N11n69L29N3m02N52m53J51K45n20
$$ -255 26 174 -330 290 -121 -119 250 -298 193 -18 -197 314 -255 74 127 -275 277 -176 -25 220 -300
4379c00N32k45j21M13n16L44l5k79M74m42J74J70m15M53k98J0K93m68L83j20j95
$$ -300 232 -13 -134 279 -237 107 72 -207 267 -175 -1 169 -246 207 -91 -81 212 -256 127 7 -188
4400a88M13m13K49M1l39M68l46M3K61m15L62j24j48L64m04K36M3k92L41k65J10
$$ -188 225 -188 61 102 -237 231 -115 -72 189 -226 136 12 -136 228 -176 60 103 -189 152 -113 -3
4421cJ29l08L69k30m9K74l33K67j00j51L56l74J61J55l58L41j72k8J91l04K71
$$ -3 126 -182 187 -43 -92 182 -151 116 16 -135 221 -153 8 163 -195 146 -26 -54 137 -167 104
4442A04p4j77L01k30R7j3j10K53k68R8J61l16K38p6n7J95k87K46j2k62L54j85
$$ 104 30 -147 154 -76 21 8 -102 151 -117 -19 142 -174 64 -12 -69 126 -161 85 73 -189 165 -20
4464b0k7J24j61J81j46k6K33k77J28M6j02P7j42J77j8k01L01j42q1J44j23J57
$$ -20 -47 77 -84 97 -49 -75 158 -119 9 55 -47 30 -112 65 47 -154 147 5 -76 68 -55 102
4486A02j49k4K49k96Q3J77k11J03n0N8J9k07K61n3j71J47l3K8j11K1K19k97R1
$$ 102 -47 -71 178 -118 -35 142 -69 34 -16 42 61 -146 115 62 -109 38 5 33 -78 -57 162 -135 -44
4509d4J88k20O2LN0%k03K54j2k65K58j8q9J9K2J15k26L5K29j98k3R6K1n3j20K31
$$ -44 144 -76 -14 -11 39 39 -164 90 78 -187 71 53 -36 -17 5 120 -106 -71 158 -40 -63 33 54 1 -119 112
4535A12n0k47K65jj44K9M8R0k02K6K40k33m4K08p7p7KJ52m3k25K30M4k12N8J07
$$ 112 62 -185 80 79 -65 -36 12 102 -100 -74 166 -67 -111 97 20 -57 -55 97 54 -171 59 103 -109 -51 56
4560E6J9j98Q0K03k44k9K29j04p9J8J33m2k18K49M7k51J24J07q9r5P1J87k32n4
$$ 56 75 -123 -43 160 -84 -113 116 12 -67 -49 84 42 -176 73 120 -131 -7 100 11 -84 -13 174 -58 -112
4584a12K59j24j17R0J24j16j68K58J6k67J52J11j27p1R4J54k71mL01j84j26J62
$$ -112 147 23 -94 -4 120 4 -164 94 110 -157 -5 106 -21 -92 2 156 -115 -119 182 -2 -128 34
4606C4N2j16r8K09K4k72J55J43j95k5J31P2k32K1K76j92j29J99K9j45m8K18k1
$$ 34 86 -30 -128 81 105 -167 -12 131 -64 -89 42 114 -118 -97 179 -13 -142 57 86 -59 -107 111 90
4629I0k70K04J23k36K3J35K1j95K7K44j84j28K36pj68LK05n6k46K25Q7k43N2J30
$$ 90 -180 24 147 -89 -66 69 90 -105 -78 166 -18 -146 90 83 -85 -82 123 67 -179 46 133 -110 -58 72
$$ [...]
8191f3
##END NTUPLES=NMR FID
##END=
