##TITLE=1H ikalashn
Pr-1
20.12.2024
##JCAMPDX= 6.0         $$ Bruker NMR JCAMP-DX V2.0
##DATA TYPE= NMR FID
##DATA CLASS= NTUPLES
##ORIGIN= UXNMR, Bruker Analytische Messtechnik GmbH
##OWNER= root
$$ TOPSPIN		Version 1.3
$$ 2024-12-20 15:15:53.781 +0400  Irina@DPX200
$$ Compression mode = diff/dup
##.OBSERVE FREQUENCY= 200.131300845
##.OBSERVE NUCLEUS= ^1H
##.DELAY= (6, 6)
##.ACQUISITION MODE= SIMULTANEOUS
##.ACQUISITION SCHEME= undefined
##.AVERAGES= 8
##.DIGITISER RES= 18
##SPECTROMETER/DATA SYSTEM= spect
##.PULSE SEQUENCE= zg
##.SOLVENT NAME= Acetone
##.SHIFT REFERENCE= INTERNAL, Acetone, 1, 17.49637
##AUDIT TRAIL= $$ (NUMBER, WHEN, WHO, WHERE, WHAT)
$$ ##TITLE= Audit trail, TOPSPIN		Version 1.3
$$ ##JCAMPDX= 5.01
$$ ##ORIGIN= Bruker BioSpin GmbH
$$ ##OWNER= Irina
$$ $$ F:/spectra/data/iren/nmr/1H/4/audita.txt
$$ ##AUDIT TRAIL=  $$ (NUMBER, WHEN, WHO, WHERE, VERSION, WHAT)
(   1,<2024-12-20 15:15:42.359 +0400>,<Irina>,<DPX200>,<TOPSPIN 1.3>,
      <created by zg
	started at 2024-12-20 15:15:05.031 +0400,
	POWCHK disabled, PULCHK disabled
       configuration hash MD5:
       BE 6D 3F 07 2A EA 11 49 91 17 2B D3 AF B3 58 0D
       data hash MD5: 16K
       58 DF 25 37 5E 42 06 76 78 14 8D 25 74 A4 0B 92>)
$$ ##END=
$$ 
$$ $$ hash MD5
$$ $$ 16 95 95 8F 6E 86 DD C4 2A 9E 51 77 CB 4E DE B3
##$RELAX= 
##$RELAX= 
##$RELAX= 
##$RELAX= 
##$RELAX= 
##$RELAX= 
##$RELAX= 
##$RELAX= 
##$RELAX= 
$$ Bruker specific parameters
$$ --------------------------
##$DU= <F:/spectra>
##$EXPNO= 4
##$NAME= <1H>
##$PROCNO= 1
##$TYPE= <nmr>
##$USER= <iren>
##$AMP= (0..31)
100 100 100 100 100 100 100 100 100 100 100 100 100 100 100 100 100 100 
100 100 100 100 100 100 100 100 100 100 100 100 100 100 
##$ANAVPT= -1
##$AQSEQ= 0
##$AQ_mod= 1
##$AUNM= <au_zg>
##$AUTOPOS= <>
##$BF1= 200.13
##$BF2= 200.13
##$BF3= 200.13
##$BF4= 200.13
##$BF5= 200.13
##$BF6= 200.13
##$BF7= 200.13
##$BF8= 200.13
##$BYTORDA= 1
##$CFDGTYP= 0
##$CFRGTYP= 5
##$CHEMSTR= <none>
##$CNST= (0..63)
1 1 145 1 1 1 1 1 1 1 1 1 1 1 1 1 1 1 1 1 1 1 1 1 1 1 1 1 1 1 1 1 1 1 
1 1 1 1 1 1 1 1 1 1 1 1 1 1 1 1 1 1 1 1 1 1 1 1 1 1 1 1 1 1 
##$CPDPRG= <>
##$CPDPRG1= <>
##$CPDPRG2= <>
##$CPDPRG3= <>
##$CPDPRG4= <mlev>
##$CPDPRG5= <mlev>
##$CPDPRG6= <mlev>
##$CPDPRG7= <mlev>
##$CPDPRG8= <mlev>
##$CPDPRGB= <>
##$CPDPRGT= <>
##$D= (0..63)
0 2 0 0 0 0 0 0 0 0.06 0 0.03 0 0 0 0 0.0002 0 0 0 0 0 0 0 0 0 0 0 0 0 
0 0 0 0 0 0 0 0 0 0 0 0 0 0 0 0 0 0 0 0 0 0 0 0 0 0 0 0 0 0 0 0 0 0 
##$DATE= 1734693338
##$DBL= (0..7)
120 120 120 120 120 120 120 120 
##$DBP= (0..7)
150 150 150 150 150 150 150 150 
##$DBP07= 0
##$DBPNAM0= <>
##$DBPNAM1= <>
##$DBPNAM2= <>
##$DBPNAM3= <>
##$DBPNAM4= <>
##$DBPNAM5= <>
##$DBPNAM6= <>
##$DBPNAM7= <>
##$DBPOAL= (0..7)
0.5 0.5 0.5 0.5 0.5 0.5 0.5 0.5 
##$DBPOFFS= (0..7)
0 0 0 0 0 0 0 0 
##$DE= 6
##$DECBNUC= <off>
##$DECIM= 32
##$DECNUC= <off>
##$DECSTAT= 4
##$DIGMOD= 1
##$DIGTYP= 9
##$DL= (0..7)
0 120 120 120 120 120 120 120 
##$DP= (0..7)
150 150 150 150 150 150 150 150 
##$DP07= 0
##$DPNAME0= <>
$$ [...]
##$SW= 21.9926040160658
##$SWIBOX= (0..15)
0 0 2 0 0 0 0 0 0 0 0 0 0 0 0 0 
##$SW_h= 4401.40845070422
##$TD= 16384
##$TD0= 1
##$TE= 300
##$TE2= 300
##$TE3= 300
##$TEG= 300
##$TL= (0..7)
0 120 120 120 120 120 120 120 
##$TP= (0..7)
150 150 150 150 150 150 150 150 
##$TP07= 0
##$TPNAME0= <>
##$TPNAME1= <>
##$TPNAME2= <>
##$TPNAME3= <>
##$TPNAME4= <>
##$TPNAME5= <>
##$TPNAME6= <>
##$TPNAME7= <>
##$TPOAL= (0..7)
0.5 0.5 0.5 0.5 0.5 0.5 0.5 0.5 
##$TPOFFS= (0..7)
0 0 0 0 0 0 0 0 
##$TUNHIN= 0
##$TUNHOUT= 0
##$TUNXOUT= 0
##$USERA1= <user>
##$USERA2= <user>
##$USERA3= <user>
##$USERA4= <user>
##$USERA5= <user>
##$V9= 5
##$VALIST= <valist>
##$VCLIST= <CCCCCCCCCCCCCCC>
##$VD= 0
##$VDLIST= <DDDDDDDDDDDDDDD>
##$VPLIST= <PPPPPPPPPPPPPPP>
##$VTLIST= <TTTTTTTTTTTTTTT>
##$WBST= 1024
##$WBSW= 25
##$XGAIN= (0..3)
0 0 0 0 
##$XL= 0
##$YL= 0
##$YMAX_a= 464775
##$YMIN_a= -661976
##$ZGOPTNS= <>
##$ZL1= 120
##$ZL2= 120
##$ZL3= 120
##$ZL4= 120
##$ABSF1= 10
##$ABSF2= 0
##$ABSG= 5
##$ABSL= 3
##$ALPHA= 0
##$AQORDER= 0
##$ASSFAC= 0
##$ASSFACI= 0
##$ASSFACX= 0
##$ASSWID= 0
##$AUNMP= <proc_1d>
##$AXLEFT= 0
##$AXRIGHT= 0
##$AXTYPE= 0
##$AXUNIT= <>
##$AZFE= 0.1
##$AZFW= 0.1
##$BCFW= 1
##$BC_mod= 2
##$BYTORDP= 1
##$COROFFS= 0
##$CY= 7568.61572265625
##$DATMOD= 1
##$DC= 2
##$DFILT= <>
##$DTYPP= 0
##$F1P= 17.9538593292236
##$F2P= -4.03888763876832
##$FCOR= 0.5
##$FTSIZE= 32768
##$FT_mod= 4
##$GAMMA= 1
##$GB= 1
##$INTBC= 1
##$INTSCL= 1
##$ISEN= 128
##$LB= 0.02
##$LEV0= 0
##$LPBIN= 0
##$MAXI= 945.577
##$MC2= 0
##$MEAN= 0
##$ME_mod= 0
##$MI= -402.1523
##$NCOEF= 0
##$NC_proc= 0
##$NLEV= 6
##$NOISF1= 8.587773
##$NOISF2= 6.764455
##$NSP= 1
##$NTH_PI= 0
##$NZP= 0
##$OFFSET= 17.49637
##$PC= 1
##$PHC0= 358.5127
##$PHC1= -17.70145
##$PH_mod= 0
##$PKNL= yes
##$PPARMOD= 0
##$PPDIAG= 0
##$PPIPTYP= 0
##$PPMPNUM= 100
##$PPRESOL= 1
##$PSCAL= 0
##$PSIGN= 0
##$REVERSE= no
##$SF= 200.13
##$SI= 32768
##$SIGF1= 18.5376
##$SIGF2= -6.396296
##$SINO= 400
##$SIOLD= 32768
##$SREGLST= <1H.CDCl3>
##$SSB= 3
##$STSI= 0
##$STSR= 0
##$SW_p= 4401.40845070422
##$SYMM= 0
##$S_DEV= 0
##$TDeff= 0
##$TDoff= 0
##$TI= <>
##$TILT= no
##$TM1= 0
##$TM2= 0
##$TOPLEV= 0
##$USERP1= <user>
##$USERP2= <user>
##$USERP3= <user>
##$USERP4= <user>
##$USERP5= <user>
##$WDW= 1
##$XDIM= 8192
##$YMAX_p= 0
##$YMIN_p= 0
$$ End of Bruker specific parameters
$$ ---------------------------------
##NTUPLES= NMR FID
##VAR_NAME=  TIME,          FID/REAL,        FID/IMAG
##SYMBOL=    X,             R,               I
##VAR_TYPE=  INDEPENDENT,   DEPENDENT,       DEPENDENT
##VAR_FORM=  AFFN,          ASDF,            ASDF
##VAR_DIM=   8192,          8192,            8192
##UNITS=     SECONDS,       ARBITRARY UNITS, ARBITRARY UNITS
##FACTOR=    0.0002272,     1,               1
##FIRST=     0,             0,               0
##LAST=      1.8609952,     -20,             49
##MIN=       0,             -661976,         -661976
##MAX=       1.8609952,     464775,          464775
$$ Real data points
##PAGE= N=1
##DATA TABLE= (X++(R..R)), XYDATA
$$ plain form
0 0 0 0 0 0 0 0 0 8 -2 8 -8 9 -17 17 -25 26 -34 43 -51 67 -76 93 -111 129 -152 179 -209 239 -280 315 -365
31 -365 416 -473 535 -603 681 -765 856 -956 1066 -1187 1321 -1466 1621 -1795 1984 -2188
47 -2188 2411 -2658 2928 -3226 3556 -3919 4321 -4776 5287 -5866 6531 -7303 8216 -9305
61 -9305 10636 -12310 14488 -17442 21695 -28383 40460 -69022 273317 -53890 -630542 158008
73 158008 296512 -156740 -29330 272102 -202784 -312088 215661 294525 -109049 -121658
83 -121658 -85104 -100108 217708 305200 -279102 -351312 258076 229189 -241474 30861 251884
94 251884 -293398 -303482 457415 329147 -452688 -279320 321304 125099 -143991 75694
104 75694 15433 -236102 30188 264774 -10037 -139592 -16368 -88369 9542 310122 28135
$$ packed form
0@%%%%%%%Qj0J0j6J7k6L4m2N1o0P7r4J18j43J69k04K40k81L31l88M48n19N95o80
31c65P81q89J008j138J284j446J621j812K022k253K508k787L087l416L779m172
47b188M599n069N586o154O782p475Q240r097J0063j1153J2397j3834J5519j7521
61i305J9941k2946K6798l1930L9137n0078O8843j09482L42339l27207n76652P88550
73A58008J38504m53252J27410L01432m74886j09304N27749P8864m03574j2609
83a21658L6554j5004L17816Q7492n84302p2210O09388k8887m70663K72335K21023
94B51884n45282j0084P60897j28268p81835J73368O00624j96205k69090K19685
104G5694o0261k51535K66290K34586k74811j29555J23224p2001R7911L00580k81987
$$ plain form
115 28135 -426364 -47687 394919 -2126 -253180 132838 82747 -298927 37144 418688
125 418688 -73757 -419481 51879 287113 -24770 -77736 28162 -113339 -56877 202519
135 202519 70808 -161635 -28173 28736 -77920 120125 206616 -216048 -288421 234801
145 234801 267770 -201242 -140222 161240 -43002 -147724 200121 157842 -262872 -158582
155 -158582 213300 115603 -89819 -24215 -39558 -81262 116673 144319 -123652 -121826 84677
166 84677 13094 -42512 135760 26655 -255164 -34492 289837 36528 -229792 -3408
176 -3408 112173 -68558 3155 149800 -67526 -193460 68344 165022 -29673 -67030 -9712
187 -9712 -58702 24307 153068 -16809 -172507 11840 112483 -33736 -7863 85462 -88752
$$ packed form
115B8135m54499L78677M42606l97045k51054L86018n0091l81674L36071L81544
125D18688m92445l45724M71360K35234l11883n2966J05898j41501N6462K59396
135B02519j31711k32443J33462N6909j06656J98045Q6491m22664p2373N23222
145B34801L2969m69012O1020L01462k04242j04722L47845m2279m20714J04290
155a58582L71882r7697k05422O5604j5343m1704J97935K7646k67971J826K06503
166H4677p1583n5606J78272j09105k81819K20672L24329k53309k66320K26384
176c408J15581j80731P1713J46645k17326j25934K61804R6678j94695l7357N7318
187i712m8990Q3009J28761j69877j55698J84347J00643j46219K5873R3325j74214
$$ plain form
198 -88752 -142519 136861 166999 -128402 -132961 86477 45752 -45539 57731 27207 -129780
209 -129780 -29250 137530 31369 -81299 -13360 -6638 -26920 81899 69288 -113362 -84391
220 -84391 97735 54102 -56398 14712 18471 -91960 -1922 140056 4225 -135220 -7571
231 -7571 81535 -4508 -7405 33374 -51739 -63441 72762 72300 -55187 -46256 18739 -8098 11824
244 11824 65821 -22843 -97914 17846 88224 -11379 -42341 16682 -16078 -35217 58941 54450
256 54450 -69759 -57386 51025 34939 -19842 6131 -4828 -46969 13149 67024 -8540 -56036
268 -56036 2605 20337 -5319 21385 17117 -49407 -29005 53355 29768 -36348 -14047 11289
280 11289 -13483 7647 39808 -13213 -50809 8586 40600 -2408 -14362 2158 -14744 -9102
$$ packed form
198h8752n3767K79380L0138k95401m559K19438m0725r1291J03270l0524j56987
209a29780J00530J66780j06161j12668O7939O722k0282J08819j2611j82650K8971
220h4391J82126m3633j10500P1110L759j10431R0038J41978j35831j39445J27649
231g571Q9106q6043k897M0779q5113j1702J36203m62j27487Q931O4995k6837J9922
244A1824N3997q8664p5071J15760P0378r9603l0962N9023l2760j9139R4158m491
256E4450j24209J2373J08411j6086n4781K5973j0959m2141O0118N3875p5564m7496
268e6036N8641J7732k5656K6704m268o6524K0402Q2360k3587o6116K2301K5336
280A1289k4772K1130L2161n3021l7596N9395L2014m3008j1954J6520j6902N642
$$ plain form
292 -9102 33103 17658 -33456 -19315 19148 9612 -724 7969 -11631 -24487 13614 30844 -7908
305 -7908 -23293 1444 5575 -320 12709 4932 -22777 -10840 21190 12316 -11259 -6990 -419
318 -419 -3162 7530 12850 -7567 -16501 2878 12002 1651 -2262 -2767 -7499 167 12688 3832
332 3832 -11338 -5831 5188 3737 1519 1648 -4870 -6913 4034 9146 -732 -7235 -2278 2492 2902
347 2902 2317 -786 -4532 -2285 3241 3908 -185 -3133 -2451 837 3310 1474 -2361 -2758 362 2188
363 2188 1047 -579 -1103 -878 85 1400 1095 -1146 -1999 396 2205 356 -1764 -607 1086 244 -680
380 -680 391 625 -994 -757 1455 933 -1729 -937 1823 627 -1769 28 1622 -743 -1265 1253 465
397 465 -1596 564 1519 -1585 -949 2156 -284 -2174 1887 1392 -3539 29 4535 -1934 -4512 3951
$$ packed form
292i102M2205j5445n1114J4141L8463r536j0336Q693j9600j2856L8101J7230l8752
305g908j5385K4737M131n895J3029p777k7709J1937L2030q874k3575M269O571
318d19k743J0692N320k0417q934J9379R124j0351l913n05m732P666J2521q856
332C832j5170N507J1019j451k218J29o518k043J0947N112r878o503M957M770M10
347B902n85l103l746K247N526O67m093k948O82L288K473j836l835l97L120J826
363B188j141j626n24K25R63J315l05k241q53K395J809j849k120J157J693q42r24
380f80J071K34j619K37K212n22k662P92K760j196k396J797J594k365n22K518p88
397D65k061K160R55l104O36L105k440j890M061m95m931L568M506o469k578Q463
$$ plain form
413 3951 3133 -5612 -722 6291 -2278 -5548 5118 3169 -7257 131 7809 -3473 -6123 6081
427 6081 2217 -7396 3024 7017 -8049 -4855 11043 972 -10759 4322 7173 -10038 -1580
440 -1580 14349 -4226 -15098 8926 11117 -11810 -2992 12694 -6993 -11513 15381 8092 -18994
453 -18994 -2210 16296 -5949 -8717 14412 -1091 -20344 10007 20583 -15703 -13471 17467
465 17467 -187 -16294 15982 13027 -28015 -7673 31321 -469 -24641 11071 10583 -22187 5322
478 5322 29735 -17291 -28903 22390 17187 -21225 3012 16407 -24635 -9927 39113 2285
490 2285 -39997 7479 26588 -19672 -4299 32144 -17758 -39403 32012 35776 -35411 -19041
502 -19041 29840 -7118 -20120 33465 10288 -49003 -1397 46136 -8268 -25395 19882 -4839
$$ packed form
413C951q18q745M890P013q569l270J0666j949j0426P388P678j1282k650J2204
427F081l864r613J0420L993j5066L194J5898j0071j1731J5081K851j7211Q458
440a580J5929j8575j0872K4024K191k2927Q818J5686j9687m520K6894p289k7086
453a8994J6784J8506k2245k768K3129j5503j9253L0351J0576l6286K232L0938
465A7467j7654j6107L2276k955m1042K0342L8994l1790k4172L5712m88l2770K7509
478E322K4413m7026j1612N1293n203l8412K4237J3395m1042J4708M9040l6828
490B285m2282M7476J9109m6260J5373L6443m9902k1645P1415L764p1187J6370
502a9041M8881l6958j3002N3585k3177n9291M7606M7533n4404j7127M5277k4721
$$ plain form
514 -4839 -31506 32432 37286 -47448 -30726 46518 8974 -33794 23292 17387 -54387 -3814 70451
527 70451 -5705 -63020 14101 34096 -24368 4519 35520 -36558 -40874 49850 32065 -42225
539 -42225 -5959 21111 -31278 2034 65044 -18960 -78928 28736 64144 -35950 -24967 44973
551 44973 -22648 -54800 58929 58001 -70586 -45824 56673 15417 -27978 25129 -735 -59244
563 -59244 19207 69096 -26662 -46472 29103 -1800 -33058 56034 38498 -93529 -37901 100297
575 100297 21863 -77718 12397 40083 -56126 -5764 90800 -13415 -97646 17551 69139
586 69139 -14931 -14644 14479 -42681 -17200 77811 15283 -76736 1410 43177 -36017 4693
598 4693 78930 -45152 -110130 65342 110299 -66485 -73126 59330 10749 -54785 50695
$$ packed form
514d839k6667O3938M854q4734J6722P7244l7544m2768N7086n905p1774N0573P4265
527G0451p6156n7315P7121J9995n8464K8887L1001p2078m316R0724j7785p4290
539d2225L6266K7070n2389L3312O3010q4004n9968J07664L5408j00094J0983O9940
551D4973o7621l2152J13729r28j28587K4762J02497m1256m3395N3107k5864n8509
563e9244P8451M9889r5758j9810P5575l0903l1258Q9092j7536j32027N5628J38198
575A00297p8434r9581R0115K7686r6209N0362R6564j04215q4231J15197N1588
586F9139q4070K87K9123n7160K5481R5011o2528r2019P8146M1767p9194M0710
598D693P4237j24082o4978J75472M4957j76784o641J32456m8581o5534J05480
$$ plain form
609 50695 54779 -84539 -51408 77331 33939 -35920 357 -17734 -40756 59570 66417 -76602
621 -76602 -58857 71085 13579 -56115 54272 44479 -116187 -38783 145054 31309 -129671
632 -129671 -11800 79864 -22523 -20712 60954 -21815 -83193 34655 71716 -21782 -23745 -827
644 -827 -43677 18282 100965 -26328 -121328 32484 95038 -48184 -35051 77420 -30517
655 -30517 -110320 73946 127001 -82603 -110550 63257 59162 -35004 8678 15138 -62775 -8477
667 -8477 76919 6363 -43939 3819 -19937 -26844 84443 52931 -121994 -62999 121750 41240
679 41240 -93229 12372 57712 -78363 -33474 126828 25110 -133588 -23542 94408
689 94408 15330 -27762 4910 -34721 -28178 66149 36346 -57685 -14549 21588 -36168 18554
$$ packed form
609E0695M084j39318L3131J28739m3392o9859L6277j8091k3022J00326O847j43019
621g6602J7745J29942n7506o9694J10387r793j60666P7404J83837j13745j60980
632a29671J17871R1664j02387J811Q1666q2769o1378J17848L7061r3498j963K2918
644h27m2850O1959Q2683j27293r5000J53812O2554j43222J3133J12471j07937
655c0517p9803J84266N3055k09604k7947J73807m095r4166M3682O460p7913N4298
667h477Q5396p0556n0302M7758k3756o907J11287l1512j74925N8995J84749q0510
679D1240j34469J05601M5340j36075M4889J60302j01718j58698J10046J17950
689I4408p9078m3092L2672l9631O543R4327k9803r4031M3136L6137n7756N4722
$$ plain form
701 18554 96050 -43581 -135782 49174 133090 -46122 -86315 49208 16340 -64818 44614
712 44614 84422 -70901 -90255 56534 68119 -17004 -19990 -22800 -34398 43817 67332 -43286
724 -43286 -59212 33351 11144 -29778 54888 39186 -107907 -53431 125002 55705 -103208
735 -103208 -33113 59454 -12090 -18760 60981 -1080 -88008 -1194 76346 12811 -28823 -17717
747 -17717 -32264 9616 77630 3932 -86967 -6837 59709 -12664 -13830 51786 -26068 -92720
759 -92720 43361 111833 -37937 -94855 23362 46189 -15677 12051 21405 -52495 -33442 57321
771 57321 36451 -28266 -19607 -15754 -14350 51077 48847 -62714 -62820 52021 44328 -33193 899
784 899 21819 -51912 -23986 84156 32945 -83053 -34885 52128 20009 -9781 9222 -22063
$$ packed form
701A8554P7496j39631r2201J84956Q3916j79212m0193J35523l2868q1158J09432
712D4614L9808j55323j9354J46789J1585q5123k986k810j1598P8215K3515j10618
724d3286j5926R2563k2207m0922Q4666j5702j47093N4476J78433o9297j58913
735a03208P0095R2567p1544o670P9741o2061q6928Q6814P7540o3535m1634J1106
747a7717j4547M1880O8014p3698r0899Q0130O6546p2373j166O5616p7854o6652
759i2720J36081O8472j49770n6918J18217K2827o1866K7728R354p3900J9053R0763
771E7321k0870o4717Q659L853J404O5427k230j11561j06J14841p693p7521L4092
784H99K0920p3731K7926J08142n1211j15998M8168Q7013l2119k9790J9003l1285
$$ plain form
796 -22063 -38260 30674 49064 -18338 -31929 -1083 -7287 12950 49867 -11264 -74337 1885
808 1885 68612 2425 -37045 7403 -3071 -29983 31714 52720 -37454 -59777 23253 42818
820 42818 -2645 -7294 -10080 -29935 8780 49816 1054 -42342 -7484 12506 1660 23218
832 23218 15693 -46663 -33793 47998 38891 -31005 -23928 8989 -6016 4529 36307 -3894 -50665
845 -50665 -5540 41479 12686 -14064 -9061 -16535 -4948 34649 20199 -32852 -24922 15705 13245
858 13245 4361 10371 -15488 -33640 13204 43102 -2924 -33232 -5312 9188 3824 16042 7090
871 7090 -29590 -19687 25928 23835 -9768 -14609 -7822 -4506 16474 23083 -12846 -30150 2113
884 2113 21351 6555 -1484 -6254 -18344 -2741 27565 13552 -22312 -17487 7410 10334 7328
$$ packed form
796b2063j6197O8934J8390o7402j3591L0846o204K0237L6917o1131o3073P6222
808A885O6727o6187l9470M4448j0474k6912O1697K1006r0174k2323Q3030J9565
820D2818m5463m649k786j9855L8715M1036m8762m3396L4858J9990j0846K1558
832B3218p525o2356J2870Q1791r107o9896P077L2917j5005J0545L1778m0201m6771
845e0665M5125M7019k8793k6750N003p474J1587L9597j4450n3051P930M0627k460
858A3245q884O010k5859j8152M6844K9898m6026l0308K7920J4500n364J2218q952
871G090l6680R903M5615k093l3603m841O787L316K0980O609l5929j7304L2263
884B113J9238j4796q039m770j2090J5603L0306j4013l5864M825K4897K924l006
$$ plain form
897 7328 4657 -13537 -18843 9247 23583 619 -15960 -8072 366 7676 14237 -38 -19927
910 -19927 -9036 14518 12632 -2419 -7734 -8658 -3209 12385 13461 -7893 -16752 -692 10968
923 10968 6969 428 -6810 -10842 647 14492 6873 -10018 -10423 806 7304 7197 631 -9392
937 -9392 -8420 5222 11314 1939 -7541 -6987 -348 6829 7583 -1855 -9902 -4272 6436 7410 176 -5505
953 -5505 -5612 -28 6740 5680 -3345 -7938 -1912 5595 5429 -439 -5149 -4307 1416 5739 3037 -3433
969 -3433 -5450 -869 4350 4299 -682 -4837 -3104 2436 4646 1139 -3255 -3547 -49 3420 3100 -1049
985 -1049 -3985 -1862 2443 3424 460 -2782 -2753 651 3253 1559 -1774 -2276 -531 1211 2316 908
1001 908 -2649 -2617 1725 2918 -419 -1574 -370 -630 228 2513 412 -3189 -819 2463 412 -940
$$ packed form
897G328k671j8194n306K8090J4336k2964j6579P888Q438P310O561j4275j9889
910a9927J0891K3554j886j5051n315r24N449J5594J076k1354q859J6060J1660
923A0968l999o541p238m032J1489J3845p619j6891m05J1229O498j07o566j0023
937i392R72J3642O092r375r480N54O639P177P54r438q047N630J0708R74p234n681
953e505j07N584O768j060r025m593O026P507j66n868m710Q42N723M323k702o470
969c433k017M581N219n1m981m155J733N540K210l507m394k92L498L469l20m149
985a049k936K123M305R81k964l242K9L404K602j694l333n02J745J742J105j408
1001I08l557L2M342J193l337j155J204k60Q58K285k101l601K370L282k051j352
$$ plain form
1017 -940 739 -776 -2056 2013 2656 -2609 -2081 2700 313 -2426 1952 1804 -3856 -758 4699 -717
1033 -717 -4200 2457 2553 -3924 -138 4564 -2319 -3910 4315 2009 -5271 777 4929 -3636 -3167 5795
1049 5795 375 -6470 2911 5474 -5781 -2877 7420 -794 -7253 4577 5209 -7509 -1674 8632
1063 8632 -2512 -7540 6314 4312 -8744 164 8940 -4928 -6773 8553 2516 -10170 2721
1076 2721 9194 -7628 -5707 10752 394 -11195 5489 8741 -10360 -3908 12805 -2114 -11927
1089 -11927 7929 7726 -11983 -1165 13242 -5873 -11115 11530 5869 -14040 1501 12856 -9088
1102 -9088 -8218 14816 1437 -16761 5923 13933 -12125 -6894 15774 -2484 -16010 11291 12382
1115 12382 -16938 -5370 17813 -3792 -13938 12781 6728 -18938 1726 19784 -9510 -14573
$$ packed form
1017i40J679j515j280M069O43n265N28M781k387k739M378j48n660L098N457n416
1033g17l483O657R6o477L786M702o883j591Q225k306p280O048M152q565M69Q962
1049E795n420o845R381K563j1255K904J0297q214o459J1830O32j2718N835J0306
1063H632j1144n028J3854k002j3056Q908Q776j3868j845J5326o037j2686J2891
1076B721O473j6822J921J6459j0358j1589J6684L252j9101O452J6713j4919r813
1089a1927J9856k03j9709J0818J4407j9115n242K2645n661j9909J5541J1355k1944
1102i088Q70K3034j3379j8198K2684Q010k6058N231K2668j8258j3526K7301J091
1115A2382k9320J1568K3183k1605j0146K6719o053k5666K0664J8058k9294n063
$$ plain form
1127 -14573 15128 4345 -17675 7722 16611 -17809 -11624 22762 3096 -21275 7582 14480
1139 14480 -17719 -4790 24051 -4829 -23751 12351 16035 -16704 -2820 17712 -11566 -15176
1151 -15176 22290 8942 -25711 778 21053 -12608 -10564 23532 -1957 -29671 12701 27759
1163 27759 -19621 -17143 22231 562 -21332 16303 17348 -27376 -10232 28615 -94 -20115
1175 -20115 12282 5583 -23215 9398 28386 -20328 -24136 25264 10050 -25031 10011 21507
1187 21507 -28987 -15789 39696 7794 -38163 3009 25675 -15521 -7774 26464 -8532 -30814
1199 -30814 18349 24683 -20449 -7987 17067 -14220 -11121 33746 4161 -42670 4176 37349
1211 37349 -14889 -20447 27281 -813 -37846 18244 41184 -26772 -33276 26108 14414 -19847
$$ packed form
1127a4573K9701j0783k2020K5397Q889l4420O185L4386j9666k4371K8857O898
1139A4480l2199J2929K8841k8880j8922L6102L684l2739J3884K0532k9278l610
1151a5176L7466j3348l4653K6489K0275l3661K044L4096k5489k7714M2372J5058
1163B7759m7380K478L9374k1669k1894L7635J045m4724J7144L8847k8709k0021
1175b0115L2397o699k8798L2613J8988m8714l808M9400j5214l5081L5042J1496
1187B1507n0494J3198N5485l1902m5957M1172K2666m1196P747L4238l4996k2282
1199c0814M9163O334m5132J2462K5054l1287L099M4867k9585m6831M6846L3173
1211C7349n2238n558M7728k8094l7033N6090K2940o7956o504N9384j1694l4261
$$ plain form
1223 -19847 9372 12158 -28751 -5151 35352 -2067 -26090 11130 5014 -21952 18884 30930
1235 30930 -36332 -32237 42398 21676 -37928 -94 28138 -25502 -18323 44758 10837 -48980
1247 -48980 -4299 36147 -3563 -11903 13126 -13029 -20720 28814 20518 -30926 -8417 21873
1259 21873 -14018 -8404 39000 -3269 -55758 10769 56001 -16026 -38987 22161 11794 -30104
1271 -30104 13758 36414 -27729 -35368 26516 22974 -14057 -1053 -1531 -22395 13192 36575 -18671
1284 -18671 -33637 20662 13516 -23463 15564 28765 -41052 -33331 52840 31313 -48100 -18308
1296 -18308 32217 -3823 -14618 26945 3177 -39852 341 35107 490 -13386 -206 -15773
1308 -15773 -3322 39309 7045 -47186 -4829 37663 -7594 -17633 28340 -2219 -49004 13812
$$ packed form
1223a9847K9219K786m0909K3600M0503l7419k4023L7220o116k6966M0836J2046
1235C0930o7262M095P4635k0722n9604L7834K8232n3640P179O3081l3921n9817
1247d8980M4681M0446l9710q340K5029k6155p691M9534q296n1444K2509L0290
1259B1873l5891N614M7404m2269n2489O6527M5232p2027k2961O1148j0367m1898
1271c0104M3862K2656o4143p639O1884l542l7031J3004m78k0864L5587K3383n5246
1284a8671j4966N4299p146l6979L9027J3201o9817P721Q6171k1527p9413K9792
1296a8308N0525l6040j0795M1563k3768m3029M0193L4766l4617j3876J3180j5567
1308a5773J2451M2631l2264n4231M2357M2492m5257j0039M5973l0559m6785O2816
$$ plain form
1320 13812 58671 -15783 -50680 12628 26706 -10821 2846 13118 -24740 -16683 29721 15348
1332 15348 -17254 -4624 -4599 -13834 24382 31884 -33963 -39109 32429 29253 -25365 -4529 20368
1345 20368 -24494 -20805 44610 24140 -46892 -23675 31778 14307 -8399 2957 -10925 -20052
1357 -20052 18211 26733 -13316 -16810 3194 -7014 3724 33849 -3707 -50581 -289 48979
1369 48979 1094 -30688 6774 5852 -22257 13115 37338 -18743 -42091 11886 30925 -537
1381 -537 -7228 -6510 -17806 5823 31821 -590 -27818 -1857 8389 -3938 15738 16976 -32459
1394 -32459 -29684 35062 32772 -25191 -21203 11568 -1319 -3139 24283 3665 -35878 -9567 30118
1407 30118 13188 -10352 -8658 -12435 -3123 26729 15152 -26470 -18363 14485 8106 -8 11812
$$ packed form
1320A3812M4859p4454l4897O3308J4078l7527J3667J0272l7858Q057M6404j4373
1332A5348l2602J2630K5r235L8216P502o5847n146P1538l176n4618K0836K4897
1345B0368m4862L689O5415k0470p1032K3217N5453j7471k2706J1356j3882r127
1357b0052L8263Q522m0049l494K0004j0208J0738L0125l7556m6874N0292M9268
1369D8979m7885l1782L7462r22k8109L5372K4223n6081k3348N3977J9039l1462
1381e37o691P18j1296K3629K5998l2411k7228K5961J0246j2327J9676J238m9435
1394c2459K775O4746k290n7963L988L2771j2887j820K7422k0618l9543K6311L9685
1407C0118j6930k3540J694l777R312K9852j1577m1622Q107L2848o379q114J1820
$$ plain form
1420 11812 -8178 -31502 6738 39969 225 -32340 -4924 12616 1608 8460 8814 -20370
1432 -20370 -19602 18320 22275 -5957 -12934 -7660 -4684 14353 21363 -11529 -27557 3391 19452
1445 19452 2471 -1306 -702 -17006 -7867 26118 17186 -22130 -19513 9136 11353 4225 4031 -10299
1459 -10299 -18397 6888 23270 1720 -15497 -8094 -723 7087 16410 783 -23137 -9847 17953
1472 17953 12871 -5057 -6557 -7339 -6305 12230 18287 -7949 -21912 -1078 14520 7664 -106
1485 -106 -6946 -13171 -476 18080 9132 -12459 -12363 591 7226 9979 3763 -13134 -13875 8030
1499 8030 16707 1088 -10094 -7465 -2136 6875 12984 -28 -16253 -7962 10505 11197 234 -6962
1513 -6962 -9208 -2448 11275 11225 -5947 -13724 -2673 8126 8480 2229 -7744 -11195 1155 13376
$$ packed form
1420A1812j9990k3324L8240L3231l9744l2565K7416J7540j1008O852L54k9184
1432b0370P68L7922L955k8232o977N274K976J9037P010l2892j6028L0948J6061
1445A9452j6981l777O04j6304R139L3985q932l9316K617K8649K217p128j94j4330
1459a0299q098K5285J6382k1550j7217P403P371P810R323j5627k3920J3290K7800
1472A7953n082j7928j500p82J034J8535O057k6236j3963K0834J5598o856p770
1485a06o840o225J2695J8556q948k1591R6J2954O635K753o216j6897p41K1905
1499H030Q677j5619j1182K629N329R011O109j3012j6225Q291J8467O92j0963p196
1513f962k246O760J3723n0j7172p777J1051J0799L54o251r973l451J2350J2221
$$ plain form
1527 13376 6484 -7836 -9757 -1701 6228 9164 1963 -10185 -9533 4729 11507 3153 -6516 -7992
1541 -7992 -2212 6771 9378 -559 -10592 -6168 5509 8828 2440 -5531 -8007 -1406 8065 7631 -2877
1556 -2877 -8968 -3708 4738 7365 2321 -5829 -7772 388 8320 5209 -3903 -7212 -2461 4361 6679
1571 6679 1407 -6339 -6369 1921 7328 3372 -3826 -6144 -1808 4705 5985 -254 -6263 -4157 2666
1586 2666 5659 2369 -3378 -5646 -1103 5280 4817 -1798 -5326 -2331 2505 4501 1970 -3456 -5042
1601 -5042 241 5035 2948 -2025 -3905 -1982 2156 4565 1024 -4277 -3388 1675 3331 1531 -863
1616 -863 -3316 -2445 2877 4493 -913 -4098 -1046 1399 1633 1917 -588 -4084 -1132 4049 2147 -2161
1632 -2161 -1561 -482 -517 2379 2809 -2823 -3862 2111 3019 -1065 -409 532 -2590 -575 4615 831 -4741
$$ packed form
1527A3376o892j4320j921Q056P929K936p201j2148O52J4262O778q354r669j476
1541g992N780Q983K607r937j0033M424J1677L319o388p971k476O601R471m34j0508
1556b877o091N260Q446K627n044q150j943Q160P932l111r112l309M751O822K318
1571F679n272p746l0Q290N407l956p198k318M336O513J280o239o009K106O823
1586B666K993l290n747k268M543O383m63o615l528K995M836J996k531n426j586
1601e042N283M794k087m973j880J923M138K409l541n301Q89N063J656j800k394
1616h63k453Q71N322J616n406l185L052K445K34K84k505l496K952N181j902m308
1632b161O00J079l5K896M30n632j039N973R08m084O56R41l122K015N190l784n572
$$ plain form
1649 -4741 -484 3150 -678 -622 2428 -1680 -3674 3062 3659 -3398 -1991 3026 -846 -2234 3733 1189
1665 1189 -5491 116 5453 -1772 -3742 3486 924 -4751 2017 4903 -4279 -3591 5356 925 -5152
1680 -5152 2301 3723 -5115 -1429 6510 -1351 -6041 4029 3747 -5952 -323 6529 -3285 -5385 6164
1695 6164 2768 -7481 863 6958 -4449 -4591 7099 1039 -7939 2977 6713 -6298 -3601 8183
1709 8183 -585 -7934 4843 5603 -7961 -1701 9114 -2811 -7869 6793 4447 -9176 323 9246
1723 9246 -5209 -6907 8839 2613 -10290 2531 9074 -7276 -5457 10284 301 -10687 5094
1736 5094 8261 -9316 -3556 11296 -2227 -10360 7572 6680 -11006 -1037 11756 -5073 -9433
1749 -9433 10072 4642 -12481 1527 11699 -7491 -7778 11826 1868 -13205 4576 11143 -9842
$$ packed form
1649d741M257L634l828N6L050m108j994O736N97p057J407N017l872j388N967k544
1665A189o680N607N337p225j970P228k562n675O768K886r182O88Q947m431o077
1680e152P453J422q838L686P939p861m690J0070k82r699N629O852r814k100J1549
1695F164l396j0249Q344O095j1407j42J1690o060q978J0916L736j3011K697J1784
1709H183q768p349J2777P60j3564O260J0815j1925n058J4662k346j3623R499Q923
1723I246j4455j698J5746o226j2903J2821O543j6350J819J5741r983j0988J5781
1736E094L167j7577N760J4852j3523q133J7932q92j7686R969J2793j6829m360
1749i433J9505n430j7123J4008J0172j9190k87J9604r958j5073J7781O567k0985
$$ plain form
1762 -9842 -5967 12681 -1012 -12381 7960 9007 -12801 -3234 14211 -3655 -11788 10000 6281
1775 6281 -14208 711 14842 -7367 -11506 12032 4769 -13754 3478 12209 -10876 -7746 15102
1788 15102 1234 -14845 6023 10248 -12311 -2819 15896 -5169 -15365 11610 10403 -15001
1800 -15001 -1970 15019 -7455 -11845 15049 6364 -18150 522 15838 -7457 -8891 13094
1812 13094 -184 -15647 8580 13914 -13945 -7491 15381 -2224 -13226 12441 8480 -19814
1824 -19814 -2347 21594 -4433 -17190 10867 8153 -15879 2154 17876 -10358 -15422 14311
1836 14311 8201 -13656 2252 9699 -12744 -4056 19427 -2020 -19489 8057 12780 -13607 -1704
1849 -1704 17855 -9604 -19143 17408 15968 -19680 -7827 17011 -3428 -11432 14193 5268 -20115
$$ packed form
1762i842L875J8648j3693j1369K0341J047k1808R567J7445j7866q133K1788l719
1775F281k0489J4919J4131k2209m139K3538p263j8523J7232Q731k3085L130K2848
1788A5102j3868j6079K0868M225k2559R492J8715k1065j0196K6975j207k5404
1800a5001J3031J6989k2474m390K6894q685k4514J8672J5316k3295j434K1985
1812A3094j3278j5463K4227N334k7859O454K2872j7605j1002K5667l961k8294
1824a9814J7467K3941k6027j2757K8057k714k4032J8033J5722k8234n064K9733
1836A4311o110k1857J5908P447k2443Q688K3483k1447j7469K7546M723k6387J1903
1849a704J9559k7459r539L6551j440l5648J1853K4838k0439q004K5625q925k5383
$$ plain form
1862 -20115 326 18539 -5090 -9728 9169 -2966 -12086 14618 12365 -21149 -8359 20938
1874 20938 -421 -15484 11972 7857 -22488 -1040 27356 -3811 -24092 7096 13461 -9796
1886 -9796 238 11886 -11531 -11991 16285 8122 -13520 323 5769 -11380 2982 20941 -9473
1899 -9473 -24282 12872 19083 -14312 -6732 15517 -7751 -16783 18599 16714 -21637 -13033 16862
1912 16862 4952 -7547 5693 -1492 -14553 6942 16971 -8318 -10723 7540 -2305 -7040 16736
1925 16736 7433 -26421 -7272 27471 3973 -20387 3580 9328 -13685 317 21982 -5093
1937 -5093 -23718 4897 16782 -2401 -3417 783 -10588 -970 18909 1481 -17924 633 8779
1950 8779 -6880 3488 15754 -13025 -22788 16442 23355 -14234 -15458 10008 1760 -7405 11825
$$ packed form
1862b0115K0441J8213k3629m638J8897j2135r120K6704k253l3514J2790K9297
1874B0938k1359j5063K7456m115l0345K1448K8396l1167k0281L1188O365k3257
1886i796J0034J1648k3417m60K8276q163k1642J3843N446j7149J4362J7959l0414
1899i473j4809L7154O211l3395P580K2249k3268r032L5382j885l8351Q604K9895
1912A6862j1910j2499J3240p185j3061K1495J0029k5289k405J8263r845m735K3776
1925A6736r303l3854J9149L4743k3498k4360K3967N748k3013J4002K1665k7075
1937e093j8625K8615J1885j9183j016M200j1371R618J9879j7428j9405J8557Q146
1950H779j5659J0368J2266k8779r763L9230O913l7589j224K5466q248r165J9230
$$ plain form
1963 11825 7677 -18951 -8882 16505 7759 -6354 -2420 -5920 -5643 14337 12170 -15834 -12489
1976 -12489 11491 4738 -5588 8329 2110 -20861 -2392 26548 4271 -22730 -4181 11527
1988 11527 -177 1060 7681 -9003 -14046 9340 14601 -3620 -7388 -3326 -4871 7045 16303
2001 16303 -6082 -20706 2833 15613 -1386 -3687 4509 -8749 -11031 15667 16793 -14418 -16945
2014 -16945 7375 9697 293 2176 -3807 -12661 2042 16015 2235 -10300 -4564 -1496 2106
2027 2106 12870 4078 -18085 -9725 15053 10044 -6706 -3417 -1399 -7466 4594 16723 -2080
2040 -2080 -19070 -2975 12788 5826 -1292 -3599 -9148 -2567 13171 8428 -9229 -9255 673 3454
2054 3454 6990 6364 -9325 -14511 5847 16049 47 -9638 -3452 -1211 1671 10506 4217 -13339
$$ packed form
1963A1825m148k6628J0069K5387q746j4113L934l500K77J9980k167k8004L345
1976a2489K3980o753j0326J3917o219k2971J8469K8940k2277k7001J8549J5708
1988A1527j1704J237O621j6684n043K3386N261j8221l768M062j545J1916R258
2001A6303k2385j4624K3539J2780j6999k301Q196j3258k282K6698J126l1211k527
2014a6945K4320K322r404J883n983q854J4703J3973j3780j2535N736L068L602
2027B106J0764q792k2163Q360K4778n009j6750L289K018o067J2060J2129j8803
2040b080j6990J6095J5763o962p118k307n549O581J5738m743j7657k6R928K781
2054C454L536o26j5689n186K0358J0202j6002r685O186K241K882Q835o289j7556
$$ plain form
2068 -13339 -9846 8664 10668 -105 -5216 -6869 -3777 8257 11054 -3996 -12038 -2274 5856 5718
2082 5718 3916 -3922 -11735 -1868 13179 7354 -7925 -8339 -465 3528 6755 4513 -7520 -10910
2096 -10910 2895 11540 3398 -5807 -6785 -2951 5022 9758 691 -10626 -6254 5450 7679 2382
2110 2382 -3592 -7906 -3554 8073 9384 -3171 -9994 -3105 4809 6406 3054 -4624 -8929 -951
2124 -951 9299 6308 -4267 -7696 -2840 3963 7491 2643 -7020 -7902 2027 8316 3859 -3624 -6706
2139 -6706 -3291 4732 8149 630 -8028 -5633 3213 6897 3166 -3481 -7070 -2463 6244 7088 -1437
2154 -1437 -7380 -3904 3198 6360 2924 -4398 -7109 -580 6840 5216 -2425 -6364 -3163 3326 6496
2169 6496 1960 -5562 -6077 1178 6294 3665 -2592 -5852 -2775 4013 6332 405 -6020 -4472 2079
$$ packed form
2068a3339L493J8510K004j0773n111j653L092J2034K797j5050q042R764Q130j38
2082E718j802p838p813R867J5047n825j5279m14P874L993L227k242j2033l390
2096a0910J3805Q645q142r205r78L834P973M736r067j1317M372J1704K229n297
2110B382n974m314M352J1627J311j2555o823O889P914J597l352p678m305P978
2124i51J0250k991j0575l429M856O803L528m848r663q82R929O289m457p483l082
2139f706L415Q023L417p519q658K395Q846L684l731o647l589M607Q707Q44q525
2154a437n943L476P102L162l436p322k711O529P420j624p641l939L201O489L170
2169F496m536p522n15P255N116k629o257l260L077O788K319n927o425J548O551
$$ plain form
2184 2079 5412 2878 -2702 -5744 -1941 4777 5380 -866 -5423 -3342 2051 5108 2575 -3448 -5495
2199 -5495 -335 4930 3739 -1309 -4402 -2989 2004 5358 1816 -4420 -4476 1051 4266 2579 -1208
2214 -1208 -4147 -2678 2858 4976 168 -4266 -2819 1038 3397 2744 -1543 -4790 -1356 4024 3257
2229 3257 -1170 -2823 -2037 214 3580 2847 -2823 -4466 543 3544 1530 -586 -2065 -2720 817 4420
2245 4420 1072 -3696 -2143 1164 1455 1687 709 -3229 -2909 2953 3752 -1388 -2494 -169 -265 761 3078
2262 3078 -257 -4390 -623 3666 942 -1340 -142 -1346 -1429 3051 2706 -3259 -2765 2280 1187 -937
2278 -937 1375 -60 -3765 390 4691 -496 -3846 753 1518 -1497 1149 2316 -3084 -2629 3662 1868
2294 1868 -2995 1 1622 -2367 -127 4194 -1047 -4584 1967 3375 -2626 -911 3141 -1771 -3153
$$ packed form
2184B079L333k534n580l042L803O718O03o246m557K081N393L057k533o023k047
2199e495N160N265j191n048l093J413M993L354l542o236n6N527L215j687l787
2214a208k939J469N536K118m808m434J447L857K359o53m287l247L434N380p67
2229C257m427j653P86K251L366p33n670j643N009L001k014k116j479o55L537L603
2245D420l348m768J553L307K91K32r78l938L20N862P99n140j106K325r6J026K317
2262C078l335m133L767M289k724k282J198j204q3M480l45n965M94N045j093k124
2278i37K312j435l705M155M301n187l350M599P65l015K646J167n400M55O291j794
2294A868m863K996J621l989K240M321n241l537O551J408o001J715M052m912j382
$$ plain form
2309 -3153 3792 2507 -4502 -936 3962 -1157 -2408 3288 461 -4546 1407 4383 -2893 -2746 3815
2324 3815 129 -3993 2618 3269 -4674 -1743 5374 -484 -4673 2811 2798 -4638 -351 5278 -2190 -4480
2340 -4480 4096 2353 -5011 530 4713 -3357 -3202 5310 802 -5827 1991 4794 -4375 -2413 5791
2355 5791 -614 -5686 3552 4129 -5566 -1345 6209 -1809 -5165 4621 2785 -6229 407 6229 -3541
2370 -3541 -4527 5830 1557 -6667 1876 5753 -4954 -3409 6776 108 -6852 3251 5071 -5862
2384 -5862 -2054 6959 -1597 -6339 4812 3974 -6820 -557 7075 -3170 -5551 6133 2584 -7560
2398 -7560 1110 7039 -4605 -4708 7012 1157 -7657 2750 6374 -5913 -3339 7608 -586 -7354
2412 -7354 4429 5236 -7097 -1656 7968 -2393 -6695 5958 3682 -8030 295 7953 -4188 -5724
$$ packed form
2309c153O945j285p009L566M898n119j251N696k827n007N953K976p276J47O561
2324C815l686m122O611O51p943K931P117n858m189P484j3p436M287N629p468k290
2340d480Q576j743p364N541M183q070J55Q512m508o629P818K803r169J962Q204
2355E791o405n072R238N77r695M221P554q018l356R786j836r014O636N822r770
2370c541r86J0357m273q224Q543L877j0707J545J0185o668o960J0103J820j0933
2384e862L808R013q556m742J1151q38j0794O263P632j0245k381J1684l549j0144
2398g560Q670N929j1644j03J1720n855q814J0407L624j2287K574J0947q194o768
2412g354J1783Q07j2333N441R624j0361m302J2653k276j1712Q325P658j2141j536
$$ plain form
2426 -5724 7038 1826 -8116 2509 7140 -6219 -4293 8199 179 -8007 4101 5749 -7495
2439 -7495 -2154 8919 -1886 -7977 5377 4777 -7560 -325 7913 -4138 -6339 7327 3105 -8314
2453 -8314 1154 7017 -5374 -3928 8429 13 -9226 3832 7499 -6690 -3512 8146 -1428 -7909
2467 -7909 5904 6008 -8468 -2688 8495 -1497 -6237 5457 2541 -8121 1362 8375 -4622 -5929
2481 -5929 6581 1277 -7215 3984 6436 -8258 -4318 10050 930 -9018 3090 5744 -6918
2494 -6918 -1607 9206 -2107 -8969 4574 5905 -5528 -822 5280 -4528 -4006 8241 1865 -8977
2508 -8977 1180 6694 -4732 -2421 8042 -2087 -9829 5437 9112 -6941 -5582 6852 239
2521 239 -5815 5060 4388 -8272 -2616 8171 279 -4993 2606 178 -5404 4200 6867 -6797
$$ packed form
2426e724J2762n212r942J0625M631j3359J926J2492q020q186J2108J648j3244
2439g495N341J1073j0805o091J3354o00j2337P235Q238j2051k201J3666m222j1419
2453h314R468N863j2391J446J2357q416r239J3058L667j4189L178J1658r574o481
2467g909J3813J04j4476N780J1183r992m740J1694k916j0662R483P013j2997j307
2481e929J2510n304q492J1199K452j4694L940J4368r120r948J2108K654j2662
2494f918N311J0813j1313o862J3543J331j1433M706O102r808N22J2247o376j0842
2508h977J0157N514j1426K311J0463j0129p742J5266L675j6053J359J2434o613
2521B39o054J0875o72j2660N656J0787p892n272P599k428n582R604K667j3664
$$ plain form
2535 -6797 -5939 7105 2192 -5952 3252 4339 -8442 -2939 11144 1601 -10253 219 6297 -2759
2549 -2759 -1156 5409 -3018 -6889 4771 5927 -4067 -2162 2124 -3239 -177 8066 -1016 -10084 1766
2564 1766 8354 -2848 -3599 4798 -1880 -7086 5810 8470 -6799 -7422 5191 3698 -2490 1564
2578 1564 338 -6093 480 7631 -442 -5370 630 268 -1933 5168 3884 -8570 -5245 8579 4367
2593 4367 -5961 -795 2588 -4288 -317 8524 -46 -9687 -692 6992 1051 -1692 -7 -3620 -2104
2608 -2104 6421 3762 -5591 -3234 2273 22 1501 4767 -3532 -8591 3336 9324 -1839 -6219
2622 -6219 843 700 -1501 4499 3560 -6831 -5379 5461 5163 -1611 -2260 -2373 -2301 4184 5937 -3342
2638 -3342 -6539 1063 3357 611 2104 -286 -6948 -1803 8703 3890 -6643 -4011 2242 1350 1881
$$ packed form
2535f797Q58J3044m913q144R204J087j2781N503J4083r543j1854J0472O078r056
2549b759J603O565q427l871J1660J156r994J905M286n363L062Q243r082r068J1850
2564A766O588j1202p51Q397o678n206J2896K660j5269o23J2613j493o188M054
2578A564j226o431O573P151q073m928O000l62k201P101j284j2454L325J3824m212
2593D367j0328N166L383o876L971Q841q570r641Q995P684n941k743J685l613J516
2608b104Q525k659r353K357N507k251J479L266q299n059J1927N988j1163m380
2622f219P062j43k201O000r39j0391J452J0840k98o774o49j13P2O485J753r279
2638c342l197P602K294k746J493k390o662N145J0506m813j0533K632O253q92N31
$$ plain form
2653 1881 3050 -3426 -6533 2004 7007 857 -3774 -2812 -1504 2437 5957 32 -7107 -2527 4573
2668 4573 3073 99 -724 -4043 -3339 5150 6660 -3176 -6993 -143 3795 2377 1347 -1958 -5519
2683 -5519 -685 6411 3484 -3685 -4317 -974 2176 4651 1777 -5363 -5087 2917 5479 720 -2508
2698 -2508 -3099 -2327 2653 6113 160 -6645 -3163 3742 4173 913 -2132 -4289 -1730 4642 4963 -1949
2714 -1949 -5335 -1780 2509 4081 2057 -3317 -5433 273 5698 2924 -2696 -3971 -1696 2021 4738
2729 4738 1717 -4671 -4795 1787 5117 1916 -2380 -3972 -1884 3062 4951 37 -5075 -3173 2160
2744 2160 4215 1874 -2331 -4578 -1230 4309 4199 -1473 -4597 -2072 2109 4000 1802 -3062 -4609
2759 -4609 60 4676 3006 -1931 -4007 -1806 2311 4318 1106 -3945 -3858 1203 4275 2157 -1915
$$ packed form
2653A881J169o476l107Q537N003o150m631R62J308L941L520n925p139M580P100
2668D573j500k974q23l319P04Q489J510r836l817O850L938j418j030l305l561
2683e519M834P096k927p169o32L343L150K475k874p140K76Q004K562m759l228
2698b508n91P72M980L460n953o805L482O905M31l260l045k157K559O372L21o912
2714a949l386L555M289J572k024n374k116N706N425k774n620j275K275L717K717
2729D738l021o388j24O582L330l201m296j592K088M946J889m914n112J902N333
2744B160K055k341m205k247L348N539j10n672l124K525M181J891k198m864j547
2759d609M669M616j670m937k076K201M117K007l212n051Q7N061L072k118m072
$$ plain form
2774 -1915 -3871 -1703 2922 4298 8 -4218 -2916 1575 3826 1941 -2164 -4114 -1012 3623 3521
2789 3521 -983 -3804 -2208 1527 3762 1769 -2835 -4048 116 3883 2550 -1364 -3370 -1889 1885
2804 1885 3878 946 -3380 -3188 869 3380 2108 -1313 -3554 -1654 2741 3650 -287 -3310 -2089
2819 -2089 941 2905 2098 -1559 -3812 -891 3286 2778 -862 -2800 -1905 874 3248 1698 -2521 -3274
2835 -3274 303 2747 1831 -389 -2559 -2361 1431 3795 580 -3137 -2087 770 1928 1778 -250 -3059
2851 -3059 -1902 2408 3010 -448 -2287 -1460 93 2210 2331 -1412 -3427 -108 2667 1277 -414 -1079
2867 -1079 -1945 -249 3201 1844 -2687 -2480 1027 1646 772 368 -1551 -2378 1135 3162 -62 -2270
2883 -2270 -753 115 589 2067 356 -3208 -1401 2807 1580 -1326 -599 -342 -1229 1222 2765 -1158
$$ packed form
2774a915j956K168M625J376m290m226J302M491K251j885m105j950L102M635j02
2789C521m504k821J596L735K235j993m604j213M164L767j333l914k006J481L774
2804A885J993k932m326J92M057K511j272l421k241J900M395R09l937l023J221
2819b089L030J964q07l657k253K921M177n08l640j938Q95K779K374j550m219p53
2835c274L577K444r16k220k170J98L792K364l215l717J050K857J158j50k028k809
2851c059J157M310O02l458j839Q27J553K117J21l743k015L319K775j390j691o65
2867a079q66J696L450j357m531K07L507O19q74m04j919q27L513K027l224k208
2883b270J517Q68M74J478j711l564J807M208j227k906P27K57q87K451J543l923
$$ plain form
2899 -1158 -3206 465 2141 47 -69 -11 -1950 -493 2958 951 -2583 -728 1188 -318 444 1814
2915 1814 -1515 -2868 1821 2879 -1487 -1651 1101 -305 -881 2152 876 -3004 -772 2650 242
2930 242 -1309 745 -340 -1839 1594 2390 -2171 -2042 2064 655 -1675 1180 1155 -2819 -695 3474
2946 3474 102 -3041 690 1672 -1616 19 2317 -1434 -2420 2186 1649 -2249 -135 1808 -1597 -1031
2962 -1031 3001 124 -3438 905 2841 -1840 -1360 2659 -395 -2919 1942 2508 -2820 -1353 2931
2977 2931 -273 -2317 1935 1199 -3073 133 3235 -1463 -2398 2485 783 -3046 1055 2822 -2640
2992 -2640 -1970 3483 420 -3461 1254 2554 -2736 -1142 3506 -548 -3333 2059 2213 -3042 -480
3007 -480 3286 -1411 -2660 2932 1358 -3681 394 3504 -2059 -2347 3319 650 -3726 1245 3221
$$ packed form
2899a158k048L671J676k094j16N8j939J457L451k007l534J855J916j506P62J370
2915A814l329j353M689J058m366j64K752j406n76L033j276l880K232L422k408
2930B42j551K054j085j499L433P96m561J29M106j409k330K855k5l974K124M169
2946C474l372l143L731R82l288J635K298l751r86M606n37l898K114J943l405N66
2962a031M032k877l562M343J936m681M80M019l054k524M861N66n328J467M284
2977B931l204k044M252p36m272L206L102m698r35M883j702l829M101J767n462
2992b640O70N453l063l881M715J300n290J594M648m054k785N392J54n255K562
3007d80L766m697j249N592j574n039M075L110n563k88N666k669m376M971J976
$$ plain form
3022 3221 -2792 -1877 3629 -5 -3522 1910 2503 -3290 -855 3839 -1029 -3357 2676 1961 -3685 -29
3038 -29 3757 -1950 -2903 3423 1269 -3998 702 3526 -2522 -2164 3696 241 -3923 1691 3074 -3199
3054 -3199 -1381 3856 -689 -3540 2617 2309 -3814 -438 4016 -1537 -3132 3198 1526 -4000 519
3069 519 3796 -2351 -2541 3624 686 -3933 1395 3287 -3040 -1782 3873 -202 -3701 2160 2581 -3556
3085 -3556 -818 3975 -1107 -3323 2750 1754 -3729 231 3730 -2179 -2841 3462 1086 -3875 948
3100 948 3304 -2815 -1988 3973 264 -4028 1504 3008 -2872 -1168 3594 -837 -3376 2515 2305 -3347
3116 -3347 -495 3261 -1546 -2318 3308 917 -4112 704 3776 -2137 -2319 3230 263 -3681 1755
3131 1755 3367 -3047 -2218 3399 412 -2840 1570 1662 -3157 -342 3671 -966 -2968 1955 1153 -2715
$$ packed form
3022C221o013R15N506l634l517N432N93n793K435M694m868k328O033p15n646L656
3038b9L786n707r53O326k154n267M700K824o048L58N860l455m164N614J383o273
3054c199J818N237m545k851O157l08o123L376M454n553j595O330j672n526M519
3069E19L277o147j90O165k938m619N328J892o327J258N655m075l499N861M21o137
3085c556K738M793n082k216O073r96n483L960L499n909o62O303k376m961M823
3100I48K356o119Q27N961l709m292N532J504n880J704M762m431k539N891k10n652
3116c347K852L756m807p72N626k391n029M816L072n913j82N549k967l944N436
3131A755J612o414Q29N617k987l252M410R2m819K815M013m637k002M923q02l868
$$ plain form
3147 -2715 1035 2938 -2851 -2572 3779 1461 -3607 294 2629 -2229 -1339 3739 170 -4066 759
3162 759 3156 -1379 -1174 1857 -1048 -2017 2748 1778 -3200 -774 2595 -840 -1211 2734 -170 -4076
3178 -4076 1168 4294 -1667 -3091 1919 858 -2211 1445 2430 -2911 -2329 2995 1496 -1937 16
3193 16 306 -1847 1015 3131 -1669 -3152 1607 1694 -1493 664 1533 -2952 -1779 4142 1802 -3785
3209 -3785 -1203 2298 -210 -454 2009 -732 -3237 1035 3260 -552 -1711 67 -666 2 2843 390
3225 390 -3720 -728 3035 399 -1178 846 -784 -2556 1853 3790 -1744 -3713 907 2142 -174
3240 -174 342 123 -2477 -789 3133 1416 -2137 -1311 64 148 1845 1599 -2649 -2884 2091 2774 -858
3257 -858 -1086 -119 -1370 126 3385 719 -3793 -1574 2541 1662 -311 -518 -1588 -1260 2177 2604 -1287
$$ packed form
3147b715L750J903n789K79O351k318n068L901K335m858Q90N078l569m236M825
3162G59K397m535K05L031k905r69M765r70m978K426L369l435l71L945k904l906
3178d076N244L126n961j424N010j061l069L656R85n341N82N324j499l433J953
3193A6K90k153K862K116m800j483M759Q7l187K157Q69m485J173N921k340n587
3209c785K582L501k508k44K463k741k505M272K225l812j159J778p33O68K841k453
3225C90m110K992L763k636j577K024j630j772M409J937n534j969M620J235k316
3240a74N16k19k600J688L922j717l553Q26J375Q4J697k46m248k35M975O83l632
3257h58k28R67j251J496L259k666m512K219M115q79j973k07j070L28L437M27l891
$$ plain form
3274 -1287 -2543 -230 955 1369 1469 -1283 -3298 252 3589 942 -2124 -1246 -267 199 2120 1574
3290 1574 -2513 -3014 1332 3017 422 -1425 -1599 -1051 1354 2837 -31 -2998 -1431 1380 1825 1001
3306 1001 -782 -2753 -1134 2868 2661 -1377 -2657 -559 1011 1735 1434 -1347 -3126 -190 3172 1795
3322 1795 -1437 -2225 -977 1096 2603 947 -2492 -2482 873 2538 1172 -895 -2266 -1456 1726 3108
3338 3108 -27 -2993 -1666 1175 2085 1157 -941 -2690 -1126 2417 2665 -683 -2672 -1381 975 2352
3354 2352 1357 -1665 -2898 -193 2674 1919 -814 -2266 -1492 1030 2840 1098 -2358 -2594 528 2526
3370 2526 1563 -762 -2378 -1511 1561 2960 365 -2588 -2006 678 2277 1566 -923 -2737 -1136 2174
3386 2174 2544 -289 -2371 -1625 682 2353 1480 -1497 -2773 -349 2324 1936 -485 -2172 -1662 894
$$ packed form
3274a287j256K313J185M14J00k752k015L550L337k647l066Q78R79M66J921n46
3290A574m087n01M346J685k595j847j74N48K405J483k868k967J567K811M45q24
3306A001j783j971J619M002k07m038j280K098J570P24l01k781j779K936L362j377
3322A795l232p88J248K073J507j656l439J0L355J665j366k067j371Q10L182J382
3338C108l135k966J327K841R10r28k098j749J564L543K48l348j989J291K356J377
3354B352r95l022j233K705K867p55k733j452P74K522J810j742l456k36L122J998
3370B526r63k325j616Q67L072J399k595k953N82K684J599p11k489j814J601L310
3386B174L70k833k082P46K307J671q73k977j276K424K673l88k421j687N10K556
$$ plain form
3402 894 2727 1005 -2146 -2327 300 2104 1571 -478 -2273 -1564 1423 2700 371 -2179 -1857 353
3418 353 2095 1667 -875 -2583 -899 1928 2070 -73 -1774 -1709 231 2400 1622 -1532 -2570 -126
3434 -126 1965 1557 -187 -1753 -1699 667 2514 908 -1818 -1943 25 1663 1671 -297 -2336 -1377 1547
3451 1547 2100 -21 -1510 -1359 -181 1619 1886 -748 -2604 -621 1895 1525 -162 -1286 -1496 101
3467 101 2151 1283 -1447 -1865 -19 1225 1371 385 -1708 -1901 997 2452 224 -1628 -987 -52 796
3484 796 1638 266 -2218 -1419 1495 1777 -91 -1054 -1196 -448 1538 1714 -956 -2055 -94 1135 714
3501 714 482 -560 -1968 -284 2423 1103 -1762 -1245 432 500 750 789 -1156 -1843 753 1976 73
3518 73 -1008 -600 -538 549 1839 57 -2213 -560 1612 559 -312 212 -827 -1304 1322 2071 -1050
$$ packed form
3402H94J833j722l151j81K627J804n33k049j795P09K987J277k329k550L22K210
3418C53J742m28k542j708J684K827J42k143j701O5J940K169p78l154j038K444
3434a26K091m08j744j566N4K366J847j606k726j25J968J638Qj968k039R59K924
3451A547N53k121j489J51J178J800K67k634j856J983K516l70j687j124k10J597
3467A01K050q68k730m18J846J244J46r86k093j93K898J455k228j852O41R35Q48
3484G96Q42j372k484P99K914K82j868r63j42P48J986J76k670j099J961J229m21
3501G14k32j042j408J684K707j320k865N17J677O8K50L9j945o87K596J223j903
3518G3j081M08O2J087J290j782k270J653K172j053q71N24j039m77K626P49l121
$$ plain form
3535 -1050 -1982 420 981 43 469 -91 -1650 -219 1883 463 -1251 -315 -3 -388 1094 1164 -1657
3552 -1657 -1623 1494 1296 -1002 -283 496 -1036 -277 1968 318 -2121 -302 1468 60 -306 538 -762
3569 -762 -1036 1352 1222 -1301 -737 904 -238 -356 1396 12 -2130 236 2178 -427 -1449 767
3585 767 336 -1164 722 1406 -1374 -1331 1391 697 -1018 306 423 -1301 88 1818 -549 -1713 882
3602 882 901 -1223 184 1393 -1245 -1374 1818 975 -1847 -226 1418 -733 -740 1513 35 -1809 605
3619 605 1517 -1018 -663 1258 -409 -1224 1386 936 -1861 -323 1862 -482 -1350 1320 579 -1828 275
3636 275 1895 -971 -1420 1409 539 -1547 494 1305 -1363 -757 1790 -30 -1710 823 1109 -1519
3652 -1519 -280 1807 -658 -1671 1366 1056 -1785 -158 1737 -819 -1292 1568 569 -1852 329 1665
$$ packed form
3535a050r32K402N61r38M26n60j559J431K102j420j714R36L12l85J482P0k821
3552a657L4L117j98k298P19P79j532P59K245j650k439J819J770j408l66Q44j300
3569g62k74K388j30k523N64J641j142j18J752j384k142K366J942k605j022K216
3585G67m31j500J886O84k780M3K722o94j715J324J17j724J389J730k367j164K595
3602H82J9k124J407J209k638j29L192q43k822J621J644k151pK253j478j844K414
3619F05R12k535L55J921j667q15K610m50k797J538K185k344q68K670p41k407K103
3636B75J620k866m49K829q70k086K041Q11k668O06K547j820j680K533K86k628
3652a519J239K087k465j013L037l10k841J627J895k556m73K860r99k421K181J336
$$ plain form
3668 1665 -1102 -990 1638 96 -1714 868 1383 -1535 -625 1867 -276 -1660 1137 1078 -1726 -209
3684 -209 1864 -690 -1523 1393 800 -1726 145 1620 -1054 -1112 1637 307 -1810 528 1470 -1286
3700 -1286 -795 1680 -130 -1720 974 1270 -1562 -512 1719 -401 -1484 1206 876 -1692 -76 1719
3716 1719 -716 -1289 1358 552 -1611 350 1533 -1085 -999 1571 240 -1583 650 1271 -1316 -591
3732 -591 1685 -160 -1556 948 1045 -1467 -258 1647 -533 -1405 1216 782 -1544 6 1469 -824
3748 -824 -1103 1348 406 -1514 363 1234 -1066 -641 1472 -117 -1489 784 1091 -1285 -383 1474 -432
3765 -432 -1344 1147 911 -1472 -257 1461 -432 -1015 1094 469 -1391 191 1343 -680 -834 1024
3781 1024 103 -1078 734 937 -1263 -540 1447 -27 -1213 702 723 -1285 -143 1577 -354 -1473
$$ packed form
3668A665k767J12K628j542j810K582N15k918R10K492k143j384K797n9k804J517
3684b09K073k554q33K916n93k526J871J475k674n8K749j330k117K338R42k756
3700a286M91K475j810j590K694K96k832J050K231k120j083K690l30k568J616J795
3716A719k435n73K647q06k163J961J183k618Q6K570j331j823K233O21k587P25
3732e91K276j845j396K504R7k512J209J905k180q72K621m34k326J550J463k293
3748h24k79K451r42j920J877Q71k300M25K113j589j372K273L07k376R02J857j906
3765d32r12K491k36k383J215J718j893n83K109o25j860J582J152k023j54J858
3781A024r21j181J812K03k200P23J987j474j186J915K1k008J142J720j931j119
$$ plain form
3797 -1473 684 878 -898 -114 918 -678 -840 1105 520 -1129 -31 725 -609 -164 1168 -384
3813 -384 -1419 729 1226 -871 -557 908 -292 -893 1054 881 -1349 -651 1209 267 -637 360 58
3830 58 -901 396 1176 -514 -916 473 243 -377 665 394 -1344 -413 1549 356 -1190 -27 479
3847 479 -584 141 1137 -486 -1436 406 1162 -202 -460 12 -475 -79 1120 252 -1202 -348 693 116
3865 116 75 449 -724 -1053 950 1350 -688 -1097 327 331 -73 670 177 -1246 -455 1288 707 -652 -531
3884 -531 -205 -17 825 706 -895 -1079 468 828 99 -39 -381 -963 200 1552 232 -1447 -602 673
3902 673 457 245 111 -868 -870 795 1279 -251 -1061 -423 225 707 774 -442 -1335 -137 1177 620 -351
3921 -351 -545 -606 -17 1202 857 -1033 -1263 415 1102 408 -216 -678 -785 384 1410 322 -1203 -889
$$ packed form
3797a473K157J94j776P84J032j596j62J945n85j649J098P56j334M45J332j552
3813c84j035K148M97k097L14J465j200o01J947j73k230O98J860r42r04R97l02
3830E8r59J297P80j690m02J389k30o20J042k71j738R31J962j193j546J163N06
3847D79j063P25R96j623r50J842P56j364k58M72m87L96J199q68j454Q54J041n77
3865A16m1L74j173l29K003M00k038m09J424Mm04P43m93j423P91J743n81j359J21
3884e31L26J88Q42j19j601j84J547L60p29j38l42n82J163J352j320j679Q45J275
3902F73k16k12j34r79kJ665M84j530q10O38O48M82O7j216q93J198J314n57r71
3921c51j94o1N89J219l45j890k30J678O87o94o24m62j07J169J026j088j525L14
$$ plain form
3939 -889 340 876 691 -250 -1260 -637 1048 1195 -234 -1018 -640 94 960 953 -579 -1554 -252 1283
3957 1283 870 -357 -913 -749 214 1305 733 -1003 -1325 108 1122 803 -180 -1085 -891 652 1481 249
3975 249 -1169 -947 184 970 938 -229 -1409 -705 1082 1320 -97 -1072 -827 127 1147 991 -645 -1538
3993 -1538 -307 1177 1022 -153 -1048 -975 298 1432 693 -1025 -1307 -28 1035 988 -75 -1284 -1040
4010 -1040 716 1508 249 -1116 -1006 1 995 1119 -217 -1550 -768 1066 1320 31 -1012 -961 51
4027 51 1238 1023 -612 -1423 -341 974 1095 166 -1038 -1187 304 1548 607 -978 -1081 -96 791 1042
4045 1042 170 -1250 -1137 670 1446 296 -964 -1013 -136 964 1101 -312 -1382 -599 779 1032 306
4062 306 -736 -1240 -147 1433 1021 -836 -1298 -139 780 845 307 -810 -1214 182 1458 649 -808
$$ packed form
3939h89J229N36j85r41j010O23J685J47j429p84L78P34Q66pj532r75J302J535
3957A283m13j227n56J64R63J091n72j736l22J433J014l19r83r05J94J543Q29j232
3975B49j418K22J131P86l2j167j180P04J787K38j417r75K45R54J020j56j636q93
3993a538J231J484j55j175q95P3J273J134p39j718k82J279J063m7j063j209K44
4010a040J756P92j259j365J10J007R94J24j336j333P82J834K54j289j043N1J012
4027E1J187k15j635q11J082J315J21r29j204j49J491J244r41j585j03R85Q87K51
4045A042q72j420J13J807P76j150j260m9Q77J100J37j413j070P83J378K53p26
4062C06j042n04J093J580m12j857m62J159R19O5n38j117m04J396J276q09j457
$$ plain form
4079 -808 -1075 -247 783 1161 28 -1312 -802 740 1006 236 -412 -917 -568 945 1376 -387 -1507 -372
4097 -372 860 726 197 -486 -1052 -237 1180 877 -602 -1014 -337 443 1004 443 -1086 -1182 557 1209 117
4116 117 -537 -490 -516 292 1327 313 -1418 -846 842 947 123 -386 -773 -422 906 1060 -384 -1002 -242
4135 -242 294 648 738 -453 -1440 -20 1491 445 -866 -429 -40 -111 707 824 -814 -1287 416 1133
4153 1133 145 -418 -509 -557 394 1140 -54 -1143 -251 482 183 388 261 -1037 -847 1157 1124 -795 -887
4172 -887 267 167 90 715 -72 -1191 -135 1124 382 -476 -281 -357 -87 998 559 -1080 -669 772
4190 772 381 -255 356 -133 -1070 214 1458 -92 -1286 -4 647 -94 151 354 -722 -647 817 636
4208 636 -557 -289 75 -342 303 914 -478 -1173 466 944 -427 -296 480 -434 -619 964 720 -1058
$$ packed form
4079h08k67Q28J030L78j133j340N10J542K66p70o48n05L49J513M31j763j120J135
4097c72J232j34n29o83n66Q15J417l03j479m12O77P80N61n61j529r6J739O52j092
4116A17o54M7k6Q08J035j014j731N72J688J05q24n09l87L51J328J54j444o18P60
4135b42N36L54R0j191r87J420J511j046j311M37L89p1Q18J17j638m73J703P17
4153A133r88n63r1m8R51P46j194j089Q92P33k99K05j27j298J90K004l3j919r2
4172h87J154j00p7O25p87j119J056J259p42q58J95p6K70J085m39j639M11J441
4190G72l91o36O11m89r37J284J244j550j194J282O51p41K45K03j076P5J464j81
4208F36j193K68L64m17O45O11j392o95J639M78j371J31P76r14j85J583k44j778
$$ plain form
4226 -1058 -584 822 204 -310 350 -81 -785 363 938 -377 -641 411 38 -380 650 439 -1075 -351
4244 -351 1168 161 -862 213 417 -661 61 981 -353 -1005 449 650 -477 -83 418 -556 -345
4261 -345 870 175 -949 82 661 -432 -188 772 -261 -906 578 862 -714 -453 748 -55 -587
4278 -587 611 417 -881 -111 910 -155 -592 500 167 -713 315 768 -616 -577 796 176 -757 312
4296 312 579 -750 -265 967 -66 -894 389 581 -657 -111 761 -341 -696 666 385 -842 -4
4313 -4 719 -429 -479 739 115 -871 274 753 -574 -427 753 29 -754 442 589 -704 -244 840
4331 840 -116 -712 490 451 -704 -27 795 -336 -632 650 340 -764 67 717 -458 -471 717 129
4349 129 -824 230 665 -538 -369 706 -57 -722 419 538 -681 -244 727 -158 -619 493 340 -732
$$ packed form
4226a058M74J406o18n14O60m31p04J148N75j315k64J052l73m18J030k11j514P24
4244c51J519j007j023J075K04j078P22R20j334o52J454K01j127L94N01r74K11
4261c45J215o95j124J031N79j093K44R60j033o45J484K84j576K61J201q03n32
4278e87J198j94j298P70J021j065m37J092l33q80J028M53j384L9J373o20r33J069
4296C12K67j329M85J232j033q28J283J92j238N46Q72j102l55J362k81j227Q38
4313dP23j148n0J218o24r86J145M79j327J47J180p24p83J196J47j293M60J084
4331H40r56n96J202l9j155O77Q22j131k96J282l10j104Q31O50j175j3J188n88
4349A29r53J054M35j203J69J075p63o65J141J19j219M37R71q85m61J112j53j072
$$ plain form
4367 -732 1 743 -329 -547 576 237 -683 180 647 -492 -407 715 131 -686 240 541 -527 -238 717
4386 717 -78 -630 383 450 -536 -104 627 -227 -487 514 271 -636 34 575 -342 -436 569 131 -678 136
4406 136 564 -419 -332 557 12 -604 222 457 -444 -239 487 -86 -437 363 246 -531 -34 569 -188 -390
4426 -390 446 153 -572 136 610 -331 -444 481 200 -484 144 442 -370 -268 511 105 -438 136 253 -313
4446 -313 13 443 -225 -451 352 290 -395 -8 369 -313 -303 533 213 -633 -122 480 -81 -257 280 -31 -451
4467 -451 152 464 -210 -324 156 19 -102 328 89 -532 -61 547 29 -319 143 48 -339 241 567 -294
4487 -294 -567 264 426 -148 -66 98 -289 -98 516 175 -449 -196 200 63 135 171 -392 -434 374 464 -262 -300
4509 -300 65 -104 1 466 72 -670 -230 557 267 -236 -153 -113 -147 338 428 -269 -516 69 331 199 98
$$ packed form
4367g32P33P42j072k18J123l39r20Q63M67j139Q5J122n84q17R26L01j068K89R55
4386G17p95n52J013O7r86M32P31q54k60J001k43r07O70N41r17r4J005m38q09Q14
4406A36M28r83Q7Q89n45o16Q26K35r01K05P26n73l51Q00j17p77M97O03p57k02
4426c90Q36k93p25P08M74r41j13R25k81o84O28K98q12J02P79m06n43N74J17n66
4446c13L26M30o68k26Q03o2o85L87L77o82J0Q36l20q46N11O02n61j76N37l11m20
4467d51O03L12o74j14M80j37j21M30k39o21M71O08n18l48M62r5l87N80L26q61
4487b94k73Q31J62n74Q2J64l87J91O14l41o24K53L96j37P2L6n63m2Q08R0p26l8
4509c00L65j69J05M65l94p42M40P87k90n03Q3M0l4M85R0o97k47N85K62j32j01
$$ plain form
4530 98 -211 -492 83 669 175 -485 -231 132 140 316 248 -452 -554 358 684 0 -417 -216 -40 265 485
4551 485 -7 -665 -296 414 420 -5 -267 -468 -143 586 502 -401 -628 21 359 286 161 -303 -654 42 785
4572 785 317 -518 -491 7 333 464 143 -548 -536 345 688 144 -362 -451 -168 481 679 -124 -781 -264 468
4593 468 502 129 -301 -617 -174 719 630 -377 -758 -132 412 483 185 -470 -722 63 799 385 -442 -622 -232
4614 -232 385 683 106 -761 -589 354 692 223 -307 -603 -308 565 837 -96 -882 -355 435 603 248 -323
4634 -323 -712 -162 774 687 -274 -744 -308 370 730 330 -633 -784 171 803 377 -298 -594 -426 336 923
4654 923 199 -891 -700 373 737 260 -310 -697 -397 536 848 -58 -824 -515 240 723 468 -482 -944
4673 -944 -100 848 549 -276 -554 -409 116 828 549 -657 -943 157 882 420 -273 -596 -421 367 879
$$ packed form
4530I8l09k81N75N86m94o60K54L63QJ76o8p00j02R12L26o84m17K01J76L05K20
4551D85m92o58L69P10Om25k62k01L25P29q4r03k27O49L38p3j25m64l51O96P43
4572G85m68q35K7M98L26J31l21o91J2Q81L43n44n06q9K83O49J98q03o57N17P32
4593D68L4l73m30l16M43Q93q9j007l81O26N44P1k98o55k52P85P36m14q27j80L90
4614b32O17K98n77q67J72R43L38m69n30k96K95Q73K72r33p86N27P90J68l55n71
4634c23l89N50R36q7r61m70M36O78L60m00r63j51R55O32m26o75k96J68P62N87
4654I23p24j090J91J073L64m77n70l87L00R33L12r06p66L09P55M83k55r50m62
4673i44Q44R48k99q25k78J45N25P12k79j206k86J100P25m62o93l23J75P88N12
$$ plain form
4692 879 202 -721 -635 132 654 578 -180 -958 -450 817 805 -265 -666 -316 68 530 666 -280 -1105 -261
4712 -261 882 656 -260 -666 -479 200 836 368 -664 -710 61 533 522 81 -763 -769 548 1124 -33 -870
4732 -870 -342 232 352 532 82 -840 -547 690 855 -87 -639 -474 81 752 575 -512 -833 74 573
4751 573 302 103 -344 -801 -4 1115 447 -921 -692 349 472 251 97 -532 -684 326 891 89 -609
4770 -609 -493 -83 541 735 -230 -1037 -151 801 344 -178 -112 -423 -396 720 923 -537 -1029 145 737 244
4790 244 -46 -294 -567 37 845 298 -528 -411 -40 222 635 263 -881 -653 731 711 -337 -332 -14 -303
4810 -303 94 862 84 -1050 -329 741 391 -172 -200 -429 -206 652 519 -508 -521 148 128 231 462 -307
4830 -307 -936 220 1058 -13 -724 -21 165 -144 393 488 -601 -681 517 657 -141 -231 -180 -295 319 693
$$ packed form
4692H79o77r23Q6P67N22p6p58p78N08J267j2j070m01L50L84M62J36r46q25Q44
4712b61J143k26r16m06J87O79O36m68j032m6P71M72j1m41q44oJ317N76j157q37
4732h70N28N74J20J80m50r22K93J237J65r42n52J65N55O71j77j087l21R07M99
4751E73k71j99m47m57P97J119o68j368K29J041J23k21j54o29j52J010N65q02o98
4770f09J16M10O24J94r65q07Q86R52m57n22O6l11K7J116K03j460m92J174N92m93
4790B44k90k48k73O04Q08n47q26J17L71K62M13l72j144K28J384k0j048NL18k89
4810c03L97P68p78j134P21J070l50n63k8k29K23Q58j33j027j3O69k0J03K31p69
4830c07o29J156Q38j071p11P03J86l09N37R5j089q0J198J40p98r0N1j15O14L74
$$ plain form
4850 693 -232 -724 124 390 -74 162 201 -650 -433 842 522 -727 -405 381 31 -68 423 -109 -737 86
4870 86 708 -37 -376 7 -149 -89 561 228 -713 -253 600 132 -252 244 -36 -585 230 818 -239 -697
4890 -697 226 403 -199 103 264 -452 -278 602 277 -472 -68 201 -200 102 492 -306 -632 353 505 -368
4910 -368 -170 311 -264 -307 567 255 -693 -166 541 -38 -276 255 -29 -467 236 511 -347 -355 339 52 -271
4931 -271 313 202 -543 -79 636 -22 -461 239 217 -366 130 508 -288 -436 411 317 -394 19 316 -294 -168
4952 -168 502 42 -531 115 373 -283 -158 387 -136 -400 318 310 -472 -172 411 -124 -335 321 157 -497 21
4973 21 490 -209 -366 353 151 -374 125 372 -318 -229 447 84 -403 162 316 -318 -99 459 -95 -394 297
4994 297 299 -365 -53 401 -159 -308 361 171 -423 17 396 -189 -264 325 56 -398 136 337 -322 -226 369
$$ packed form
4850F93r25m92Q48K66m64K36L9q51K17J275l20j249L22P86l50r9M91n32o28Q23
4870H6O22p45l39L83j56O0O50l33r41M60Q53m68l84M96k80n49Q15N88j057m58
4890f97R23J77o02L02J61p16J74Q80l25p49M04K69m01L02L90p98l26R85J52q73
4910c68J98M81n75m3Q74l12r48N27P07n79k38N31k84m38P03K75q58qO94k87l23
4931b71N84j11p45M64P15o58m39P00k2n83M96L78p96j48Q47r4p11M13K97o10J26
4952a68O70m60n73O46K58o56J25N45n23k64P18qp82L00N83n35k11O56j64o54N18
4973B1M69o99j57P19k02n25M99K47o90Q9O76l63m87N65J54o34K19N58n54k99O91
4994B97Ko64L12M54n60j49O69j90n94M40L79n85p5N89k69m54N34K01o59R6N95
$$ plain form
5015 369 0 -357 181 243 -366 -111 412 -81 -369 214 210 -309 -29 328 -195 -281 313 172 -344 33 307
5036 307 -184 -162 364 45 -363 144 346 -223 -146 337 -16 -303 218 267 -316 -120 323 -39 -261 189 138
5057 138 -307 -2 313 -125 -236 219 57 -315 88 253 -235 -225 285 46 -307 116 238 -248 -124 292
5077 292 34 -284 116 195 -187 -24 267 -92 -232 182 147 -203 27 219 -159 -143 293 76 -305 34 276
5098 276 -109 -125 240 -16 -284 85 295 -132 -165 144 4 -109 172 97 -269 -82 225 -15 -146 85 -37
5119 -37 -244 133 280 -186 -289 172 140 -148 56 111 -253 -145 324 151 -260 -88 111 -10 61 176 -145
5140 -145 -245 172 258 -57 -68 23 -139 31 360 55 -386 -81 289 88 -81 56 -109 -235 197 365 -127
5161 -127 -365 19 160 75 107 -89 -344 -45 340 125 -198 -125 -78 -27 246 236 -339 -394 205 360 -22 -97 -72
$$ packed form
5015C69l69l57N38O2o09K55N23m93k88N83mn19K80L57n23q6N94j41n16L77K74
5036C07m91K2N26l19m08N07K02n69P7M83l53k87N21M9n83J96M43l62k22M50n1
5057A38m45L05L15m38j11M55j62l72M03J65m88J0N10k39l53M23J22m86J24M16
5077B92k58l18M00P9l82J63K91l59j40M14l5l50K30J92l78J6M36k17l81L39K42
5098B76l85j6L65k56k68L69K10m27l3L09j40j13K81p5l66J87L07k40j31K31j22
5119c7k07L77J47m66j03M61l2k88K04N5l64J08M69j73m11J72J99j21P1J15l21
5140a45j00M17Q6l15j1R1j62J70L29l05m41L05L70k01j69J37j65j26M32J68m92
5161a27k38L84J41q5L2j96k55K99L85k15l23P3M7N1K73j0n75n5N99J55l82p5K5
$$ plain form
5184 -72 -200 39 444 127 -438 -244 239 256 85 -49 -284 -210 322 406 -126 -321 -84 78 230 301 -136 -527
5206 -527 -66 489 215 -239 -226 -153 -17 356 292 -346 -508 86 411 159 -147 -321 -289 181 485 55 -476
5227 -476 -292 115 270 297 -47 -532 -306 468 521 -165 -407 -151 61 346 400 -155 -606 -113 561 413 -122
5248 -122 -365 -303 110 552 294 -434 -476 43 394 354 24 -493 -499 294 688 59 -546 -328 52 292 401 4
5270 4 -622 -429 446 611 -26 -466 -385 24 496 437 -286 -630 -116 428 412 94 -376 -596 77 802 367 -552
5292 -552 -534 97 380 376 122 -492 -583 236 786 209 -498 -503 -25 525 565 -155 -718 -282 432 463 98 -297 -617
5315 -617 -229 697 679 -442 -814 -51 503 349 73 -355 -614 -33 750 444 -428 -638 -166 416 666 71
5335 71 -743 -505 455 616 74 -233 -404 -361 402 889 -24 -936 -372 593 546 39 -306 -519 -159 609 601 -254
$$ packed form
5184g2j28K39M05l17n65J94M83J7j71j34k35P4N32Q4n32j95K37J62J52P1m37l91
5206e27M61N55k74m54J3P3J36L73o4o38j62N94L25k52l06j74L2M70L04m30n31
5227d76J84M07J55K7l44m85K26P74N3o86k42K56K12K85N4n55m51M93O74j48n35
5248a22k43O2M13M42k58p28m2N19L51m0l30n17oP93L94o29o05K18L80K40J09l97
5270Do26J93Q75J65o37m40Q1M09M72n9p23l44N14N44j6l18m70k20O73P25m35r19
5292e52J8O31K83mk54o14r1Q19N50n77p07nM78N50M0p20n63M36P14L1l65l95l20
5315f17L88R26j8j121l72P63N54j54k76m28k59N81P83l06q72k10M72N82K50n95
5335G1q14K38R60J61n42l07j71M3P63M87r13r12N64R65m7n07l45k13L60P68qq55
$$ plain form
5357 -254 -666 -270 284 654 303 -644 -800 279 819 133 -431 -339 -242 83 722 339 -824 -769 436 777
5377 777 82 -411 -459 -213 456 642 -108 -655 -306 233 487 435 -285 -880 -116 959 489 -535 -457 22
5397 22 95 365 497 -345 -870 62 875 339 -412 -485 -219 347 687 63 -689 -370 292 349 275 19 -678 -548
5419 -548 663 883 -365 -834 -19 320 186 296 -49 -720 -301 697 580 -297 -538 -259 187 624 298
5438 298 -619 -569 320 483 88 43 -230 -601 163 989 176 -900 -344 497 319 46 32 -387 -457 416 691
5459 691 -99 -544 -245 83 415 471 -319 -793 67 676 104 -263 -81 -276 -251 596 597 -611 -764 319 560
5480 560 24 -102 -201 -399 118 646 94 -508 -232 119 201 408 86 -664 -333 650 471 -369 -213 64 -162
5501 -162 140 635 -86 -784 -63 662 186 -224 -100 -224 -104 463 319 -439 -362 169 162 96 205 -281 -554
$$ packed form
5357b54m12L96N54L70l51r47j56J079N40o86n64R2R7L25O39l83j163N5J205L41
5377G77o95m93m8K46O69J86p50n47L49N39K54n2p20n95P64J075m70j024P8M79
5397B2P3K70J32q42n25R32Q13n36p51p3K66N66L40o24p52L19O62N7p4k56o97J30
5419e48J211K20j248m69Q15L39j34J10l45o71M19R98j17q77k41K79M46M37l26
5438B98r17N0Q89J63l95m5k73l71P64Q26q13j076N56Q41j78k73j4m19p0Q73K75
5459F91p90m45K99L28L32N6p90m74Q60O09n72l67J82j95K5Q47Jj208j53J083K41
5480E60n36j26r9j98N17N28n52o02K76L51Q2K07l22p50L31R83j79q40J56K77k26
5501a62L02M95p21o98P21P25m76m10J24j24J20N67j44p58P7N31po6J09m86k73
$$ plain form
5522 -554 259 670 -173 -515 45 106 -100 274 250 -534 -397 502 400 -279 -180 -9 -119 188 434 -186 -475
5543 -475 146 348 -35 48 82 -367 -136 577 236 -538 -169 320 -7 -36 263 -117 -477 189 478 -128 -303
5564 -303 68 -2 -57 279 82 -430 -110 383 47 -216 77 -35 -290 203 387 -290 -415 259 215 -190 34
5585 34 154 -272 -122 409 118 -378 -21 238 -83 20 231 -148 -300 271 279 -226 -96 206 -84 -108 319
5606 319 69 -387 0 367 -79 -210 182 20 -261 129 277 -248 -238 241 64 -192 73 99 -271 -37 307
5627 307 -80 -294 135 146 -207 -3 236 -146 -232 268 141 -278 -8 235 -118 -127 244 29 -269 99 265
5648 265 -138 -115 214 12 -191 171 145 -233 -60 280 -29 -190 140 103 -231 27 253 -128 -233 188 128
5669 128 -238 19 168 -172 -122 235 27 -271 56 199 -149 -87 212 -36 -227 155 170 -204 -94 215 -22
$$ packed form
5522e54Q13M11q43l42N60O1k06L74k4p84J37Q99j02o79R9J71j10L07K46o20k89
5543d75O21K02l83Q3L4m49K31P13l41p74L69M89l27k9K99l80l60O66K89o06j75
5564c03L71p0n5L36j97n12L20M93l36k63K93j12k55M93J84o77j25O74m4m05K24
5585C4J20m26J50N31k91m96L57K59l21J03K11l79j52N71Qn05J30L02k90k4M27
5606C19k50m56L87L67m46j31L92j62k81L90J48n25J0M79j77k56K65K6l70K34L44
5627C07l87k14M29J1l53K04K39l82q6N00j27m19K70K43l53rL71k15k98L68J66
5648B65m03K3L29k02k03L62k6l78J73L40l09j61L30l7l34K58K26l81j05M21o0
5669A28l66K57J49l40N0L57k08k98L27J43l48O2K99k48j91L82J5l74J10L09k37
$$ plain form
5690 -22 -157 176 86 -210 4 250 -67 -151 165 83 -167 82 199 -159 -124 218 67 -181 88 145 -184 -77
5712 -77 227 3 -214 75 152 -129 -50 173 -72 -191 112 96 -156 -35 110 -103 -116 175 18 -218 35 161
5734 161 -112 -97 165 -17 -193 97 198 -129 -105 174 23 -140 130 136 -161 -49 173 18 -84 98 27 -143
5756 -143 62 175 -106 -150 140 51 -124 84 115 -211 -107 216 53 -219 -25 110 -94 -24 146 -67 -220
5777 -220 54 144 -37 -53 24 -125 -43 201 38 -234 -47 137 -23 -15 129 -88 -226 142 310 -93 -223 48
5799 48 82 -25 135 73 -211 -97 227 120 -62 -46 -74 -68 202 195 -200 -235 124 147 -36 26 -15 -276 -47 351
5823 351 105 -340 -180 130 75 59 62 -207 -232 154 296 -19 -189 -118 -63 153 300 -83 -395 -64 290 136
5845 136 -65 -35 -171 -137 303 360 -213 -395 63 262 139 56 -131 -288 26 388 150 -232 -219 -35 124 296
$$ packed form
5690b2j35L33r0k96K14K46l17q4L16q2k50K49J17l58L5L42j51k48K69N7l29J07
5712g7L04k24k17K89P7k81P9K23k45j19L03j6k52J21J45k13j3K91j57k36K53J26
5734A61k73J5K62j82j76K90J01l27K4K79j51j63K70Ok97J12K22j55j02J82p1j70
5756a43K05J13k81m4K90q9j75K08L1l26J04L23j63k72J94J35k04P0J70k13j53
5777b20K74R0j81j6P7j49Q2K44j63k72J87J84j60QJ44k17j38L68J68m03j30K71
5799D8L4j07J60o2k84J14L24j07j82J6k8OK70pl95l5L59K3j83O2m1k61K29L98
5823C51k46m45J60L10n5j6Lk69k5L86J42l15j70P1N5K16J47l83l12L31L54j54
5845A36k01L0j36L4M40N7n73j82M58J99j23q3j87j57L14L62k38l82J3J84J59J72
$$ plain form
5867 296 91 -397 -306 274 330 -43 -154 -170 -161 177 429 -42 -544 -175 341 248 2 -182 -308 -106 382 338
5889 338 -228 -385 -64 202 327 172 -340 -435 156 538 108 -256 -193 -112 127 458 171 -498 -393 295 464
5910 464 46 -255 -303 -150 311 450 -79 -478 -237 204 352 203 -280 -568 -37 552 280 -315 -346 -108 97
5931 97 373 273 -389 -609 113 613 217 -317 -382 -145 264 492 79 -489 -363 192 430 296 -145 -581 -238
5952 -238 576 578 -243 -516 -77 193 307 325 -138 -649 -177 630 499 -270 -527 -208 256 502 155 -448 -464
5973 -464 77 389 281 -50 -507 -473 338 768 -33 -715 -287 292 301 195 -31 -500 -385 423 681 -59 -597
5994 -597 -345 219 578 299 -402 -578 62 495 270 -37 -301 -481 57 804 392 -688 -639 312 542 133
6014 133 -111 -326 -407 170 679 192 -572 -501 85 514 416 -253 -716 -166 560 340 -174 -244 -295 -188 490 647
$$ packed form
5867B96k05m88R1N80N6l73j11j6RL38K52m71n02L69N16r3k46j84j26K02M88m4
5889C38n66j57L21K66J25j55n12r5N91L82m30l64O3Q1K39L31k87o69J05O88J69
5910D64m18l01m8J53M61J39n29l99K41M41J48j49m83k88N31N89k72n95l1K38K05
5931I7K76j00o62k20P22N00l96n34o5K37M09K28m13n68J26N55K38j34m41m36L43
5952b38Q14Kq21k73M39K70J14J8m63n11M72Q07j31p69k57L19M64K46l47o03j6
5973d64N41L12j08l31m57L4Q11M30q01o82M28N79Rj06k26m69J15Q08K58p40n38
5994e97K52N64L59k79p01j76O40M33k25l07k64j80N38P47m12j080M9R51K30m09
6014A33k44k15q1N77N09m87p64P1N86M29r8o69m63N50P26k20n14p0n1J07O78J57
$$ plain form
6036 647 -366 -897 10 723 277 -236 -293 -273 40 548 355 -384 -544 -22 432 490 1 -661 -411 549 637
6057 637 -142 -406 -136 -44 203 562 55 -800 -396 642 600 -209 -460 -262 57 416 354 -288 -541 -102 313
6078 313 390 134 -458 -636 199 800 85 -642 -276 140 103 258 253 -435 -628 290 749 32 -509 -295 53
6099 53 368 411 -124 -524 -146 351 301 122 -124 -494 -160 673 486 -500 -555 192 309 102 117 -129 -530 -55
6121 -55 627 288 -429 -415 -4 293 372 -1 -507 -281 331 328 -26 -113 -267 -328 281 624 -143 -708 -62 479
6143 479 164 -62 -25 -257 -187 394 437 -214 -402 -40 229 288 148 -295 -401 195 466 4 -221 -71 -117 -8
6165 -8 444 215 -540 -376 381 340 -141 -156 -96 -185 130 398 -69 -443 -98 199 163 98 -126 -389 -66 434 170
6188 170 -318 -167 80 -41 126 272 -183 -464 149 470 -9 -227 -21 -30 19 293 141 -314 -187 217 167
$$ packed form
6036F47j013n31R07P13m46n13n7K0L13N08j93p39j60N22M54N8m89o62K50R60Q8
6057F37p79k64K70R2K47L59n07q55M04J038m2q09k51J98L19L59o2o42k53M39M15
6078C13P7k56n92j78Q35O01p15p27L66M16l7J55no88j93R18M59p17n41K14L48
6099E3L15M3n35m00L78M97n0j79k46l70L34Q33j87r86n5P47J17k07J5k46m01M75
6121e5O82l39p17J4M11K97P9l73n06K26O12ll54q7j54o1O09L43p67n65O46N41
6143D79l15k26L7k32P0N81M3o51j88L62K69N9j40m43j06N96K71m62k25J50m6J09
6165hM52k29p55J64P57m1m81j5O0q9L15K68m67l74L45K97l6o5k24k63L23N00k64
6188A70m88J51K47j21J67J46m55k81O13L21m79k18K06rM9K74j52m55J27M04n0
$$ plain form
6209 167 -4 1 -123 -195 243 339 -169 -290 94 128 -33 126 69 -326 -119 358 156 -273 -117 90 -47 77
6231 77 195 -163 -281 124 225 -94 -93 27 -123 -10 280 44 -327 -67 256 3 -67 123 -66 -205 187
6252 187 286 -158 -196 144 92 -55 119 40 -227 -38 286 18 -210 33 75 -104 75 174 -159 -191 177 131 -142
6275 -142 -22 82 -139 -56 196 -33 -277 26 194 -95 -95 115 -56 -165 146 161 -166 -104 183 26 -103 103
6297 103 36 -177 27 221 -69 -120 137 85 -119 57 155 -135 -93 202 81 -166 49 148 -106 -52 190 -29
6319 -29 -183 73 145 -112 -70 124 -43 -108 131 57 -194 -34 167 -48 -116 99 13 -163 50 187 -111 -138 127
6342 127 47 -112 45 91 -141 -36 191 12 -150 68 121 -89 0 162 -67 -136 143 139 -125 -35 134 -48 -60
6365 -60 168 49 -161 11 142 -45 -74 98 -26 -140 93 133 -147 -90 129 4 -123 81 83 -173 -61 165
$$ packed form
6209A67j71Nj24p2M38R6n08j21L84L4j61J59n7l95K07M77k02m29J56K07j37J24
6231G7J18l58j18M05J01l19JJ20j50J13K90k36l71K60L23k53p0J90j89j39L92
6252A87R9m44l8L40n2j47J74p9k67J89L24k68k28K43M2j79J79R9l33l2L68m6k73
6275a42J20J04k21Q3K52k29k44L03J68k89%K10j71j09L11J5l27O2K87j57j29K06
6297A03o7k13K04J94k90n1K57n2k04J76R8k90M2K95j21k47K15R9k54N4K42k19
6319b9j54K56P2k57M2J94j67o5K39p4k51J60K01k15o8K15q6j76K13J37k98k7K65
6342A27q0j59J57M6k32J05K27j79j62K18N3k10Q9J62k29o9K79mk64R0J69j82j2
6365f0K28j19k10J72J31j87k9J72j24j14K33M0k80N7K19j25j27K04Kk56J12K26
$$ plain form
6387 165 5 -148 39 67 -89 16 126 -43 -84 100 42 -92 45 75 -126 -36 190 25 -171 47 137 -85
6409 -85 -12 166 -16 -141 73 157 -64 -66 66 -26 -41 126 32 -132 -13 73 -46 -6 104 -76 -184 101 163 -127
6433 -127 -130 91 2 -120 92 93 -173 -113 155 86 -87 -17 -11 -70 83 132 -92 -112 97 69 -40 87 23 -213 -30
6458 -30 270 74 -202 -25 117 -13 26 128 -58 -196 67 222 0 -110 -57 -54 55 183 -18 -228 -44 163
6480 163 15 -4 30 -148 -177 180 228 -167 -247 41 84 27 75 -15 -246 -59 250 131 -137 -122 -42 39 232 114
6504 114 -212 -192 175 201 26 2 -85 -175 89 378 13 -331 -91 191 128 59 -11 -220 -162 236 269 -107 -256
6527 -256 -91 59 161 163 -185 -339 21 287 91 -119 -151 -166 6 324 150 -355 -310 167 255 59 -59 -167
6549 -167 -212 122 396 44 -326 -206 120 234 181 -67 -344 -118 312 276 -80 -209 -161 -13 319 336 -217 -458
$$ packed form
6387A65j60j53J87K8j56J05J10j69m1J84n8j34J37L0k01R0K26j65j96K18R0k22
6409h5P3J78j82j25K14Q4k21kJ32r2j5J67r4j64J19Q6j19M0J10j80j08K85O2k90
6433a27lK21q9j22K12Jk66O0K68o9j73P0On9J53M9k24k0K09k8j09J27o4k36J83
6458c0L00j96k76J77J42j30L9J02j86j38K63J55k22j10N3LJ09J28k01k10J84K07
6480A63j48j9L4j78k9L57M8l95q0K88M3n7M8r0k31J87L09j19k68J5Q0Q1J93j18
6504A14l26K0L67K6j75k4q7r0K64K89l65l44K40K82o3o9p0k09N8L98L3l76j49
6527b56J65J50J02Kl48j54L60K66j96k10l2j5J72L18j74n05M5M77Q8j96j18j08
6549a67m5L34K74l52l70J20L26J14n3k48k77K26M30l6l56j29M8J48L32J7n53k41
$$ plain form
6571 -458 37 412 145 -130 -169 -211 7 356 215 -320 -383 35 290 218 -79 -390 -238 260 374 -26 -290
6592 -290 -180 -39 200 382 -33 -542 -216 453 360 -138 -266 -138 6 297 328 -143 -436 -108 338 355 14
6613 14 -366 -345 187 508 93 -342 -220 22 146 330 144 -431 -459 309 587 -25 -423 -241 54 230 260
6634 260 -82 -435 -248 231 366 109 -317 -467 5 554 284 -398 -394 98 193 162 179 -200 -518 2 662 302
6656 302 -413 -393 81 344 301 -6 -359 -240 190 362 158 -152 -416 -206 457 532 -222 -608 -31 394 169
6677 169 7 -104 -356 -231 439 495 -247 -582 -98 371 352 -7 -393 -311 154 365 111 -155 -300 -266 192
6698 192 577 70 -650 -332 443 401 -78 -172 -167 -168 212 485 24 -510 -253 299 439 123 -327 -393 84 478
6720 478 163 -239 -215 -129 30 408 293 -391 -588 213 581 46 -342 -211 -41 112 318 116 -382 -359 143
$$ packed form
6571d58M95L75k67k75l9m2K18L49j41n35o3M18K55p2k97l11J52M98J14m00k64
6592b90J10J41K39J82m15n09L26O69r3m98j28J28J44K91L1m71k93L28M46J7l41
6613A4l80K1N32L21m15m35J22K42J24J84j86n75k8P68K78o12l98J82K95J76L0
6634B60l42l53J87M79J35k57m26j50M72N49k70o82MM92R5l1J7l79l18N20O60l60
6656C02p15K0M74K63m3l07l53J19M30J72k04l10k64K10O63P5p54l86N77M25k25
6677A69j62j11k52J25O70N6p42l35M84M69j9l59l86Q2M65K11k54k66j45L4M58
6698A92L85n07p20L18P75m2m79r4NjL80K73m61n34K57N52J40l16m50o6M77L94
6720D78l15m02K4Q6J59L78j15o84j97Q01L68n35l88J31J70J53K06k02m98K3N02
$$ plain form
6741 143 397 196 -221 -465 -75 464 309 -244 -320 4 90 183 278 -116 -531 -69 553 306 -321 -315 24 177
6763 177 246 125 -228 -327 77 349 201 -105 -335 -213 293 458 -87 -460 -98 203 132 69 8 -333 -273 316
6785 316 421 -181 -414 -95 176 190 95 -185 -310 -1 301 162 -80 -195 -198 71 409 153 -393 -257 229
6806 229 272 -17 -25 -97 -201 115 422 60 -357 -153 189 216 101 -67 -250 -68 292 219 -139 -171 -65 -15 192
6829 192 223 -190 -379 72 324 28 -154 -79 -114 -25 239 137 -283 -234 135 180 42 -30 -142 -178 166 283 -76
6852 -76 -214 -15 76 55 175 21 -277 -75 295 152 -146 -88 3 -10 142 184 -123 -231 104 217 15 -54 -24
6875 -24 -115 26 229 52 -249 -99 126 39 -15 39 -132 -152 132 175 -115 -165 23 22 7 114 -6 -215 -29 222
6899 222 25 -134 -17 14 -44 86 141 -106 -146 114 135 -33 4 7 -68 44 190 3 -148 20 115 -18 15 68
$$ packed form
6741A43K54k01m17k44L90N39j55n53p6L24Q6R3R5l94m15M62O22k47o27OL39J53
6763A77O9j21l53r9M04K72j48l06k30J22N06J65n45l73L62L01p1o3o1l41O0N89
6785C16J05o02k33L19K71J4r5k80j25L09L02j39k42j15lK69L38k56n46J36M86
6806B29M3k89qp2j04L16L07l62m17K04L42K7j15j68j83J82L60p3l58l2J06N0K07
6829A92L1m13j89M51K52k96j82P5l5Q9K64j02m20M9L69M5j38p2j12l6L44J17l59
6852g6j38J99R1k1J20j54k98K02L70j43k98N8R1j3J52M2l07j08L35J13k02o9L0
6875b4r1J41K03j77l01J50K25q7n4N4j71k0K84M3k90n0J88jj5J07j20k09J86K51
6899B22j97j59J17L1n8J30N5k47m0K60K1j68L7Lp5J12J46j87j51J68R5j33L3N3
$$ plain form
6923 68 -81 -112 152 145 -120 -89 82 9 -40 88 8 -156 -17 127 -34 -99 8 -20 -56 74 62 -148 -60 139
6947 139 12 -121 34 40 -110 16 146 -19 -151 56 113 -56 -37 81 -29 -44 110 60 -88 3 83 -16 -19 92
6971 92 -10 -105 68 129 -86 -65 99 14 -72 56 57 -124 -60 128 -11 -117 16 19 -83 -15 79 -98 -91 91 32
6996 32 -112 -7 59 -76 -32 134 11 -124 26 107 -46 -37 91 -9 -79 95 96 -86 -14 120 -8 -49 86 43
7020 43 -121 25 144 -33 -95 65 44 -78 54 64 -67 -84 78 31 -85 7 16 -82 -18 111 -60 -141 51 51 -102
7045 -102 -15 82 -75 -116 98 86 -103 -47 73 -22 -50 77 9 -85 27 82 -38 -3 76 -43 -51 119 81 -107 -46
7070 -46 134 -10 -52 116 73 -131 -28 133 -6 -100 27 19 -42 28 60 -67 -83 60 -2 -55 52 -23 -142 -14
7094 -14 141 -36 -130 45 75 -95 -9 118 -47 -142 81 122 -35 -39 35 -10 14 108 3 -101 19 104 20 29 75 -79
$$ packed form
6923F8j49l1K64pk65L1J71p3m9J28q0j64J39J44j61o5J07k8l6J30j2k10Q8J99
6947A39j27j33J55Oj50J26J30j65j32K07N7j69J9J18j10j5J54n0j48R1Q0r9lJ11
6971I2j02r5J73O1k15K1J64q5q6J28Jj81O4J88j39j06J33Lj02O8R4j77PJ82n9
6996C2j44J05O6j35M4J66j23j35J50Q1j53RJ28j00p0J74Jj82P2J34j28m1J35m3
7020D3j64J46J19j77o2J60k1j22J32J0j31j7J62m7j16R2Rr8O4J29j71q1J92%j53
7045a02Q7R7j57m1K14j2j89N6J20r5k8J27o8r4J12N5j20L5P9j19qJ70l8j88O1
7070d6J80j44m2J68m3k04J03J61j39r4J27qo1P0L2j27j6J43o2n3J07p5j19J28
7094a4J55j77r4J75L0j70Q6J27j65r5K23M1j57mP4m5K4R4j05j04J20Q5q4RM6j54
$$ plain form
7120 -79 -89 162 138 -117 -89 91 43 -25 94 31 -163 -22 180 34 -92 -35 -6 -28 111 54 -154 -107 84 77 -36
7145 -36 12 -49 -133 50 200 -34 -220 -11 111 12 56 48 -132 -114 168 162 -97 -107 10 43 70 152 -62 -196 18
7170 18 208 60 -50 -40 -73 1 209 99 -182 -133 113 109 22 24 -116 -179 100 255 -5 -241 -71 65 53 75
7194 75 -10 -234 -123 188 150 -68 -117 -86 -22 188 170 -158 -245 63 208 39 15 -41 -181 -7 322 149 -233
7217 -233 -184 134 193 89 10 -158 -147 147 256 15 -152 -135 -33 171 211 -94 -335 -53 269 108 -89 -85 -121
7240 -121 -109 198 273 -146 -352 -47 247 127 -63 -183 -189 54 259 86 -171 -180 -59 117 268 71 -338 -221
7262 -221 272 325 -74 -172 -58 -38 111 295 50 -330 -174 262 285 32 -210 -230 38 307 146 -172 -203 -41
7284 -41 71 189 162 -253 -398 92 424 43 -325 -177 46 76 163 78 -240 -284 108 324 102 -209 -299 -50
$$ packed form
7120g9j0K51k4k55K8J80m8o8J19o3j94J41K02j46j26N7K9k2J39n7k08M7J91pj13
7145c6M8o1q4J83J50k34j86K09J22r9M4qj80J8K82ok59j0J17L3K7Q2k14j34K14
7170A8J90j48j10J0l3P4K08j10k81M9K46mq7Kj40o3K79J55k60k36J70J36j2K2
7194G5q5k24J11L11l8k18m9L1O4K10j8l28q7L08J45j69k4n6j40J74L29j73l82
7217b33M9L18N9j04p9j68J1K94J09k41j67J7J02K04M0l05k41K82L22j61j97Ml6
7240a21J2L07P5m19k06L05K94j20j90j20oK43K05j73k57rJ21J76J51j97m09J17
7262b21M93N3l99r8J14K0J49J84k45l80J56M36K3k53k42k0K68K69j61l18l1J62
7284d1J12J18k7m15j45M90L32l81l68J48K23L0Q7q5l18m4L92K16k22l11r0K49
$$ plain form
7306 -50 309 255 -177 -285 -14 119 119 146 -38 -362 -114 426 305 -253 -338 44 218 143 78 -152 -230 2 297
7329 297 207 -118 -287 -144 223 348 -48 -396 -144 228 136 -3 -29 -216 -238 194 403 -60 -433 -130 234
7350 234 205 17 -151 -234 -47 247 194 -79 -222 -182 83 349 166 -322 -318 190 323 17 -103 -69 -146 31 345
7373 345 156 -320 -297 156 301 80 -164 -229 -73 205 228 -72 -214 -143 2 191 228 -151 -414 -38 382 135
7395 135 -229 -164 -43 16 160 192 -197 -332 30 303 131 -115 -227 -137 172 268 -30 -258 -103 70 129 185
7417 185 18 -286 -177 310 315 -119 -246 -34 96 129 159 -67 -281 -56 264 171 -67 -190 -160 62 275 84
7439 84 -272 -201 101 140 52 1 -163 -234 103 317 -2 -301 -117 97 111 85 -41 -227 -105 195 177 -66 -153
7462 -153 -82 -5 193 171 -155 -251 71 239 73 -49 -69 -117 29 249 104 -205 -157 97 131 70 18 -147 -143 111
$$ packed form
7306e0L59n4m32j08K71J33%K7j84l24K48N40j21n58q5L82J74p5o5k30p8K32K95
7329B97r0l25j69J43L67J25l96l48K52L72r2j39k6j87k2M32K09m63l73L03L64
7350B34k9j88j68q3J87K94n3k73j43M0K65K66j83m88MN08J33l06j20L4p7J77L14
7373C45j89m76K3M53J45k21k44o5J56K78K3l00j42P1J45J89L7l79k63L76M20k47
7395A35l64O5J21N9J44L2l89j35L62K73j72k46j12R0L09R6k98k28J55J73N9N6
7417A85j67l04J09M87Nm34j27K12J30L3L0k26k14K25L20r3k38j23L0K22K13j91
7439H4l56P1L02L9q8n1j64p1L37K14l19k99J84K14J4k6j26j86J22L00j8k43q7
7462a53P1P7J98k2l26r6L22J68j66j22k0m8J46K20j45l09M8K54L4o1n2j65MK54
$$ plain form
7486 111 232 -38 -184 -48 5 54 136 -28 -243 -92 175 102 -93 -103 -71 -54 134 137 -131 -191 62 142 27 -6
7510 -6 -27 -142 6 228 50 -181 -67 101 59 47 37 -91 -101 122 171 -27 -111 -20 7 56 136 -24 -179 -15
7534 -15 149 33 -60 7 -37 -65 99 128 -127 -179 48 95 -21 -25 -33 -89 -15 136 -24 -130 -29 26 2 66 44 -132
7560 -132 -88 151 108 -102 -50 74 -10 -2 120 21 -123 7 153 17 -51 16 0 -18 95 52 -96 -47 66 18 -23
7585 -23 51 3 -126 32 145 -44 -131 45 57 -65 -6 64 -80 -63 64 42 -82 -34 25 -46 16 68 -41 -118 62
7610 62 82 -70 -24 81 -18 -62 95 66 -120 -12 136 11 -52 45 21 -48 64 94 -45 -43 68 25 -47 42 34 -96
7636 -96 -4 123 -20 -106 39 60 -84 -15 77 -61 -82 58 38 -90 -47 63 -38 -45 73 -23 -109 22 100 -52 -49
7661 -49 73 -28 -75 84 82 -84 -55 102 35 -50 52 25 -61 17 107 -25 -69 89 54 -62 33 82 -75 -60 142
$$ packed form
7486A11J21k70j46J36N3M9Q2j64k15J51K67p3j95j0L2J7J88Lk68o0K53Q0j15l3
7510fk1j15J48K22j78k31J14J68m2j2j0j28j0K23M9j98q4R1K7M9Q0j60j55J64
7534a5J64j16r3O7m4k8J64K9k55n2K27M7j16mqn6P4J51j60j06J01N5k4O4k2j76
7560a32M4K39m3k10N2J24q4QJ22r9j44J30J46j36o8O7j6j8J13m3j48M9J13m8m1
7585b3P4m8j29J58J13j89q7J76J2j22N9P0j44J7J27k2j24M8N9p1O2N2j09p7J80
7610F2K0j52M6J05r9m4J57k9j86J08J48j25o3R7k4o9J12L0j39KJ11m3p2Q9qj30
7636i6R2J27j43q6J45K1j44O9R2j38k1J40k0j28M3J10j01pJ18r6q6J31P8j52L
7661d9J22j01m7J59kj66K9J57o7q5J02k7q6P8R0j32m4J58l5j16R5M9j57J5K02
$$ plain form
7686 142 43 -122 -8 58 -62 -23 77 -16 -104 6 61 -52 -22 32 -45 -61 58 37 -131 -13 76 -56 -67 88
7710 88 10 -138 36 131 -31 -78 80 53 -58 37 86 -52 -14 109 15 -30 42 29 -67 27 132 -56 -88 96 50
7735 50 -77 32 92 -63 -90 97 67 -81 -28 55 -38 -45 51 -16 -103 15 42 -44 -12 43 -89 -66 99 47 -121 -25
7761 -25 96 -39 -59 89 20 -147 37 137 2 -70 60 28 -42 78 71 -73 -29 87 32 -25 53 12 -102 57
7785 57 169 -42 -113 57 54 -45 27 68 -109 -92 122 74 -94 -49 30 -55 22 112 -47 -144 37 113 -35 -17 23 -97
7811 -97 -51 154 75 -152 -50 101 31 13 79 -43 -125 96 188 -40 -106 26 36 10 127 65 -152 -80 153 103 -50
7836 -50 -43 -24 -35 106 129 -88 -171 38 75 5 39 -28 -174 -50 200 55 -196 -84 74 26 46 76 -85 -178 47
7861 47 191 2 -101 -70 -43 96 172 -11 -188 -37 148 62 22 32 -95 -107 189 249 -99 -220 52 154 48
$$ packed form
7686A42r9j65J14O6j20L9J00r3q8J10N5j13L0N4p7j6J19k1j68J18Q9j32j1J55
7710H8p8j48J74R5j62m7J58k7j11R5M9j38L8J23r4m5P2j3r6R4J05j88l2J84m6
7735E0j27J09O0j55k7J87l0j48N3Q3r3pR6o7q7J18K7q6L2N5j32K3J65n2j68R6
7761b5J21j35k0J48o9j67J84J00j35p2J30l2p0J20pj44M4J16n5n7P8m1j14J59
7785E7J12k11p1J70lr9P2M1j77J7K14m8j68M5P9q5P7R0j59r7J81P6j48J8M0j20
7811i7M6K05p9k27J02J51p0j8O6j22q2K21R2k28o6J32J0k6J17o2k17P2K33n0j53
7836e0PJ9j1J41K3k17q3K09L7p0L4o7j46J24K50j45k51J12J58m8K0L0j61r3K25
7861D7J44j89j03L1K7J39P6j83j77J51J85q6m0J0j27j2K96O0l48j21K72J02j06
$$ plain form
7884 48 37 -36 -156 -33 208 110 -105 -138 -43 62 174 52 -229 -165 150 127 -56 -39 -66 -155 24 268 24 -295
7908 -295 -119 175 146 -1 -62 -113 -56 133 164 -40 -136 -63 44 204 161 -147 -258 94 279 46 -128 -27 -52
7931 -52 -20 205 179 -195 -270 104 252 47 -118 -155 -85 117 175 -29 -172 -107 4 101 163 -56 -322 -132 287
7954 287 172 -183 -163 3 17 60 156 -58 -287 -44 260 172 -82 -213 -94 110 222 39 -202 -99 59 102
7976 102 126 79 -201 -226 203 344 -63 -285 -41 131 86 102 8 -204 -151 179 201 -33 -206 -146 36 241 127
7999 127 -216 -227 60 153 43 27 -85 -224 -10 324 119 -291 -193 126 169 53 -34 -158 -155 112 248 27 -162
8022 -162 -138 -8 193 222 -86 -280 -9 266 126 -59 -61 -93 -60 211 226 -141 -294 37 230 86 -40 -133 -165
8045 -165 63 233 53 -176 -117 -6 89 169 25 -278 -180 193 205 -69 -155 -57 -10 88 201 -13 -262 -63 208
$$ packed form
7884D8j1p3j20J23K41r8k15l3R5J05J12j22k81O4L15k3j83J7k7q9J79K44k44l19
7908b95J76K94k9j47o1n1N7J89L1k04r6P3J07J60m3l08j11L52J85k33j74J01k5
7931e2L2K25k6l74p5L74J48k05j65l7P0K02N8k04j43O5J11R7O2k19k66J90M19
7954B87j15l55K0J66J4M3R6k14k29K43L04q8k54j31J19K04J12j83k41J03J58M3
7976A02K4m7k80k5M29J41m07k22K44J72m5J6r4k12N3L30K2k34j73O0J82K05j14
7999A27l43j1K87R3j10j6j12j39K14L34k05m10R8L19M3j16q7j24LK67J36k21j89
8022a62K4J30K01K9l08j94K71K75j40j85kl2L3K71J5l67j53L31J93j44j26r3l2
8045a65K28J70j80k29N9J11R5Q0j44l03R8L73J2k74q6R8M7R8J13k14k49J99K71
$$ plain form
8068 208 141 -16 -88 -120 7 237 149 -161 -160 43 113 119 70 -113 -217 75 301 65 -175 -89 43 97 151 52 -212
8093 -212 -152 169 177 -32 -116 -97 -61 132 162 -83 -256 -33 164 74 -8 -70 -154 -51 192 122 -152 -144 23 68 103
8118 103 72 -121 -184 92 235 19 -93 -36 4 54 205 73 -187 -121 156 144 -4 -45 -65 -39 107 163 -68 -153
8142 -153 9 106 50 57 -40 -167 -37 195 83 -162 -101 27 15 36 78 -92 -169 43 167 7 -104 -55 -34 38
8166 38 128 9 -157 -34 127 46 -15 28 -46 -76 144 207 -66 -129 71 123 11 58 19 -105 -28 141 86 -83 -20
$$ packed form
8068B08o7j57p2l2J27K30q8l10JK03P0Om9j83j04K92K26k36k40Q6J32N4N4r9k64
8093b12O0L21Qk09q4J9L6J93L0k45j73K23J97r0q2o2q4J03K43p0k74QJ67M5L5
8118A03l1j93o3K76J43k16j12N7M0N0J51j32k60O6K77j2j48m1k0K6J46N6k31q5
8142a53J62R7n6Pr7j27J30K32j12k45O1J28j2K1M2j70p7K12J24j60j11M9K1P2
8166C8R0j19j66J23J61q1o1M3p4l0K20O3k73o3K00N2j12M7l9j24P7J69n5j69O3
8191b0
$$ Imaginary data points
##PAGE= N=2
##DATA TABLE= (X++(I..I)), XYDATA
$$ plain form
0 0 0 0 0 0 0 0 0 0 0 0 1 -2 8 -8 8 -9 9 -10 17 -17 25 -26 33 -34 42 -51 59 -64 73 -85 97 -110 120 -137
34 -137 156 -175 193 -218 243 -269 297 -329 363 -402 443 -488 538 -593 653 -720 793 -872 965
53 965 -1066 1183 -1313 1465 -1644 1855 -2113 2428 -2830 3360 -4089 5141 -6794 9689 -15732
68 -15732 33150 -180364 -661976 125584 464775 -142758 -164152 217000 -109448 -296941 229462
79 229462 321064 -178764 -220672 11054 15195 159887 215859 -260782 -349900 272739 312222
90 312222 -247774 -108043 240469 -168305 -276452 394642 322517 -475293 -317531 398793
100 398793 212753 -231509 -25860 70221 -167743 18168 269994 -24759 -220162 -5631
110 -5631 32176 18320 207035 7841 -386083 -43875 428330 33481 -333337 58964 165928
$$ packed form
0@%%%%%%%%%%JlJ0j6J6j7J8j9K7l4M2n1N9o7P6r3J10j23J37j58J82k07K30k57
34a37K93l31L68m11M61n12N66o26O92p65Q45r31J026j131J246j373J513j665J837
53I65k031K249k496K778l109L499l968M541n258O190p449R230j1935J6483k5421
68a5732M8882k13514m81612P87560L39191o07533k1394L81152l26448j87493N26403
79B29462R1602m99828m1908K31726M141J44692N5972m76641q9118O22639L9483
90C12222n59996J39731L48512m08774j08147O71094p2125p97810J57762P16324
100C98793j86040m44262K05649R6081k37964J85911K51826k94753j95403K14531
110e631L7807j3856J88715j99194l93924L42208M72205l94849l66818L92301J06964
$$ plain form
121 165928 -216188 -13001 370042 -65571 -436714 66837 367859 -35983 -186482 21901
131 21901 -26215 -41368 174065 68749 -197373 -58137 102314 -18462 48709 143566 -177546
142 -177546 -257794 234459 292562 -221834 -215365 179323 50692 -150442 129960 151429 -245891
153 -245891 -161934 250868 143749 -156818 -74679 21534 -30112 86927 121556 -128242 -145038
164 -145038 107322 76314 -61539 60554 30644 -203431 -29064 284979 38409 -270311
174 -270311 -25419 174590 -28873 -50545 110864 -43481 -179166 75082 189136 -51551
184 -51551 -122883 7866 3943 20638 113280 -22080 -173534 12197 151019 -18573 -62538
195 -62538 56837 -44584 -115676 120259 160986 -138870 -157841 109440 94268 -64008 6990
$$ packed form
121A65928l82116K03187L83043m35613l71143N03551L01022m03842j50499K08383
131B1901m8116j5153K15433j05316k66122J39236J60451j20776O7171R4857l21112
142a77546q0248M92253N8103n14396O469L94688j28631k01134K80402K1469l97320
153b45891Q3957M12802j07119l00567Q2139R6213n1646J17039L4629k49798j6796
164a45038K52360l1008j37853J22093k9910k34075J74367L14043k46570l08720
174b70311K44892K00009k03463k1672J61409j54345j35685K54248J14054k40687
184e1551p1332J30749l923J6695R2642j35360j51454J85731J38822j69592m3965
195f2538J19375j01421p1092K35935M0727k99856j8971K67281j5172j58276P0998
$$ plain form
206 6990 33122 -100385 -26707 142525 31803 -115999 -25569 38495 -4848 48369 49716 -104030
218 -104030 -81864 110544 75143 -78398 -23031 35436 -54722 -7183 121738 1633 -144727
229 -144727 -7024 113133 3978 -44745 17516 -25957 -49696 67634 71755 -67928 -63765
240 -63765 37686 21343 -1477 38484 -19948 -86572 21581 98483 -13793 -68626 12136
251 12136 12851 -24810 40904 45863 -68678 -58851 63253 49292 -35693 -15717 5802 -27975
263 -27975 11127 60581 -11842 -65396 4962 40280 -2577 1132 10481 -38061 -23779 54491
275 54491 31324 -46822 -23917 23885 1072 -351 27772 -12125 -47851 11684 48255 -5110
287 -5110 -28778 1273 -773 -4927 25960 13709 -35588 -19807 27568 15853 -9708 -1297 -6644
$$ packed form
206F990K6132j33507P3678J69232j10722j47802R0430O4064m3343N3217J347j53746
218a04030K2166J92408l5401j53541N5367N8467r0158M7539J28921j20105j46360
229a44727J37703J20157j09155m8723O2261m3473k3739J17330M121j39683M163
240f3765J01451j6343k2820L9961n8432o6624J08153P6902j12276n4833Q0762
251A2136P15l7661O5714M959j14541R827J22104j3961q4985J9976K1519l3777
263b7975L9102M9454p2423n3554P0358L5318m2857L709R349m8542J4282P8270
275E4491k3167p8146K2905M7802k2813j423K8123l9897l5726N9535L6571n3365
287e110k3668L0051k046m154L0887j2251m9297J5781M7375j1715k5561Q411n347
$$ plain form
300 -6644 -16994 13906 29314 -11332 -28754 4303 15161 -39 4141 2089 -19157 -8118 23371
313 23371 12366 -16898 -10474 5203 2289 4818 8440 -8380 -15690 5523 15201 -301 -7435
326 -7435 -2721 -2964 1817 10872 1866 -12802 -5286 8632 5347 -1632 -1309 -3729 -4508 4889 8516
341 8516 -2528 -8683 -996 5056 2967 108 -2133 -3875 -816 4256 3371 -1790 -3792 -1315 2091
356 2091 3124 384 -3027 -2325 1404 2676 484 -1424 -1233 -263 672 1268 550 -1351 -1608 799 2202
373 2202 31 -2064 -568 1426 493 -822 65 619 -725 -693 1230 841 -1616 -981 1787 821 -1797
390 -1797 -323 1694 -412 -1514 1016 907 -1448 52 1606 -1124 -1311 1948 390 -2276 1065 1877
406 1877 -2755 -745 4184 -945 -4671 2949 3983 -4859 -2045 6142 -757 -6136 3749 4549 -6320
$$ packed form
300f644j0350L0900J5408m0646j7422L3057J0858j5200M180k052k1246J1039L1489
313B3371j1005k9264O424J5677k914K529L622j6820p310K1213R678j5502p134
326g435M714k43M781R055r006j4668P516J3918l285o979L23k420p79R397L627
341H516j1044o155P687O052k089k859k241j742L059N072q85n161k002K477L406
356B091J033k740l411P02L729J272k192j908J91R70R35N96p18j901k57K407J403
373B202k171k095J496J994r33j315Q87N54j344L2J923l89k457O35K768r66k618
390a797J474K017k106j102K530j09k355J500J554k730j87L259j558k666L341Q12
406A877m632K010M929n129l726P620J034q842K814Q187o899n379R885Q00j0869
$$ plain form
421 -6320 -1558 7806 -1833 -7258 4927 4410 -6923 331 7415 -5670 -6152 9909 3113 -11355
435 -11355 1559 9315 -7236 -4516 12517 -1386 -15277 6786 13709 -10630 -7464 12512 -1972
448 -1972 -12372 11610 10098 -17955 -5493 18397 -1650 -12971 10307 3868 -17925 5832 21305
461 21305 -13351 -17994 17060 7251 -17178 8154 14914 -22840 -10657 30936 3965 -29149 5549
474 5549 18225 -16763 -2457 26721 -12074 -30623 20733 24400 -22468 -7802 19114 -14195
486 -14195 -13299 33262 6278 -41455 2284 34871 -13335 -16033 26167 -7314 -36840 26176 39194
499 39194 -35097 -28990 33468 6643 -25204 20974 15058 -43221 -5812 50064 -3217 -37637
511 -37637 13838 10718 -25989 19734 35585 -41931 -35871 48864 21650 -41147 6447 25540
$$ packed form
421f320M762R364r639n425J2185n17j1333P254P084j3085m82J6061o796j4468
435a1355J2914P756j6551K720J7033j3903j3891K2063O923k4339L166J9976j4484
448a972j0400K3982j512k8053J2462K3890k0047j1321K3278o439k1793K3757J5473
461B1305l4656m643L5054r809k4429K5332O760l7754J2183M1593k6971l3114L4698
474E549J2676l4988J4306K9178l8795j8549N1356L667m6868J4666K6916l3309
486a4195Q96M6561k6984m7733M3739L2587m8206k698M2200l3481k9526O3016J3018
499C9194p4291O107O2458k6825l1847M6178n916n8279L7409N5876n3281l4420
511c7637N1475l120l6707M5723J5851p7516O060Q4735k7214o2797M7594J9093
$$ plain form
523 25540 -39898 -10045 65045 -1331 -69827 9794 50683 -18951 -14987 30158 -22319 -39469
535 -39469 45955 38622 -48396 -21019 32644 -12054 -9144 49676 -11532 -75317 24507 75168
547 75168 -32350 -46819 40151 953 -50141 43286 57819 -68234 -54247 66353 32679
558 32679 -43250 4478 12784 -44245 11537 68032 -24047 -61781 28016 24517 -30708 29671
570 29671 35944 -78092 -39617 101064 32231 -92043 -6754 59575 -34108 -21508 75911 -6006
582 -6006 -98571 16967 87650 -16438 -43898 14124 -15358 -15782 64284 17509 -82027 -9253
594 -9253 63131 -16747 -19570 57534 -26994 -97403 58031 114912 -67791 -96095 63133 43654
606 43654 -56331 21953 54525 -72357 -54252 86095 44908 -59769 -18548 9013 -20968
$$ packed form
523B5540o5438K9853P5090o6376o8496P9621M0889o9634L964M5145n2477j7150
535c9469Q5424p333q7018K7377N3663m4698K910N8820o1208o3785R9824N0661
547G5168j07518j4469Q6970l9198n1094R3427J4533j26053J3987J20600l3674
558C2679p5929M7728Q306n7029N5782N6495r2079l7734Q9797l499n5225O0379
570B9671O273j14036L8475J40681o8833j24274Q5289O6329r3683J2600R7419q1917
582f006r2565J15538P0683j04088k7460N8022k9482m24Q0066m6775r9536P2774
594i253P2384p9878k823P7104q4528p0409J55434N6881j82703k8304J59228j9479
606D3654r9985P8284L2572j26882J8105J40347m1187j04677M1221K7561k9981
$$ plain form
617 -20968 41293 56820 -71406 -67502 76010 40427 -63857 19144 49423 -87918 -41178
628 -41178 135931 35940 -142765 -23512 107723 -3856 -49691 42375 -3879 -75438 32085
639 32085 82312 -30616 -51709 10561 -9244 10784 75540 -23255 -116924 28893 113714 -38618
651 -38618 -67708 61404 992 -94562 56258 121963 -82645 -123540 75386 88511 -48971
662 -48971 -25537 23352 -39391 -10439 75861 7699 -65834 -2904 14131 -13993 54125 40613
674 40613 -107791 -61227 126451 56567 -109818 -17625 74975 -45630 -43523 106646 27617
685 27617 -136270 -24394 119076 20903 -62667 -6487 -5976 -17225 55399 35341 -66601 -29616
697 -29616 41672 -8046 -568 66766 -33655 -120241 48400 140426 -47784 -114398 46175
$$ packed form
617b0968O2261J5527j28226L904J43512l5583j04284Q3001L0279j37341M6740
628d1178J77109r9991j78705J19253J31235j11579m5835R2066m6254p1559J07523
639C2085N0227j12928k1093O2270j9805K0028O4756r8795r3669J45817Q4821j52332
651c8618k9090J29112o0412r5554J50820O5705k04608m0895J98926J3125j37482
662d8971K3434M8889o2743K8952Q6300o8162p3533O2930J7035k8124O8118j3512
674D0613j48404M6564J87678o9884j66385R2193R2600j20605K107J50169p9029
685B7617j63887J11876J43470r8173q3570N6180N11j1249P2624k0058j01942L6985
697b9616P1288m9718P478O7334j00421q6586J68641R2026j88210o6614J60573
$$ plain form
708 46175 52266 -55648 17224 75132 -63035 -90233 68228 83021 -38420 -46433 -4369 -8148
720 -8148 36257 55159 -45715 -68883 38436 39192 -30037 21561 33049 -84856 -46702 121684
732 121684 57142 -118316 -47819 82519 12449 -37294 37681 5719 -78679 2121 87337
743 87337 6924 -56035 -16840 -1893 15115 58559 -2582 -87378 -7718 77116 124 -37537
755 -37537 30564 -8251 -73564 37958 106275 -42872 -108125 30686 73437 -17913 -16495 16995
767 16995 -36017 -27538 59761 37020 -46142 -30742 6582 3976 35813 32929 -60165 -59519 59464
780 59464 57733 -42549 -23989 25889 -27303 -21355 71699 28435 -88009 -35679 70399 29736
792 29736 -30934 -6508 -8570 -24942 29491 46884 -26416 -44018 8486 14090 8602 29579 -13709
$$ packed form
708D6175O091j07914P2872N7908j38167k7198J58461J4793j21441q013M2064l779
720h148M4405J8902j00874k3168J07319P56o9229N1598J1488j17905L8154J68386
732A21684o4542j75458P0497J30338p0070m9743P4975l1962q4398Q0800Q5216
743H7337q0413o2959L9195J4947J7008M3444o1141q4796P9660Q4834p6992l7661
755c7537O8101l8815o5313J11522O8317j49147o5253J38811M2751r1350J418L3490
767A6995n3012Q479Q7299k2741q3162J5400L7324k606L1837k884r3094O46J18983
780E9464j731j00282J8560M9878n3192N948R3054m3264j16444N2330J06078m0663
792B9736o0670K4426k062j6372N4433J7393p3300j7602N2504N604n488K0977m3288
$$ plain form
805 -13709 -65504 6752 75390 1660 -55207 510 16713 -17670 19844 42379 -37605 -59045
817 -59045 32138 54319 -12743 -26530 -5372 -12361 11100 43010 -4220 -49551 -5418 29373
829 29373 6328 5838 6049 -37394 -25558 50164 38681 -41081 -33908 19663 10042 -568 22213
842 22213 -5883 -46267 -393 49006 10082 -29246 -12452 -1944 2925 27883 13217 -36206
854 -36206 -24494 25500 21096 -5169 -2281 -11590 -23006 15860 40697 -8470 -40510 -2072 22289
867 22289 6006 4180 790 -24884 -13881 29846 23328 -18791 -20914 387 5739 13686 14652 -16028
881 -16028 -28530 7815 27642 3045 -12202 -7710 -9192 2533 24725 8500 -26628 -16810 15501
894 15501 15268 596 -3370 -11840 -12487 12518 22739 -4509 -21242 -5122 8633 8966 7645 -4496
$$ packed form
805a3709n1795P2256O8638p3730n6867N5717J6203l4383L7514K2535p9984k1440
817e9045R1183K2181o7062j3787K1158o989K3461L1910m7230m5331M4133L4791
829B9373k3045m90K11m3443J1836P5722j1483p9762P173N3571r621j0610K2781
842B2213k8096m0384M5874M9399l8924l9328J6794J0508M869K4958j4666m9423
854c6206J1712M9994m404k6265K888r309j1416L8866K4837m9167l2040L8438K4361
867B2289j6283j826l390k5674J1003M3727o518m2119k123K1301N352P947R66l0680
881a6028j2502L6345J9827k4597j5247M492j482J1725K2192j6225l5128R818L2311
894A5501k33j4672l966q470o47K5005J0221k7248j6733J6120J3755L33j321j2141
$$ plain form
908 -4496 -18519 -4808 18473 11836 -8864 -11232 -3725 2656 11652 8893 -11012 -16222 3680 14905
922 14905 4467 -5579 -7743 -6195 4253 13714 3287 -13172 -9410 5641 9680 3721 -3678
935 -3678 -9189 -4900 7952 10700 -1707 -10204 -5003 3820 7636 4363 -4797 -9492 -1341 8806
949 8806 6426 -3284 -7093 -3302 2979 6790 3113 -5494 -7376 702 7276 4080 -3182 -5812 -2218
964 -2218 3564 5511 901 -4991 -4643 1371 5328 2851 -2713 -4991 -1357 3941 4276 -652 -4310 -2619
980 -2619 1704 3823 1751 -2407 -3848 -465 3475 2884 -1034 -3366 -1783 1837 3281 541 -2703
995 -2703 -2139 627 1939 1574 -203 -2658 -1883 2301 2986 -1070 -2417 -66 522 385 1675 86 -3000
1012 -3000 -681 2974 737 -1775 91 59 -1441 1463 2493 -2373 -2513 2715 1321 -2581 826 2156
$$ packed form
908d496j4023J3711K3281o637k0700k368P507O381Q996k759j9905n210J9902J1225
922A4905j0438j0046k164J548J0448R461j0427j6459L762J5051M039n959p399
935c678n511M289J2852K748j2407q497N201Q823L816l273r160m695Q151J0147
949H806k380r710l809L791O281L811l677q607j882Q078O574l196p262k630L594
964b218N782J947m610n892L48O014L957k477n564k278L634N298L35m928l658J691
980b619M323K119k072m158j441L383L940n91l918k332J583L620J444k740l244
995b703N64K766J312l65j777k455P75M184O85m056j347K351N88j37J290j589l086
1012c000K319L655k237k512J866l2j500K904J030m866j40N228j394l902L407J330
$$ plain form
1028 2156 -3008 -1321 4444 69 -4627 1585 3527 -3232 -1391 4400 -1123 -4390 3425 3112 -4936
1043 -4936 -671 5273 -2256 -4230 4848 1875 -6335 1258 6174 -4463 -4350 6815 1110 -7588 2736
1058 2736 6453 -6209 -3572 8330 -403 -8376 4536 6137 -7773 -2182 9145 -2581 -8148
1071 -8148 6938 4836 -9666 86 10021 -5296 -7742 9490 3203 -11332 2563 10326 -8147
1084 -8147 -6569 11969 959 -12807 5131 10200 -10242 -4628 13014 -2421 -12617 9006 8821
1097 8821 -13250 -2378 13911 -5398 -10915 12307 4988 -16374 2297 15944 -9266 -10850 14323
1110 14323 2308 -16363 7133 14657 -14661 -9269 18002 914 -16421 8474 10646 -16386
1122 -16386 -2531 20112 -5807 -17922 12675 9929 -16818 1707 17659 -13268 -14603 21059
$$ packed form
1028B156n164J687N765m375m696O212J942o759J841N791n523l267P815l13q048
1043d936M265N944p529j974R078k973q210P593M916j0637J13J1165n705q698J0324
1058B736L717j2662K637J1902q733p973J2912J601j3910N591J1327j1726n567
1071h148J5086k102j4502R752R935j5317k446J7232o287j4535J3895P763j8473
1084h147J578J8538j1010j3766J7938N069k0442N614J7642j5435j0196K1623j85
1097H821k2071J0872J6289j9309n517K3222p319k1362J8671J3647k5210j584K5173
1110A4323j2015j8671K3496P524k9318N392K7271j7088j7335K4895K172k7032
1122a6386J3855K2643k5919j2115L0597k746k6747J8525J5952l0927j335L5662
$$ plain form
1134 21059 7741 -22803 2106 18401 -12917 -9798 21572 -181 -24858 8944 20766 -14946
1146 -14946 -9905 17635 -4536 -16900 17651 12533 -25046 -4475 24304 -6614 -16340 18383
1158 18383 4277 -27448 7709 29837 -16718 -23475 21428 9295 -22191 8247 19721 -22905
1170 -22905 -14193 29357 5440 -25445 6097 13261 -18180 2182 26813 -15544 -27576 23556
1182 23556 18200 -25678 -368 23590 -20111 -18893 35747 12130 -40521 -2756 33018 -9212
1194 -9212 -16955 21480 -976 -29779 14405 29183 -20299 -17474 19275 -2928 -14267 24872
1206 24872 7724 -39910 -253 41752 -9227 -29980 21029 9806 -33105 10431 40768 -23746
1218 -23746 -38761 27434 24957 -23387 -2593 15996 -20231 -8591 34005 1673 -32604 6311
$$ packed form
1134B1059j3318l0544K4909J6295l1318L119L1370k1753k4677L3802J1822l5712
1146a4946N041K7540k2171j2364L4551n118l7579K0571K8779l0918r726L4723
1158A8383j4106l1725L5157K2128m6555o757M4903j2133l1486L0438J1474m2626
1170b2905Q712M3550k3917l0885L1542P164l1441K0362K4631m2357j2032N1132
1182B3556n356m3878K5310K3958m3701J218N4640k3617n2651L7765L5774m2230
1194i212p743L8435k2456k8803M4184J4778m9482K825L6749k2203j1339L9139
1206B4872j7148m7634L9657M2005n0979k0753N1009j1223m2911M3536L0337o4514
1218b3746j5015O6195k477m8344K0794J8589l6227J1640M2596l2332l4277L8915
$$ plain form
1230 6311 16539 -16475 7197 27029 -28851 -32885 40867 28541 -41181 -11964 33321 -12820
1242 -12820 -22998 36552 14315 -49082 -7616 44497 635 -24840 8261 -1162 -17530 22498
1254 22498 21944 -31555 -16038 27412 -1866 -15250 26837 2063 -49055 7483 58198 -13463
1266 -13463 -49378 18820 25951 -26026 1932 33810 -22597 -37152 28933 30662 -21220 -12853
1278 -12853 6111 -11131 8131 31303 -16618 -37460 19818 25355 -21757 663 25903 -29514
1290 -29514 -31498 49045 33528 -52379 -26266 40991 8003 -23040 15968 7859 -35317 -559
1302 -559 39876 -116 -25959 -743 -1089 -1221 29021 5507 -45541 -7046 44322 -54 -28313
1315 -28313 17324 7033 -39384 9289 55796 -15818 -57024 14413 40209 -11240 -11802 11533
$$ packed form
1230F311J0228l3014K3672J9832n5880m034P3752j2326o9722K9217M5285m6141
1242a2820j0178N9550k2237o3397M1466N2113m3862k5475L3101r423j6368M0028
1254B2498n54n3499J5517M3450k9278j3384M2087k4774n1118N6538N0715p1661
1266a3463l5915O8198P131n1977K7958L1878n6407j4555O6085J729n1882Q367
1278a2853J8964j7242J9262K3172m7921k0842N7278N537m7112K2420K5240n5417
1290b9514j984Q0543j5517q5907K6113O7257l2988l1043L9008q109m3176L4758
1302e59M0435l9992k5843K5216l46j32L0242k3514n1048L8495N1368m4376k8259
1315b8313M5637j0291m6417M8673M6507p1614m1206P1437K5796n1449n62K3335
$$ plain form
1327 11533 -15494 -15126 29622 17030 -25311 -11230 6749 -4036 15415 23582 -30674 -37418 34344
1340 34344 36422 -29092 -18254 22251 -10296 -19940 36394 22494 -48219 -24821 41103 20221
1352 20221 -20348 -6268 -2431 -12173 16288 25228 -16980 -23913 8321 6065 1058 20915 -4535
1365 -4535 -44213 1774 52214 1559 -41458 1639 18267 -13953 5001 30487 -17734 -41536
$$ packed form
1327A1533k7027L68M4748j2592m2341J4081J7979j0785J9451Q167n4256o744P1762
1340C4344K078o5514J0838M0505l2547r644N6334j3900p0713K3398O5924k0882
1352B0221m0569J4080L837r742K8461Q940m2208o933L2234k256n007J9857k5450
1365d535l9678M5987N0440n0655m3017M3097J6628l2220J8954K5486m8221k3802
$$ [...]
8191D9
##END NTUPLES=NMR FID
##END=
