##TITLE=1H ikalashn
MA1212
13.12.2024
##JCAMPDX= 6.0         $$ Bruker NMR JCAMP-DX V2.0
##DATA TYPE= NMR SPECTRUM
##DATA CLASS= NTUPLES
##ORIGIN= UXNMR, Bruker Analytische Messtechnik GmbH
##OWNER= root
$$ TOPSPIN		Version 1.3
$$ 2024-12-13 09:44:57.656 +0400  Irina@DPX200
$$ Compression mode = diff/dup
##.OBSERVE FREQUENCY= 200.131300845
##.OBSERVE NUCLEUS= ^1H
##.ACQUISITION MODE= SIMULTANEOUS
##.ACQUISITION SCHEME= undefined
##.AVERAGES= 64
##.DIGITISER RES= 18
##SPECTROMETER/DATA SYSTEM= spect
##.PULSE SEQUENCE= zg
##.SOLVENT NAME= CDCl3
##.SHIFT REFERENCE= INTERNAL, CDCl3, 1, 17.49637
##AUDIT TRAIL= $$ (NUMBER, WHEN, WHO, WHERE, WHAT)
$$ ##TITLE= Audit trail, TOPSPIN		Version 1.3
$$ ##JCAMPDX= 5.01
$$ ##ORIGIN= Bruker BioSpin GmbH
$$ ##OWNER= Irina
$$ $$ F:/spectra/data/iren/nmr/1H/4/pdata/1/auditp.txt
$$ ##AUDIT TRAIL=  $$ (NUMBER, WHEN, WHO, WHERE, VERSION, WHAT)
(   1,<2024-12-13 09:43:58.437 +0400>,<Irina>,<DPX200>,<TOPSPIN 1.3>,
      <created by zg
	started at 2024-12-13 09:39:45.421 +0400,
	POWCHK disabled, PULCHK disabled
       configuration hash MD5:
       BE 6D 3F 07 2A EA 11 49 91 17 2B D3 AF B3 58 0D
       data hash MD5: 16K
       A2 C0 7A 5D 85 88 B8 24 CE 68 1A 1E 5F CB C4 BD>)
(   2,<2024-12-13 09:44:31.093 +0400>,<Irina>,<DPX200>,<TOPSPIN 1.3>,
      <Start of raw data processing
       efp BC_mod = 2 LB = 0.05 FT_mod = 6 PKNL = 1 PHC0 = -28.88938 PHC1 = -6.720823 SI = 32K 
       data hash MD5: 32K
       8F 71 AF 1A 14 41 59 A7 67 5E 3F 40 DA 8D C2 86>)
(   3,<2024-12-13 09:44:48.218 +0400>,<Irina>,<DPX200>,<TOPSPIN 1.3>,
      <pk fgphup PHC0 = -1.543506 PHC1 = 5.6 
       data hash MD5: 32K
       E7 0A 73 79 9B F6 01 FA 5E 63 CA 7A 6A EB 76 46>)
$$ ##END=
$$ 
$$ $$ hash MD5
$$ $$ 04 CB 2D 54 56 1B A3 74 4F 6C B9 77 73 A1 CB 6A
##$RELAX= 
##$RELAX= 
##$RELAX= 
##$RELAX= 
##$RELAX= 
##$RELAX= 
##$RELAX= 
##$RELAX= 
##$RELAX= 
$$ Bruker specific parameters
$$ --------------------------
##$DU= <F:/spectra>
##$EXPNO= 4
##$NAME= <1H>
##$PROCNO= 1
##$TYPE= <nmr>
##$USER= <iren>
##$AMP= (0..31)
100 100 100 100 100 100 100 100 100 100 100 100 100 100 100 100 100 100 
100 100 100 100 100 100 100 100 100 100 100 100 100 100 
##$ANAVPT= -1
##$AQSEQ= 0
##$AQ_mod= 1
##$AUNM= <au_zg>
##$AUTOPOS= <>
##$BF1= 200.13
##$BF2= 200.13
##$BF3= 200.13
##$BF4= 200.13
##$BF5= 200.13
##$BF6= 200.13
##$BF7= 200.13
##$BF8= 200.13
##$BYTORDA= 1
##$CFDGTYP= 0
##$CFRGTYP= 5
##$CHEMSTR= <none>
##$CNST= (0..63)
1 1 145 1 1 1 1 1 1 1 1 1 1 1 1 1 1 1 1 1 1 1 1 1 1 1 1 1 1 1 1 1 1 1 
1 1 1 1 1 1 1 1 1 1 1 1 1 1 1 1 1 1 1 1 1 1 1 1 1 1 1 1 1 1 
##$CPDPRG= <>
##$CPDPRG1= <>
##$CPDPRG2= <>
##$CPDPRG3= <>
##$CPDPRG4= <mlev>
##$CPDPRG5= <mlev>
##$CPDPRG6= <mlev>
##$CPDPRG7= <mlev>
##$CPDPRG8= <mlev>
##$CPDPRGB= <>
##$CPDPRGT= <>
##$D= (0..63)
0 2 0 0 0 0 0 0 0 0.06 0 0.03 0 0 0 0 0.0002 0 0 0 0 0 0 0 0 0 0 0 0 0 
0 0 0 0 0 0 0 0 0 0 0 0 0 0 0 0 0 0 0 0 0 0 0 0 0 0 0 0 0 0 0 0 0 0 
##$DATE= 1734068637
##$DBL= (0..7)
120 120 120 120 120 120 120 120 
$$ [...]
0 0 2 0 0 0 0 0 0 0 0 0 0 0 0 0 
##$SW_h= 4401.40845070422
##$TD= 16384
##$TD0= 1
##$TE= 300
##$TE2= 300
##$TE3= 300
##$TEG= 300
##$TL= (0..7)
0 120 120 120 120 120 120 120 
##$TP= (0..7)
150 150 150 150 150 150 150 150 
##$TP07= 0
##$TPNAME0= <>
##$TPNAME1= <>
##$TPNAME2= <>
##$TPNAME3= <>
##$TPNAME4= <>
##$TPNAME5= <>
##$TPNAME6= <>
##$TPNAME7= <>
##$TPOAL= (0..7)
0.5 0.5 0.5 0.5 0.5 0.5 0.5 0.5 
##$TPOFFS= (0..7)
0 0 0 0 0 0 0 0 
##$TUNHIN= 0
##$TUNHOUT= 0
##$TUNXOUT= 0
##$USERA1= <user>
##$USERA2= <user>
##$USERA3= <user>
##$USERA4= <user>
##$USERA5= <user>
##$V9= 5
##$VALIST= <valist>
##$VCLIST= <CCCCCCCCCCCCCCC>
##$VD= 0
##$VDLIST= <DDDDDDDDDDDDDDD>
##$VPLIST= <PPPPPPPPPPPPPPP>
##$VTLIST= <TTTTTTTTTTTTTTT>
##$WBST= 1024
##$WBSW= 25
##$XGAIN= (0..3)
0 0 0 0 
##$XL= 0
##$YL= 0
##$YMAX_a= 389083
##$YMIN_a= -337549
##$ZGOPTNS= <>
##$ZL1= 120
##$ZL2= 120
##$ZL3= 120
##$ZL4= 120
##$ABSF1= 0
##$ABSF2= 0
##$ABSG= 0
##$ABSL= 0
##$ALPHA= 0
##$AQORDER= 0
##$ASSFAC= 0
##$ASSFACI= 0
##$ASSFACX= 0
##$ASSWID= 0
##$AUNMP= <proc_1d>
##$AXLEFT= 0
##$AXRIGHT= 0
##$AXTYPE= 0
##$AXUNIT= <>
##$AZFE= 0.1
##$AZFW= 0.1
##$BCFW= 0
##$BC_mod= 2
##$BYTORDP= 0
##$COROFFS= 0
##$CY= 7568.61572265625
##$DATMOD= 1
##$DC= 0
##$DFILT= <>
##$DTYPP= 0
##$F1P= 17.9538593292236
##$F2P= -4.03888763876832
##$FCOR= 0.5
##$FTSIZE= 32768
##$FT_mod= 6
##$GAMMA= 0
##$GB= 0
##$INTBC= 0
##$INTSCL= 5.656564e-011
##$ISEN= 128
##$LB= 0.05
##$LEV0= 0
##$LPBIN= 0
##$MAXI= 945.577
##$MC2= 0
##$MEAN= 0
##$ME_mod= 0
##$MI= -402.1523
##$NCOEF= 0
##$NC_proc= -4
##$NLEV= 6
##$NOISF1= 8.587773
##$NOISF2= 6.764455
##$NSP= 0
##$NTH_PI= 0
##$NZP= 0
##$OFFSET= 17.49637
##$PC= 1
##$PHC0= -30.43289
##$PHC1= -1.120823
##$PH_mod= 1
##$PKNL= yes
##$PPARMOD= 0
##$PPDIAG= 0
##$PPIPTYP= 0
##$PPMPNUM= 100
##$PPRESOL= 1
##$PSCAL= 0
##$PSIGN= 0
##$REVERSE= no
##$SF= 200.13
##$SI= 32768
##$SIGF1= 16.12182
##$SIGF2= -4.496377
##$SINO= 3.521527
##$SIOLD= 32768
##$SREGLST= <1H.CDCl3>
##$SSB= 0
##$STSI= 32768
##$STSR= 0
##$SW_p= 4401.40845070422
##$SYMM= 0
##$S_DEV= 0
##$TDeff= 16384
##$TDoff= 0
##$TI= <>
##$TILT= no
##$TM1= 0
##$TM2= 0
##$TOPLEV= 0
##$USERP1= <user>
##$USERP2= <user>
##$USERP3= <user>
##$USERP4= <user>
##$USERP5= <user>
##$WDW= 1
##$XDIM= 32768
##$YMAX_p= 351160098
##$YMIN_p= -396518
$$ End of Bruker specific parameters
$$ ---------------------------------
##NTUPLES= NMR SPECTRUM
##VAR_NAME=  FREQUENCY,     SPECTRUM/REAL,   SPECTRUM/IMAG
##SYMBOL=    X,             R,               I
##VAR_TYPE=  INDEPENDENT,   DEPENDENT,       DEPENDENT
##VAR_FORM=  AFFN,          ASDF,            ASDF
##VAR_DIM=   32768,         32768,           32768
##UNITS=     HZ,            ARBITRARY UNITS, ARBITRARY UNITS
##FACTOR=    0.134324425510551, 1,           1
##FIRST=     4401.40845070422, -164470,      119202
##LAST=      0,             -174932,         95780
##MIN=       0,             -396518,         0
##MAX=       4401.40845070422, 351160098,    0
$$ Real data points
##PAGE= N=1
##DATA TABLE= (X++(R..R)), XYDATA
$$ [...]
25963g9788K7141j4052l4156j1374J5284N379k6161l4523p450K2713K3960K247
$$ -79788 -52647 -66699 -100855 -112229 -96945 -91566 -117727 -152250 -159700 -136987 -113027 -110780
25951a10780j1144p03J6033J5395K98q854q354j1379j4892M2K5314K2138j6881
$$ -110780 -121924 -122627 -106594 -91199 -90901 -99755 -108109 -119488 -134380 -134338 -109024 -86886 -103767
25938a03767m1268j3739K8295K9304K959K889K5997J6776l2115n6982k1189K7421
$$ -103767 -145035 -158774 -130479 -101175 -98216 -95327 -69330 -52554 -84669 -141651 -162840 -135419
25926a35419L0809K126p706J0650K1121j40l5637m8606k0171K6713M1917P531
$$ -135419 -104610 -102484 -110190 -99540 -78419 -78559 -114196 -162802 -182973 -156260 -114343 -106812
25914a06812k7389r051L5070L0751k2754m2971L864M3684J4077l4711k6767J6157
$$ -106812 -134201 -143252 -108182 -77431 -100185 -143156 -139292 -95608 -81531 -116242 -143009 -126852
25902a26852K2437n875j0512J1417R734j7096j6981J6588K9232K302j7675n423
$$ -126852 -104415 -110290 -120802 -109385 -99651 -116747 -133728 -117140 -87908 -85606 -103281 -108704
25890a08704M793q083j4460J679J0813P18J875J7925N496l6452l8197K3696O2696
$$ -108704 -103911 -111994 -126454 -124775 -113962 -113244 -111369 -93444 -87948 -124400 -162597 -138901 -76205
25877g6205J2274n4692l4417L8277M6068j8190m4032J0722N4456J6882m2280m0626
$$ -76205 -63931 -118623 -153040 -114763 -68695 -86885 -130917 -120195 -65739 -48857 -91137 -131763
25865a31763j125L974k3627k4778R995K9803J2106n325R187L3242K7852p865l8094
$$ -131763 -132888 -128914 -152541 -177319 -167324 -137521 -125415 -130740 -121553 -88311 -60459 -68324 -106418
25852a06418l2136M406L3582K2149j8161l8052j1535K5849K3454j2656k9568p425
$$ -106418 -138554 -134148 -100566 -78417 -96578 -134630 -146165 -120316 -96862 -109518 -139086 -146511
25840a46511J2516m167k8487j4421K4222L1614j566k0304Q249M0218K3860j6014
$$ -146511 -133995 -138162 -166649 -181070 -156848 -125234 -126800 -147104 -138855 -98637 -74777 -90791
25828i0791j7657J5142J8352k3451m6968j4731K0849P336j5426J4756O4288M7021
$$ -90791 -108448 -93306 -74954 -98405 -145373 -160104 -139255 -131919 -147345 -132589 -68301 -21280
25816b1280l1029o7770j7664M3409L9074l507j9963r342o130o632P104J1053k0288
$$ -21280 -52309 -120079 -137743 -94334 -55260 -58767 -78730 -88072 -94202 -100834 -93730 -82677 -102965
25803a02965m7720j7993L9654M7837L134k0384M817J9116j5420m7005k0682L1992
$$ -102965 -150685 -168678 -129024 -81187 -78053 -98437 -93620 -74504 -89924 -136929 -157611 -125619
25791a25619M5986J8877m184q742j6049k8494k4351j780J5084J3875O027L246
$$ -125619 -79633 -60756 -64940 -73682 -89731 -118225 -142576 -144356 -129272 -115397 -109370 -106124
25779a06124P049J5593J9497L057k8239l9411j2484J8795J4375j1854j7485M01
$$ -106124 -99075 -83482 -63985 -60928 -89167 -128578 -141062 -122267 -107892 -119746 -137231 -136830
25767a36830J0231O672J2416K3565J1173j7635j9460J0593K3834O81j2394J5674
$$ -136830 -126599 -119927 -107511 -83946 -72773 -90408 -109868 -99275 -75441 -74760 -87154 -71480
25755g1480M0062J1914l6632m1114n615J1816m080j2775K062P779r889j6363Q894
$$ -71480 -31418 -19504 -56136 -97250 -102865 -91049 -95129 -107904 -105842 -98063 -107952 -124315 -115421
25742a15421K9592Q679k8949l0565P555L6527K2745j1955k3595l39K6704K2250
$$ -115421 -85829 -77150 -106099 -136664 -129109 -92582 -69837 -81792 -105387 -105726 -79022 -56772
25730e6772j0118l0606j2975J9429K3886l061k3234j3749M854Q606O213J2496
$$ -56772 -66890 -97496 -110471 -91042 -67156 -70217 -93451 -107200 -102346 -93740 -87527 -75031
25718g5031J3937n882k6285j6058R027K062l7010m8711k023M9378L9299j3451
$$ -75031 -61094 -66976 -93261 -109319 -100292 -98230 -135240 -183951 -185974 -136596 -97297 -110748
25706a10748l2419M959M1478L1729J570q394o974j9172k9178q962K2122K2889
$$ -110748 -143167 -138208 -96730 -65001 -63431 -71825 -78799 -97971 -127149 -136111 -113989 -91100
25694i1100o0p035L34j4058m0003k3586L2927N4704J3536j7466J5503M8864N038
$$ -91100 -91160 -98195 -97861 -111919 -151922 -175508 -142581 -87877 -74341 -91807 -76304 -27440 -22402
25681b2402o8912o8243K176L9886J0802j2575R758K2049j3325m0402p817L8222
$$ -22402 -91314 -159557 -157381 -117495 -106693 -119268 -109510 -87461 -100786 -141188 -149005 -110783
25669a10783K9407j5358k8457p56J8608N727j4167j4312N330K7015K5568r822
$$ -110783 -81376 -96734 -125191 -125947 -107339 -101612 -115779 -130091 -124761 -97746 -72178 -82000
25657h2000m5499l0704K4201M5852M314l6647j8609K4397L4932K5027K7259J4268
$$ -82000 -127499 -158203 -134002 -88150 -83836 -120483 -139092 -114695 -79763 -54736 -27477 -13209
25645a3209m1442p9109k9342N3498N6619j3180m2449J352K9300k799k4172R038
$$ -13209 -54651 -133760 -163102 -109604 -52985 -66165 -108614 -107262 -77962 -80761 -104933 -95895
25633i5895L0445q819m2853p765M0327K1706k9787l0484J0180J7371j6712l0947
$$ -95895 -65450 -74269 -117122 -124887 -84560 -62854 -92641 -123125 -112945 -95574 -112286 -143233
25621a43233m561K3526L1450K8926Q414l8483o7479k6525M9789P0854J7703l6187
$$ -143233 -147794 -124268 -92818 -63892 -55478 -93961 -161440 -187965 -138176 -67322 -49619 -85806
25609h5806l7722j1891N551J8118K9147J9297r177k1938r691k692r615p67K5066
$$ -85806 -123528 -135419 -129868 -111750 -82603 -63306 -72483 -94421 -104112 -106804 -116419 -117186 -92120
25596i2120K0898k6595n6131j9082M1728N2302R028l1345l5196j5710P156K4011
$$ -92120 -71222 -97817 -153948 -173030 -131302 -79000 -69972 -101317 -136513 -152223 -145067 -121056
25584a21056K4622P618o408p20J0724Q386J276O013J0581n180k6908k2480N606
$$ -121056 -96434 -88816 -95224 -95944 -85220 -76834 -75558 -69545 -58964 -64144 -91052 -113532 -107926
25571a07926K2065J1613m741q613p106r581r328O28J3848K1997K3589J5095q911
$$ -107926 -85861 -74248 -78989 -87602 -94708 -104289 -113617 -112989 -99141 -77144 -53555 -38460 -47371
25558d7371l7962m5290j9228J5811K5277O765q901j06J7420J5423m986j5773n294
$$ -47371 -85333 -130623 -149851 -134040 -108763 -101998 -110899 -111005 -93585 -78162 -83148 -98921 -104215
25545a04215M686m043j4834l275K1603L0997K0323Q424m37j8419l8439l4876p003
$$ -104215 -99529 -103572 -118406 -121681 -100078 -69081 -48758 -40334 -40771 -59190 -97629 -132505 -139508
25532a39508J4806J6566J6738K1215N070l5697n5546k0277L4545M8947K0795k132
$$ -139508 -124702 -108136 -91398 -70183 -65113 -100810 -156356 -176633 -142088 -93141 -72346 -74478
25520g4478J406N905n666j3293n91J1981j360k7395k7415Q716M3283L5238o787
$$ -74478 -73072 -67167 -72833 -86126 -86717 -74736 -76096 -103491 -130906 -122190 -78907 -43669 -50456
25507e0456l3875j9820P947J3220J348k440j684j4041k3924k583L0250K4990j3451
$$ -50456 -84331 -104151 -96204 -82984 -81636 -84076 -85760 -99801 -123725 -126308 -96058 -71068 -84519
25494h4519k5996K304J7035o365j6908J5016L4633q76l7214j3205K8986J7129
$$ -84519 -110515 -108211 -91176 -97541 -114449 -99433 -64800 -65676 -102890 -116095 -87109 -69980
25482f9980k2038j3731K5195J6188l3161l7038J3538L0907j3676l8823J834L9028
$$ -69980 -92018 -105749 -80554 -64366 -97527 -134565 -121027 -90120 -103796 -142619 -140785 -101757
25470a01757J2223k6864r325L4654L5474k118k3962j8663j2321p557O956J5781
$$ -101757 -89534 -116398 -125723 -91069 -55595 -57713 -81675 -100338 -112659 -120216 -113260 -97479
25458i7479K114j3911j0152l307j0296q078J9220L5286Q869k4569j8031Q826J0135
$$ -97479 -95365 -109276 -119428 -122735 -133031 -141109 -121889 -86603 -77734 -102303 -120334 -111508 -101373
25445a01373n020j667N467j6406l8003n591N5192O1750K417m2293k0808K2643
$$ -101373 -106393 -108060 -102593 -118999 -157002 -162593 -107401 -45651 -43234 -85527 -106335 -83692
25433h3692K6931l476k5698k1271l179Q485P04j8572j8381J6289N1043M2061j042
$$ -83692 -56761 -60237 -85935 -107206 -110385 -101900 -101196 -119768 -138149 -121860 -70817 -28756 -29798
25420b9798l1992l4478k7119j6468K992J4392l01j5820J887L0413K4100l280l135
$$ -29798 -61790 -96268 -123387 -139855 -136863 -122471 -122772 -138592 -136705 -106292 -82192 -85472 -88607
25407h8607J5302L136k6847j6179K2075J4100l2915k4853M8262O9109j4038q3221
$$ -88607 -73305 -70169 -97016 -113195 -91120 -77020 -109935 -134788 -86526 -17417 -31455 -114676
25395a14676l6435M1645K1789n1474l7149O1478R6701R261q6515p7959L361N7441
$$ -114676 -151111 -109466 -87677 -139151 -176300 -114822 -18121 -8860 -95375 -173334 -169973 -112532
25383a12532M5796k21l7898m0237o841K8019K9850J0005J592J294j3902k6789
$$ -112532 -66736 -66957 -104855 -145092 -151933 -123914 -94064 -84059 -82467 -81173 -95075 -121864
25371a21864l273L1765J8474l3579m6186M244M5267K2839j8352j5074J8101K7817
$$ -121864 -125137 -93372 -74898 -108477 -154663 -150419 -105152 -82313 -100665 -115739 -97638 -69821
25359f9821Q958m412k526k874j0640j6703j8203j2205R262L3820K7971j1233l6989
$$ -69821 -60863 -65275 -67801 -70675 -81315 -98018 -116221 -128426 -119164 -85344 -57373 -68606 -105595
25346a05595j7529J3671J1122j1434r862J5014K3465N127j0653r911j1517k3618
$$ -105595 -123124 -109453 -98331 -109765 -119627 -104613 -81148 -76021 -86674 -96585 -108102 -131720
25334a31720k4583j275K5093K7685Q130j1004j3680j624J1052R279q165k3593
$$ -131720 -156303 -157578 -132485 -104800 -96670 -107674 -121354 -122978 -111926 -102647 -110812 -134405
25322a34405j8903J514J6572J6632J3556J9102K4422J1529j7661l5884k2580O006
$$ -134405 -153308 -151794 -135222 -118590 -105034 -85932 -61510 -49981 -67642 -103526 -126106 -120100
25310a20100J4884k412j6799j0104L81N70Q710L3869L9542k124m6886l2765J8579
$$ -120100 -105216 -107628 -124427 -134531 -134150 -133580 -124870 -91001 -51459 -53583 -100469 -133234 -114655
25297a14655K9593q281k3566Q610K3657j2364l4799O129M9550K3576k9772k6041
$$ -114655 -85062 -93343 -116909 -108299 -84642 -97006 -131805 -125676 -76126 -52550 -82322 -108363
25285a08363J8147K0362k1950l3895R16J8635l687j1666J8809L5365O234k2830
$$ -108363 -90216 -69854 -91804 -125699 -124783 -106148 -109835 -121501 -102692 -67327 -61093 -83923
25273h3923j1864Q899M255n077L719M687j9658k8553R175M7652K9433k1591l8813
$$ -83923 -95787 -86888 -82633 -87710 -83991 -79304 -98962 -127515 -118340 -70688 -41255 -62846 -101659
25260a01659j3383R516J0876R321Q816k060q991R746L0849J2349l0036l5072Q844
$$ -101659 -115042 -105526 -94650 -85329 -76513 -78573 -87564 -77818 -46969 -34620 -64656 -99728 -90884
25247i0884M1822K2863j3618j8718p8L022j6522l1423k4850p413M440O722N543
$$ -90884 -49062 -26199 -39817 -58535 -58613 -55591 -72113 -103536 -128386 -135799 -131359 -124637 -119094
25234a19094O562P511K427m074J931J7307J4331j7353l9597j3310L4637L9858
$$ -119094 -112532 -105021 -102594 -106668 -104737 -87430 -73099 -90452 -130049 -143359 -108722 -68864
25222f8864m001l2492q664K1279M705l2694k9705J2663L4412Q675k4086k1853
$$ -68864 -72865 -105357 -114021 -92742 -88037 -120731 -150436 -137773 -103361 -94686 -118772 -140625
25210a40625L985J8452J4908J2160J8411K2489J4559j824j7009k3545j7940k476
$$ -140625 -136640 -118188 -103280 -91120 -72709 -50220 -35661 -37485 -54494 -78039 -95979 -98455
25198i8455J3468J9001J1139k090q555l419M937K658j2282k3163j2123J4791K9179
$$ -98455 -84987 -65986 -54847 -56937 -65492 -68911 -63974 -61316 -73598 -96761 -108884 -94093 -64914
25185f4914J2464k0106l5788k0737R009K9685L0548J3194j2936k8776j7647Q955
$$ -64914 -52450 -72556 -108344 -129081 -120072 -90387 -59839 -46645 -59581 -88357 -106004 -97049
25173i7049J5936p111k2665R90L2186J7027l0123l6260J7604N6647K1572l8915
$$ -97049 -81113 -88224 -110889 -109899 -77713 -60686 -90809 -127069 -109465 -52818 -31246 -70161
25161g0161m2002N135K6860J377j7879r01J6930P695m701l6J161j0722m992K6467
$$ -70161 -112163 -107028 -80168 -78791 -96670 -97571 -80641 -72946 -77647 -77683 -76522 -87244 -92236 -65769
25147f5769L3996j0718n1958k9196K3284K8785r785k1238J4079L9801K3225r62
$$ -65769 -31773 -42491 -94449 -123645 -100361 -71576 -81361 -102599 -88520 -48719 -25494 -26456
25135b6456n272j2877l5584l6558J920L1439R896k6628k2921K680o786m1621l2352
$$ -26456 -31728 -44605 -80189 -116747 -114827 -83388 -73492 -100120 -123041 -120361 -127147 -168768 -201120
25122b01120L4381P9569M1511l1899m6906Q580N2722K3835l8715n2291l317L8999
$$ -201120 -166739 -87170 -45659 -77558 -124464 -115884 -63162 -39327 -78042 -130333 -133650 -94651
25110i4651K2202j9612k3901N950J5022p866j3057K0258M1971J3748k3254j6136
$$ -94651 -72449 -92061 -115962 -110012 -94990 -102856 -115913 -95655 -53684 -39936 -63190 -79326
25098g9326R894k984m0565l6517J3810M2183J9363k085J6217L3878O873l4364
$$ -79326 -69432 -72416 -112981 -149498 -135688 -93505 -74142 -76227 -60010 -26132 -19259 -53623
25086e3623l6674p793Q649N890M368r21k2474l2815m50M0881K8353k7604m8555
$$ -53623 -90297 -98090 -89441 -83551 -79183 -80104 -102578 -135393 -135843 -94962 -66609 -94213 -142768
25073a42768n706L7997K7628o565r551J3825K1203K737j6842k1136q940J8629
$$ -142768 -148474 -110477 -82849 -89414 -98965 -85140 -63937 -61200 -78042 -99178 -108118 -89489
25061h9489M3653L0429k3032n9212l1584K2468L1587l611j5891J9875M8460K2128
$$ -89489 -45836 -15407 -38439 -97651 -129235 -106767 -75180 -78791 -94682 -74807 -26347 -4219
25049d219k9255m7302k4303J728N346n664j3496q532P313J9496J2661o452j2641
$$ -4219 -33474 -80776 -105079 -103351 -98005 -103669 -117165 -125697 -118384 -98888 -86227 -92679 -105320
25036a05320J855J4194O224p726n615Q248J4142P755K71j324K943J2139J8798
$$ -105320 -103465 -89271 -83047 -90773 -96388 -88140 -73998 -66243 -65972 -67296 -64353 -52214 -33416
25023c3416J0277j0146j9866j0217l152j4647k4079q130J5814J6054O09L140K2937
$$ -33416 -23139 -33285 -53151 -63368 -66520 -81167 -105246 -113376 -97562 -81508 -80899 -77759 -54822
25010e4822K4675m3j6551m556R669j360k2790k4047m090J4373J8102J0277r61
$$ -54822 -30147 -30190 -46741 -51297 -41628 -42988 -65778 -89825 -93915 -79542 -61440 -51163 -52124
24997e2124m527P709K2950J3928k0765m3064k2805J9164L8344K1851p832k9956
$$ -52124 -56651 -48942 -25992 -12064 -32829 -75893 -98698 -79534 -41190 -19339 -27171 -57127
24985e7127l7897k4866R647M0035L2586q537l7588k1465J9286L6562J1647k6400
$$ -57127 -95024 -119890 -110243 -70208 -37622 -46159 -83747 -105212 -85926 -49364 -37717 -64117
24973f4117l6711j1996J6915K0916P334L248J1574Q420j1815j9426L644K7101
$$ -64117 -100828 -112824 -95909 -74993 -67659 -64411 -52837 -44417 -56232 -75658 -72014 -44913
24961d4913J2699k6986m4799k3741Q947K6193K4501O724k0266k9789J445M7028
$$ -44913 -32214 -59200 -103999 -127740 -118793 -92600 -68099 -61375 -81641 -111430 -109985 -62957
24949f2957N0205L601l3767k1193O289n25k5726j9274J8201L6934J6794p894q113
$$ -62957 -12752 -9151 -42918 -64111 -57822 -58347 -84073 -103347 -85146 -48212 -31418 -39312 -47425
24936d7425J228j858q878l563M941j289j4629j0454J4963L6216L0503L711j9735
$$ -47425 -46197 -48055 -56933 -60496 -55555 -56844 -71473 -81927 -66964 -30748 -245 3466 -16269
24923a6269k4310j4518k833N000R592R820M438o73R25J732j1626l0751k6203R664
$$ -16269 -40579 -55097 -57930 -52930 -43338 -33518 -29080 -29753 -28828 -27096 -38722 -69473 -95676 -86012
24909h6012M0181K8948o503j6883P767K4458K433l1264l1248M102L4676L0741
$$ -86012 -45831 -16883 -23386 -40269 -32502 -8044 -5611 -36875 -68123 -64021 -29345 1396
24897A396M77k8974l7890k2317O108K4555J6040j1030k7630j4778J4470K9676
$$ 1396 1873 -27101 -64991 -87308 -81200 -56645 -40605 -51635 -79265 -94043 -79573 -49897
24885d9897J8290p17k191J2603J9057M213j5454j8543p794j094l252m892l645
$$ -49897 -31607 -32324 -34515 -21912 -2855 1358 -14096 -32639 -40433 -41527 -44779 -49671 -53316
24872e3316n366n515P249K4711K0877q620l1202j8765J2818K6649J4831J542J980
$$ -53316 -58682 -64197 -56948 -32237 -11360 -19980 -51182 -69947 -57129 -30480 -15649 -14107 -12127
24859a2127M260m156j4690j4287q482j1366j9069j1569J5417L6212K6078k765
$$ -12127 -7867 -12023 -26713 -41000 -49482 -60848 -79917 -91486 -76069 -39857 -13779 -16544
24847a6544j5110j300J1354K627j1414j0997q127j9371k4917K713M0721L7600
$$ -16544 -31654 -32954 -21600 -18973 -30387 -41384 -49511 -68882 -93799 -91086 -50365 -12765
24835a2765n723k9950o504K1587J3815n664M52J5746O328j2403m412J6590Q836
$$ -12765 -18488 -48438 -54942 -33355 -19540 -25204 -24752 -9006 -2678 -15081 -19493 -2903 5933
24822E933j9232j8164J6851L4080Q777k1074k0607o316m379p384q10N751J749
$$ 5933 -13299 -31463 -14612 19468 28245 7171 -13436 -19752 -24131 -31515 -32325 -26574 -24825
24809b4825j982J855L39j0277j1027K794O519q123j0048J8529M3428K8417q950
$$ -24825 -26807 -24952 -24613 -34890 -45917 -43123 -36604 -44727 -54775 -36246 7182 35599 26649
24796B6649k9301k8431k2122n171K7070M2871J3584k9141l0310N648K3871N091
$$ 26649 -2652 -31083 -53205 -58376 -31306 11565 25149 -3992 -34302 -28654 -4783 308
24784C08j3159l777J4089J6139N026r223k2370k2643j469J9428J0851j3455j3355
$$ 308 -12851 -16628 -2539 13600 18626 9403 -12967 -35610 -37079 -17651 -6800 -20255 -33610
24771c3610J0834J9618N430K767J6346O117l2193m0819O090M6584K1940l1215
$$ -33610 -22776 -3158 2272 5039 21385 27502 -4691 -45510 -39420 7164 29104 -2111
24759b111m0956p004J8996K3162K6305J8977k0193n5052k5110M8284P0684R676
$$ -2111 -43067 -50071 -31075 -7913 18392 37369 17176 -37876 -62986 -14702 55982 65658
24747F5658n2907l8022K4025M9264J5555k7790l7084j4638J3588K4672J1030r887
$$ 65658 12751 -25271 -1246 48018 63573 35783 -1301 -15939 -2351 22321 33351 23464
24735B3464q564J6528K9592P466k3087k3826l14J2675N396k210q76q55l089L553
$$ 23464 14900 31428 61020 68486 45399 21573 21259 33934 39330 37120 36244 35389 32300 35853
24721C5853J3763P500j3730k3689j3088k619k074Q637L6316M6742J4319k6482
$$ 35853 49616 57116 43386 19697 6609 3990 1916 10553 46869 93611 107930 81448
24709H1448k3054J5588K8894n617m1266l4014j238J5785J1632O767N666J051L52
$$ 81448 58394 73982 102876 97259 55993 21979 20741 36526 48158 54925 60591 61642 61994
24696F1994J1283J6093k475k2868j3967Q253K228k5268k3731J4382L2659J121
$$ 61994 73277 89370 86895 64027 50060 58313 60541 35273 11542 25924 58583 59704
24684E9704l0433j0032L3340L6065l976l2980k3548J452J7619K3299J8500J961
$$ 59704 29271 19239 52579 88644 84668 51688 28140 29592 47211 70510 89010 90971
24672I0971j1225m922Q177N559m303K308J7233J2743n816q413J141j0682l9481
$$ 90971 79746 74824 83001 88560 84257 86565 103798 116541 110725 102312 103453 92771 53290
24659E3290l7329Q977M9310M4942K1450J5978J7352k662l4343m6762l4674j4287
$$ 53290 15961 24938 74248 119190 140640 156618 173970 171308 136965 90203 55529 41242
24647D1242O662K5338L0950K0861Q873j167k1013l9323j8869L8023O6470K5398
$$ 41242 47904 73242 104192 125053 133926 132759 111746 72423 53554 91577 158047 183445
24635A83445l3467l6391O414K7172P311j1028p237m598r992J94K2865K0264j2323
$$ 183445 149978 113587 120001 147173 154484 143456 136219 131621 121629 121823 144688 164952 152629
24622A52629k9164q415J0959k293j7300L717L7864L8627J1936J712J3651Q527
$$ 152629 123465 115050 126009 123716 106416 110133 147997 186624 198560 200272 213923 222450
24610B22450k5216m3517j4051K6571K0618k4450m3103q394K6200R509k4038p141
$$ 222450 197234 153717 139666 166237 186855 162405 119302 110908 137108 146617 122579 115438
24598A15438M7523N9051O150l4955j0220L0119K1511j0226o428J6715N524k4523
$$ 115438 162961 222012 228162 193207 182987 213106 234617 224391 217963 234678 240202 215679
24586B15679j6426J6816J1353k5704k2086K6130M0370J350j2238L0772M7683j2289
$$ 215679 199253 216069 227422 201718 179632 205762 246132 247482 235244 266016 313699 301410
24574C01410o5811k8965M0133L8386j6068l1238j560K785k3759j6623L1003N0042
$$ 301410 235599 206634 246767 285153 269085 237847 236287 239072 215313 198690 229693 279735
24562B79735J5445j7089j1782O34k676k38J2914Q090r675L030L9098L1701k9908
$$ 279735 295180 278091 266309 266943 264267 264029 276943 285033 275358 278388 317486 349187 319279
24549C19279o1429j1837M9824M1852o234j6356P454K409l2304l3604J3057M5604
$$ 319279 257850 246013 295837 337689 331455 315099 322553 324962 292658 259054 272111 317715
24537C17715K4385j0311o738K3811L4015R864j8953k3297n709J0095R014N87L550
$$ 317715 342100 331789 325051 348862 382877 392741 373788 350491 344782 354877 363891 364478 368028
24524C68028J6310J5867p087k8314k0828P286K5258K1800J4071J6918K2837J7561
$$ 368028 384338 400205 393118 364804 343976 351262 376520 398320 412391 429309 452146 469707
24512D69707K956m541L422J3002N743r718k373L1386M6372Q723m1632l7374J3631
$$ 469707 472663 468122 471544 484546 490289 480571 478198 509584 555956 564679 523047 485673 499304
24499D99304L3216p489l9791l841N7049O3366J5946j9393j5843n877q966n164
$$ 499304 532520 525031 485240 481399 538448 601814 617760 598367 582524 576647 567681 562517
24487E62517J4733K7738J8746K8j6516k8846k4388R058M8931N6252L2331J3820
$$ 562517 577250 604988 623734 623762 607246 578400 554012 563070 612001 668253 700584 714404
24475G14404Q756j0123l8975l0553K5351O6286M2534q539k1054M472J8893R485
$$ 714404 723160 713037 674062 643509 668860 735146 777680 769141 748087 752559 771452 780937
24463G80937O804J8629J7101m381j3387Q277L4443L5294J6228j018q698p274O064
$$ 780937 787741 806370 823471 819090 805703 813980 848423 883717 899945 898927 890229 882955 889019
24450H89019K4122K6005O340j0103k490J5562K1403J9847K5385K5259l13k8953
$$ 889019 913141 939146 945486 935383 932893 948455 969858 989705 1015090 1040349 1040036 1011083
24438A011083j4044M0609P0531L6667j8554l1998k303K6510L4567L2432J9720
$$ 1011083 997039 1037648 1108179 1144846 1126292 1094294 1091991 1118501 1153068 1185500 1205220
24427A205220p693k0574J3312O2424N8768K491k8069N524M3177K6916o352O099
$$ 1205220 1197527 1176953 1190265 1252689 1311457 1313948 1285879 1291403 1334580 1361496 1355144 1361243
24415A361243M4788M5750J1769K855L0346M2959K0681N094J9908L0489R592j4460
$$ 1361243 1406031 1451781 1463550 1466405 1496751 1539710 1560391 1565485 1585393 1615882 1625474 1611014
24403A611014p401J9416L8300M6472M8684L5069P063o220J1972L6565L8814K7835
$$ 1611014 1603613 1623029 1661329 1707801 1756485 1791554 1798617 1792397 1804369 1840934 1879748 1907583
24391A907583K6592L1886K8302K0937K3962L2450L3115L0050L4736M0996L2707
$$ 1907583 1934175 1966061 1994363 2015300 2039262 2071712 2104827 2134877 2169613 2210609 2243316
24380B243316J0367o356J408L5326P4285Q5875O0665L1250L2204M7956L7615P011
$$ 2243316 2253683 2247327 2248735 2284061 2358346 2444221 2504886 2536136 2568340 2616296 2653911 2660922
24368B660922M954M1330O6747N2776L3942M1558N3961M8602M6005N8920N5664
$$ 2660922 2665876 2707206 2773953 2826729 2860671 2902229 2956190 3004792 3050797 3109717 3165381
24357C165381K4881J7997O5498J07367P9828K0728O667L0555L3491J9646L6057
$$ 3165381 3190262 3208259 3273757 3381124 3460952 3481680 3488347 3518902 3552393 3572039 3608096
24346C608096O5548N2051J8027L7620R4468R3260K8571Q277O9694J07534N2192
$$ 3608096 3673644 3725695 3743722 3781342 3875810 3969070 3997641 4005918 4075612 4183146 4235338
24335D235338o709K9863J03233R6512K4474k237M2790Q1018O9490M9234N1729
$$ 4235338 4228629 4258492 4361725 4458237 4482711 4480474 4523264 4604282 4673772 4723006 4774735
24324D774735N4430M3902M3916O1883P0329N6795L9841K9017J9874K7546O6675
$$ 4774735 4829165 4873067 4916983 4978866 5049195 5105990 5145831 5174848 5194722 5222268 5288943
24313E288943R8564O7097l185j9366M4025R5145N6003j9573k3669N0217J03315
$$ 5288943 5387507 5454604 5451419 5432053 5476078 5571223 5627226 5607653 5583984 5634201 5737516
24302E737516P2751Q355p994L0426O2354M8008J3167L549K4807M5121M2005K3132
$$ 5737516 5810267 5818622 5810628 5841054 5903408 5951416 5964583 5968132 5992939 6038060 6080065 6103197
24290F103197M770n585j533K1442M6745M3044O361k6405k5130o081j527j1144
$$ 6103197 6107967 6102382 6100849 6122291 6169036 6212080 6218441 6192036 6166906 6160825 6159298 6148154
24278F148154j1530K663J6460K0859J4908m991l1771l9484j6820P942N761q951
$$ 6148154 6136624 6139287 6155747 6176606 6191514 6186523 6154752 6115268 6098448 6106390 6112151 6103200
24266F103200q121k661k0906n0565n2267k3350L52J834n365j7410m1089n7192
$$ 6103200 6095079 6092418 6071512 6020947 5968680 5945330 5945682 5947516 5942151 5924741 5883652 5826460
24254E826460l7567j182J493l4168n9553m8986k7231j4322l604l322l3060o5571
$$ 5826460 5788893 5787711 5789204 5755036 5695483 5646497 5619266 5604944 5601340 5598018 5564958 5499387
24242E499387m6314Q461J5043m4306q0137l8143Q012k0180p2675n7521J350N462
$$ 5499387 5453073 5461534 5476577 5432271 5352134 5313991 5322003 5301823 5229148 5171627 5172977 5178439
24230E178439n3336q3881m5050M91m295l5458m7256l8102k9643l0021l8827n1779
$$ 5178439 5125103 5041222 4996172 4996663 4992368 4956910 4909654 4871552 4841909 4811888 4773061 4721282
24218D721282n3276l7373k8690m4189n3410k7018K13j9548n7465n0591j5508k2365
$$ 4721282 4668006 4630633 4601943 4557754 4504344 4477326 4477539 4457991 4400526 4349935 4334427 4312062
24206D312062o2863n6946k517N807n6609q7589l1586J5917k9317q8056n1167K6521
$$ 4312062 4249199 4192253 4189736 4195543 4138934 4051345 4019759 4035676 4006359 3918303 3867136 3893657
24194C893657J4559p0026r1703k7243K27o2216j05608m4235M0627L1455m7927
$$ 3893657 3908216 3838190 3746487 3719244 3719471 3657255 3551647 3507412 3548039 3579494 3531567
24183C531567q6153n3338j5917j5332k4449j8620j4659k8296m5291m8819m1557
$$ 3531567 3445414 3392076 3376159 3360827 3336378 3317758 3303099 3274803 3229512 3180693 3139136
24172C139136l2394k5451k3947k5584j8892k877M40k4136n4466n7684l7466k4595
$$ 3139136 3106742 3081291 3057344 3031760 3012868 3009991 3010431 2986295 2931829 2874145 2836679 2812084
24160B812084k7135k3988q299k873k2348m6693m6623j9398J0284J4678j3348m9615
$$ 2812084 2784949 2760961 2752662 2749789 2727441 2680748 2634125 2614727 2625011 2639689 2626341 2576726
24148B576726n6307k6339m18j5072m4833l5053J0598K5978j9602p1050o7252k5688
$$ 2576726 2520419 2494080 2493662 2478590 2433757 2398704 2409302 2435280 2415678 2344628 2277376 2251688
24136B251688j665n20R619K0566q515o6148q2324l0288K4971J6224l4307n5824
$$ 2251688 2250023 2249503 2259122 2279688 2271173 2205025 2122701 2092413 2117384 2133608 2099301 2043477
24124B043477k7277J1907K6437J3513j9119n7087o8447l4398J0185J1543k4541
$$ 2043477 2016200 2028107 2054544 2068057 2048938 1991851 1923404 1889006 1899191 1910734 1886193
24113A886193l6557o83L0183P232l9678m9547k0706l560j7235k5981m503J8464
$$ 1886193 1849636 1848953 1879136 1886368 1846690 1797143 1776437 1772877 1755642 1729661 1725158 1743622
24101A743622M744l3661m9322k3954Q528Q451j8730l3208j5755Q931J1259p44
$$ 1743622 1748366 1714705 1665383 1641429 1649957 1658408 1639678 1606470 1590715 1599646 1610905 1610161
24089A610161j47R920m66l3358m8527k1602J4799J5993j2557l1069k5679j5170
$$ 1610161 1610014 1619934 1619468 1586110 1537583 1515981 1530780 1546773 1534216 1503147 1477468 1462298
24077A462298r143j417j038k3917m8757l0340K6223N3228J2949m1244m0381j815
$$ 1462298 1453155 1451738 1450700 1426783 1378026 1347686 1373909 1427137 1440086 1398842 1358461 1356646
24065A356646K221l9803o1129k1500L1984L6593m0k4347j7052o004j2507k4313
$$ 1356646 1358867 1319064 1257935 1236435 1268419 1305012 1304972 1280625 1263573 1257569 1245062 1220749
24053A220749k1976l782J7758K5019N113k9241l8255k893L4579J6950m1104o0830
$$ 1220749 1198773 1194991 1212749 1237768 1242881 1213640 1175385 1172492 1207071 1224021 1182917 1122087
24041A122087r988M4221K8217l3309n6943j9528K1771K1691m90j1620j5112k5601
$$ 1122087 1112099 1156320 1184537 1151228 1094285 1074757 1096528 1118219 1117729 1106109 1090997 1065396
24029A065396l2961k2456m614K748K579N059N034l418p468M482J8365J5116K598
$$ 1065396 1032435 1009979 1005365 1008113 1010692 1015751 1020785 1017367 1009899 1014381 1032746 1047862 1050460
24016A050460P99O340m29j9867l1851k7514j8157j3783j3495j5438j7327j0466
$$ 1050460 1051259 1057599 1057170 1037303 1005452 977938 959781 945998 932503 917065 899738 889272
24004H89272Q224K3142J7954O73q504o524l949k210J598j494j5851k0358L049
$$ 889272 897496 920638 938592 939265 930761 924237 920288 918078 919676 918182 902331 881973 885022
23991H85022L0835K6007l733j8695j1354q621j3370j642J6919J562l9455m0949
$$ 885022 915857 941864 938131 919436 908082 899461 886091 884449 901368 902930 863475 822526
23979H22526J4303N1765J4960m3617m4416r20J6863o28n649R968Q358r978j076
$$ 822526 836829 888594 903554 859937 815521 814601 831464 830836 825187 835155 843513 833535 832459
23966H32459L3735L4412j8876o3675m5049R957M1891L4342O700k3716l8365j7402
$$ 832459 866194 900606 881730 818055 773006 782963 824854 859196 865896 842180 803815 786413
23954G86413K2701L0125r393m0564j8274K1320J8099j8159k9334l092J5141j535
$$ 786413 809114 839239 829846 789282 771008 792328 810427 792268 762934 759842 774983 773448
23942G73448k7413l0801j2083J1146K3931J6762l416r576R459K1544l722l6893
$$ 773448 746035 715234 703151 714297 738228 754990 751574 741998 751457 773001 769279 732386
23930G32386k4764K2577L8873J879l3478k1357J1695K0072O929N02J565m263j0862
$$ 732386 707622 730199 769072 770951 737473 716116 727811 747883 754812 755314 756879 752616 741754
23917G41754p245m642j2420j1595J1182K8586J2032j7494k2160q693p743j2368
$$ 741754 734509 729867 717447 705852 717034 745620 757652 740158 717998 709305 701562 689194
23905F89194M792K6400Q527l7623n0703j5625J3544O145J99K3150L6673Q730k0182
$$ 689194 693986 720386 728913 691290 640587 624962 638506 644651 644850 668000 704673 713403 693221
23892F93221l793K6403J3806k4726k9217q88M883k0107k5523K248J4458j0020
$$ 693221 689428 715831 729637 704911 675694 674806 679689 659582 634059 636307 650765 640745
23880F40745k4640J361K6699R653k0934j8784J290l240k3757j7856J2409K1397
$$ 640745 616105 617466 644165 653818 632884 614100 615390 612150 588393 570537 582946 604343
23868F04343l921k3405p928J9913K3745K97k6092l3911j9132M903J7316J1542
$$ 604343 600422 577017 569089 589002 612747 613044 586952 553041 533909 538812 556128 567670
23856E67670M804J2172K0215O932k0732l4738k5696q282P983K3181K4874k925
$$ 567670 572474 584646 604861 611793 591061 556323 530627 522345 530328 553509 578383 575458
23844E75458m2739n0246j2467K8692K8822m267k6129j1198K2979L8573J5653k6282
$$ 575458 532719 482473 470006 498698 527520 523253 497124 485926 508905 547478 563131 536849
23832E36849m4952k3265O570N105j8377k1932K767J9802R267m587o11N237k868
$$ 536849 491897 468632 475202 480307 461930 439998 442765 462567 471834 467247 466636 471873 469005
23819D69005p002R455K4704J2301j2801j9323j0440j0339j6248o540J2532J2340
$$ 469005 462003 471458 496162 508463 495662 476339 465899 455560 439312 432772 445304 457644
23807D57644o927j3151L424J2945l081j9768j0084R917O808j4907j6292J6137
$$ 457644 450717 437566 440990 453935 450854 431086 421002 430919 437727 422820 406528 422665
23795D22665M2777K0869l2557n4893j9232K5805J9323k8456n1525j9987K5530
$$ 422665 465442 486311 453754 398861 379629 405434 424757 396301 344776 324789 350319
23784C50319L8189K0864o5j5544k1546m436K6799K8675j5370n3493l3412J6086
$$ 350319 388508 409372 409307 393763 372217 367781 394580 423255 407885 354392 320980 337066
23772C37066K8107M34j0871Q511J0383k6622n4908l2088J5365L4813J5918j1890
$$ 337066 365173 365607 354736 363247 373630 347008 292100 260012 275377 310190 326108 314218
23760C14218k2000r041J2505J6789l107j4305J2706M6669L1304k3456m9197k6112
$$ 314218 292218 283177 295682 312471 309364 295059 307765 354434 385738 362282 313085 286973
23748B86973q781k3230k0197K6044N3980J4633l6532k7558J0224L798k7657r427
$$ 286973 278192 254962 234765 260809 314789 329422 292890 265332 275556 279354 251697 242270
23736B42270M4379M2100k6968o1820p969N6439M3693j7711m3447j7682J0156J1925
$$ 242270 286649 328749 301781 239961 231992 288431 332124 314413 270966 253284 263440 275365
23724B75365O09j2049k3735k2050k40J9342J2974o330j0738k430k593r040j660
$$ 275365 275974 263925 240190 218140 217900 237242 250216 243886 233148 230718 228125 219085 217425
23711B17425J6941K1911O691p930p937k616k121j919K314K705p275j8459j5786
$$ 217425 234366 256277 262968 255038 247101 244485 242364 240445 242759 245464 238189 219730 203944
23698B03944R21J3283N037j4703j7322Q244L3518K3192j5281l9037k7872o461
$$ 203944 204865 218148 223185 208482 191160 199404 232922 256114 240833 201796 173924 167463
23686A67463o81k938J838N418k764p556Q509L0415L0182R772n669q713j2978k0580
$$ 167463 166782 163844 165682 171100 168336 160780 169289 199704 229886 239658 233989 225276 212298 191718
23672A91718j7385j335J1940J4375J2702R231o35j0157n729O495L875j5474k3311
$$ 191718 174333 172998 184938 199313 212015 221246 220611 210454 204725 211220 215095 199621 176310
23659A76310j231L0474L8693J7882r464k2901k1915j8195j8790j8163p843O510
$$ 176310 175079 205553 244246 262128 252664 229763 207848 189653 170863 152700 144857 151367
23647A51367Q491k381l860J3955K6043J0402j0486l731J3136l666m2399l9833
$$ 151367 159858 157477 153617 167572 193615 204017 193531 189800 202936 199270 156871 117038
23635A17038J7272N7966K9680k2017k7078L238R347j1362r148K1048K6888q613
$$ 117038 134310 192276 221956 199939 172861 176099 185446 174084 164936 185984 212872 204259
23623B04259l4910j7989P367K667j2322m199J3300J0259l306j229P042j588j3244
$$ 204259 169349 151360 158727 161394 149072 144873 158173 168432 165126 163897 170939 169351 156107
23610A56107j379J6054J089l2200l0772J1540M1600K9884P010P10m771k0078j9057
$$ 156107 154728 170782 171871 139671 108899 120439 162039 191923 198933 199643 194872 174794 155737
23597A55737P117J6469j6211m3874j5635L5265L7004r219l2051N33L9737L3966
$$ 155737 162854 179323 163112 119238 103603 138868 175872 166653 134602 135135 174872 208838
23585B08838n120l2095k4353N531K5727R098l2268m4352J418N2583L8476k2887
$$ 208838 203718 171623 147270 152801 178528 187626 155358 111006 112424 165007 203483 180596
23573A80596m7353j3520J0267j3757l0395P558N3194M2623k675k1478j3647j9837
$$ 180596 133243 119723 129990 116233 85838 93396 146590 189213 186538 165060 151413 131576
23561A31576l5236k2559R378J6593p89k020J6446J6760n532j0980J1510K5991
$$ 131576 96340 73781 83159 99752 98963 96943 113389 130149 124617 113637 125147 151138
23549A51138J4962L114J782j0986l7044m1970j3933J3623J8877J9290K2733P847
$$ 151138 166100 169214 170996 160010 122966 80996 67063 80686 99563 118853 141586 149433
23537A49433k1807k3598J0614K5427j0818m4423j4960M8860P0163L0168k1165
$$ 149433 127626 104028 114642 140069 129251 84828 69868 118728 188891 219059 197894
23526A97894l9764k5663k942J678k1295m0045r780M9787N6763j2391o6459k8624
$$ 197894 158130 132467 129525 131203 109908 69863 60083 109870 166633 154242 87783 59159
23514E9159L7627K3391m8583n6068K6173Q3337L6987m3892n6863n366L6495L5654
$$ 59159 96786 120177 71594 15526 41699 125036 162023 118131 61268 55902 92397 128051
23502A28051J3677q772k3640j8981L164J3862k754k1084j6828q412j9493k9027
$$ 128051 141728 132956 109316 90335 93499 107361 104607 83523 66695 58283 38790 9763
23490I763l068M2414N6039K1908k1704l4095j3671J2929K1220O872j2885j7210
$$ 9763 6695 49109 105148 127056 105352 71257 57586 70515 91735 98607 85722 68512
23478F8512o141K869M535J0557J9221J0072j6676k7852p235J3666M459j3840m391
$$ 68512 62371 65240 69775 80332 99553 109625 92949 65097 57862 71528 75987 62147 57756
23465E7756K3576L1123J2148m503o937j0760j9655j7127k120M350l674o138O607
$$ 57756 81332 112455 124603 120100 113163 102403 82748 65621 63501 67851 64177 58039 64646
23452F4646J5694M931j3789j9672r552N531J5349J4180K530r473j1539o666k984
$$ 64646 80340 85271 71482 51810 42258 47789 63138 77318 79848 70375 58836 52170 49186
23439D9186K980J6242K1764m3l3999l6555N439M7587M0436o498l6688j7961J9754
$$ 49186 52166 68408 90172 90129 56130 19575 25014 72601 113037 106539 69851 51890 71644
23426G1644K5468p221l2625j3941K5815L3483j488l3803k7039Q88J3968Q255o02
$$ 71644 97112 89891 57266 43325 69140 102623 101135 67332 40293 41181 55149 63404 62802
23413F2802j0946k1479r793L2062O0284K8424l6851o3180l2297M096J0764Q737
$$ 62802 51856 30377 20584 52646 112930 141354 104503 41323 9026 13122 23886 32623
23401C2623J4716O436k0946k4175J8105N4107L0337k3382l7694o473J5038K724
$$ 32623 47339 53775 32829 8654 26759 80866 111203 87821 50127 43654 58692 61416
23389F1416o972J3864L7637K3935k2399n7339m8085n406K9574K8645O283k980
$$ 61416 54444 68308 105945 129880 107481 50142 2057 -3349 26225 54870 61153 58173
23377E8173N489L949j4578j7332J1944L4764J2704k8951l7209r798J0745P163
$$ 58173 63662 67611 53033 35701 47645 82409 95113 66162 28953 19155 29900 37063
23365C7063Q66K343p75o866o9J1445M487j0195P23K8099K3423k0075m7438k4990
$$ 37063 37929 40272 39497 32631 32562 44007 48494 38299 39022 67121 90544 70469 23031 -1959
23351a959J2462K4917K2310K1922O198l0862m5014n248M2986L7404q746l4299
$$ -1959 10503 35420 57730 79652 85850 54988 9974 4726 47712 85116 76370 42071
23339D2071k4628j4080j2489J925K3929K3319N800O503J9161P38m2469m7052M186
$$ 42071 17443 3363 -9126 -7201 16728 40047 45847 52350 71511 72249 29780 -17272 -13086
23326a3086M3301K0991j6617p646K5290K0056j9527l4439o530K2947K3851Q383
$$ -13086 30215 51206 34589 26943 52233 72289 52762 18323 11793 34740 58591 66974
23314F6974o744j8020j5387P229K3060L947k1712j230M7687M4133l0581q5514
$$ 66974 60230 42210 26823 34052 57112 61059 39347 38117 85804 129937 99356 13842
23302A3842m5034L7263N4449k522m3742j6190L3500M2211J3909p693o832j294
$$ 13842 -31192 6071 60520 57998 14256 -1934 31566 73777 87686 79993 73161 71867
23290G1867l377o370k746M304O745Q46p639p227L917J0130j938j9581j7345O656
$$ 71867 68490 62120 59374 63678 70423 71269 63630 56403 60320 70450 68512 48931 31586 38242
23276C8242K6543K2680J861j8223k5582j3937J1433K5694Q254k0741j8406J6996
$$ 38242 64785 87465 89326 71103 45521 31584 43017 68711 76965 56224 37818 54814
23264E4814L5761R198k4556j8529J1317J5022j1709k5722p586J3545J2028M05
$$ 54814 90575 99773 75217 56688 68005 83027 71318 45596 38010 51555 63583 63988
23252F3988k281k453j2101k1514j3513Q656K4279J9144j734j8995j4742P860K3571
$$ 63988 61707 59254 47153 25639 12126 20782 45061 64205 62471 43476 28734 36594 60165
23239F0165J5777P31J889R250n546l6576m3627j3093J8239J7533L11k577P176
$$ 60165 75942 76673 78562 87812 82266 45690 2063 -11030 7209 24742 25053 22476 29652
23226B9652R305L653L516O343J396m494L039J7995K0918P279j1328k4429k2609
$$ 29652 38957 42610 46126 52469 53865 49371 52410 70405 91323 98602 87274 62845 40236
23213D0236K848L6177L4391j6382o0638l6369L1036N2538j316n7303m2182K0817
$$ 40236 43084 79261 113652 97270 36632 263 31299 83837 82521 25218 -16964 3853
23201C853N4683L2179o378j9452o488J0897J6412N744j1583j6133j082J3033M077
$$ 3853 58536 90715 84337 64885 58397 69294 85706 91450 79867 63734 62652 75685 79762
23188G9762j6259j5390J1598L0291J2774k3333l6672j4197J4200J4445r071j9448
$$ 79762 63503 48113 59711 90002 102776 79443 42771 28574 42774 57219 48148 28700
23176B8700M342L6824L5880j861l4566k9073j224J2229N037P96Q990J1186l492
$$ 28700 33042 69866 105746 103885 69319 40246 39022 51251 56288 57084 66074 77260 73768
23163G3768j5849o486R689K782k4321l3436l878L3303L3069j729k1489L093L9458
$$ 73768 57919 51433 61122 63904 39583 6147 2269 35572 68641 66912 45423 48516 87974
23150H7974L6680m966l4456j7985J9992L2969R244k2706l2703j5893J1952L0236
$$ 87974 124654 119688 85232 67247 87239 120208 129452 106746 74043 58150 70102 100338
23138A00338K6025L204j9158k4127j2147M379J5541J6587M697j4764k4281j1498
$$ 100338 126363 129567 110409 86282 74135 78514 94055 110642 115339 100575 76294 64796
23126F4796J0664J6259O53j2659n316J1077J4690N498M8O85p579k5465k7846j54
$$ 64796 75460 91719 92372 79713 74397 85474 100164 105662 105710 106395 98816 73351 45505 45351
23112D5351L0309K5200q774k4406M56L2354L2511R159n591o888j0742j3691o51
$$ 45351 75660 100860 92086 67680 68136 100490 133001 142160 136569 129681 118939 105248 104597
23099A04597J4578K183k8495l3654m527J6032M418o492R810K2603j004l1824k2721
$$ 104597 119175 121358 92863 59209 54682 70714 75132 68640 78450 101053 100049 68225 45504
23086D5504J3664K8598J6296Q748P800j0805l2316j4228L0340L4027j8105n3296
$$ 45504 59168 87766 104062 112810 120610 109805 77489 63261 93601 127628 109523 56227
23074E6227j8711L7412M0299m754l4751k2747N389K4087K6996R768j9664k7866
$$ 56227 37516 74928 115227 110473 75722 52975 58364 82451 109447 119215 99551 71685
23062G1685L303L7230K8858m189q062J9715K7755j773k4139q457J1776l644l5462
$$ 71685 74988 112218 141076 136887 128825 148540 176295 174522 150383 141926 153702 150058 114596
23049A14596l5886q8L1978L3113J5209N46o366j1715j3184k88K6037M2384K4540
$$ 114596 78710 78622 110600 143713 158922 159468 153102 141387 128203 127915 153952 196336 220876
23036B20876j6068l4778p984L0450L0909n407l1727k1406N548K1689K2471J1728
$$ 220876 204808 170030 162046 192496 223405 217998 186271 164865 170413 192102 214573 226301
23024B26301q263k2255j0655J5998K3890P919J34J3173J8279N35j0219N332J5683
$$ 226301 218038 195783 185128 201126 225016 232935 233069 246242 264521 265056 254837 260169 275852
23011B75852n495k5954q534J9566J1660j4881r415J8791J5947j5890j7439K1209
$$ 275852 270357 244403 235869 255435 267095 252214 242799 261590 277537 261647 244208 265417
22999B65417L7676N072j9915L122K7373L881k9341j4011K4578K1123j6511k2844
$$ 265417 303093 308165 288250 291372 318745 322626 293285 279274 303852 324975 308464 285620
22987B85620J2347L1160Q035j5953j2252n427j2005n785K3674L7208J0096k0763
$$ 285620 297967 329127 337162 321209 308957 303530 291525 285740 309414 346622 356718 335955
22975C35955j6600J583j661j1063L447K0039j014l8455l4712Q359K9240P632n305
$$ 335955 319355 320938 319277 308214 311661 331700 330686 292231 257519 265878 295118 302750 297445
22962B97445K1281M3114J6663k4780k2661J5682L2845R179j7640j5166O576K3343
$$ 297445 318726 361840 378503 353723 331062 346744 379589 388768 371128 355962 362538 385881
22950C85881K6345J7586L169l962L392J0974J676j4007j2151M027R312J288L291
$$ 385881 412226 429812 432981 429019 432411 443385 445061 431054 418903 422930 432242 433530 436821
22937D36821J7289J4421j2202k5447n46L1645L1409J1386J0345K5998K1273q664
$$ 436821 454110 468531 456329 430882 430336 461981 493390 504776 515121 541119 562392 553728
22925E53728k3397k09K9637K6402m322k5299j8165P84P367m382k0875k3438m166
$$ 553728 530331 530122 559759 586161 581839 556540 538375 539159 546526 542144 521269 497831 493665
22912D93665K6553M6850L9860P667k6041l0579J253L5807L0869o672k1315J3222
$$ 493665 520218 567068 606928 614595 588554 557975 559228 595035 625904 619232 597917 611139
22900F11139M5996J7077m7247o2569p908M2226K7840j2037p161L5069M7420J0037
$$ 611139 657135 674212 626965 564396 556488 598714 626554 614517 607356 642425 689845 699882
22888F99882k2773q799K2272K0287r801j9155J1796M5562L9484K574j8609l098
$$ 699882 677109 668310 690582 710869 701068 681913 693709 739271 778755 781329 762720 759622
22876G59622K0119J9452Q140J8127M1562L8213L239j6108R071M1036L0126j1229
$$ 759622 779741 799193 807333 825460 867022 905235 908474 892366 901437 942473 972599 961370
22864I61370k9401p082K1981K8717K0012J3591J4805K1611K6284J3635j5677k6554
$$ 961370 931969 924887 946868 975585 995597 1009188 1023993 1045604 1071888 1085523 1069846 1043292
22852A043292J0786O5647P3028K0757l0890k9589Q019L3336K7957O785j0253p281
$$ 1043292 1054078 1119725 1192753 1213510 1182620 1153031 1161050 1194386 1222343 1229128 1218875 1211594
22840A211594J9804M5806L5345k804j5766J6336M4250K4456j0950o778K6420L4580
$$ 1211594 1231398 1277204 1312549 1309745 1293979 1310315 1354565 1379021 1368071 1361293 1387713 1422293
22828A422293J0570j345J4567K4449J1646O353K8432M8685L4984K785q304J3227
$$ 1422293 1432863 1431518 1446085 1470534 1482180 1488533 1516965 1565650 1600634 1603419 1595115 1608342
22816A608342M2628M8423K0377j7169k0798K0321N5415L1354k4124l0095K9364
$$ 1608342 1650970 1699393 1719770 1702601 1681803 1702124 1757539 1788893 1764769 1734674 1764038
22805A764038P5813N1419J747k176K8284L2206L324j0355N734J7048J1047J6499
$$ 1764038 1839851 1891270 1893017 1890841 1919125 1951331 1954655 1944300 1950034 1967082 1978129 1994628
22793A994628M0064M5357J8038j972J5674M0212K8974n898j9653n17K5094L7255
$$ 1994628 2034692 2080049 2098087 2096115 2111789 2152001 2180975 2175077 2155424 2154907 2180001 2217256
22781B217256L6878K6080P932o67J2708K9029K0484k039J514L8361O5519M9851
$$ 2217256 2254134 2280214 2288146 2287479 2300187 2329216 2349700 2347661 2349175 2387536 2453055 2502906
22769B502906J5943J0495L8568O2178N3706K5821P658R584J7940J6569Q560J4848
$$ 2502906 2518849 2529344 2567912 2630090 2683796 2709617 2717275 2726859 2744799 2761368 2769928 2784776
22757B784776M5624P5954O7990K4396l904J6807N2197M7566J0588L47L5245O5250
$$ 2784776 2830400 2906354 2974344 2998740 2994836 3011643 3063840 3111406 3121994 3122341 3157586 3222836
22745C222836N3131L0148L5252M5779K2399j0437L628N4641P2847L9101J6043
$$ 3222836 3275967 3306115 3341367 3387146 3409545 3399108 3402736 3457377 3530224 3569325 3585368
22734C585368M3962P4111N1649R090J4154N9699P6423M3151J5368L4641O8624
$$ 3585368 3629330 3703441 3755090 3764180 3778334 3838033 3914456 3957607 3972975 4007616 4076240
22723D076240O7013L5035J7300L1189M8707M0229J4900J0578M7018R4905J03411
$$ 4076240 4143253 4178288 4195588 4226777 4275484 4315713 4330613 4341191 4388209 4483114 4586525
22712D586525O3378K4491L2702O9594Q2527O0754M2970N2563O7658O4895N5356
$$ 4586525 4649903 4674394 4707096 4776690 4859217 4919971 4962941 5015504 5083162 5148057 5203413
22701E203413N9595P5741Q9633R3725Q3363N8293L7606M4870O8492P1154N1731
$$ 5203413 5263008 5338749 5428382 5522107 5605470 5663763 5701369 5746239 5814731 5885885 5937616
22690E937616N5070R6584J24516R7360N5689O1815J00599J07138P5166O3067R1212
$$ 5937616 5992686 6089270 6213786 6311146 6366835 6428650 6529249 6636387 6711553 6774620 6865832
22679F865832J10025R1763Q2577J21189J64177J50860J04729J03170J60178K05476
$$ 6865832 6975857 7067620 7150197 7271386 7435563 7586423 7691152 7794322 7954500 8159976
22669H159976J89333J51256J56259K02583K32887K19686J98907K14743K61586
$$ 8159976 8349309 8500565 8656824 8859407 9092294 9311980 9510887 9725630 9987216
22660I987216K96838K95827K76027K71310K95979L34547L58319L52551L34429
$$ 9987216 10284054 10579881 10855908 11127218 11423197 11757744 12116063 12468614 12803043
22651A2803043L40447L85796M41102M65046M57230M57493M90338N35495N64994
$$ 12803043 13143490 13529286 13970388 14435434 14892664 15350157 15840495 16375990 16940984
22642A6940984N85049O21403O81230P52025Q26057R04817R88913J082388J197324
$$ 16940984 17526033 18147436 18828666 19580691 20406748 21311565 22300478 23382866 24580190
22633B4580190J337146J488231J644877J822944K023119K197942K282769K240851
$$ 24580190 25917336 27405567 29050444 30873388 32896507 35094449 37377218 39618069
22625C9618069K050784J686634J172504O41492K65346J07194R3568J37965K28052
$$ 39618069 41668853 43355487 44527991 45169483 45434829 45542023 45635591 45773556 46001608
22616D6001608L72418N35205O74912Q01065R41803J089474J224311J361345J526773
$$ 46001608 46374026 46909231 47584143 48385208 49327011 50416485 51640796 53002141 54528914
22607E4528914J711319J888664K054986K209130K324095K389289K455692K582416
$$ 54528914 56240233 58128897 60183883 62393013 64717108 67106397 69562089 72144505
22599G2144505K757291K929068L102483L335735L649617M006156M380514M788618
$$ 72144505 74901796 77830864 80933347 84269082 87918699 91924855 96305369 101093987
22591A01093987N234558N695842O177322O719143P335785Q012423Q778265R703422
$$ 101093987 106328545 112024387 118201709 124920852 132256637 140269060 149047325 158750747
22583A58750747J0790783J1961463J3196922J4566651J5964680J6884749J6685683
$$ 158750747 169541530 181502993 194699915 209266566 225231246 242115995 258801678
22576B58801678J5198345J2985305J0901351R433567Q528066P948342P563828
$$ 258801678 274000023 286985328 297886679 307320246 315848312 323796654 331360482
22569C31360482P191657O358854M537498J711607j485415m397116p041033r966910
$$ 331360482 338552139 344910993 349448491 351160098 349674683 345277567 338236534 328269624
22561C28269624j3387553j6654085j8739274j9147907j8231905j6716607j5121735
$$ 328269624 314882071 298227986 279488712 260340805 242108900 225392293 210270558
22554B10270558j3630100j2272717j1061207r991106r040952q192483p424004
$$ 210270558 196640458 184367741 173306534 163315428 154274476 146081993 138657989
22547A38657989o705987o036925n459210n003794m638194m301096l969908l663351
$$ 138657989 131952002 125915077 120455867 115452073 110813879 106512783 102542875 98879524
22539I8879524l395893l163968k964989k797334k648910k513180k407192k345132
$$ 98879524 95483631 92319663 89354674 86557340 83908430 81395250 78988058 76642926
22531G6642926k301590k230439k115773j977706j835327j696337j579303j507174
$$ 76642926 74341336 72110897 69995124 68017418 66182091 64485754 62906451 61399277
22523F1399277j469802j425781j354809j281272j233378j207009j186004j168694
$$ 61399277 59929475 58503694 57148885 55867613 54634235 53427226 52241222 51072528
22515E1072528j150819j109776j038638r74744r54536r52954r14881q45526q14972
$$ 51072528 49921709 48811933 47773295 46798551 45844015 44891061 43976180 43130654 42315682
22506D2315682q53232q91692q50194p47788o74522o69249o81634o56881o03095
$$ 42315682 41462450 40570758 39720564 38972776 38298254 37629005 36947371 36290490 35687395
22497C5687395n55612n21609m92033m74219m75416m76221m55930m27436m12647
$$ 35687395 35131783 34610174 34118141 33643922 33168506 32692285 32236355 31808919 31396272
22488C1396272m00286l67957l32474l29761l48155l34788k78961k37677k53634
$$ 31396272 30995986 30628029 30295555 29965794 29617639 29282851 29003890 28766213 28512579
22479B8512579k90857k85795k31686j76366j56367j66169j80456j80492j67730
$$ 28512579 28221722 27935927 27704241 27527875 27371508 27205339 27024883 26844391 26676661
22470B6676661j67392k01416k45165k42573j87389j50271j85911k51043k69510
$$ 26676661 26509269 26307853 26062688 25820115 25632726 25482455 25296544 25045501 24775991
22461B4775991k46158k43776k66707k57824k18153k33389l41640m56381m80633
$$ 24775991 24529833 24286057 24019350 23761526 23543373 23309984 22968344 22511963 22031330
22452B2031330m34812m02816m01869l86398l49193l31382l40185l37263l13770
$$ 22031330 21596518 21193702 20791833 20405435 20056242 19724860 19384675 19047412 18733642
22443A8733642l02924l05686k78151k17739j89795k27592k69227k48489j97872
$$ 18733642 18430718 18125032 17846881 17629142 17439347 17211755 16942528 16694039 16496167
22434A6496167j95507k43100k68306k35790j87746j69267j72213j70189j63179
$$ 16496167 16300660 16057560 15789254 15553464 15365718 15196451 15024238 14854049 14690870
22425A4690870j64103j71794j77574j78108j70394j53983j43495j55049j75791
$$ 14690870 14526767 14354973 14177399 13999291 13828897 13674914 13531419 13376370 13200579
22416A3200579j74419j47194j22284j11750r7088p6274q1716j23266j52350j23265
$$ 13200579 13026160 12878966 12756682 12644932 12547844 12471570 12389854 12266588 12114238 11990973
22406A1990973o3166l7184o0626q9082q6967o4684m9529n4884p8311j00944r3491
$$ 11990973 11927807 11890623 11829997 11740915 11653948 11589264 11539735 11484851 11406540 11305596 11212105
22395A1212105n2940k4042m7357r4806j01852o0160k6666l6155o0715o9898p2798
$$ 11212105 11159165 11135123 11087766 10992960 10891108 10830948 10804282 10768127 10707412 10637514 10564716
22384A0564716p5242n3690r360O255l1167o4152l5084J8826K2468j5598k0291
$$ 10564716 10489474 10435784 10426424 10432679 10401512 10337360 10302276 10321102 10343570 10327972 10307681
22373A0307681K3168M6689J4337k2079j2648J5092J3140r261j4382k865j848j3543
$$ 10307681 10330849 10377538 10391875 10369796 10357148 10372240 10385380 10376119 10361737 10358872 10357024 10343481
22361A0343481k2120l2630n9851r1910j04150r8876r5950r4785q2267o9173p9040
$$ 10343481 10321361 10288731 10228880 10136970 10032820 9933944 9837994 9743209 9660942 9591769 9512729
22350I512729j03983j10362r0487p3260p8862r5695j07407j10655j01024p5596
$$ 9512729 9408746 9298384 9207897 9134637 9055775 8960080 8852673 8742018 8640994 8565398
22340H565398n6537p4030j13503j21074q2455n3905q0825j23650j13221n5992
$$ 8565398 8508861 8434831 8321328 8200254 8117799 8063894 7983069 7859419 7746198 7690206
22330G690206k6972o1555j08862j07336o3924l2419m0190o4885p2737n7759m2622
$$ 7690206 7663234 7601679 7492817 7385481 7321557 7289138 7248948 7184063 7111326 7053567 7010945
22319G010945m9807p3601q4412o7277m6505n4290q2664r3883p7017o0287o0041
$$ 7010945 6961138 6887537 6803125 6735848 6689343 6635053 6552389 6458506 6381489 6321202 6261161
22308F261161n6146l7464l2890o3294r4250q1046m0649k9440n8618q3121p5430
$$ 6261161 6205015 6167551 6134661 6071367 5977117 5896071 5855422 5825982 5767364 5684243 5608813
22297E608813n8563n5600n7220n8268p6668j07091j03336m7740K128j3038o4429
$$ 5608813 5550250 5494650 5437430 5379162 5302494 5195403 5092067 5044327 5046455 5033417 4968988
22286D968988p7464m5047l1624o4694r0852o2445j1709r26l6137p0887p4286n7430
$$ 4968988 4891524 4846477 4814853 4750159 4659307 4596862 4585153 4584227 4548090 4477203 4402917 4345487
22274D345487m1767l3527l0376l1903l8964n1173o3620o4118m4946k1319k0353
$$ 4345487 4303720 4270193 4239817 4207914 4168950 4117777 4054157 3990039 3945093 3923774 3903421
22263C903421m1670m9563k2525Q473j807m7160p4259n3886j7936j2794l8304n4774
$$ 3903421 3861751 3812188 3789663 3798136 3796329 3749169 3674910 3621024 3603088 3590294 3551990 3497216
22251C497216m0742j8639j7805l2804l6910k6388k4575l9565m7431l2957j8989
$$ 3497216 3456474 3437835 3420030 3387226 3350316 3323928 3299353 3259788 3212357 3179400 3160411
22240C160411k8589m2655l2237j3828k5033n5672n8665l0077j7619l7366m5910
$$ 3160411 3131822 3089167 3056930 3043102 3018069 2962397 2903732 2873655 2856036 2818670 2772760
22229B772760k0120k61j6824l7254l2822l5366o6752p4270j6556L9744P552p3619
$$ 2772760 2752640 2752379 2735555 2698301 2665479 2630113 2563361 2489091 2472535 2512279 2519831 2446212
22217B446212q8715k6230J3005j3172l4551j0631K56l5034n0079k879L0532k0493
$$ 2446212 2357497 2331267 2344272 2331100 2296549 2285918 2286174 2251140 2201061 2198182 2228714 2208221
22205B208221r0867p8762p789K2370k583j7071q593k2349m8102k6554K6841K5579
$$ 2208221 2117354 2038592 2030803 2053173 2050590 2033519 2024926 2002577 1954475 1927921 1954762 1980341
22193A980341l8226o4637o712M8357J8050n0242o6531l4157j5593j9779j0994
$$ 1980341 1942115 1877478 1870766 1919123 1937173 1886931 1820400 1786243 1770650 1750871 1739877
22182A739877O064n192l6774m2263j3597J0144Q271j257o070j4416k4801k4593
$$ 1739877 1745941 1740749 1703975 1661712 1648115 1658259 1666530 1665273 1659203 1644787 1619986 1595393
22170A595393j9939k6918l4958k0981K595O61k1947k1615R145J9949j9704o5560
$$ 1595393 1575454 1548536 1513578 1492597 1495192 1495853 1473906 1452291 1461436 1481385 1461681 1396121
22158A396121n7645m273L1946J7358j8735l0896j1064J1619R714j3914l4944l8364
$$ 1396121 1338476 1334203 1366149 1383507 1364772 1333876 1322812 1334431 1344145 1330231 1295287 1256923
22146A256923l0829k1175n857J3204J4769j2481l9984l0990M271K0522K683j9738
$$ 1256923 1226094 1204919 1199062 1212266 1227035 1214554 1174570 1143580 1147851 1168373 1171056 1151318
22134A151318k5936k7842l1171j9304N085Q752j5650k7809o533J0128o423j7563
$$ 1151318 1125382 1097540 1066369 1047065 1052150 1060902 1045252 1017443 1010910 1021038 1014615 997052
22122I97052J3201M0539N201n2895m4940J7342K9661l4561p2481j4191O4141O0014
$$ 997052 1010253 1050792 1055993 1003098 958158 975500 1005161 970600 898119 883928 948069 1008083
22110A008083m064l5927j9913j0754k0738j4359L103q570l3906j5027L5714L5668
$$ 1008083 1004019 968092 948179 937425 916687 902328 905431 896861 862955 847928 883642 919310
22098I19310l0398p0542k7447L1609K8306m886L446L4717J8948l6310n3952j1637
$$ 919310 888912 818370 790923 822532 850838 845952 849398 884115 903063 866753 812801 801164
22086H01164K9529K2727j2260m0492m9548k9844J8740N3412K6263l4703m8976
$$ 801164 830693 853420 841160 800668 751120 721276 740016 793428 819691 784988 736012
22075G36012j489L3949J1084k3188j4872J5864K5115J4333j20k6587n4793l5583
$$ 736012 734523 768472 779556 756368 741496 757360 782475 796808 796688 770101 715308 679725
22063F79725L3250O4599L540o8935m9862J9679K0553m4780n7223J3446N4096m88
$$ 679725 712975 777574 781114 712179 662317 681996 702549 657769 600546 613992 668088 667600
22051F67600n8315k6864L5909K7422k9018l5263J4285L5857L823j8874p70R126
$$ 667600 609285 582421 618330 645752 616734 581471 595756 631613 635436 616562 615792 624918
22039F24918k3337n6145m2540k398J7536J1207M379Q814J6030J6433M271j8731
$$ 624918 601581 545436 502896 500498 518034 529241 533620 542434 558464 574897 579168 560437
22027E60437l3857k1722M688J0871p752j7908l243R738o53j4378p723M177l326
$$ 560437 526580 504858 509546 520417 512665 494757 491514 501252 500599 486221 478498 482675 479349
22014D79349j8080j2119P960J0547q994k1796j0231J0550J8252P783j1230k2979
$$ 479349 461269 449150 457110 467657 458663 436867 426636 437186 455438 463221 451991 429012
22002D29012j4421P004J2240j2015l5610k2380J3836K6244N509q059R135K7418
$$ 429012 414591 421595 433835 421820 386210 363830 377666 403910 409419 401360 410495 437913
21990D37913J4131j5389k6073j5877q061r072p233k686o520j4392r845O392J5662
$$ 437913 452044 436655 410582 394705 386644 377572 370339 367653 361133 346741 336896 343288 358950
21977C58950J1068M971N451P331Q301J1543J0366n068k2269j5879R207J5382j1219
$$ 358950 370018 374989 380440 387771 396072 407615 417981 412913 390644 374765 383972 399354 388135
21964C88135l3177j6201J6238J7069j4330l5741k6723q297J893J2411K5948K3233
$$ 388135 354958 338757 354995 372064 357734 321993 295270 286973 288866 301277 327225 350458
21952C50458j590k1434j5951l981r136j7063j485K3991K1098j0582k7943r064
$$ 350458 348868 327434 311483 307502 298366 281303 279818 303809 324907 314325 286382 277318
21940B77318J3868M901k1800k5313J764K5405J8716n444j5914l034J2323O492
$$ 277318 291186 296087 274287 248974 250738 276143 294859 289415 273501 270467 282790 289282
21928B89282j5782k4082j178K8183K4189j2219l4193j1866K3341K2261j1411k9302
$$ 289282 273500 249418 248240 276423 300612 288393 254200 242334 265675 287936 276525 247223
21916B47223j2271M757o656k1442l093L3284L8615K534k9730k0297J2440K4819
$$ 247223 234952 239709 233053 211611 208518 241802 280417 282951 253221 232924 245364 270183
21904B70183O265j6464k2617j9320j7734r899J5126M2167L7982n505n0617n1689
$$ 270183 276448 259984 237367 218047 200313 190414 205540 247707 285689 280184 229567 177878
21892A77878q940L1897L5235J2278o069j2182j7394k0159q496R488J0047n078
$$ 177878 168938 200835 236070 248348 242279 230097 212703 192544 184048 193536 203583 198505
21880A98505m276K1539L3448m09m7701m8228J845M2773L2763j350j2424q65l794
$$ 198505 194229 215768 249216 248807 201106 152878 154723 197496 230259 228909 216485 215620 211826
21867B11826l1590m9925k9904R486K6316J1752p56J3928L3278J8629k3339m1558
$$ 211826 180236 130311 100407 109893 136209 147961 147205 161133 194411 213040 189701 148143
21855A48143j1671K4480J5641k4906l8716o321K9207K7852K940j0866p591l603
$$ 148143 136472 160952 176593 151687 112971 106650 135857 163709 166649 155783 148192 144589
21843A44589l925j755J399j429p457r540q597o118M272K1765K8161J2351p411
$$ 144589 140664 138909 140308 138879 131422 121882 113285 107167 111439 133204 161365 173716 166305
21830A66305q286J183l348j8253j5796P404J9025L97k0845r523K2638K9385m196
$$ 166305 158019 159202 155854 137601 121805 129209 148234 148631 127786 118263 140901 170286 166090
21817A66090l4667j6051L2056M2503p831n8609m6032N895K2780n620j4619K2256
$$ 166090 131423 115372 147428 189931 182100 123491 77459 83354 106134 100514 85895 108151
21805A08151M4124N377m1158k6621K1920L0148m69p374J6144J5310j6863k3927
$$ 108151 152275 157652 116494 89873 111793 141941 141472 134098 150242 165552 148689 124762
21793A24762M481O332l6212n0517L274N1126J8466m8517n8113j2860J5754J1391
$$ 124762 129243 135575 99363 48846 52120 103246 121712 73195 15082 2222 17976 29367
21781B9367J6823L6667L0584p86r415J3440K1293l101j8111J131K0024M158k8896
$$ 29367 46190 82857 113441 112655 103240 116680 137973 134872 116761 117892 137916 142074 113178
21768A13178m3098k8764M170L8978M6743J1204l0871k2729K6764M5344M090l8223
$$ 113178 70080 41316 45486 84464 131207 142411 111540 88811 115575 160919 165009 126786
21756A26786k9074p43o873l0369j6592L0726N0935J6829k9006l4778m61L1738
$$ 126786 97712 96969 90096 59727 43135 73861 124796 141625 112619 77841 77380 109118
21744A09118K7381o966l2721k2182Q502K1183O407j1163j5594j4671j0131O048
$$ 109118 136499 129533 96812 74630 83132 104315 110722 99559 83965 69294 59163 65211
21732F5211J8199j706l4754k3438L4411O1520J3346m5770l6878J6362L6163J3090
$$ 65211 83410 81704 46950 23512 57923 119443 132789 87019 50141 66503 102666 115756
21720A15756k481j047j5221l4668j4468K9163K5475l0756n6541j0898L7583K1928
$$ 115756 113275 112228 97007 62339 47871 77034 102509 71753 15212 4314 41897 63825
21708F3825j9582j4921K4805L3758O26k4352j5817l45J724M844J8304K2055J171
$$ 63825 44243 29322 54127 87885 88511 64159 48342 47997 49721 54565 72869 94924 96095
21695I6095k4279k4089O93J7321J459l0255l6464l706L0783K6606k342r892R120
$$ 96095 71816 47727 48420 65741 67200 36945 481 -3225 27558 54164 51822 41930 51050
21682E1050J2460j4545k8633K73L4400K5640r273k0638o170l579j7663j4320J2605
$$ 51050 63510 48965 20332 20605 55005 80645 71372 50734 44564 40985 23322 9002 21607
21669B1607K5557P279r410K150J8699Q951j3480j4035O673J6321J001k0056k7514
$$ 21607 47164 54443 45033 47183 65882 74833 61353 47318 53991 70312 71313 51257 23743
21656B3743k1183m636K1041L9635K4244k1480m9784k5068K1722L1137M96j4557
$$ 23743 2560 -2076 18965 58600 82844 61364 11580 -13488 8234 39371 39867 25310
21644B5310R518K5881k043l3452j4877K7082K5020j9048l8211j0414J5474J3124
$$ 25310 34828 60709 58666 25214 10337 37419 62439 43391 5180 -5234 10240 23364
21632B3364J6080L6245K8169k1680m8710j2986K3818j428m0627j3825M8456M9707
$$ 23364 39444 75689 103858 82178 33468 20482 44300 42872 2245 -11580 36876 86583
21620H6583j2601m4950j2221J7848K401j0823J6168L8980J2513k8752l0942m248
$$ 86583 73982 29032 16811 34659 37060 26237 42405 81385 93898 65146 34204 29956
21608B9956R552O025K568m488j7773j2152K1499M1717J4150k9730l9541j8476
$$ 29956 39508 45533 48101 43613 25840 13688 35187 76904 91054 61324 21783 3307
21596C307R6J3323L0946L0169p823m2948k6880J1183M150l8817m0568J6298N4984
$$ 3307 3403 16726 47672 77841 70018 27070 190 11373 15523 -23294 -63862 -47564 7420
21583G420K4162k4513k2863J1674J7632q674j7090Q138K4748L153k5594j5018
$$ 7420 31582 7069 -15794 -4120 13512 4838 -12252 -4114 20634 23787 -1807 -16825
21571a6825K8774N2262K4130k4162m0209j7755L501J330j354J4217K2868k872
$$ -16825 11949 64211 88341 64179 23970 6215 9716 11046 9692 23909 46777 43905
21559D3905l8864l9127m321K2831K2646J5732J7183J6346O396l527r870j5078
$$ 43905 5041 -34086 -38407 -15576 7070 22802 39985 56331 62727 59200 49330 34252
21547C4252q907J3281K1298j1994m9844l0744K8323M1251j4698n4748j6154M3120
$$ 34252 25345 38626 59924 47930 -1914 -32658 -4335 36916 22218 -32530 -48684 -5564
21535e564L7942j3109k8909K750J9985m522l0595k7002j1183j955R176K3714K1731
$$ -5564 32378 19269 -9640 -6890 13095 8573 -22022 -49024 -60207 -62162 -52986 -29272 -7541
21522g541K43j2328K082K3828K4011q69k9273l3289j503L9105L9529p337m2305
$$ -7541 -7298 -19626 -17544 6284 30295 29426 153 -33136 -34639 4466 43995 36658 -5647
21509e647j7263K9298K7616j4565k8067K945K2664O798j350J7638J6889k4871
$$ -5647 -22910 6388 34004 19439 -8628 -5683 16981 23779 22429 40067 56956 32085
21497C2085m8287r512L7137K4336j6592j1275L1323L7869n442l7380k6428q144
$$ 32085 -16202 -25714 11423 35759 19167 7892 39215 77084 71642 34262 7834 -310
21485c10r283r816J896L599q490l282K2895K6167j0082l5458r421L0077K5199
$$ -310 -9593 -19409 -17513 -13914 -22404 -25686 -2791 23376 13294 -22164 -31585 -1508 23691
21472B3691j1164k0059J0101L2568J9293l639o575l28j0002l0782l3102m365L0415
$$ 23691 12527 -7532 2569 35137 54430 50791 44216 43888 33886 3104 -29998 -34363 -3948
21459c948L4150J045l2919l0874l20J9378J1695j142j821m162j7334j7336J3068
$$ -3948 30202 31247 -1672 -32546 -32866 -13488 -1793 -2935 -4756 -8918 -26252 -43588 -30520
21446c0520M1532K5976j6690k9152M29K0301m195l7310k8405J2985L4884J8093
$$ -30520 11012 36988 20298 -8854 -8425 11876 7681 -29629 -58034 -45049 -10165 7928
21434G928m410o16K0073K7279Q701k1440l9211k8285P208L8800L4518m804l9425
$$ 7928 3518 2902 22975 50254 58955 37515 -1696 -29981 -22773 16027 50545 45741 6316
21421F316l4686l467J3276L441m078J1101K7542J6779j1004k3787j6622j1826
$$ 6316 -28370 -31837 -18561 -15120 -19198 -8097 19445 36224 25220 1433 -15189 -27015
21409b7015j5539q705J3993K8555J7314n663j7907j4612l17K0165L0064Q946k9219
$$ -27015 -42554 -51259 -37266 -8711 8603 2940 -14967 -29579 -29896 -9731 20333 29279 60
21396F0l6949K587M2094L2975n510j9486q67J2079J776j0856j3281j8219k7768
$$ 60 -36889 -34302 7792 40767 35257 15771 14904 26983 28759 17903 4622 -13597 -41365
21383d1365k3326j572J6354K1142K5604L0109J5204j7983l5856j8135J4384L2460
$$ -41365 -64691 -66263 -49909 -28767 -3163 26946 42150 24167 -11689 -29824 -15440 17020
21371A7020L0153J2947j3575l1503k1833o15o303l7164m4431p170L2566L5713
$$ 17020 47173 60120 46545 15042 -6791 -7406 -13709 -50873 -95304 -102474 -69908 -34195
21359c4195J9975J4946J1551l110p141J1868J8367j0820l1399j600L3694Q166
$$ -34195 -14220 726 12277 9167 2026 13894 32261 21441 -9958 -11558 22136 30302
21347C0302m6660m0062L0109O5239J4714n2395n5125n709L2501L2988J1120j3357
$$ 30302 -16358 -56420 -26311 38928 53642 1247 -53878 -59587 -27086 5902 17022 3665
21335C665k2577n311J8397J2611j6819k2837P503K8536R939j7499j9050o742Q8
$$ 3665 -18912 -24223 -5826 6785 -10034 -32871 -25368 3168 13107 -4392 -23442 -30184 -30096
21322c0096J1858K9054K0139j7201k8595J0965L9824K334n3372m7225N762K7648
$$ -30096 -18238 10816 30955 13754 -14841 -3876 35948 38282 -15090 -62315 -56553 -28905
21310b8905O989Q90K1497J9601j3136k1832R396K1546j6658m9096k3426K4028
$$ -28905 -21916 -21026 471 20072 6936 -14896 -5500 16046 -612 -49708 -73134 -49106
21298d9106L1491P884K846J7071R749k0726k7586P894M1132K4834k5775n1817
$$ -49106 -17615 -9731 -6885 10186 19935 -791 -28377 -20483 20649 45483 19708 -32109
21286c2109k3012K8833N1094L1850N641O28L388r872k9064k5220J392J9349J0637
$$ -32109 -55121 -26288 24806 56656 62297 62925 66313 56441 27377 2157 3549 22898 33535
21273C3535r804k0114j4739j749N178k298r638R272M3532L9775j8268o2072k8351
$$ 33535 23731 3617 -11122 -12871 -7693 -9991 -19629 -10357 33175 72950 54682 -7390 -35741
21260c5741L6161L8372j4405k9107J3988K9703j8082m7706k758M4169J5260l6609
$$ -35741 420 38792 24387 -4720 9268 38971 20889 -26817 -29575 14594 29854 -6755
21248f755k1078L1138K4307l2033l9043J9130M7814K398m0209j1467M3174M5159
$$ -6755 -27833 3305 27612 -4421 -43464 -24334 23480 25878 -14331 -25798 17376 62535
21236F2535l85k9631j7031P434J3182j56j4616j3520J036N940r640j7403R341
$$ 62535 62150 32519 15488 22922 36104 35948 21332 7812 8848 14788 5148 -12255 -2914
21223b914L9725K2035k7624l8333M857L5201J3328j3535k871P482k2395m6289
$$ -2914 36811 58846 31222 -7111 -2254 32947 46275 32740 29869 37351 14956 -31333
21211c1333n646N4232L9895l7209o5525j455O3128L9431l0638m5491Q509N0430
$$ -31333 -36979 17253 57148 19939 -45586 -47041 16087 55518 24880 -20611 -12102 38328
21199C8328K6187k7409m5431j4615K7427M2939K3890j2231l8372l7107j5752K553
$$ 38328 64515 37106 -8325 -22940 4487 47426 71316 59085 20713 -16394 -32146 -29593
21187b9593P986J2719K3064K2067l49j7207K442L7744L4924j1931m3484j9408
$$ -29593 -21607 -8888 14176 36243 35894 18687 21129 58873 93797 81866 38382 18974
21175A8974K1778K1203j6139l8283k3198O486K8686L6267K0015j5878l3094l809
$$ 18974 40752 61955 45816 7533 -15665 -9179 19507 55774 75789 59911 26817 23008
21163B3008L5095K7718j1102j7452J3810K0326j7396l9674j1481J7389J298k4520
$$ 23008 58103 85821 74719 57267 71077 91403 74007 34333 22852 40241 41539 17019
21151A7019j3004J2010P133r700K0J7992O543j2481N955M1226L4365j1067l3321
$$ 17019 4015 16025 23158 13458 13478 31470 38013 25532 31487 72713 107078 96011 62690
21138F2690j1472J2909J2167K699k599q286l004K4553L9773J778n3354m7701J4795
$$ 62690 51218 64127 76294 78993 76394 68108 65104 89657 129430 131208 77854 30153 44948
21125D4948M5720J0625k0435M937L7592J8083k4949l2566j0810q1K163J8900L1765
$$ 44948 90668 101293 80858 85795 123387 141470 116521 83955 73145 73064 75227 94127 125892
21112A25892J0381k4141k8790r401k052n396O634K2343P689k4651k6027Q527L1136
$$ 125892 136273 112132 83342 73941 71889 66493 73127 95470 103159 78508 52481 61008 92144
21099I2144J6976n913j1430p635j863J5750L5774K3783k3750n7453l8329P479
$$ 92144 109120 103207 91777 84142 82279 98029 133803 157586 133836 76383 38054 45533
21087D5533K7074J1107m615N497K7367L0761N417k7662l6481j3000J4494J4826
$$ 45533 72607 83714 79099 84596 111963 142724 148141 120479 83998 70998 85492 100318
21075A00318m512q518J3052K9745J5715j2523k1025n430P379j252j8340j8095
$$ 100318 95806 87288 100340 130085 145800 133277 112252 106822 114201 112949 94609 76514
21063G6514N357L0180L1583J0317r988j3525q275n926j852J0063J6828L268j7974
$$ 76514 81871 112051 143634 153951 143963 130438 122163 116237 114385 124448 141276 144544 126570
21050A26570j8983J734J5331M610j3401j5503l139O406N243l32j515M128R715
$$ 126570 107587 109321 124652 129262 115861 100358 97219 103625 108868 108536 107021 111149 120864
21037A20864M133j1475j6497M108L0261K4706j5476m8483l9092l59K8485K7394
$$ 120864 124997 113522 97025 101133 131394 156100 140624 92141 53049 52690 81175 108569
21025A08569M588k1532l1190j0049K9497M5487J1971l7779m3535L450M5243L3560
$$ 108569 113157 91625 60435 50386 79883 125370 137341 99562 56027 59477 104720 138280
21013A38280p820k2021J584K3019J7412L036k060q827k2591j9269J0423K6924
$$ 138280 130460 108439 110023 133042 150454 153490 151430 142603 120012 100743 111166 138090
21001A38090k867m2141l1938J3992K8101j112j4018J2204K3154r753k7765J3931
$$ 138090 135223 93082 61144 75136 103237 102125 88107 100311 123465 113712 85947 99878
20989I9878N5457K3222m3453n1048j467J9537j1830k9345q23K2413O088j0003
$$ 99878 155335 178557 135104 84056 82589 102126 90296 60951 60128 82541 88629 78626
20977G8626N251J6677l598j7332Q661L4317J2359k6624k2094J8002L3137M731
$$ 78626 83877 100554 96956 79624 88285 122602 134961 108337 86243 104245 137382 142113
20965A42113k5361k3715l982M535n598j6249m389K5709L3189o691m6302j7588
$$ 142113 116752 93037 89055 93590 87992 71743 67354 93063 126252 119561 73259 55671
20953E5671N4089O4634j2095o9639k7393M2554L1407l6914n8778k0075O969M602
$$ 55671 109760 174394 162299 92660 65267 107821 139228 102314 43536 23461 30430 35032
20941C5032K0957N0582L0833l1196m9767m174K4771k191j8936J5742L7629k318
$$ 35032 55989 106571 137404 106208 56441 52267 77038 74847 55911 71653 109282 106964
20929A06964m0421j1322L2076J0431m1877l7846J4209L6912K0716J9236L0866
$$ 106964 66543 55221 87297 97728 55851 18005 32214 69126 89842 109078 139944
20918A39944M151m4439l8398K0218L7930j3872m5071m87M2715Q114m5212k3125
$$ 139944 144095 99656 61258 81476 119406 105534 60463 59976 102691 110805 65593 42468
20906D2468L8896L2840l6724n4562J6094P0328K6091n2132n9145q02L9016L1485
$$ 42468 81364 114204 77480 22918 39012 109340 135431 83299 24154 23352 62368 93853
20894I3853J7384J5906M644j4288p387K0178J8752k0800m2040j2719K2503J8529
$$ 93853 111237 127143 131787 117499 110112 130290 149042 128242 86202 73483 95986 114515
20882A14515O79P986J8408m885l4077j8454K1500K2090j4310k1190J8881M6135
$$ 114515 115194 123180 141588 136703 102626 84172 105672 127762 113452 92262 111143 157278
20870A57278K5568k110j410p48k7920n0137l0420N382J1921l433m123J0447J4659
$$ 157278 182846 180736 179326 178578 150658 100521 70101 75483 87404 83971 79848 90295 104954
20857A04954Q143Q917J2739L532r857o992O948J2123P732L519m181j7311j9395
$$ 104954 113097 122014 134753 138285 128428 121436 128384 140507 148239 151758 147577 130266 110871
20844A10871n051J489r046m037L0018M2194n313n3149k0127O0036P2082r783q0576
$$ 110871 105820 107309 98263 94226 124244 166438 161125 107976 87849 147885 219967 210184 129608
20831A29608n8653P642L1713J2060L333J7646K2469Q921P03M460K0j9260l2237
$$ 129608 70955 78597 110310 122370 125703 143349 165818 174739 175442 179902 179922 160662 128425
20818A28425k1942R90J3137N355q222o160J3285K6439J5127n807j0168k07J295
$$ 128425 106483 107473 120610 125965 117743 111583 124868 151307 166434 160627 150459 150252 151547
20805A51547p750p366O139J4052R676N406K956q116j9299r606J1942J2924n972
$$ 151547 143797 136431 142570 156622 166298 171704 174660 166544 147245 137639 149581 162505 156533
20792A56533q104J3378J9047o676k2318K283L3503K8798J539j1533j0537j4725
$$ 156533 148429 161807 180854 174178 151860 154143 187646 216444 217983 206450 195913 181188
20780A81188j6253N63J8056R605j3166j9094n859Q549K2135L6727L1334p228m4836
$$ 181188 164935 165498 183554 193159 179993 160899 155040 163589 185724 222451 253785 246557 201721
20767B01721l8442q23J9337J0485L039R184Q645m922j0857j466N071l60m165J875
$$ 201721 163279 162456 181793 192278 195317 204501 213146 208224 197367 195901 200972 200612 196447 198322
20753A98322Q394Q938P361M275j131j150N788K512j8277k9727q393K2171K4468
$$ 198322 206716 215654 223015 227290 226159 225009 230797 233309 215032 185305 176912 199083 223551
20740B23551N700j096L710k810j2342j172J2568o317l4661j4517M4194O4304K1413
$$ 223551 229251 228155 231865 229055 216713 215541 228109 221792 187131 172614 216808 281112 302525
20727C02525j7877p962O011k2009n1864k5171L1960M5350K313l9054l5656l318
$$ 302525 284648 276686 282697 260688 208824 183653 215613 260963 263276 224222 188566 185248
20715A85248J8114P140k4842l9479q862L8773M2865k280k9682J018L8281J9974
$$ 185248 203362 210502 185660 146181 137319 176092 218957 216677 186995 188013 226294 246268
20703B46268k7773l5456J051K6047J7691O725R889R365j095o356q102k1033l1099
$$ 246268 218495 183039 184090 210137 227828 234553 244442 253807 252712 246356 238254 217221 186122
20690A86122j0953K1998J9972j5962k9278M700M0832L5407L882j9189l0207l4385
$$ 186122 175169 197167 217139 201177 171899 176599 217431 252838 256720 237531 207324 172939
20678A72939j6995K3500M7405K2395k2172l1563k234J8561M447j7804j4708N861
$$ 172939 155944 179444 226849 249244 227072 195509 193275 211836 216283 198479 183771 189632
20666A89632J0682r338k5600j0597K1910L0825L253k3699j2673J9656K6608R82
$$ 189632 200314 190976 165376 154779 176689 207514 210767 187068 174395 194051 220659 221641
20654B21641j6693l062J4515O863r710m719J2659P882k1091l6532j4895K0907
$$ 221641 204948 201886 216401 223264 213554 208835 221494 229376 208285 171753 156858 177765
20642A77765L4166J8930k777j4787j9372k0252j2511L734J4123P770m214l779
$$ 177765 211931 230861 228084 213297 193925 173673 161162 164896 179019 186789 182575 178796
20630A78796N561M847p224j1092m73O676J338o74Q052P448j1965k2242k040K0035
$$ 178796 184357 189204 181980 170888 170415 177091 178429 177755 185807 193255 181290 159048 157008 177043
20616A77043P910j8832j4938J1580R248k8614m6122j0913L5603M0698J0794j0910
$$ 177043 184953 166121 151183 162763 172011 143397 97275 86362 121965 162663 173457 162547
20604A62547o089Q894J3467O5k3001l2902j5305Q631N769j4882j0425K3664L7238
$$ 162547 156458 165352 178819 178884 155883 122981 107676 116307 122076 107194 96769 120433 157671
20591A57671M392l0208k0797P148L044k3166j9467J9801M2196J6255k5244l4159
$$ 157671 162063 131855 111058 118206 121250 98084 78617 98418 140614 156869 131625 97466
20579I7466o342K2708K2169m963k7812j9975J0315K9730K2893Q865O254N347p466
$$ 97466 91124 113832 136001 131038 103226 83251 93566 123296 146189 155054 161308 166655 159189
20566A59189k0345j5315J48N440k668j3034j9382j7375j10K3905K8795Q432q276
$$ 159189 138844 123529 123677 129117 126449 113415 94033 76658 76548 100453 129248 137680 129404
20553A29404k220M580q393j8350J027K7416K3992J575l805M825j370j5217n226
$$ 129404 127184 131764 123371 105021 106048 133464 157456 159031 155226 160051 158681 143464 138238
20540A38238J8689J3615k1119l7675j6159R935J5522J5489K0233J4224k276j959
$$ 138238 156927 170542 149423 111748 95589 105524 121046 136535 156768 170992 168716 166757
20528A66757J7588K0077p577k7446j1397J5204J9196O689m700j8781l4295k6222
$$ 166757 184345 204422 196845 169399 158002 173206 192402 199091 194391 175610 141315 115093
20516A15093J0778L7099K3538j833m98J4641O747k0757l1116j0349J9623L2836
$$ 115093 125871 162970 186508 184675 184177 198818 205565 184808 153692 143343 162966 195802
20504A95802J8728j4520l6429j7621K4408L4854j150l1083j4914J3502P724j3661
$$ 195802 214530 200010 163581 145960 170368 205222 204072 172989 158075 171577 179301 165640
20492A65640o901J6956J6664j947j980J0118k262k8372j9617K2740M1990J8187
$$ 165640 158739 175695 192359 190412 188432 198550 196288 167916 148299 171039 213029 231216
20480B31216l463N480J3079o760k4790j0492J3179J0081j0975j7930o754N504
$$ 231216 227753 233233 246312 239552 214762 204270 217449 227530 216555 198625 191871 197375
20468A97375J6120L0210L5390J5757j6834l1159j3924J6207K8883J0618j9950
$$ 197375 213495 243705 279095 294852 278018 246859 232935 249142 278025 288643 268693
20457B68693k6624J223K7297J3824k0217k3089R478K5206k430l3031k5750n22
$$ 268693 242069 243292 270589 284413 264196 241107 250585 275791 273361 240330 214580 214058
20445B14058M493k120J0602L3296K9543J80j4711J283J8041Q235j3879j8503l231
$$ 214058 218551 216431 227033 260329 289872 290052 275341 276624 294665 302900 289021 270518 267287
20432B67287P399l305k2163k0761R160M0023L8007O505j7045j0698P416J2739
$$ 267287 274686 271381 249218 228457 237617 277640 315647 322152 305107 294409 301825 314564
20420C14564O909k33j5264m0601m9964j9704K5369L4601O73k7860j2388K6159
$$ 314564 321473 321240 305976 265375 215411 195707 221076 255677 256350 228490 216102 242261
20408B42261M0008J6812j1876j6206k167L733p851j7924o297J9382L1115J4883
$$ 242261 282269 299081 287205 270999 268832 272565 264714 246790 240493 259875 290990 305873
20396C05873j2772k4577j0947J3563K5619J4182q304j8328j0496m823j3907j8173
$$ 305873 293101 268524 257577 271140 296759 310941 302637 284309 273813 268990 255083 236910
20384B36910K868K8423K0741j2953k4333L880L1524K2597n519j6847p755J940
$$ 236910 239778 268201 288942 275989 251656 255536 287060 309657 304138 287291 279536 281476
20372B81476K051n824j5349j0403J6821L3714j454o1556o4125O385N8322K5974
$$ 281476 283527 277703 262354 251951 268772 302486 301032 239476 175351 181736 240058 266032
20360B66032k7056j2896L5634K6424k9506l7594J3361L1665j5142m3207K42M5487
$$ 266032 238976 226080 261714 288138 258632 221038 234399 266064 250922 207715 207957 253444
20348B53444K1576k6297k1775J4572J2591k3862l2919m045J4870N063n193l950
$$ 253444 275020 248723 226948 241520 254111 230249 197330 193285 208155 213218 208025 204075
20336B04075p529j0531J0570L9135K6613k7099n8287k7016K6446M0410J1498j5141
$$ 204075 196546 186015 196585 235720 262333 235234 176947 149931 176377 216787 228285 213144
20324B13144j2899n70p354l0638l6319l018L9652L7773j3222n0680k6177K3783
$$ 213144 200245 199675 192321 161683 125364 122346 161998 199771 186549 135869 109692 133475
20312A33475L0114p140k4934J445K5510J1038j2953q735P142r00k2521j8108J5994
$$ 133475 163589 156449 131515 132960 158470 169508 156555 147820 154962 154062 131541 113433 129427
20299A29427M1150L1841M756r811k872R794M956k5331n7912n4500p542M0956M5601
$$ 129427 170577 202418 207174 197363 194491 204285 209241 183910 125998 71498 63956 104912 150513
20286A50513J3186j0884n061P550K391j1833j4317n938l240j0517j5642r376M033
$$ 150513 163699 152815 147754 155304 157695 145862 131545 125607 122367 111850 96208 86832 90865
20273I0865J3845J1947j787j5917j4203M859K0324J2449r559j8067m886Q904O007
$$ 90865 104710 116657 114870 98953 84750 89609 109933 122382 112823 94756 89870 98774 104781
20260A04781k549J344J2044R492p908j9812j2781M232J5169J3001j233j9931k5850
$$ 104781 102232 103576 115620 125112 117204 97392 84611 88843 104012 117013 115780 95849 69999
20247F9999m933K9251L9961J0117l0667l8150o605K7035L1059J3125o37n094j5961
$$ 69999 65066 94317 134278 144395 113728 75578 68973 96008 127067 140192 139555 134461 118500
20234A18500l3248k9275J0738N2702M7817O68l1021j5411J0979M390j8283j3895
$$ 118500 85252 55977 66715 119417 167234 167902 136881 121470 132449 136839 118556 104661
20222A04661J1110J3418j0307j8414J470J2038n746k0522r013N890M295N898K1999
$$ 104661 115771 129189 118882 100468 101938 113976 108230 87708 78695 84585 88880 94778 116777
20209A16777J9916j9811n3087l0882K4270N1797L6303P624j6236l3952l1639k741
$$ 116777 136693 116882 63795 32913 57183 108980 145283 152907 136671 102719 71080 68339
20197F8339K1239J0657j1873j1036j238j1248j7878J2953M6785K7034j9211j7756
$$ 68339 89578 100235 88362 77326 76088 64840 46962 59915 106700 133734 114523 96767
20185I6767K1078J5586l7972m7929J3530N3957J4327l4703k0766J0283q847m0385
$$ 96767 117845 133431 95459 47530 61060 115017 129344 94641 73875 84158 75311 34926
20173C4926j6306L0942K5758j3025q079L4725L7521r640l3125n009J6881j629
$$ 34926 18620 49562 75320 62295 54216 88941 126462 116822 83697 78688 95569 93940
20161I3940j5590J1150M0028K2793k3186m5014k3459J6189L6699J9298j5421j9831
$$ 93940 78350 89500 129528 152321 129135 84121 60662 76851 113550 132848 117427 97596
20149I7596J8869M5864J1720m3327m1407J0859L1255n483l1266k982K8423R796
$$ 97596 116465 162329 174049 130722 89315 100174 131429 125946 94680 91698 120121 129917
20137A29917k7382k8324m941j521j2389P08L3071M0287R349k3115k5833r333n08
$$ 129917 102535 74211 69270 67749 55360 56068 89139 129426 138775 115660 89827 80494 79986
20124G9986n202o807O217J9753R797j7941k4409P491L7760K4304r586j1815J2634
$$ 79986 74784 67977 74194 93947 103744 85803 61394 68885 106645 130949 121363 109548 122182
20111A22182J4782r078j4149N668P655j0695m15L5805K4453m9228q7882k6610
$$ 122182 136964 127886 113737 119405 127060 116365 115950 151755 176208 126980 39098 12488
20099A2488N4579M9462j3792l0531J3015L8019J1005k0747k4267j9432j8746o222
$$ 12488 67067 116529 102737 72206 85221 123240 134245 113498 89231 69799 51053 44831
20087D4831J6697K7917K8712L4298K9505n687l9969k7939Q616R871k1164k6109
$$ 44831 61528 89445 118157 152455 181960 176273 136304 108365 116981 126852 105688 79579
20075G9579M208J6909n568j9328m009O918j006J909K1273K1857K73l467J1229
$$ 79579 83787 100696 95128 75800 71791 78709 77703 79612 100885 122742 123015 119548 130777
20062A30777m398m7659m4870K5153P7376M5288k2129m8222l6040k2357j13L7944
$$ 130777 126379 78720 33850 59003 136379 181667 159538 111316 75276 52919 52806 90750
20050I0750M6987L323l1821o270K6059l846n0421k6175M0147M3811j8268m1094
$$ 90750 137737 141060 109239 102969 129028 125182 74761 48586 88733 132544 114276 73182
20038G3182J1480M9779J0064m7841m6011l103J6226J475j2943j1771k954J0522
$$ 73182 84662 134441 144505 96664 50653 47550 63776 65251 52308 40537 37583 48105
20026D8105K3643J9876k705j9939j6102l893L574J0272J5534R156j200N123J9916
$$ 48105 71748 91624 88919 68980 52878 48985 52559 62831 78365 87521 86321 91444 111360
20013A11360J1400j7515k4665N05J3617j1044l5437k1860N200N225r604j366K5592
$$ 111360 122760 105245 80580 81085 94702 83658 48221 26361 31561 36786 27182 25816 51408
20000E1408L2807P909k4782m1744l4949m101L3716M3382J4130j4194k525K6651
$$ 51408 84215 92124 67342 25598 -9351 -13452 20264 63646 77776 63582 61057 87708
19988H7708K1026k0148m2599j6926K0223J9686j4171l1413p14M8351N3554m675
$$ 87708 108734 88586 45987 29061 49284 68970 54799 23386 22672 71023 124577 119902
19976A19902o6306n5767J7060N9932J9665m4317m5695Q574M0206J8674q074r38
$$ 119902 53596 -2171 14889 74821 94486 50169 4474 13048 53254 71928 63854 62916
19964F2916J6265Q623j4928k6475k3223j8610j4655p941l925m361K602K0634K9703
$$ 62916 79181 87804 72876 46401 23178 4568 -10087 -18028 -21953 -26314 -23712 -3078 26625
19951B6625J3047j3184j8929j664J2035M745r874p897J3741L4104L2382R304j6554
$$ 26625 39672 26488 7559 5895 17930 22675 12801 4904 18645 52749 85131 94435 77881
19938G7881k9299k6437j1544J1055K9422K6273J235k0308j7074j667l02j0199
$$ 77881 48582 22145 10601 21656 51078 77351 78586 58278 41204 39537 39235 29036
19926B9036m607J9166K8018K752k7190k2418R439K4376M857j8096j3827L896L571
$$ 29036 24429 43595 71613 74365 47175 24757 34196 58572 63429 45333 31506 35402 38973
19913C8973j1027p607J7182K5436j037k3777m818K7553J7765k7227m4296j1271
$$ 38973 27946 20339 37521 62957 61920 38143 33325 60878 78643 51416 7120 -4151
19901d151K2684J9212K540J111k169j9469j5755K6732N3725J8377k8475j1329
$$ -4151 18533 37745 40285 41396 39227 19758 4003 30735 84460 102837 74362 63033
19889F3033L9257K8058m5105p5645j8685M2308L0335j5200j9799J1688K8459K2439
$$ 63033 102290 130348 85243 9598 -9087 33221 63556 48356 28557 40245 68704 91143
19877I1143J4560k535l9555o1717l1232K3653M1881J5661r448o121J1110K0902
$$ 91143 105703 103168 63613 1896 -29336 -5683 36198 51859 42411 36290 47400 68302
19865F8302J2568j5335l8663j7554L8948N7504J456n7476l8533J9752K1744k6027
$$ 68302 80870 65535 26872 9318 48266 105770 107226 49750 11217 30969 52713 26686
19853B6686k9808K4434M3659p987m0904O980N8768K4527m7326m7594K0169N3306
$$ 26686 -3122 21312 64971 56984 16080 23060 81828 106355 59029 11435 31604 84910
19841H4910J3310k9174j6850J6552J6506j1421k5957j2732R422K0271J3911k676
$$ 84910 98220 69046 52196 68748 85254 73833 47876 35144 44566 64837 78748 76072
19829G6072j5393j7548j8257k3488j8558Q208L4995L0756M200o703O639J4272
$$ 76072 60679 43131 24874 1386 -17172 -8964 26031 56787 60987 54284 60923 75195
19817G5195L212m13J7613K6408j804m0348m2622j0173J3120Q088J737J6330L2962
$$ 75195 78407 77994 95607 122015 120211 79863 37241 27068 40188 48276 50013 66343 99305
19804I9305K3607n938k7566k9359k0189o985Q052J3573n64j8882j3761J1436K1743
$$ 99305 122912 116974 89408 60049 39860 32875 40927 54500 53936 35054 21293 32729 54472
19791E4472L721j2256j656J4675R537k365N332J6988L17l0979l4772j2437l640
$$ 54472 58193 45937 44281 58956 68493 66128 71460 88448 88765 57786 23014 10577 6937
19778F937j0862L883L8029L8227m468k5396O858K9816p727n0008k2899L7995M2814
$$ 6937 -3925 -42 37987 76214 71746 46350 53208 83024 75297 25289 2390 40385 83199
19765H3199n595k3699R442K7660K283j2855J1929K4953j2882n5393m5732k289
$$ 83199 77604 53905 63347 91007 93290 80435 92364 117317 104435 49042 3310 1021
19753A021K3842K6379K5902J8073o084k2947j0627Q340N211l824P649K0507L079
$$ 1021 24863 51242 77144 95217 89133 66186 55559 63899 69110 65286 72935 93442 96521
19740I6521k4593j8935R775R701k5915m3516j0873L5554M3920J2555j8095j7941
$$ 96521 71928 52993 62768 72469 46554 3038 -7835 27719 71639 84194 66099 48158
19728D8158M583J8153O334j0696k678K2548K4937l603j9783J152J8951o034m0241
$$ 48158 52741 70894 77228 66532 63854 86402 111339 107736 87953 89105 108056 102022 61781
19715F1781k7399J7443L1048K620j8526r730J373K207J3084K8988J4267k5581
$$ 61781 34382 51825 82873 85493 66967 57237 58610 60817 73901 102889 117156 91575
19703I1575l5745j797J9857m715k8750m625L6477L8303O258j5139j5260j3999
$$ 91575 55830 54033 73890 69175 40425 35800 72277 110580 116838 101699 86439 72440
19691G2440j4169o829k20n64R253L1767K9591j5297n2681l0585K0793L4071P358
$$ 72440 58271 51442 51222 50658 59911 91678 121269 105972 53291 22706 43499 77570 84928
19678H4928o396O540J1349M71L070J7153O499k4282k3735J8331M4774K0059j6775
$$ 84928 78532 85072 96421 96892 99962 117115 123614 99332 75597 93928 138702 158761 141986
19665A41986k0790o580o764j3365l493J3247J3995K488l620j956K897J1461J3834
$$ 141986 121196 114616 107852 94487 90994 104241 118236 120724 117104 115148 118045 129506 143340
19652A43340o015l2463k4506J7628L7938P654k5378j1380K3711K6970M384k029
$$ 143340 137325 104862 80356 97984 135922 143576 118198 106818 130529 157499 161883 159854
19640A59854P945K352j5774j5202J677N068k873M408J7789L979k4681j9506J9012
$$ 159854 167799 170151 154377 139175 140852 145920 143047 147455 165244 169223 144542 125036 144048
19627A44048L3959N743j5438L562K5419J2234j0261l716J6782J7338N980P238
$$ 144048 178007 183750 168312 171874 197293 209527 199266 195550 212332 229670 235650 242888
19615B42888Q734j3197l9164l2221j318J3082N557N814J7712J1757j6553l0402
$$ 242888 251622 238425 199261 167040 165722 178804 184361 190175 207887 219644 203091 172689
19603A72689q256K2911K8670J0694p169j1427l485P670P505r462k2298n558K7101
$$ 172689 164433 187344 216014 226708 219539 208112 204627 212297 219802 210340 188042 182484 209585
19590B09585L2677K243k0896n963J7572P948k1802k5042N916L0527K0449p547
$$ 209585 242262 244505 223609 217646 235218 243166 221364 196322 202238 232765 253214 245667
19578B45667k3125j6522M555K5529K6783R09k5737j6652K0795L5974M780l3310
$$ 245667 222542 206020 210575 236104 262887 263796 238059 221407 242202 278176 282956 249646
19566B49646l2285m239O985n345r556P233K2436J8431L144j2683k4984k1034Q782
$$ 249646 217361 213122 220107 214762 205206 212439 234875 253306 256450 243767 218783 197749 206531
19553B06531L9287L1155p695k5483n377R416o739j5582J2439L4184L540l8689
$$ 206531 245818 276973 269278 243795 238418 247834 241095 225513 237952 272136 275676 236987
19541B36987k1268L7502N1550J533l9455k5258K960K141o025N068J0424j1434
$$ 236987 215719 253221 304771 306304 266849 241591 244551 246692 240667 245735 256159 244725
19529B44725k5681j609K3679N153k7878j8385K0593K8925J614q509J3826K3221
$$ 244725 219044 217435 241114 246267 218389 200004 220597 249522 251136 242627 256453 279674
19517B79674k645k3712o638K0903J6719j3088k9212j4047J2365J9056l871l0836
$$ 279674 277029 253317 246679 267582 284301 271213 242001 227954 240319 259375 255504 224668
19505B24668k2355K3673N6614L5885r133k1785l833m295l0240l3769K800L3271
$$ 224668 202313 225986 282600 318485 309352 287567 283734 279439 249199 215430 218230 251501
19493B51501K1641p808k1799k5154k5536n756L0015L4820r035m3564j4942M0352
$$ 251501 273142 265334 243535 218381 192845 187089 217104 251924 242889 199325 184383 224735
19481B24735M9091Q925k1595j7602o183k963L807R182o066k5819j0656L1674M4857
$$ 224735 273826 282751 261156 243554 237371 234408 238215 247397 241331 215512 204856 236530 281387
19468B81387Q562k8872k4391J453Q810K3J765J5220K0187J1762K218l604j0066
$$ 281387 289949 261077 236686 238139 246949 246972 248737 263957 284144 295906 298124 294520 284454
19455B84454j4608j0792m246q190k1863k5916n233K7965M1545J9572j3685j9181
$$ 284454 269846 259054 254808 246618 224755 198839 193606 221571 263116 282688 269003 249822
19443B49822O849K6898J2960j8120l2502k0421O206L2643L8825P034m2431n5139
$$ 249822 256671 283569 296529 278409 245907 225486 231692 264335 303160 310194 267763 212624
19431B12624j4414K5889K1110O991L2755O2840K7244n2059p9143k8562K2486K1696
$$ 212624 198210 224099 245209 252200 284955 347795 375039 322980 243837 215275 237761 259457
19419B59457P511J7060K0281o162k1479L408K3477j801l0142q369L1070K3769
$$ 259457 266968 284028 304309 298147 276668 280076 303553 301752 271610 263241 294311 318080
19407C18080j7549k8336P63K0159Q771n609n256o09M560J4271J6056Q34r659J325
$$ 318080 300531 272195 272958 293117 301888 296279 291023 290414 294974 309245 325301 326135 316476 317801
19393C17801Q457r743k2388k73K1013R19k3622J182L9979K1819k8004k2720L1957
$$ 317801 326258 316515 294127 293854 314867 315786 292164 293346 333325 355144 327140 304420 336377
19380C36377M1827j1878m0352m870K0826q502k8428J0400M7212K0427k3313j6285
$$ 336377 378204 366326 325974 321104 341930 333428 305000 315400 362612 383039 359726 343441
19368C43441J5765J5791M35J0635K0743p931l7854j6347K2156J3352k0132j1313
$$ 343441 359206 374997 375432 386067 406810 398879 361025 344678 366834 380186 360054 348741
19356C48741K7600L0794R08l627J5146L310k8859j4939L9068M9688j945l4653
$$ 348741 376341 407135 408043 404416 419562 422872 394013 379074 418142 467830 465885 431232
19344D31232n577K1843n894m2531k5937K3642M7377L1903J377k3879k4062J2561
$$ 431232 425655 447498 441604 399073 373136 396778 444155 476058 477435 453556 429494 442055
19332D42055N0382L4369j8023k5452K6800N1378R15m6719j5548M1771L5425j3243
$$ 442055 492437 526806 508783 483331 510131 561509 562424 515705 500157 541928 577353 564110
19320E64110k0023J5534K3633m407j0031J6800K1892p189j7737P777J8554r202
$$ 564110 544087 559621 583254 578847 568816 585616 607508 600319 582582 590359 608913 599711
19308E99711k5996K665L2367J2765l0117l6780j644L1909L9077L1098J8739j289
$$ 599711 573715 576380 608747 621512 591395 554615 552971 584880 623957 655055 673794 672505
19296F72505k3808k8482n784K2867K2575j3556m7203l5393J0704L4110J0875j3864
$$ 672505 648697 620215 614431 637298 659873 646317 599114 563721 574425 608535 619410 605546
19284F05546M410M0048M1449J4988P498K2862K0473p406k1240l770J5725J8045
$$ 605546 609956 650004 691453 706441 713939 736801 757274 749868 728628 724858 740583 758628
19272G58628J9029K5656K2459J3937K3159L6682J6177k0399o806N5052P3490R787
$$ 758628 777657 803313 825772 839709 862868 899550 915727 895328 888522 943574 1017064 1026851
19260A026851m5350j0129N3234L8403l0520m0112K6406O5548J9412m5497n3781
$$ 1026851 981501 971372 1024606 1063009 1032489 992377 1018783 1084331 1103743 1058246 1004465
19249A004465k3785j1502k2199k7484k1963j7869j5571j3594k1266l6153l5553
$$ 1004465 980680 969178 946979 919495 897532 879663 864092 850498 829232 793079 757526
19238G57526j2018Q991O141q898j6421j6479j5651j1047j991N119J1849K2115
$$ 757526 745508 754499 760640 751742 735321 718842 703191 692144 690153 695272 707121 729236
19226G29236K0727o331l0648j0208L4102L2996k0125m2969J0799P0834N5883p49
$$ 729236 749963 743632 712984 702776 736878 769874 749749 706780 717579 788413 844296 843547
19214H43547j1370K5677L9120J3433M488K8355L2867l27j5421K0340N7248M6366
$$ 843547 832177 857854 896974 910407 914895 943250 976117 975790 960369 980709 1037957 1084323
19202A084323J5007P094P591j3034k8713j695L8415L2378j2448l5105j9815r813
$$ 1084323 1099330 1106424 1114015 1100981 1072268 1070573 1108988 1141366 1128918 1093813 1073998 1064185
19190A064185k2020k1307L591P222l6530q1056p1955k5204L196l650j8688k5142
$$ 1064185 1042165 1020858 1024449 1031671 995141 914085 842130 816926 820122 816472 797784 772642
$$ [...]
##END NTUPLES=NMR SPECTRUM
##END=
