##TITLE=1H ikalashn
Eze 1511H
15.11.2024
##JCAMPDX= 6.0         $$ Bruker NMR JCAMP-DX V2.0
##DATA TYPE= NMR FID
##DATA CLASS= NTUPLES
##ORIGIN= UXNMR, Bruker Analytische Messtechnik GmbH
##OWNER= root
$$ TOPSPIN		Version 1.3
$$ 2024-11-15 16:31:48.984 +0400  Irina@DPX200
$$ Compression mode = diff/dup
##.OBSERVE FREQUENCY= 200.131300845
##.OBSERVE NUCLEUS= ^1H
##.DELAY= (6, 6)
##.ACQUISITION MODE= SIMULTANEOUS
##.ACQUISITION SCHEME= undefined
##.AVERAGES= 16
##.DIGITISER RES= 18
##SPECTROMETER/DATA SYSTEM= spect
##.PULSE SEQUENCE= zg
##.SOLVENT NAME= D2O
##.SHIFT REFERENCE= INTERNAL, D2O, 1, 17.49637
##AUDIT TRAIL= $$ (NUMBER, WHEN, WHO, WHERE, WHAT)
$$ ##TITLE= Audit trail, TOPSPIN		Version 1.3
$$ ##JCAMPDX= 5.01
$$ ##ORIGIN= Bruker BioSpin GmbH
$$ ##OWNER= Irina
$$ $$ F:/spectra/data/iren/nmr/1H/4/audita.txt
$$ ##AUDIT TRAIL=  $$ (NUMBER, WHEN, WHO, WHERE, VERSION, WHAT)
(   1,<2024-11-15 16:31:30.453 +0400>,<Irina>,<DPX200>,<TOPSPIN 1.3>,
      <created by zg
	started at 2024-11-15 16:30:22.328 +0400,
	POWCHK disabled, PULCHK disabled
       configuration hash MD5:
       BE 6D 3F 07 2A EA 11 49 91 17 2B D3 AF B3 58 0D
       data hash MD5: 16K
       31 0F 05 37 31 9D AE 34 5F 07 68 42 FC C2 E5 E7>)
$$ ##END=
$$ 
$$ $$ hash MD5
$$ $$ 3C 98 73 D4 2C F6 A2 00 A6 95 8E 58 2E D3 30 F8
##$RELAX= 
##$RELAX= 
##$RELAX= 
##$RELAX= 
##$RELAX= 
##$RELAX= 
##$RELAX= 
##$RELAX= 
##$RELAX= 
$$ Bruker specific parameters
$$ --------------------------
##$DU= <F:/spectra>
##$EXPNO= 4
##$NAME= <1H>
##$PROCNO= 1
##$TYPE= <nmr>
##$USER= <iren>
##$AMP= (0..31)
100 100 100 100 100 100 100 100 100 100 100 100 100 100 100 100 100 100 
100 100 100 100 100 100 100 100 100 100 100 100 100 100 
##$ANAVPT= -1
##$AQSEQ= 0
##$AQ_mod= 1
##$AUNM= <au_zg>
##$AUTOPOS= <>
##$BF1= 200.13
##$BF2= 200.13
##$BF3= 200.13
##$BF4= 200.13
##$BF5= 200.13
##$BF6= 200.13
##$BF7= 200.13
##$BF8= 200.13
##$BYTORDA= 1
##$CFDGTYP= 0
##$CFRGTYP= 5
##$CHEMSTR= <none>
##$CNST= (0..63)
1 1 145 1 1 1 1 1 1 1 1 1 1 1 1 1 1 1 1 1 1 1 1 1 1 1 1 1 1 1 1 1 1 1 
1 1 1 1 1 1 1 1 1 1 1 1 1 1 1 1 1 1 1 1 1 1 1 1 1 1 1 1 1 1 
##$CPDPRG= <>
##$CPDPRG1= <>
##$CPDPRG2= <>
##$CPDPRG3= <>
##$CPDPRG4= <mlev>
##$CPDPRG5= <mlev>
##$CPDPRG6= <mlev>
##$CPDPRG7= <mlev>
##$CPDPRG8= <mlev>
##$CPDPRGB= <>
##$CPDPRGT= <>
##$D= (0..63)
0 2 0 0 0 0 0 0 0 0.06 0 0.03 0 0 0 0 0.0002 0 0 0 0 0 0 0 0 0 0 0 0 0 
0 0 0 0 0 0 0 0 0 0 0 0 0 0 0 0 0 0 0 0 0 0 0 0 0 0 0 0 0 0 0 0 0 0 
##$DATE= 1731673887
##$DBL= (0..7)
120 120 120 120 120 120 120 120 
##$DBP= (0..7)
150 150 150 150 150 150 150 150 
##$DBP07= 0
##$DBPNAM0= <>
##$DBPNAM1= <>
##$DBPNAM2= <>
##$DBPNAM3= <>
##$DBPNAM4= <>
##$DBPNAM5= <>
##$DBPNAM6= <>
##$DBPNAM7= <>
##$DBPOAL= (0..7)
0.5 0.5 0.5 0.5 0.5 0.5 0.5 0.5 
##$DBPOFFS= (0..7)
0 0 0 0 0 0 0 0 
##$DE= 6
##$DECBNUC= <off>
##$DECIM= 32
##$DECNUC= <off>
##$DECSTAT= 4
##$DIGMOD= 1
##$DIGTYP= 9
##$DL= (0..7)
0 120 120 120 120 120 120 120 
##$DP= (0..7)
150 150 150 150 150 150 150 150 
##$DP07= 0
##$DPNAME0= <>
$$ [...]
##$SW= 21.9926040160658
##$SWIBOX= (0..15)
0 0 2 0 0 0 0 0 0 0 0 0 0 0 0 0 
##$SW_h= 4401.40845070422
##$TD= 16384
##$TD0= 1
##$TE= 300
##$TE2= 300
##$TE3= 300
##$TEG= 300
##$TL= (0..7)
0 120 120 120 120 120 120 120 
##$TP= (0..7)
150 150 150 150 150 150 150 150 
##$TP07= 0
##$TPNAME0= <>
##$TPNAME1= <>
##$TPNAME2= <>
##$TPNAME3= <>
##$TPNAME4= <>
##$TPNAME5= <>
##$TPNAME6= <>
##$TPNAME7= <>
##$TPOAL= (0..7)
0.5 0.5 0.5 0.5 0.5 0.5 0.5 0.5 
##$TPOFFS= (0..7)
0 0 0 0 0 0 0 0 
##$TUNHIN= 0
##$TUNHOUT= 0
##$TUNXOUT= 0
##$USERA1= <user>
##$USERA2= <user>
##$USERA3= <user>
##$USERA4= <user>
##$USERA5= <user>
##$V9= 5
##$VALIST= <valist>
##$VCLIST= <CCCCCCCCCCCCCCC>
##$VD= 0
##$VDLIST= <DDDDDDDDDDDDDDD>
##$VPLIST= <PPPPPPPPPPPPPPP>
##$VTLIST= <TTTTTTTTTTTTTTT>
##$WBST= 1024
##$WBSW= 25
##$XGAIN= (0..3)
0 0 0 0 
##$XL= 0
##$YL= 0
##$YMAX_a= 985764
##$YMIN_a= -1125386
##$ZGOPTNS= <>
##$ZL1= 120
##$ZL2= 120
##$ZL3= 120
##$ZL4= 120
##$ABSF1= 10
##$ABSF2= 0
##$ABSG= 5
##$ABSL= 3
##$ALPHA= 0
##$AQORDER= 0
##$ASSFAC= 0
##$ASSFACI= 0
##$ASSFACX= 0
##$ASSWID= 0
##$AUNMP= <proc_1d>
##$AXLEFT= 0
##$AXRIGHT= 0
##$AXTYPE= 0
##$AXUNIT= <>
##$AZFE= 0.1
##$AZFW= 0.1
##$BCFW= 1
##$BC_mod= 2
##$BYTORDP= 1
##$COROFFS= 0
##$CY= 7568.61572265625
##$DATMOD= 1
##$DC= 2
##$DFILT= <>
##$DTYPP= 0
##$F1P= 17.9538593292236
##$F2P= -4.03888763876832
##$FCOR= 0.5
##$FTSIZE= 32768
##$FT_mod= 4
##$GAMMA= 1
##$GB= 1
##$INTBC= 1
##$INTSCL= 1
##$ISEN= 128
##$LB= 0.02
##$LEV0= 0
##$LPBIN= 0
##$MAXI= 945.577
##$MC2= 0
##$MEAN= 0
##$ME_mod= 0
##$MI= -402.1523
##$NCOEF= 0
##$NC_proc= 0
##$NLEV= 6
##$NOISF1= 8.587773
##$NOISF2= 6.764455
##$NSP= 1
##$NTH_PI= 0
##$NZP= 0
##$OFFSET= 17.49637
##$PC= 1
##$PHC0= 214.6321
##$PHC1= -23.64118
##$PH_mod= 0
##$PKNL= yes
##$PPARMOD= 0
##$PPDIAG= 0
##$PPIPTYP= 0
##$PPMPNUM= 100
##$PPRESOL= 1
##$PSCAL= 0
##$PSIGN= 0
##$REVERSE= no
##$SF= 200.13
##$SI= 32768
##$SIGF1= 18.5376
##$SIGF2= -6.396296
##$SINO= 400
##$SIOLD= 32768
##$SREGLST= <1H.CDCl3>
##$SSB= 3
##$STSI= 0
##$STSR= 0
##$SW_p= 4401.40845070422
##$SYMM= 0
##$S_DEV= 0
##$TDeff= 0
##$TDoff= 0
##$TI= <>
##$TILT= no
##$TM1= 0
##$TM2= 0
##$TOPLEV= 0
##$USERP1= <user>
##$USERP2= <user>
##$USERP3= <user>
##$USERP4= <user>
##$USERP5= <user>
##$WDW= 1
##$XDIM= 8192
##$YMAX_p= 0
##$YMIN_p= 0
$$ End of Bruker specific parameters
$$ ---------------------------------
##NTUPLES= NMR FID
##VAR_NAME=  TIME,          FID/REAL,        FID/IMAG
##SYMBOL=    X,             R,               I
##VAR_TYPE=  INDEPENDENT,   DEPENDENT,       DEPENDENT
##VAR_FORM=  AFFN,          ASDF,            ASDF
##VAR_DIM=   8192,          8192,            8192
##UNITS=     SECONDS,       ARBITRARY UNITS, ARBITRARY UNITS
##FACTOR=    0.0002272,     1,               1
##FIRST=     0,             0,               0
##LAST=      1.8609952,     12,              -27
##MIN=       0,             -1125386,        -1125386
##MAX=       1.8609952,     985764,          985764
$$ Real data points
##PAGE= N=1
##DATA TABLE= (X++(R..R)), XYDATA
0 0 0 0 0 0 0 0 0 0 0 0 16 -16 16 -16 32 -32 48 -48 64 -80 96 -112 128 -144 176 -208 240 -273 320 -368 416
31 416 -480 544 -608 689 -776 876 -977 1089 -1217 1356 -1507 1669 -1853 2046 -2257 2494
47 2494 -2749 3035 -3339 3678 -4053 4468 -4934 5450 -6037 6704 -7471 8368 -9422 10699
61 10699 -12261 14250 -16854 20445 -25739 34346 -50783 93835 -459001 -1125386 -743181
72 -743181 -557404 -146090 326727 781160 880941 900760 792813 494168 -15601 -413625
82 -413625 -715660 -923585 -963519 -696048 -314905 77973 463723 806057 916332 814386
92 814386 584405 261579 -165618 -546777 -779115 -851770 -781655 -527369 -148462 246529
102 246529 571505 787605 832740 695784 416153 59192 -310443 -603091 -761701 -768108
112 -768108 -620163 -333533 17031 348019 607478 749604 723627 536853 251008 -77469
122 -77469 -397031 -628104 -710869 -647973 -464271 -180476 144897 424211 604868 670526 600107
133 600107 393141 106490 -185937 -436853 -603179 -637231 -529470 -318734 -52486 224848
143 224848 454641 580947 582923 469543 261728 -794 -258224 -454826 -554806 -540356 -412925
154 -412925 -200877 47458 280628 452647 528117 492115 355239 148273 -85553 -297932
164 -297932 -444694 -496721 -445358 -303034 -100639 118786 309370 432629 464370 399465 253334
175 253334 58002 -145608 -315860 -417617 -430874 -355104 -207793 -20074 168524 318190
185 318190 399158 396839 312753 165042 -13651 -185436 -316158 -379936 -363328 -271621 -126324
196 -126324 41996 199159 312299 357943 328997 233307 91086 -67581 -208863 -303914 -334882
207 -334882 -296272 -196767 -58568 88655 214922 294416 311314 263374 161947 29155 -106899
218 -106899 -218125 -281930 -286309 -231334 -129579 -3404 120920 218084 267928 261101 200644
229 200644 100101 -19311 -132263 -214993 -251563 -235775 -171383 -72572 38633 139183 209225
240 209225 234655 210507 143242 48441 -54275 -143947 -201621 -215920 -185504 -117793 -27018 67316
252 67316 145165 191161 197057 161951 93987 8503 -76402 -143778 -179942 -177855 -139118 -72935
264 -72935 6589 82943 140171 166892 158789 118239 54247 -19118 -86521 -134447 -153544 -140479
276 -140479 -98814 -38114 28631 87859 127401 139663 123059 81729 24753 -35672 -87043 -119123
288 -119123 -126053 -106938 -66550 -13798 40126 84421 110270 112881 92464 53818 5372 -42680
300 -42680 -80638 -101181 -100540 -79551 -43072 851 43330 75890 92141 89266 68584 34658 -5246
313 -5246 -42951 -70759 -83556 -79312 -59255 -27821 8027 41210 65358 75714 70675 51627 22963
326 22963 -9455 -39112 -60213 -68654 -63290 -45583 -19277 10094 36687 55310 62536 57328 40816
339 40816 16703 -9952 -34088 -50982 -57392 -52409 -37205 -15033 9528 31718 47244 53149 48486
352 48486 34380 13863 -8895 -29587 -44074 -49646 -45446 -32398 -13171 8271 27782 41510
364 41510 46943 43067 30733 12575 -7704 -26239 -39477 -44735 -41115 -29536 -12263 7224 25058
377 25058 37800 42968 39635 28516 11903 -6919 -24168 -36532 -41626 -38411 -27660 -11501 6671
390 6671 23450 35573 40513 37446 26993 11255 -6577 -22983 -34813 -39651 -36584 -26302 -10899
403 -10899 6545 22622 34190 38916 35913 25766 10541 -6661 -22502 -33914 -38463 -35392 -25233
416 -25233 -10236 6796 22469 33648 38026 34956 24883 9719 -7212 -22607 -33594 -37974 -34602
429 -34602 -24230 -9252 7496 22997 33905 37788 34127 23872 8664 -8407 -23621 -33968
441 -33968 -37735 -34030 -23134 -7701 8971 24088 34657 38004 33465 22387 6995 -10108 -25332
454 -25332 -35010 -37724 -33130 -21801 -5699 11331 25821 35464 38052 32570 20389 4483 -12387
467 -12387 -27118 -36202 -37690 -31712 -19409 -3100 13938 27972 36351 37435 30875 17944 1507
480 1507 -15138 -28915 -36733 -36913 -29716 -16503 100 16668 29639 36567 36305 28427 14637 -1753
494 -1753 -17615 -30180 -36679 -35293 -26771 -13181 3180 19144 30896 35960 34026 25354 11215
507 11215 -5120 -19886 -30670 -35602 -33093 -23432 -9410 6000 20584 31206 34832 31147 21755
520 21755 8072 -7619 -21618 -30550 -33446 -30087 -20310 -6129 8654 21289 30168 32959 28495
533 28495 18261 5013 -9180 -21950 -29947 -31264 -26689 -17157 -3879 10271 21775 28678 30276
546 30276 25852 15683 2592 -10416 -21429 -28493 -29418 -24088 -14327 -2142 10760 21481 27481
559 27481 27910 23157 13732 1387 -10942 -20904 -26847 -27425 -22254 -12681 -882 11036 20789 26184
573 26184 26230 21260 12038 481 -10957 -20192 -25553 -25864 -20746 -11545 -379 11021 20424 25325 24869
588 24869 19910 11112 -253 -11376 -19681 -24356 -24704 -19771 -10415 463 10892 19861 24975 24288
602 24288 18586 10083 -541 -11733 -20184 -23845 -23330 -18827 -9845 1541 11678 19385 24122 23955
616 23955 17981 8644 -1556 -11791 -20394 -24370 -22677 -17187 -8772 2082 12796 20133 23448 22812
630 22812 17399 7768 -3090 -12815 -20341 -24180 -22629 -16149 -6898 3426 13488 20965 23717 21710
644 21710 15780 6584 -4271 -14145 -20968 -23713 -21807 -15280 -5473 5258 14727 21343 23685 21160
658 21160 14197 4584 -5877 -15167 -21576 -23604 -20707 -13621 -3894 6709 16071 22084 23404 20013
672 20013 12674 2708 -7875 -16685 -22035 -23078 -19507 -11779 -1556 8668 17195 22473 23092 18717
686 18717 10573 462 -9776 -18179 -22715 -22379 -17611 -9473 721 10927 18681 22516 22000 16967
700 16967 8303 -2162 -11913 -19188 -22718 -21586 -15747 -6657 3463 12845 19811 22621 20591 14413
714 14413 5574 -4593 -13971 -20293 -22325 -19845 -13415 -4022 6224 14935 20459 22020 19004 11799
728 11799 2342 -7315 -15543 -20789 -21567 -17693 -10409 -1131 8561 16495 20867 20832 16613 9050 -545 -9948
744 -9948 -16988 -20618 -20098 -15261 -7356 2030 10777 17453 20480 19187 13899 5883 -3344 -11882 -17850
759 -17850 -20137 -18173 -12454 -4279 4728 12614 17956 19508 16921 10943 2905 -5850 -13347 -17999 -18813
774 -18813 -15864 -9657 -1325 7100 13789 17732 18137 14549 7967 24 -7778 -14183 -17592 -17127 -13190
789 -13190 -6834 1073 8865 14515 16990 16161 12091 5361 -2472 -9366 -14319 -16586 -15260 -10582 -4021
804 -4021 3187 9853 14545 15973 13975 9450 3019 -4246 -10405 -14216 -15165 -13097 -8314 -1819 4901
819 4901 10411 13893 14500 11973 7128 948 -5443 -10650 -13579 -13689 -10987 -6159 -52 5939 10600 13057
835 13057 12854 9994 5244 -620 -6294 -10444 -12545 -12067 -9130 -4374 1252 6470 10262 12020 11273 8217
851 8217 3683 -1613 -6599 -10026 -11415 -10503 -7581 -3109 2063 6609 9685 10880 9836 6849 2582
866 2582 -2248 -6543 -9424 -10380 -9279 -6403 -2222 2405 6433 9067 9882 8765 5907 1886 -2490 -6328
882 -6328 -8770 -9508 -8355 -5586 -1720 2562 6207 8520 9147 8016 5367 1557 -2503 -6060 -8294 -8886
898 -8886 -7775 -5173 -1491 2519 5941 8103 8710 7634 5026 1417 -2441 -5861 -8064 -8580 -7520 -4986
914 -4986 -1400 2477 5857 8033 8585 7495 4976 1367 -2540 -5886 -8111 -8668 -7541 -4899 -1329 2601
930 2601 6093 8179 8733 7566 4918 1177 -2859 -6247 -8391 -8914 -7654 -4870 -1024 3068 6536 8682
946 8682 9102 7669 4760 802 -3389 -6875 -8946 -9284 -7720 -4656 -481 3789 7283 9303 9485 7697
962 7697 4394 159 -4265 -7708 -9651 -9644 -7652 -4138 288 4761 8230 9994 9778 7513 3755 -904
978 -904 -5417 -8689 -10341 -9882 -7313 -3320 1566 6043 9240 10626 9780 6983 2709 -2297 -6781 -9820
994 -9820 -10903 -9748 -6577 -2003 3075 7445 10315 11076 9557 6057 1274 -3885 -8207 -10798 -11193 -9250
1010 -9250 -5449 -415 4773 8903 11183 11254 8891 4715 -515 -5631 -9552 -11553 -11100 -8356 -3932 1428
1026 1428 6499 10132 11732 10877 7709 2999 -2501 -7399 -10720 -11926 -10499 -6952 -1970 3507 8214
1041 8214 11197 11752 9969 6084 937 -4587 -9018 -11525 -11709 -9375 -5106 282 5614 9681 11771
1056 11771 11414 8586 4019 -1406 -6599 -10294 -11891 -10922 -7704 -2882 2639 7586 10810 11820 10335
1071 10335 6720 1658 -3836 -8389 -11160 -11593 -9614 -5673 -404 4936 9077 11375 11241 8742 4411
1086 4411 -902 -6004 -9718 -11468 -10729 -7745 -3217 2124 6965 10227 11335 10047 6750 1885 -3343
1101 -3343 -7790 -10513 -11093 -9265 -5479 -585 4456 8454 10699 10639 8336 4282 -689 -5553 -9078 -10691
1117 -10691 -10041 -7310 -3008 1939 6446 9467 10507 9323 6157 1693 -3156 -7210 -9731 -10187 -8452
1132 -8452 -5026 -446 4224 7875 9808 9641 7509 3688 -868 -5235 -8369 -9739 -9031 -6452 -2472
1147 -2472 2064 6103 8722 9471 8293 5315 1206 -3185 -6807 -8893 -9132 -7426 -4127 40 4204
1162 4204 7352 8915 8582 6433 2893 -1211 -5130 -7848 -8763 -7874 -5403 -1732 2392 5896 7970 8440
1178 8440 7137 4223 438 -3385 -6459 -8181 -8019 -6225 -3132 670 4357 6991 8047 7390 5231
1193 5231 1938 -1873 -5165 -7288 -7841 -6748 -4231 -739 2818 5778 7468 7498 5947 3128 -422 -3829
1209 -3829 -6336 -7447 -6977 -5009 -1986 1536 4566 6602 7322 6311 3996 884 -2443 -5303 -6930
1224 -6930 -6918 -5524 -3023 247 3488 5771 6783 6471 4772 1856 -1327 -4122 -6092 -6809 -5917 -3723
1240 -3723 -842 2253 4842 6403 6430 5117 2819 -179 -3165 -5338 -6285 -6014 -4438 -1828 1218 3921
1256 3921 5670 6304 5545 3546 751 -2109 -4487 -5930 -6026 -4822 -2565 198 2906 5004 5977 5629
1272 5629 4090 1732 -1104 -3673 -5371 -5863 -5156 -3324 -754 1988 4173 5448 5646 4556 2426 -192
1288 -192 -2678 -4637 -5634 -5324 -3850 -1581 962 3414 5005 5494 4805 3105 759 -1817 -3907 -5109
1304 -5109 -5226 -4264 -2351 143 2516 4308 5221 4992 3628 1510 -986 -3114 -4600 -5122 -4511 -2925
1320 -2925 -709 1627 3625 4821 4970 3983 2232 -63 -2345 -4024 -4862 -4607 -3477 -1499 814 2862
1336 2862 4250 4779 4234 2761 663 -1489 -3302 -4503 -4687 -3768 -2100 -16 2120 3779 4527 4274
1352 4274 3190 1457 -685 -2646 -3951 -4450 -4025 -2658 -654 1340 3028 4120 4319 3529 1968 39
1368 39 -1847 -3401 -4169 -3980 -2993 -1372 566 2374 3649 4094 3635 2439 678 -1206 -2784 -3766 -3943
1385 -3943 -3236 -1861 -55 1724 3087 3774 3669 2736 1217 -530 -2178 -3342 -3745 -3345 -2188 -595
1401 -595 1070 2518 3435 3555 2891 1650 28 -1600 -2779 -3365 -3269 -2438 -1056 551 2001 2973 3313
1418 3313 2943 1900 494 -1009 -2287 -3060 -3112 -2502 -1355 63 1476 2506 2985 2825 2037 794 -637
1435 -637 -1861 -2674 -2901 -2527 -1539 -287 1045 2122 2732 2687 2053 1000 -279 -1461 -2314 -2652 -2412 -1623
1453 -1623 -449 723 1738 2412 2482 2018 1113 -32 -1179 -2058 -2409 -2290 -1622 -600 541 1508 2181 2346
1471 2346 1958 1145 58 -973 -1818 -2259 -2165 -1607 -685 379 1370 2040 2231 1914 1160 181 -885 -1747 -2189
1490 -2189 -2139 -1629 -747 273 1265 1975 2231 1966 1224 258 -784 -1640 -2186 -2218 -1676 -857 214 1233 1960
1509 1960 2266 2022 1356 399 -701 -1619 -2181 -2297 -1864 -1041 83 1189 1959 2355 2237 1608 666 -519
1527 -519 -1563 -2273 -2494 -2156 -1345 -191 973 1938 2476 2515 1932 974 -245 -1412 -2316 -2676 -2443 -1713 -582
1546 -582 747 1823 2549 2752 2327 1397 137 -1193 -2237 -2838 -2800 -2139 -1043 309 1634 2555 2975 2797
1564 2797 1928 647 -764 -2028 -2812 -3039 -2628 -1590 -216 1224 2431 3078 3123 2484 1290 -211 -1679
1581 -1679 -2774 -3284 -3093 -2204 -863 689 2091 3054 3392 2978 1951 486 -1114 -2475 -3331 -3424 -2822
1598 -2822 -1583 -12 1614 2831 3528 3417 2583 1204 -461 -1990 -3173 -3649 -3319 -2300 -818 926
1614 926 2431 3375 3670 3188 1987 346 -1372 -2758 -3612 -3654 -2929 -1614 85 1742 3085 3711 3590
1631 3590 2675 1209 -560 -2181 -3323 -3811 -3465 -2390 -807 1003 2540 3526 3804 3234 2027 339
1647 339 -1438 -2891 -3683 -3738 -3001 -1655 91 1814 3098 3779 3646 2696 1266 -548 -2198 -3341 -3829
1664 -3829 -3482 -2415 -841 898 2481 3469 3809 3279 2092 458 -1297 -2760 -3603 -3718 -3044 -1747 -62
1681 -62 1653 2989 3667 3625 2805 1366 -323 -1975 -3167 -3710 -3453 -2511 -1011 674 2225 3285 3656
1698 3656 3274 2159 643 -1116 -2495 -3398 -3621 -3055 -1830 -254 1344 2705 3452 3533 2777 1543 -66
1715 -66 -1677 -2873 -3478 -3353 -2525 -1191 430 1934 3013 3454 3200 2268 846 -761 -2149 -3079 -3399
1732 -3399 -2992 -2001 -540 990 2358 3144 3289 2787 1686 237 -1279 -2519 -3176 -3239 -2598 -1423 37
1749 37 1494 2610 3107 3044 2354 1109 -301 -1716 -2694 -3142 -2935 -2104 -871 562 1864 2741 3052 2744
1767 2744 1876 608 -761 -1959 -2775 -2959 -2594 -1669 -339 984 2134 2781 2852 2386 1392 118 -1159
1784 -1159 -2200 -2761 -2775 -2221 -1219 52 1312 2251 2726 2619 1992 972 -280 -1445 -2303 -2693 -2530 -1794
1802 -1794 -731 441 1552 2326 2591 2336 1638 572 -637 -1650 -2369 -2546 -2232 -1472 -418 740 1721
1819 1721 2349 2496 2095 1329 282 -870 -1754 -2304 -2398 -1995 -1131 -104 966 1815 2299 2353 1836 1027 -73
1838 -73 -1025 -1845 -2308 -2229 -1762 -890 138 1106 1869 2254 2159 1601 737 -263 -1237 -1949 -2222 -2112 -1533 -623
1858 -623 361 1302 1929 2163 2028 1404 530 -463 -1328 -1918 -2139 -1966 -1305 -448 558 1381 1957 2090 1840 1219
1878 1219 327 -616 -1490 -1956 -2107 -1789 -1070 -236 678 1508 1955 2028 1699 975 105 -831 -1541 -1949 -1998 -1629
1898 -1629 -952 2 858 1553 1928 1949 1495 786 -61 -965 -1652 -1919 -1894 -1425 -687 157 1031 1636 1894 1864 1336
1919 1336 633 -277 -1112 -1633 -1890 -1762 -1247 -473 346 1128 1672 1866 1695 1155 397 -462 -1169 -1660 -1833 -1626
1939 -1626 -1031 -274 508 1174 1664 1765 1513 969 233 -550 -1273 -1700 -1718 -1420 -891 -135 610 1271 1649 1649 1355
1960 1355 830 19 -692 -1263 -1645 -1612 -1312 -694 40 740 1304 1605 1546 1210 666 -55 -757 -1292 -1551 -1473 -1136
1981 -1136 -554 165 794 1303 1504 1410 1075 507 -165 -796 -1292 -1471 -1378 -984 -460 211 802 1247 1422 1308
2001 1308 942 389 -233 -813 -1192 -1389 -1289 -928 -349 248 815 1170 1346 1180 843 347 -262 -804 -1159 -1331
2021 -1331 -1148 -836 -324 291 767 1121 1248 1174 810 298 -218 -746 -1076 -1250 -1132 -777 -303 236 750 1084
2041 1084 1229 1103 798 284 -270 -754 -1102 -1203 -1107 -828 -314 192 681 1079 1185 1070 735 330 -206 -704
2061 -704 -1076 -1194 -1124 -778 -326 206 742 1079 1229 1145 823 373 -202 -705 -1091 -1267 -1199 -878 -346 203 728
2082 728 1182 1292 1238 908 361 -210 -767 -1125 -1357 -1276 -925 -407 223 825 1255 1406 1304 925 367 -268 -912
2103 -912 -1347 -1532 -1403 -995 -363 297 910 1392 1573 1445 987 333 -427 -1099 -1523 -1679 -1479 -1017 -317 459
2123 459 1148 1628 1746 1539 990 239 -575 -1264 -1717 -1821 -1568 -965 -154 731 1379 1830 1905 1599 923 9
2143 9 -830 -1550 -1990 -1975 -1602 -824 64 966 1665 2108 2022 1571 772 -183 -1152 -1883 -2196 -2103 -1570 -678 386
2164 386 1314 1980 2268 2092 1483 495 -598 -1504 -2188 -2371 -2101 -1389 -386 757 1696 2351 2449 2080 1303
2183 1303 167 -1005 -1911 -2471 -2507 -2057 -1112 31 1175 2120 2589 2545 1963 915 -245 -1393 -2317 -2727
2201 -2727 -2556 -1872 -815 454 1631 2461 2758 2524 1739 574 -725 -1896 -2620 -2858 -2531 -1624 -379
2218 -379 940 2089 2706 2890 2408 1385 91 -1243 -2313 -2926 -2893 -2328 -1212 156 1543 2488 2993
2235 2993 2879 2156 984 -426 -1741 -2697 -3070 -2848 -2014 -778 650 1994 2852 3117 2715 1780 465
2252 465 -1013 -2251 -2970 -3178 -2683 -1578 -180 1247 2435 3063 3122 2467 1306 -129 -1541 -2662 -3238
2269 -3238 -3087 -2309 -1056 448 1824 2783 3233 2960 2096 748 -720 -2067 -3009 -3264 -2870 -1891 -519
2286 -519 1013 2310 3077 3217 2690 1594 167 -1312 -2512 -3189 -3207 -2502 -1344 126 1596 2664 3235
2303 3235 3058 2287 1023 -460 -1854 -2815 -3236 -2989 -2085 -761 754 2079 2941 3218 2782 1784 413
2320 413 -1087 -2300 -3045 -3169 -2614 -1527 -130 1317 2471 3078 3078 2399 1217 -187 -1597 -2643 -3089
2337 -3089 -2993 -2179 -937 481 1800 2737 3082 2801 1948 627 -797 -2047 -2846 -3027 -2624 -1658 -344 1069
2355 1069 2184 2843 2952 2426 1325 -21 -1316 -2371 -2868 -2846 -2217 -1068 267 1508 2438 2831 2644
2372 2644 1912 786 -534 -1713 -2527 -2810 -2493 -1695 -534 763 1854 2559 2712 2296 1441 231 -1011
2389 -1011 -1994 -2584 -2579 -2082 -1132 38 1193 2095 2543 2449 1861 858 -326 -1418 -2202 -2489 -2286 -1606 -598
2408 -598 528 1543 2193 2388 2086 1342 330 -747 -1658 -2190 -2280 -1919 -1076 -107 905 1735 2157 2162 1684
2427 1684 857 -157 -1092 -1803 -2119 -1989 -1477 -639 338 1234 1867 2053 1815 1212 370 -550 -1340 -1834 -1937
2446 -1937 -1638 -1013 -150 697 1374 1800 1786 1430 770 -38 -857 -1447 -1740 -1698 -1246 -564 198 912 1411 1636
2466 1636 1454 985 340 -383 -1038 -1417 -1518 -1329 -831 -194 470 1064 1401 1369 1107 652 -16 -589 -1073 -1303
2486 -1303 -1246 -986 -405 158 693 1070 1215 1112 797 261 -276 -706 -1050 -1144 -968 -591 -144 386 771 977
2506 977 991 806 425 -21 -470 -800 -949 -850 -631 -262 111 463 705 842 684 463 150 -224 -515 -683 -743
2527 -743 -610 -361 -53 262 510 646 606 452 219 -37 -310 -525 -578 -507 -354 -122 147 387 420 476 404 235
2549 235 43 -192 -368 -390 -396 -276 -104 69 224 336 345 276 156 -11 -157 -245 -291 -255 -163 -62 93 165 238 241 202
2574 202 80 -31 -142 -230 -222 -185 -90 46 144 209 208 221 147 2 -100 -181 -187 -189 -131 4 79 191 272 217 171 85 -58
2601 -58 -151 -212 -274 -239 -142 -25 112 248 273 330 234 100 -64 -238 -313 -374 -366 -239 -45 131 271 383 417 321 161
2626 161 -68 -250 -392 -481 -436 -321 -137 93 297 459 476 444 288 33 -169 -356 -510 -497 -432 -239 28 269
2648 269 444 542 552 394 171 -51 -319 -522 -607 -534 -353 -111 126 383 574 606 536 313 -4 -244 -496 -662
2670 -662 -657 -518 -286 26 343 515 674 653 480 188 -124 -385 -622 -719 -666 -453 -170 180 448 621 707 598
2692 598 399 74 -236 -526 -682 -733 -572 -336 6 355 600 715 723 556 232 -69 -393 -613 -732 -706 -515
2713 -515 -185 149 462 691 738 668 416 107 -251 -521 -708 -772 -643 -401 -48 297 575 754 751 577 288 -92
2735 -92 -392 -626 -780 -715 -537 -208 133 436 692 789 686 459 127 -174 -478 -698 -761 -671 -408 -54 258 557
2757 557 714 751 568 342 4 -325 -585 -755 -665 -561 -271 45 395 614 714 640 476 179 -145 -460 -665
2778 -665 -711 -651 -426 -163 177 455 640 686 552 350 27 -272 -528 -673 -643 -533 -300 18 326 549 653
2799 653 634 461 177 -89 -373 -553 -639 -566 -429 -172 133 370 568 618 560 359 63 -183 -416 -544 -574 -538
2821 -538 -299 -70 219 381 566 547 438 244 -20 -258 -414 -520 -562 -377 -208 2 261 403 517 482 324
2842 324 123 -114 -291 -423 -457 -438 -286 -64 126 317 411 465 411 251 79 -167 -317 -430 -450 -354 -175 -41
2864 -41 163 306 389 399 294 112 -53 -229 -351 -377 -357 -281 -128 43 203 275 357 319 218 73 -81 -211 -352
2887 -352 -372 -261 -155 -44 96 227 274 281 257 138 9 -100 -249 -283 -285 -192 -109 1 113 209 245 233 202 100 -62
2912 -62 -118 -170 -215 -193 -142 -60 60 110 154 160 179 111 55 -52 -137 -188 -204 -186 -117 -71 19 83 107 147 100 88 10 -59 -114 -113
2942 -113 -129 -94 -51 -12 53 95 79 120 93 33 14 -24 -69 -119 -76 -48 -13 -36 48 63 68 90 56 -13 4 -19 -63 -64 -55 -24 -39
2973 -39 -46 -17 29 22 22 25 29 3 -21 10 -66 -41 -11 -37 -27 -41 -48 12 5 17 23 16 23 46 3 6 -40 -74 -45 -64 -28 11 8 31 41 61
3009 61 49 76 35 -8 -18 -46 -112 -36 -46 -53 -40 42 41 89 95 41 73 -7 -49 -97 -129 -97 -119 -76 -19 -20 70 83 94 109 44 -4
3041 -4 -76 -140 -98 -169 -149 -97 -20 62 109 151 158 119 86 33 -69 -103 -181 -161 -116 -87 -11 94 109 195 194 122 89 -13 -138 -158
3071 -158 -226 -182 -91 -48 48 100 175 244 184 115 -1 -66 -134 -211 -223 -194 -142 -58 61 183 232 215 187 102 13 -104 -192 -227
3099 -227 -269 -181 -117 6 137 191 248 265 203 105 -10 -117 -228 -239 -238 -183 -93 40 151 241 272 252 173 99 -51 -192
3125 -192 -261 -267 -225 -193 -63 89 214 274 305 226 159 21 -113 -230 -297 -320 -258 -163 -11 139 255 307 317 256 128
3150 128 -22 -159 -276 -326 -320 -265 -107 47 176 298 382 270 227 72 -53 -206 -321 -361 -322 -219 -38 108 242
3173 242 375 334 283 186 55 -135 -275 -351 -351 -306 -161 -1 155 293 332 352 265 122 -40 -211 -314 -376 -350 -281
3197 -281 -101 30 205 335 373 338 244 77 -88 -242 -353 -376 -312 -223 -37 113 256 349 367 321 183 22 -125
3220 -125 -285 -398 -361 -302 -183 40 196 312 349 374 247 100 -61 -234 -342 -384 -379 -243 -115 82 256 316 399
3243 399 325 204 61 -153 -289 -338 -414 -288 -179 13 144 310 373 384 321 149 -13 -142 -311 -370 -323 -273 -110
3266 -110 88 227 325 390 350 176 65 -44 -250 -367 -371 -307 -190 -37 133 256 326 341 282 201 26 -142 -316
3289 -316 -383 -378 -247 -128 36 218 316 337 309 208 72 -77 -224 -318 -352 -304 -211 -32 99 243 329 293 257 160 23
3314 23 -109 -262 -317 -343 -241 -134 51 160 277 309 261 234 87 -65 -193 -308 -347 -270 -201 -45 60 190 240
3337 240 287 207 143 16 -139 -186 -296 -334 -240 -162 -14 125 226 290 285 215 69 -30 -162 -222 -277 -229 -155 -18 56 198
3363 198 233 250 210 134 34 -94 -187 -247 -243 -208 -64 26 90 209 229 229 169 85 -21 -125 -183 -197 -214 -153 -32 58 119
3390 119 163 204 139 126 -9 -92 -167 -230 -209 -163 -86 21 98 153 194 196 106 90 -50 -110 -155 -171 -129 -81 -39 27 120 146 156
3419 156 140 48 -7 -55 -124 -153 -128 -122 -91 -20 44 116 117 136 73 22 -23 -74 -112 -139 -136 -51 -19 67 135 137 122 99 37 -21 -76 -97
3451 -97 -129 -129 -84 -81 19 88 77 102 137 37 11 -17 -59 -90 -98 -84 -66 13 49 77 104 107 63 25 -34 -77 -60 -106 -74 -62 -4
3482 -4 -13 39 64 97 61 -9 4 -53 -47 -96 -69 -49 -38 11 23 78 60 46 -3 -12 -55 -56 -131 -65 -38 -48 1 19 18 70 63 29 58 -3
3516 -3 -21 -23 -55 -26 -29 -9 68 51 65 38 21 -5 35 -31 -34 -33 -24 -42 -19 -4 34 44 58 9 14 14 -41 -68 -76 -62 -32 4 22 26 28 57
3552 57 15 21 16 -14 -53 -46 -49 -33 -2 13 17 37 35 26 32 39 -4 -21 -26 -23 -39 -24 16 18 71 58 49 18 40 14 -58 -30 -54 -26 -6 -6 14
3589 14 9 35 31 26 -3 -24 -26 -32 -51 -51 -22 -19 -3 29 15 20 30 18 24 -25 -42 -39 -42 -13 15 -18 -2 36 40 27 46 50 -3 -15 -25 -14 -17
3626 -17 -53 -14 -35 24 22 0 -17 24 -19 12 3 -12 1 -23 -23 -30 12 -15 -4 -3 -33 8 -15 -23 -16 -19 -15 -40 -8 -10 -21 -45 -5 2 1 -5 17
3663 17 8 18 0 5 2 -34 -9 -38 -19 -8 2 13 17 86 12 35 32 -2 -21 -49 -49 -48 -17 -24 26 33 15 31 56 36 47 -36 -60 -43 -86
3698 -86 -74 -75 -23 1 7 37 67 31 51 31 -31 -47 -102 -57 -107 -35 -23 31 31 51 81 86 47 41 11 -37 -76 -76 -48 -59 26 30 100 119
3732 119 116 71 31 33 -37 -77 -99 -96 -86 -57 36 53 94 91 155 89 38 -47 -114 -133 -159 -140 -69 -17 45 41 132 125 91 48 -25 -42 -103
3765 -103 -142 -138 -117 -17 -10 70 127 155 94 101 55 -58 -89 -170 -143 -137 -128 -42 35 119 122 175 135 99 39 -56 -103 -173 -166 -157 -45 -10
3797 -10 77 113 166 167 123 43 -45 -81 -151 -190 -222 -156 -42 42 118 179 186 173 95 40 -40 -95 -166 -230 -180 -122 -4 46 162 200
3827 200 210 180 57 19 -108 -169 -231 -209 -174 -84 45 127 159 210 223 150 86 -39 -126 -192 -257 -167 -146 -43 87 134 207
3854 207 261 204 92 32 -87 -217 -249 -239 -214 -110 -26 106 189 284 237 145 63 -27 -128 -203 -268 -221 -191 -52 74 149
3880 149 251 281 238 180 10 -79 -172 -238 -271 -221 -163 -27 95 152 255 238 207 98 -19 -171 -222 -295 -265 -200 -116 -6
3906 -6 143 210 286 256 166 52 -46 -174 -250 -307 -273 -188 -85 43 210 236 295 224 149 31 -112 -230 -259 -265 -212 -106
3932 -106 -14 127 249 312 293 227 82 8 -164 -201 -292 -274 -187 -44 55 146 280 303 289 157 32 -131 -211 -309 -314 -256
3958 -256 -153 18 86 208 284 308 237 108 14 -135 -242 -305 -280 -205 -85 73 204 281 284 294 207 86 -37 -177
3982 -177 -255 -257 -210 -153 -33 74 234 306 300 226 195 26 -97 -250 -291 -267 -205 -134 59 141 246 330 276 228 58 -49
4008 -49 -194 -278 -318 -269 -204 -91 51 183 242 291 268 149 38 -107 -225 -278 -278 -206 -111 21 154 258 269 254 213
4033 213 92 21 -170 -271 -283 -270 -195 -49 36 190 285 276 293 131 38 -89 -191 -263 -255 -222 -150 -6 110 185 281 306
4059 306 205 118 -15 -110 -203 -277 -269 -191 -61 34 137 242 265 228 157 89 -86 -180 -228 -233 -225 -139 11 142 183 274 288
4086 288 232 110 -5 -94 -199 -267 -269 -187 -65 -5 141 234 263 232 164 58 -81 -186 -231 -267 -229 -134 -18 86 162
4111 162 273 226 171 122 -13 -110 -200 -210 -235 -202 -101 14 123 204 220 212 160 92 -64 -123 -204 -235 -221 -115 -43 82
4137 82 137 226 236 208 119 31 -72 -174 -219 -227 -136 -81 30 112 167 209 219 120 54 -71 -172 -199 -250 -190 -88 -18 63 151
4165 151 189 208 192 70 36 -78 -167 -199 -165 -170 -75 39 115 172 175 161 153 39 -42 -135 -167 -160 -186 -91 -25 52 140 159 186 153
4195 153 64 -13 -100 -131 -183 -110 -117 -50 46 111 121 168 153 96 -10 -66 -96 -198 -161 -143 -78 -20 102 119 117 108 112 44 -42 -100
4225 -100 -149 -139 -129 -92 -20 52 125 125 185 129 44 2 -26 -98 -151 -129 -90 10 34 87 151 159 144 113 -1 -19 -103 -137 -118 -115
4255 -115 -57 -28 46 137 127 142 100 51 -16 -85 -106 -133 -99 -77 -21 34 113 135 150 107 43 36 -76 -119 -147 -133 -91 -46 38 92
4285 92 137 164 137 83 24 -53 -60 -106 -117 -69 -48 20 82 101 133 154 135 39 -28 -98 -117 -123 -127 -89 8 28 111 144 124 133 25 23
4317 23 -73 -137 -139 -141 -94 -24 -10 86 118 118 154 60 21 -46 -72 -101 -127 -134 -50 8 63 112 135 169 122 50 30 -26 -120 -146 -135 -90
4349 -90 -24 54 151 120 143 153 65 22 -48 -112 -119 -155 -144 -86 -7 67 140 184 148 120 39 -54 -112 -114 -162 -132 -108 -20 66 141 120
4380 120 177 119 90 21 -65 -137 -159 -171 -113 -85 -11 86 146 216 177 136 55 -22 -103 -104 -148 -167 -127 10 47 112 203 179 176 104
4410 104 31 -81 -138 -165 -173 -152 -53 -11 89 157 185 147 108 44 -46 -87 -197 -206 -147 -116 -48 53 74 151 201 189 125 0
4438 0 -59 -145 -152 -167 -148 -38 50 85 162 170 180 122 58 45 -88 -149 -177 -178 -160 -48 18 80 165 200 125 96 8 -84 -150 -197 -188
4469 -188 -138 -80 -35 69 140 193 173 123 62 -35 -79 -175 -187 -191 -133 -45 44 98 142 155 165 93 59 -41 -127 -172 -176 -163 -82 -4
4499 -4 70 167 183 224 146 77 21 -68 -128 -202 -180 -132 -44 43 109 185 177 174 117 42 -38 -163 -177 -166 -172 -100 -46 33 153 168 210
4530 210 136 75 -1 -70 -116 -188 -198 -145 -62 8 91 156 197 194 141 59 -15 -83 -181 -195 -168 -96 -32 61 110 177 186 134 85 49 -48
4561 -48 -108 -133 -188 -138 -114 30 68 136 167 163 130 47 -5 -99 -158 -179 -165 -125 -47 50 126 126 179 131 106 26 -37 -125 -163 -174 -154
4592 -154 -60 -27 64 131 168 156 117 79 -6 -66 -138 -164 -136 -106 -64 75 108 159 142 136 126 59 -24 -97 -104 -122 -138 -132 -36 10 107
4623 107 152 118 96 84 -4 -38 -106 -143 -128 -128 -69 -10 59 113 141 172 115 47 3 -104 -106 -141 -134 -96 -34 41 75 139 120 105 72
4654 72 21 -37 -67 -85 -156 -102 -45 -6 39 113 125 110 129 88 4 -22 -99 -128 -142 -88 -40 9 61 94 129 107 79 25 33 -85
4684 -85 -116 -116 -114 -99 -16 41 82 98 144 118 68 11 -35 -77 -79 -98 -98 -49 -28 62 100 126 101 119 47 -9 -17 -58 -123 -134 -43 -13 33
4717 33 34 64 76 71 60 19 -39 -76 -132 -91 -99 -34 20 32 78 103 79 78 13 -44 -47 -46 -66 -102 -74 -32 11 57 64 82 65 62 11 -20
4751 -20 -23 -108 -70 -64 -26 -28 37 51 75 93 91 64 10 -8 -60 -117 -83 -64 -48 -23 5 62 48 92 38 26 -8 -8 -49 -50 -60 -69 -9 -3
4785 -3 26 32 76 81 58 -12 -44 -30 -64 -81 -67 -71 -20 34 74 61 65 32 50 5 -23 -42 -31 -42 -60 -14 7 43 63 53 66 47 -5
4818 -5 11 -2 -59 -36 -50 2 -28 -16 47 21 32 33 4 -15 25 -70 -66 -50 -75 -7 -14 56 36 24 16 43 15 1 4 -35 4 -23 -12
4851 -12 -3 22 56 59 38 35 38 9 -15 -36 -49 -37 -12 -51 -11 2 15 37 5 48 25 -3 -6 -1 -31 -39 -23 -23 -2 4 28 62 28 20 34
4886 34 -13 -19 -35 -47 -66 -7 -6 34 43 43 53 24 46 -16 -11 -19 -1 -43 -22 42 40 2 21 -6 17 -3 9 -17 -34 -28 -53 -25 -18 8 -31
4921 -31 38 0 -2 15 -9 -8 -6 -24 4 -3 -22 5 -21 36 6 9 22 32 4 24 -12 -44 -20 -4 -44 -4 14 -18 22 2 -25 0 14
4954 14 -10 6 -11 3 16 -30 14 1 19 18 -16 10 10 26 9 0 14 -5 -12 -5 -8 -10 29 -13 -54 9 1 -14 12 -14 -16 4 -13 13 -34
4989 -34 -20 -14 32 2 -28 -26 -9 -15 6 12 16 16 38 -3 11 41 17 -6 -14 45 -13 -34 11 27 8 49 -8 -15 26 19 7 4 -23 -12 -3 23
5025 23 5 13 20 30 -1 10 42 -23 14 -36 -18 -9 -43 -22 21 -25 25 6 -10 -31 7 -10 11 8 -7 -15 39 4 17 6 31 44 4
5058 4 10 3 0 -34 -11 -42 -33 -3 -13 -36 -30 5 6 -23 12 -20 -3 -27 -3 -8 -36 16 35 21 17 -59 4 12 -8 -33 -4 15 0 2 4 -29
5094 -29 17 23 -3 52 -13 -28 -12 -49 -44 -10 -10 24 30 37 -5 61 -8 8 28 24 -24 4 -10 -11 25 -2 13 -4 3 14 -9 -20 20 -15
5128 -15 -28 -20 -18 -27 -9 -34 17 -33 26 7 7 -21 4 -41 -14 -16 -11 -44 -9 16 11 -2 23 29 26 18 -12 -19 -3 -12 -4 -4 1 18 40 67 5 19
5166 19 1 22 -15 5 -1 -28 0 16 -51 -17 13 17 32 33 -7 15 1 -9 -32 -6 6 -4 -35 20 13 13 5 36 9 -15 -38 -26 -18 -34
5200 -34 17 -15 -21 -6 20 -6 16 -6 1 -13 -11 -34 -11 -14 7 -18 11 14 23 18 16 27 1 21 10 -44 -13 14 22 -9 -6 18 18 10 2 8 -14
5237 -14 -2 -14 -2 -23 -19 -8 3 12 -1 5 26 28 13 53 -16 4 6 -27 -3 -11 8 10 31 10 34 13 -3 29 -4 8 -47 4 -23 6
5271 6 -9 12 15 27 32 4 15 22 27 -7 -9 -22 -22 -3 8 -15 -13 33 46 22 23 -7 -27 -14 -23 -35 -43 -28 29 -9 25 21 6 -9 3 -46
5307 -46 7 -19 -5 -24 6 -13 12 30 -7 24 56 36 -16 -19 -20 -21 -20 -13 6 7 -9 33 11 35 17 -47 -18 -25 -5 -18 -64 -37 -14 19
5341 19 -8 -2 28 59 -24 -11 -25 -49 -1 -13 -39 1 -12 19 10 40 5 3 -2 -8 -22 2 -8 -11 -10 -23 26 7 6 18 45 2 18 -30
5375 -30 7 -32 -38 -14 -8 22 63 13 39 12 -17 -2 16 -45 -39 -28 -63 -43 -16 -6 7 30 42 10 29 7 6 -10 -48 -27 -11 4
5407 4 -25 -11 -3 3 16 9 -28 10 -26 -16 -26 -46 -28 -22 14 17 -5 27 47 16 -11 0 -32 -15 -28 -12 -6 44 -12 4 38 13 11 1
5441 1 -18 -23 -11 -45 -30 -13 -21 -9 19 13 25 -12 -22 -19 -40 -20 -20 -4 -29 -45 3 41 23 34 58 25 28 -25 17 -22 -31 -26 -33 22 12
5476 12 33 15 3 38 -3 -3 -1 7 -23 -33 -27 1 -13 32 36 31 15 32 23 17 -19 2 -32 -38 -12 -33 12 13 36 10 12 6 -33 -18 4 -67
5512 -67 27 -21 -2 16 14 -15 7 15 -10 13 -17 15 -23 22 -20 -16 -41 18 53 10 10 -2 12 -12 -6 -38 -25 -52 -39 -11 -14 23 -12
5545 -12 50 32 19 48 -8 -69 -58 -39 -57 -22 10 16 -4 44 24 -10 4 -21 -6 -58 -27 -11 -29 -4 1 -1 4 25 19 14 18 -36 3 -37
5579 -37 -24 -7 19 28 2 28 10 16 25 -3 -22 -7 -20 -33 -10 -17 11 13 -11 2 16 14 12 -13 -18 -18 -31 -6 -28 -17 39 4 7 26 42
5614 42 -12 6 17 -22 -20 -64 -17 -10 13 -31 19 40 23 25 -1 -1 -48 -43 -2 -20 12 -5 9 2 23 39 21 27 5 11 3 -24 -10 -9 -4 -19
5650 -19 23 2 -41 35 4 9 -13 -36 -4 -17 -19 -4 8 18 6 55 48 13 22 -3 11 -15 -44 -51 -16 17 32 8 9 7 41 -9 13 -12
5684 -12 -42 -18 -39 -26 -35 -9 -37 27 50 47 42 18 10 -2 6 -52 -7 -24 -4 14 -11 10 7 52 12 -18 -37 -24 -38 -35 -26 -37 -23 -9
5718 -9 24 4 26 36 14 20 1 -13 -29 3 0 1 2 19 8 6 40 30 -5 39 14 17 -22 -50 -27 -6 12 19 11 21 17 12 18 -37 -13 -8 -6
5755 -6 -26 -36 -17 22 -20 15 7 9 19 -19 10 -11 4 -5 -16 -24 -10 8 17 -1 18 36 25 27 16 -52 -1 -15 8 -4 19 35 35 11
5789 11 4 -1 -1 -7 -20 2 -48 5 11 -11 -20 23 15 29 -1 3 -3 -26 -23 -21 7 -2 1 -29 25 12 16 35 6 18 -27 0 -42 -26 -14 -13 -9 32
5827 32 -9 27 25 34 -4 10 11 -39 1 -54 -14 6 -10 9 21 31 37 14 1 -3 9 -11 -9 -40 -18 -9 -27 10 25 -22 -37 38 4 32
5861 32 -25 -29 -24 -44 -24 9 -13 22 10 46 -3 -8 22 -24 22 -6 3 -2 -14 -31 23 20 21 35 14 -16 -17 3 -13 -36 -19 -47 17 30
5895 30 10 6 34 20 7 36 8 2 -15 14 7 -41 -19 -13 4 14 8 16 5 1 5 11 -42 11 -45 -35 -29 -25 3 2 17 13 7 37 20 -4 6
5932 6 8 -8 0 -19 25 43 28 58 33 -17 7 10 6 -20 -46 -12 -12 4 4 15 -21 39 1 -25 -6 -9 23 -36 -33 -17 -4 -12 38 37 -6 9
5968 9 -23 13 10 -15 19 -12 -16 -12 -5 -18 40 40 49 -4 -12 32 -20 -11 -4 14 -5 16 13 14 9 38 44 18 7 18 21 -49 14 -21 -24 14 -21 15
6006 15 13 5 8 3 1 -12 -39 -2 -24 3 0 -7 15 11 0 51 25 13 6 -51 -19 -11 -38 -9 -31 4 34 10 21 19 27 10 -24 -17 -18 -22 -5 11
6044 11 44 5 20 29 7 26 17 43 -11 14 7 -34 -7 -43 23 -6 10 12 -6 0 22 36 -45 -30 -18 25 -29 15 7 -17 38 36 -5 35
6078 35 8 14 8 -12 -27 -29 3 33 58 11 36 16 -5 -27 -17 14 11 -44 -12 -49 2 -13 13 29 38 -14 -8 -60 -11 5 -34 -27 -22 -3
6112 -3 12 -1 0 -13 2 -26 -6 3 -18 0 -9 1 -4 2 -5 38 6 10 -12 15 6 -3 -50 13 3 9 21 24 -15 -12 6 17 23 7 6 -11 22 4
6150 4 -5 -19 7 -13 1 -35 6 -4 25 -23 7 -23 -9 25 -4 -4 -15 25 17 2 11 -20 -5 -22 18 10 -22 32 -12 -31 -28 10 -20 30
6184 30 -6 -15 -17 -5 -9 -22 26 14 17 28 28 24 24 17 26 12 -11 0 16 -11 6 12 0 -10 29 -2 27 -10 -33 -9 -7 -17 -26 -23 28 17 5
6221 5 24 -34 -4 9 -24 -1 -5 19 -12 -4 20 -44 -31 -10 5 11 7 17 11 -16 -22 14 -5 -22 31 3 22 2 -11 -3 -23 18 23 -23 -8
6256 -8 9 -19 -15 -17 3 -7 4 -26 -8 18 8 -10 -4 -13 -13 32 -12 17 13 19 32 5 -15 -30 11 -13 8 -4 -22 -10 -3 -1 11 5 16 -1
6292 -1 14 25 -6 -4 -14 -15 35 -8 7 17 -14 -16 24 5 34 9 -8 -19 19 -39 -24 -14 -12 6 -41 -12 -40 14 -10 10 -10 -3 4 48
6326 48 24 26 25 -18 -21 0 -13 -39 -5 13 21 16 -16 6 -8 7 2 -5 25 40 -3 -18 -13 19 -18 4 0 12 -35 27 -28 -40 -9 2 -11
6361 -11 -6 -25 12 -10 -22 17 30 11 37 -2 11 -11 -14 0 -7 -19 -21 -28 -1 -2 -20 1 -26 -1 -17 -18 -8 8 -14 18 1 10 4 -24 4
6396 4 -3 5 -5 19 -1 -38 -55 -9 5 1 1 13 2 -15 27 14 -48 -25 -53 -7 -14 28 -21 -23 -18 -17 16 31 -3 11 12 -10 16 7 -25 -8
6432 -8 21 3 19 -2 3 10 2 -10 8 14 23 9 -18 -7 -16 -4 7 31 16 3 -4 18 12 46 19 -19 30 -15 -5 15 -12 28 -10 33 18
6467 18 -13 8 19 -2 -18 -1 -7 -4 -16 18 -41 -16 -11 0 10 9 8 2 21 -33 18 1 -16 30 -16 15 37 28 18 -31 -42 -4 20 -9
6501 -9 -20 -8 -6 21 8 21 3 -5 38 -10 -33 -12 17 13 10 25 16 -7 -13 4 47 17 25 -24 -16 -14 -12 7 -24 -5 -44 -2 -3 -2 15 -8 -20
6538 -20 -11 -2 -35 -16 -20 -18 -1 -11 -8 13 16 37 0 6 -11 9 12 -31 -6 -22 -15 19 -8 12 -9 0 22 -16 -9 -22 16 -28 -28 -11 2 -10
6574 -10 -18 0 -20 5 11 -2 -20 10 -6 -11 6 -16 -7 -7 -2 -8 -12 16 26 0 0 2 -46 -21 12 3 -15 -6 1 21 15 49 9 2 -10 -38 -8 -13
6612 -13 -28 11 34 -10 14 27 -19 10 -4 -10 -27 -18 -32 -18 1 7 -4 -14 -18 21 1 23 6 -8 -30 -47 -14 -18 -13 -35 58 -28 16
6645 16 7 -13 21 30 -28 -22 0 13 -19 25 -15 -35 23 8 13 -7 -4 23 27 -7 -9 -6 9 2 27 9 -11 -36 19 -6 33 20 -4 -24 -17
6680 -17 19 -6 4 -5 11 -24 12 12 -22 -19 -2 -18 -8 -25 8 -4 7 15 -3 12 2 -32 -13 20 4 0 -12 4 24 -1 -18 12 12
6713 12 31 -9 12 8 10 8 -11 0 13 -20 -9 22 20 -4 6 -17 17 0 9 1 12 1 -15 -13 0 2 21 -13 13 17 23 -43 -2 -1 -22 -9
6749 -9 15 13 17 15 -3 11 11 7 35 10 -11 3 -20 -27 11 -4 9 -8 36 7 -38 8 -1 -10 -19 -6 -30 -17 18 29 -12 13 19 -1 3 0 10
6786 10 -8 -12 26 4 39 -7 17 -19 -6 19 -14 11 -29 8 -3 0 -15 1 -6 3 -20 9 33 -9 15 4 -8 0 27 2 -3 14 -1
6819 -1 -8 15 -16 7 -14 -15 4 -22 17 -25 -24 -3 31 -4 11 7 -2 24 1 -23 -3 -5 -26 2 25 -2 -36 53 21 -2 12 28 12 -7
6853 -7 -23 -18 2 -9 -27 -3 17 14 29 10 23 -11 38 22 27 -35 19 7 -15 29 41 -8 15 6 37 16 3 -16 45 -8 -27 -15 -3
6886 -3 -17 -11 -15 -15 -1 -10 -1 11 7 3 -20 -13 11 -43 9 37 -10 2 -8 16 43 20 -23 -12 2 -22 -2 14 -15 5 -10 2 34 11 -29
6921 -29 -15 -31 -11 3 -9 -25 13 17 3 -6 9 19 25 3 -4 -33 -11 -31 -22 -10 -5 -17 11 -15 4 18 -33 50 0 -56 -11 6 12 -25
6955 -25 10 6 38 8 2 -10 -5 1 13 20 -1 9 14 13 -7 25 11 -15 15 12 -4 -12 -26 -5 11 -10 -15 11 -4 -19 27 17 9 16 5 21
6991 21 3 -2 -1 -10 2 0 -33 -43 -4 -35 -8 -1 9 -4 -13 -19 18 -55 -27 2 -20 -3 -13 -18 4 -19 -5 4 4 14 -6 -12 -33 1 10 -4
7027 -4 22 -13 -10 -4 -28 -27 3 -27 -2 -4 -9 33 -8 -20 48 -8 -5 -16 -8 -9 -42 -14 11 6 -9 -5 -8 11 -19 -18 -6 14 -38 -3 47 -15 7
7064 7 -9 35 -11 12 -5 2 29 4 -21 -18 -4 -32 7 16 -11 43 55 17 1 -33 -14 -30 -9 -5 -53 -9 21 -8 -9 -16 -30 -30 2 13
7098 13 -3 -2 11 -34 13 8 8 -10 -2 7 26 6 14 -24 0 6 -16 -34 3 15 4 10 -3 -2 -17 -10 -8 -17 3 9 11 9 14 42 -6 35 5 39
7136 39 17 -2 -4 11 -33 22 -10 0 -22 -30 6 1 12 -21 -22 -29 -45 -58 -12 -36 -15 23 8 -13 -19 -4 -21 11 13 1 -18 25 16 4
7170 4 30 5 13 20 21 -12 27 -26 -7 20 -9 -28 -17 12 -9 11 4 2 28 -29 -31 -21 -12 -2 -21 -14 6 -22 4 30 4 37 11 -43 -16
7205 -16 -21 -15 -16 -42 -20 1 -1 -32 -17 10 10 -2 10 -24 3 -10 20 23 18 -13 -5 46 42 1 8 5 -16 30 -10 -16 10 -24 -32 -28 -42 -5 5
7242 5 -8 0 6 -3 -21 -36 8 0 8 -1 26 -11 10 -13 -2 -19 -29 -2 -3 17 -15 -14 14 -24 8 4 16 1 3 -25 13 14 -56 6 -31 8
7278 8 18 -2 7 19 -10 -10 -30 -11 0 -12 -18 -5 -25 19 16 5 2 12 -51 16 14 1 4 -26 -22 -8 -1 -13 7 1 -16 -37 44 10 1 3 -6
7315 -6 31 20 7 -14 15 -20 -10 20 -10 -7 -11 -9 -13 2 30 0 3 -11 24 33 9 22 30 -7 -5 15 -15 -2 -13 18 -7 -24 3 -4 -10 -18
7351 -18 3 13 -17 -25 3 -11 -34 -2 -22 -16 -1 2 -8 2 -8 -25 0 36 25 -48 13 7 28 17 9 2 -7 -32 28 8 3 19 6 -8
7385 -8 6 1 -12 -7 -30 1 -11 9 3 -1 -12 6 31 -13 -35 12 0 32 22 10 -15 21 -25 -4 -14 19 -17 6 -19 10 41 30 27
7418 27 -13 6 -6 19 24 10 16 36 24 25 17 0 28 -1 39 -1 7 9 -10 -2 -2 -8 20 9 -6 19 23 -57 -7 -1 0 -45 -38 -2 -16 -6 -16
7455 -16 16 -6 -17 -2 13 -40 -21 17 -39 -12 -18 17 13 15 -2 4 21 -2 20 11 28 2 18 0 -13 8 -20 -15 48 -29 -6 -14 -33 31
7489 31 28 14 -1 -36 -4 22 13 -3 11 16 -3 -4 -34 -27 -6 -3 13 2 21 26 -2 9 -15 8 -16 23 24 3 19 -20 6 -5 11 32
7523 32 12 22 32 -27 4 10 -9 7 -10 -31 17 -13 4 28 -13 11 8 15 11 -24 -15 -23 -12 17 18 6 17 -35 17 11 -5 13 -10 -6 -24
7558 -24 -25 28 -7 -15 -19 -29 -19 -1 -12 20 4 -8 26 27 -35 -4 -14 -16 -13 12 6 4 2 -14 13 49 -15 -16 -21 33 -6 1 -12 18 -2 -18
7594 -18 19 -26 -12 -14 2 10 -28 21 5 -9 -16 -3 6 -11 10 -16 -13 6 29 -9 -30 -28 -30 -6 13 1 10 -8 -41 6 -1 -10 11 35 -9
7629 -9 30 4 29 29 8 22 15 2 -3 -16 34 20 -13 14 15 34 2 4 6 6 -7 -28 -25 12 -15 24 26 25 21 7 11 -3 14 25 30 -1 21
7666 21 -7 36 10 5 6 -26 -8 -5 -3 13 -18 3 3 -36 13 -19 30 2 19 4 8 3 22 22 -3 18 22 -9 -11 -3 4 19 30 12 2 -23
7702 -23 -19 -25 1 -21 2 -6 3 -16 13 -6 -4 9 -42 6 22 -16 -11 -8 -20 -6 -11 -2 37 2 5 -19 0 -21 -8 22 -2 42 -11 -37 -24
7737 -24 -34 12 -9 -16 -6 9 -6 4 -6 29 -6 18 0 15 -7 29 -20 -3 -10 14 10 2 -6 -12 -26 -32 -11 -37 4 -17 33 -11 -22 -37
7771 -37 7 1 23 -4 2 -19 3 1 8 -1 28 23 -2 33 -6 11 -9 0 5 8 37 22 3 5 2 3 -6 -12 -6 -6 17 -37 21 -24 -3 -7 5 -22 19
7810 19 4 -7 3 -24 -26 8 25 5 -11 8 -8 -14 0 -14 2 -3 3 -12 1 3 3 -14 -2 4 14 -15 19 -15 -9 13 -6 21 7 16 -15
7845 -15 5 -7 48 -16 -21 41 8 0 23 8 18 27 8 -4 -28 3 6 43 -39 11 -17 0 -30 -1 48 7 -21 15 -3 -39 14 18 0
7878 0 16 7 -42 -20 -15 15 3 20 0 -5 3 -3 3 -17 -16 -5 20 -6 21 33 19 28 39 3 19 8 -13 8 22 10 -14 13 -13 3 -2
7913 -2 -15 10 -2 -21 -7 -1 -34 15 -20 -3 -20 -1 25 16 9 -60 3 -3 -9 -12 -20 26 8 16 26 -21 -4 -4 26 -3 20 10 0 8 0 16
7949 16 4 7 8 10 11 -14 35 35 20 40 -9 -15 -7 4 -5 14 13 22 1 -32 -13 -1 14 -34 -8 -18 22 -51 -28 -8 -31 10 29 20 6 35
7985 35 20 22 3 26 6 3 12 11 7 -43 14 -16 25 22 15 15 -12 0 2 -3 13 6 30 -6 9 21 5 7 3 -9 1 4 13 11 16 -1 27 21 -47
8024 -47 -2 16 -21 -4 -25 -22 -28 12 1 4 4 -7 23 -4 -15 -6 39 39 12 14 30 -25 14 -12 -6 -9 -17 -2 -4 -7 2 38 4 7 17 23 -1 -17
8062 -17 -31 -23 -1 18 -4 3 8 -26 -11 2 14 -2 9 -22 -6 10 5 26 18 20 30 6 25 21 47 1 34 29 16 15 34 13 7 -22 22
8097 22 23 24 27 38 8 -22 17 24 -20 3 -2 -1 36 9 9 -14 4 12 -24 11 7 -3 24 1 -7 -21 14 6 -10 18 34 7 -26 12 31 -16
8133 -16 -21 -9 0 7 -11 21 -1 1 -6 17 -4 -6 10 -24 27 -20 -1 17 -13 8 -7 33 19 38 6 -6 9 0 -4 10 40 1 21 -12
8167 -12 1 23 19 -8 21 14 -13 -24 18 11 11 12 -7 27 4 -2 -6 14 8 -3 18 -47 37 12
8191A2
$$ Imaginary data points
##PAGE= N=2
##DATA TABLE= (X++(I..I)), XYDATA
0 0 0 0 0 0 0 0 0 0 0 0 0 0 0 -8 16 -16 16 -16 32 -32 32 -48 48 -64 64 -80 96 -112 128 -144 170 -190 218 -244
34 -244 276 -314 348 -395 438 -493 547 -607 678 -745 828 -912 1011 -1112 1226 -1352 1486
51 1486 -1641 1807 -1994 2202 -2435 2705 -3007 3364 -3776 4275 -4879 5635 -6620 7942 -9845
66 -9845 12812 -18142 30702 -124745 95829 554714 749964 985764 966880 651911 214301
77 214301 -123487 -513265 -867661 -984067 -825474 -585476 -230906 245174 670236 865058
87 865058 902929 799340 496598 51449 -342988 -641196 -846871 -886277 -695762 -371280
97 -371280 -4126 372492 695678 851686 813310 616332 298178 -90335 -450778 -705495
107 -705495 -811679 -746625 -521406 -199690 153712 479985 704533 767821 674139 453272
117 453272 133136 -222230 -515872 -689667 -728004 -616039 -364117 -42912 268064 523216
127 523216 676418 678094 531747 289737 -3267 -304332 -540329 -648067 -619709 -474077
137 -474077 -229057 68973 342588 532429 613549 571457 406681 157935 -113744 -355796
147 -355796 -524750 -582459 -515185 -343093 -105488 150964 373310 513010 542971 461343 286172
158 286172 54181 -184629 -380064 -493607 -503747 -409452 -232002 -10206 209464 382039
168 382039 472604 463589 359039 182517 -28457 -229677 -379448 -448196 -423541 -311810 -137445
179 -137445 61888 244245 373083 422818 383806 266042 96338 -89882 -254726 -363767
189 -363767 -394966 -344510 -224578 -59976 114445 261186 350844 367215 307590 184811 26341
200 26341 -133788 -263319 -336589 -338579 -270328 -147979 2224 149509 263204 319896 309432
211 309432 235533 114141 -28551 -162346 -259900 -301681 -280241 -201331 -82504 50979 171279
222 171279 253567 281734 251455 169575 54031 -69938 -176754 -245065 -261297 -222841 -139022
233 -139022 -28828 85070 179385 234293 239185 194925 111602 6643 -97513 -178780 -221179
244 -221179 -217416 -168624 -85602 12793 105974 175450 207305 195132 142912 62858 -28232 -111729
256 -111729 -170022 -191546 -173305 -119883 -42816 41218 114378 162183 175561 152349 98148 25330
268 25330 -50607 -114477 -153125 -159051 -132191 -79010 -10920 57643 112453 142574 142807 113692 61932
281 61932 -955 -61868 -108465 -131640 -127141 -96710 -47456 10063 63952 103166 120192 112235
293 112235 81675 35361 -16765 -63970 -96876 -109054 -98737 -68598 -25550 21397 62593 89865
305 89865 98109 86463 57591 17923 -24001 -59929 -82808 -88341 -75802 -48385 -12265 25241
317 25241 56732 75830 79129 66621 41229 8271 -25328 -52908 -69149 -71293 -59096 -35469
329 -35469 -5524 24564 49105 63282 64454 52829 31137 3923 -23385 -45431 -57971 -58757 -47959
342 -47959 -27962 -3010 21927 42046 53470 54133 44059 25612 2519 -20506 -39130 -49677
354 -49677 -50342 -41080 -23960 -2459 19080 36607 46676 47416 38814 22681 2468 -17968 -34584
367 -34584 -44207 -44964 -36963 -21780 -2492 16957 32908 42232 43148 35528 21011 2522 -16180 -31648
381 -31648 -40721 -41686 -34399 -20365 -2512 15719 30670 39484 40462 33460 19828 2478 -15295 -29931
395 -29931 -38601 -39538 -32644 -19359 -2296 15088 29402 37823 38751 31937 18822 2133 -14946 -29046
409 -29046 -37341 -38134 -31400 -18402 -1826 15006 28796 36874 37637 30902 17908 1551 -15096 -28862
423 -28862 -36785 -37262 -30380 -17523 -1090 15537 28972 36543 37056 30141 16914 434 -15924 -29261
437 -29261 -36905 -36941 -29416 -16233 105 16678 30001 36931 36578 29160 15628 -1260 -17710 -30382
451 -30382 -37246 -36750 -28449 -14338 2225 18432 31275 37675 36176 27597 13626 -3382 -19878
464 -19878 -32026 -37648 -35999 -26901 -12086 4983 20812 32640 37995 35442 25563 10702 -6235
477 -6235 -22097 -33410 -37799 -34682 -24502 -9183 7830 23112 33857 37752 33705 22822 7561
490 7561 -9236 -24292 -34216 -37000 -32510 -21519 -5827 10864 25049 34175 36651 31367 19431
503 19431 3914 -11998 -25826 -34404 -35532 -29424 -17900 -2701 13419 26471 33720 34436 28438
516 28438 16147 587 -14469 -26383 -33409 -33581 -26360 -14037 410 14965 26835 32793 31743
529 31743 24796 13085 -1656 -16128 -26589 -31609 -30804 -23562 -11098 3089 16013 26004 31067
542 31067 29358 21549 10025 -3275 -16367 -26107 -29941 -27869 -20653 -9132 4477 16731 25183
555 25183 28873 26983 19280 7801 -4701 -16235 -24824 -28205 -25757 -18333 -7476 5003 16510
568 16510 24388 27293 24949 17466 6553 -5425 -16122 -23727 -26571 -23986 -16824 -6459 5387 16148
582 16148 23398 26033 23710 16342 5528 -5900 -15851 -23064 -25664 -22629 -15273 -5588 5502 16041
596 16041 22959 24837 22403 15649 5066 -6653 -16072 -22342 -24906 -22208 -14275 -4156 6083 15741
610 15741 22845 24545 21057 14220 4595 -6865 -16851 -22514 -23942 -21285 -13906 -3087 7678 16249
624 16249 22329 24307 20627 12620 2930 -7401 -16995 -23014 -23762 -19960 -12656 -2396 8757 17695
638 17695 22584 23484 19777 11638 1206 -9061 -17491 -22874 -23533 -19114 -10957 -807 9693 18427
652 18427 23228 23161 18438 10148 -239 -10629 -18801 -23033 -22692 -17918 -9462 1036 11282 19131 23218
667 23218 22639 17359 8368 -2191 -12113 -19685 -23359 -22100 -16243 -7290 2958 12871 20193 23271 21499
682 21499 15645 6478 -4203 -13967 -20672 -23162 -21119 -14598 -4934 5577 14659 20917 23095 20313
696 20313 13287 3811 -6397 -15518 -21527 -22923 -19467 -12244 -2573 7828 16589 21691 22298 18561 11017
711 11017 1003 -9107 -17029 -21677 -22074 -17720 -9509 375 10044 17838 22055 21411 16249 8103 -1734
726 -1734 -11342 -18555 -21666 -20453 -15183 -6755 3227 12402 18784 21510 19837 13887 5024 -4641 -13284
741 -13284 -19273 -21324 -18721 -12265 -3568 5929 14203 19457 20567 17544 10985 2061 -7205 -14865 -19432
756 -19432 -20035 -16406 -9374 -522 8409 15554 19356 19170 15044 7866 -881 -9409 -15779 -19033 -18349 -13743
772 -13743 -6353 2247 10235 16230 18840 17252 12207 4922 -3468 -11165 -16279 -17972 -16149 -11058 -3510
787 -3510 4668 11553 16094 17595 15152 9498 2144 -5489 -12065 -16212 -16689 -13704 -8265 -1060 6493
802 6493 12471 15651 15788 12789 6998 -223 -7184 -12455 -15370 -15101 -11439 -5659 1063 7618 12594 14884
818 14884 13958 10344 4738 -1973 -8163 -12442 -14254 -13118 -9329 -3659 2773 8424 12275 13652 12149
833 12149 8276 2762 -3328 -8539 -11964 -12998 -11289 -7390 -1972 3779 8664 11664 12277 10400 6526
848 6526 1325 -4176 -8580 -11178 -11610 -9650 -5760 -734 4386 8449 10837 11017 8872 5075 386 -4536
864 -4536 -8295 -10318 -10326 -8304 -4642 -6 4549 8066 9934 9852 7739 4186 -218 -4561 -7917 -9526
880 -9526 -9376 -7313 -3869 387 4467 7633 9194 8963 6991 3640 -474 -4489 -7436 -8923 -8650 -6702
896 -6702 -3475 537 4363 7264 8724 8431 6542 3375 -554 -4324 -7202 -8550 -8305 -6468 -3296 554
912 554 4258 7076 8558 8271 6371 3256 -571 -4289 -7178 -8523 -8227 -6388 -3239 646 4385 7242
928 7242 8601 8307 6387 3169 -756 -4536 -7381 -8795 -8387 -6394 -3120 924 4803 7671 8957 8505
944 8505 6396 2989 -1173 -5078 -7936 -9174 -8698 -6406 -2746 1474 5406 8303 9484 8760 6298 2531
960 2531 -1896 -5885 -8644 -9729 -8848 -6174 -2154 2373 6395 9123 10047 8819 5921 1725 -2920 -6953
976 -6953 -9564 -10217 -8822 -5623 -1207 3564 7572 10007 10446 8706 5239 587 -4258 -8155 -10450 -10554
992 -10554 -8493 -4726 125 5013 8814 10819 10643 8183 4126 -930 -5824 -9444 -11120 -10571 -7810
1007 -7810 -3436 1780 6587 10015 11415 10368 7256 2605 -2697 -7408 -10555 -11523 -10150 -6690 -1749
1022 -1749 3646 8220 11036 11626 9769 5912 797 -4584 -8908 -11441 -11581 -9251 -5086 272 5606
1037 5606 9635 11721 11389 8617 4125 -1354 -6509 -10223 -11932 -11033 -7870 -3065 2490 7435 10791
1052 10791 11948 10524 6944 1954 -3632 -8275 -11167 -11801 -9922 -5979 -712 4720 9081 11537 11574
1067 11574 9125 4892 -490 -5751 -9705 -11691 -11160 -8302 -3716 1761 6752 10257 11678 10595 7295
1082 7295 2486 -2987 -7690 -10718 -11512 -9905 -6228 -1182 4141 8451 10941 11218 9059 5027 -96
1097 -96 -5171 -9122 -11144 -10726 -8093 -3861 1338 6235 9619 10993 10066 7042 2516 -2617 -7076 -9955
1113 -9955 -10839 -9385 -5877 -1198 3772 7853 10229 10416 8415 4665 -77 -4853 -8504 -10301 -9892 -7440
1129 -7440 -3432 1354 5820 8901 10122 9182 6336 2161 -2581 -6629 -9213 -9870 -8389 -5217 -850
1144 -850 3705 7322 9335 9451 7467 3960 -419 -4705 -7851 -9370 -8822 -6446 -2765 1572 5599 8243
1160 8243 9084 8093 5404 1492 -2748 -6329 -8438 -8795 -7301 -4227 -195 3771 6918 8544 8315 6315
1176 6315 3036 -934 -4702 -7418 -8389 -7655 -5360 -1867 2100 5487 7630 8146 6973 4267 611 -3116
1192 -3116 -6094 -7809 -7748 -6034 -3116 500 4040 6645 7739 7177 5147 1962 -1663 -4862 -6963 -7597
1208 -7597 -6577 -4103 -806 2657 5460 7159 7167 5714 3094 -295 -3617 -6043 -7121 -6750 -4912 -1920
1224 -1920 1445 4345 6369 7011 6117 3796 867 -2308 -5045 -6590 -6643 -5332 -2938 184 3292 5599
1240 5599 6550 6238 4579 1823 -1330 -4046 -5865 -6510 -5698 -3610 -763 2153 4633 6114 6216 4976
1256 4976 2725 -154 -3050 -5220 -6185 -5795 -4201 -1789 1179 3778 5439 5995 5351 3459 741 -2056
1272 -2056 -4325 -5728 -5875 -4754 -2524 194 2816 4809 5766 5399 3920 1656 -1046 -3499 -5144 -5650
1288 -5650 -4959 -3229 -758 1914 4060 5313 5440 4416 2345 -210 -2623 -4465 -5402 -5083 -3692 -1543
1304 -1543 916 3200 4820 5304 4675 3009 705 -1749 -3778 -5006 -5087 -4121 -2277 110 2446 4173
1320 4173 5011 4795 3537 1517 -863 -2991 -4462 -4994 -4422 -2827 -702 1528 3477 4655 4771 3845
1336 3845 2151 -2 -2198 -3872 -4702 -4480 -3346 -1482 766 2776 4141 4573 4105 2713 684 -1439
1352 -1439 -3170 -4287 -4481 -3625 -2021 -51 1969 3600 4342 4163 3121 1412 -638 -2569 -3824 -4242
1368 -4242 -3830 -2540 -688 1265 2897 3938 4142 3402 1970 51 -1784 -3246 -4019 -3830 -2905 -1290
1384 -1290 582 2240 3482 3908 3515 2350 680 -1113 -2653 -3595 -3741 -3097 -1750 -48 1633 2961
1400 2961 3591 3447 2626 1163 -519 -2042 -3088 -3491 -3150 -2044 -595 1066 2408 3257 3304 2724 1512
1417 1512 -4 -1544 -2647 -3245 -3046 -2261 -934 559 1873 2769 3118 2729 1728 349 -1038 -2189
1433 -2189 -2873 -2901 -2255 -1176 153 1448 2431 2835 2593 1833 621 -668 -1800 -2542 -2662 -2260 -1329 -136
1451 -136 1140 2074 2554 2466 1832 782 -380 -1537 -2225 -2469 -2147 -1356 -279 887 1777 2334 2337 1797 895
1470 895 -209 -1262 -2016 -2301 -2096 -1405 -382 732 1641 2151 2215 1794 928 -137 -1132 -1865 -2235 -2052 -1431
1489 -1431 -446 626 1504 2072 2195 1811 1016 -21 -1046 -1804 -2194 -2079 -1501 -547 529 1462 2054 2202
1507 2202 1895 1120 84 -960 -1812 -2251 -2199 -1664 -698 366 1364 2099 2377 2076 1341 312 -854 -1802
1525 -1802 -2315 -2369 -1903 -960 196 1288 2159 2516 2340 1650 557 -660 -1709 -2426 -2592 -2206 -1346 -150
1543 -150 1104 2099 2638 2615 2027 979 -336 -1492 -2421 -2789 -2610 -1828 -586 787 1940 2737 2928 2491
1561 2491 1496 169 -1237 -2318 -2971 -2942 -2310 -1194 269 1615 2651 3143 2916 2070 741 -750 -2091
1578 -2091 -2983 -3222 -2823 -1766 -357 1192 2461 3223 3262 2682 1439 -102 -1628 -2806 -3412 -3233 -2400
1595 -2400 -1023 575 2069 3126 3515 3142 2100 588 -1051 -2455 -3381 -3563 -2981 -1794 -170 1490
1611 1490 2778 3546 3560 2746 1396 -304 -1943 -3144 -3668 -3447 -2440 -962 740 2285 3365 3723 3292
1628 3292 2145 584 -1201 -2636 -3606 -3744 -3101 -1807 -88 1616 3020 3720 3662 2855 1445 -307 -1994
1645 -1994 -3249 -3805 -3564 -2552 -960 786 2387 3499 3860 3414 2251 581 -1177 -2702 -3632 -3782
1661 -3782 -3156 -1853 -138 1593 2942 3710 3711 2899 1493 -252 -1929 -3174 -3736 -3588 -2617 -1093 626
1678 626 2217 3343 3771 3366 2312 724 -999 -2524 -3489 -3705 -3183 -1975 -332 1347 2750 3534 3639
1695 3639 2966 1624 -48 -1679 -2986 -3582 -3482 -2641 -1249 385 1974 3113 3597 3308 2382 912 -741
1712 -741 -2237 -3235 -3588 -3160 -2109 -530 1045 2439 3292 3460 2932 1780 236 -1364 -2594 -3327 -3373
1729 -3373 -2678 -1428 112 1607 2756 3317 3214 2427 1147 -393 -1794 -2851 -3285 -3060 -2164 -814 713
1746 713 2020 2930 3255 2898 1938 553 -918 -2206 -2998 -3156 -2676 -1693 -253 1166 2346 2977 3053 2472
1764 2472 1385 23 -1347 -2432 -2973 -2927 -2284 -1120 198 1532 2470 2922 2747 2056 889 -424 -1686
1781 -1686 -2529 -2878 -2617 -1850 -669 636 1799 2546 2785 2463 1654 450 -805 -1878 -2553 -2695 -2313 -1416
1799 -1416 -236 975 1942 2551 2619 2142 1228 89 -1119 -2031 -2519 -2519 -1997 -1059 96 1242 2074 2518 2406
1818 2406 1849 905 -242 -1329 -2099 -2453 -2322 -1657 -723 346 1374 2122 2419 2169 1523 572 -509 -1432
1836 -1432 -2166 -2364 -2093 -1395 -438 604 1532 2090 2307 1992 1280 300 -691 -1596 -2128 -2234 -1911 -1150 -175
1855 -175 808 1635 2119 2164 1796 1029 102 -869 -1647 -2078 -2105 -1716 -942 -2 961 1730 2100 2054 1610 822 -144
1876 -144 -1032 -1699 -2068 -2005 -1515 -720 248 1119 1778 2040 1920 1473 632 -300 -1185 -1797 -2034 -1872 -1310 -518
1896 -518 426 1214 1814 2021 1839 1228 449 -485 -1304 -1815 -1967 -1692 -1142 -295 606 1364 1858 1972 1663 1070
1916 1070 230 -660 -1404 -1840 -1875 -1550 -943 -91 749 1412 1842 1833 1503 818 43 -775 -1467 -1769 -1778 -1382 -740
1937 -740 65 855 1479 1767 1748 1346 664 -134 -932 -1493 -1774 -1654 -1224 -552 222 961 1461 1706 1591 1158
1957 1158 491 -322 -1012 -1456 -1681 -1563 -1086 -383 347 1033 1482 1643 1434 986 302 -431 -1029 -1487 -1582 -1383
1977 -1383 -914 -241 457 1045 1450 1524 1306 828 187 -501 -1083 -1432 -1447 -1248 -786 -121 501 1067 1399 1433 1184
1998 1184 712 102 -526 -1045 -1348 -1392 -1140 -654 -37 548 1038 1282 1326 1077 635 47 -534 -1003 -1266 -1276 -1043
2019 -1043 -578 -28 554 994 1260 1245 1047 542 31 -542 -948 -1212 -1195 -991 -533 -15 504 952 1182 1195 930
2040 930 546 56 -523 -928 -1156 -1183 -956 -551 -48 485 942 1142 1171 975 551 87 -470 -892 -1134 -1217 -973
2061 -973 -600 -65 485 909 1171 1200 1040 575 50 -445 -951 -1188 -1230 -1038 -591 -107 482 927 1223 1279 1084
2082 1084 684 128 -510 -968 -1286 -1304 -1093 -657 -79 500 1044 1301 1363 1177 679 78 -570 -1096 -1416 -1476 -1206
2103 -1206 -691 -69 638 1153 1479 1508 1261 705 34 -677 -1254 -1593 -1574 -1273 -710 57 798 1386 1705 1677 1294
2124 1294 647 -137 -894 -1480 -1806 -1759 -1301 -579 258 1014 1622 1866 1803 1292 532 -371 -1147 -1747 -1964 -1827
2144 -1827 -1296 -436 454 1321 1885 2066 1834 1225 311 -614 -1455 -2010 -2175 -1862 -1145 -204 793 1656 2150 2228
2164 2228 1862 1087 96 -963 -1824 -2249 -2267 -1818 -959 113 1156 1988 2408 2307 1787 857 -306 -1340
2182 -1340 -2146 -2523 -2339 -1691 -657 491 1590 2305 2598 2326 1567 508 -763 -1790 -2471 -2632 -2279 -1447
2200 -1447 -296 972 2026 2622 2703 2227 1298 63 -1191 -2205 -2772 -2733 -2166 -1099 172 1453 2373
2217 2373 2878 2740 2020 898 -427 -1678 -2574 -2941 -2712 -1894 -687 708 1923 2765 3024 2624 1716 411
2235 411 -994 -2146 -2866 -3051 -2534 -1545 -148 1232 2371 3013 2987 2412 1274 -128 -1514 -2596 -3131
2252 -3131 -3001 -2234 -1024 424 1795 2763 3185 2923 2069 752 -704 -2009 -2920 -3196 -2803 -1843 -478
2269 -478 1003 2272 3025 3208 2645 1630 170 -1307 -2500 -3122 -3179 -2540 -1385 143 1564 2663 3197
2286 3197 3103 2353 1069 -445 -1843 -2846 -3252 -3008 -2122 -768 777 2101 2993 3255 2871 1855 447
2303 447 -1077 -2323 -3110 -3199 -2674 -1577 -140 1322 2472 3152 3172 2482 1273 -166 -1561 -2654 -3186
2320 -3186 -3028 -2251 -989 473 1841 2803 3170 2880 2022 664 -846 -2067 -2955 -3150 -2737 -1769 -381
2337 -381 1046 2267 2981 3057 2539 1463 98 -1323 -2402 -2976 -2992 -2313 -1146 225 1565 2568 3021
2354 3021 2801 2078 890 -521 -1785 -2663 -2947 -2661 -1829 -575 786 1919 2675 2915 2470 1551 299
2371 299 -1038 -2126 -2737 -2760 -2237 -1243 17 1260 2261 2731 2646 2054 960 -310 -1466 -2343 -2685 -2489
2389 -2489 -1801 -703 546 1608 2407 2617 2302 1519 409 -775 -1776 -2369 -2525 -2086 -1247 -162 965
2406 965 1903 2405 2417 1910 1019 -105 -1158 -1959 -2302 -2249 -1664 -755 327 1325 1998 2268 2064 1434 467 -545
2426 -545 -1458 -1986 -2165 -1894 -1161 -251 728 1516 2012 2088 1666 934 26 -893 -1571 -1950 -1895 -1450 -698 199 1035
2447 1035 1653 1883 1738 1237 447 -347 -1117 -1625 -1788 -1535 -1019 -251 499 1200 1591 1669 1405 803 114 -683
2467 -683 -1217 -1554 -1537 -1175 -591 103 752 1241 1461 1383 988 409 -196 -821 -1236 -1351 -1223 -840 -237 347 892
2488 892 1181 1292 1071 624 105 -493 -930 -1124 -1148 -900 -471 64 505 923 1061 998 748 315 -187 -618 -902
2509 -902 -986 -865 -582 -164 268 654 846 823 743 413 63 -330 -608 -770 -748 -549 -279 68 396 620 693 617
2531 617 436 162 -151 -395 -585 -621 -477 -305 -52 197 414 494 502 370 182 -18 -307 -418 -456 -425 -243 -52
2553 -52 118 288 362 368 294 99 -10 -161 -279 -332 -291 -209 -32 111 234 242 246 202 80 -44 -163 -221 -243 -197 -103 31
2579 31 148 199 202 224 103 -30 -86 -186 -216 -188 -141 -21 36 212 230 231 159 35 -93 -177 -274 -235 -197 -111 56 148 262
2606 262 321 295 194 45 -100 -279 -360 -320 -286 -128 31 209 289 379 388 265 105 -70 -271 -365 -440 -377 -277 -61
2630 -61 174 351 447 434 383 170 -62 -256 -415 -488 -479 -335 -152 130 340 459 532 507 322 66 -188 -416 -535
2653 -535 -576 -475 -280 -41 258 491 568 598 468 237 -53 -336 -529 -649 -626 -454 -165 148 405 612 634 578
2675 578 400 91 -221 -476 -651 -678 -571 -338 -21 323 564 675 697 532 259 -64 -367 -600 -722 -662 -484
2696 -484 -212 141 426 645 766 635 406 135 -194 -536 -690 -709 -629 -401 -47 282 606 722 786 590 299
2717 299 -18 -360 -640 -739 -701 -541 -228 143 421 683 758 694 476 166 -162 -496 -709 -785 -681 -414 -76 253
2739 253 547 743 767 618 367 5 -310 -593 -756 -765 -551 -302 44 394 655 751 716 493 199 -150 -465 -650
2761 -650 -729 -649 -445 -117 202 531 659 731 628 354 39 -298 -530 -666 -702 -562 -324 -26 323 562 682
2782 682 694 507 245 -108 -352 -597 -660 -620 -445 -176 168 443 614 692 566 371 98 -162 -451 -614 -630 -523
2804 -523 -321 -87 217 460 599 612 481 263 4 -283 -477 -594 -579 -425 -218 86 325 515 595 531 377
2825 377 180 -98 -353 -521 -537 -487 -304 -106 181 356 501 527 418 277 53 -185 -369 -472 -485 -424 -209 31
2847 31 208 374 482 444 328 150 -50 -243 -422 -466 -419 -321 -171 81 242 395 420 385 231 71 -105 -258
2869 -258 -353 -397 -308 -191 -26 143 273 367 353 283 174 4 -130 -272 -303 -297 -248 -137 -25 164 263 362 281 177
2893 177 100 -29 -134 -244 -294 -266 -208 -51 59 170 246 269 228 133 69 -67 -167 -238 -242 -196 -127 -27 99 155 228
2918 228 184 142 145 3 -87 -181 -163 -160 -122 -58 19 57 163 187 142 140 9 -37 -56 -125 -157 -119 -98 -58 38 58 132 113 101 54
2948 54 10 -12 -16 -83 -101 -62 -73 -42 4 26 64 70 71 70 4 -36 -36 -14 -35 -77 -54 -1 8 3 57 55 59 54 13 4 52 -17 -65 -26 -30 -18
2984 -18 -32 11 -36 -4 16 21 3 36 56 16 -17 -27 -25 -72 -75 -65 -29 1 18 46 39 74 63 47 2 -11 -60 -68 -78 -50 -11 -56 -32
3017 -32 -1 58 75 79 75 35 2 -73 -63 -109 -91 -91 -23 -17 23 80 122 96 82 43 -6 -52 -95 -124 -75 -81 -8 51 101 118 158 147 98
3050 98 40 -24 -85 -118 -154 -94 -96 -50 70 98 171 195 174 81 18 -47 -122 -153 -152 -161 -143 -7 68 129 173 237 149 108 -14 -83
3080 -83 -168 -168 -181 -133 -81 5 107 167 215 252 191 44 -28 -91 -209 -237 -196 -121 -85 57 193 211 288 246 166 33 -84
3107 -84 -173 -210 -245 -224 -163 -26 106 170 238 242 243 143 35 -124 -231 -288 -311 -218 -152 -4 131 247 306 287 252 143
3133 143 -29 -169 -267 -326 -306 -178 -82 77 201 292 338 287 251 85 -82 -173 -299 -322 -262 -205 -64 101 225 283
3157 283 335 302 195 7 -97 -264 -316 -326 -257 -164 -24 135 255 378 313 231 141 -62 -179 -318 -376 -339 -246 -82
3181 -82 82 190 348 369 353 218 45 -139 -240 -341 -377 -278 -220 -47 74 251 356 383 318 191 14 -163 -322
3204 -322 -394 -374 -319 -126 32 182 329 356 334 273 125 -61 -224 -347 -394 -347 -267 -88 93 233 360 388 310 194
3228 194 15 -113 -262 -334 -356 -287 -174 -30 152 298 386 399 266 129 29 -166 -310 -359 -366 -257 -124 70 236
3251 236 352 366 355 241 86 -81 -265 -363 -371 -348 -183 -46 136 271 352 382 297 152 12 -167 -310 -365 -368 -275
3275 -275 -116 23 185 313 366 367 238 110 -82 -185 -326 -382 -299 -221 -54 121 239 330 370 309 162 31 -111
3298 -111 -288 -355 -355 -277 -126 17 214 296 357 320 263 126 -52 -211 -259 -348 -315 -200 -99 107 178 290 337 285 163
3323 163 28 -132 -237 -287 -307 -273 -192 7 126 232 308 297 212 109 -32 -157 -251 -300 -290 -219 -63 63 178 272
3347 272 312 265 189 53 -80 -212 -252 -271 -237 -119 10 91 198 243 281 182 121 14 -121 -210 -245 -237 -149 -69 95 149
3373 149 237 226 222 175 9 -57 -137 -219 -253 -196 -78 -22 102 142 206 189 146 93 -22 -131 -161 -211 -200 -134 -53 42 126 186
3401 186 198 171 95 19 -70 -123 -142 -171 -138 -93 -30 99 187 182 139 144 49 11 -84 -162 -133 -133 -71 -46 62 95 102 163 111 113 39
3432 39 -72 -112 -140 -110 -102 -77 30 76 97 131 154 71 25 -7 -100 -161 -131 -108 -52 12 60 114 91 94 81 42 -40 -99 -96 -101 -108 -82
3464 -82 -14 31 34 96 95 104 39 22 -28 -76 -84 -91 -78 -12 -34 37 97 73 71 62 -5 -20 -45 -79 -97 -53 -53 -52 13 35 35 99 31 19 14 -64
3500 -64 -63 -73 -72 -38 -4 14 34 77 65 64 27 4 -34 -28 -89 -53 -22 -13 -15 15 57 56 26 31 -7 -18 -46 -40 -80 -22 -37 -1 23 54 35
3535 35 27 63 -12 9 -50 -52 -61 -62 -28 11 37 15 64 52 39 23 3 10 -54 -49 -47 -44 20 35 36 52 30 45 33 -5 -22 -67 -44 -35 -34 -10
3571 -10 -3 1 34 23 47 17 -7 -52 -10 -27 -29 -14 -19 24 34 17 52 47 28 14 20 -5 -45 -29 -20 8 -17 11 36 36 20 9 44 36 -35
3606 -35 -10 -19 -40 4 -19 17 33 17 37 43 14 -35 -5 9 3 -8 -6 -42 9 12 -6 -5 -2 25 16 4 4 9 -33 -20 -9 -12 -8 -5 23 -22 38
3643 38 25 27 4 26 13 24 29 -49 -2 2 0 20 -8 15 51 51 9 23 22 16 8 5 -17 -22 -16 -28 -20 6 0 28 16 18 61 19 -2 -25 -42
3680 -42 -27 -54 -28 -3 -29 25 32 39 37 45 -27 17 -18 -66 -58 -60 -26 1 6 45 56 49 62 53 24 -23 -35 -40 -23 -55 8 -11 50 55 78 89
3716 89 104 44 -5 -61 -60 -107 -81 -43 -27 9 21 74 102 99 51 -1 -33 -88 -106 -96 -85 -57 -23 9 75 108 66 93 42 -2 -50
3747 -50 -93 -98 -116 -78 -21 23 41 98 125 128 80 58 12 -86 -101 -122 -98 -49 -39 40 83 143 136 115 69 0 -82 -121 -186 -119 -111 -75
3779 -75 36 80 128 161 170 109 76 -7 -74 -150 -193 -158 -97 -100 8 95 155 171 131 142 44 -9 -101 -186 -207 -134 -95 0 85 143
3809 143 182 154 148 99 16 -84 -184 -198 -178 -146 -50 -15 63 151 213 192 110 58 -35 -148 -219 -224 -188 -135 -41 78 121 195 253
3838 253 192 124 0 -78 -158 -207 -222 -166 -106 0 120 178 264 213 202 99 42 -118 -215 -255 -253 -187 -48 28 124 235 245
3865 245 215 132 23 -57 -170 -212 -277 -209 -111 21 95 196 236 234 212 145 -17 -171 -194 -253 -263 -203 -105 32 153 218
3891 218 272 264 163 79 -29 -131 -263 -274 -226 -168 -74 70 219 261 300 237 168 16 -113 -200 -266 -278 -230 -129 8
3916 8 117 243 244 285 190 89 -30 -139 -268 -303 -248 -169 -85 62 174 258 292 262 151 66 -94 -205 -271 -273 -260 -123
3942 -123 -10 78 219 287 287 219 92 -30 -108 -207 -299 -303 -210 -123 66 142 266 301 289 223 83 -57 -174 -257 -305 -243
3968 -243 -175 -58 101 200 284 289 241 132 19 -116 -250 -316 -312 -234 -120 -11 131 247 292 291 209 67 -74 -181 -253
3993 -253 -292 -280 -203 -63 86 202 265 311 228 168 10 -114 -189 -269 -294 -271 -155 9 150 269 304 312 231 145 -41
4018 -41 -154 -260 -293 -263 -197 -76 34 179 264 313 250 198 48 -79 -212 -248 -287 -250 -145 13 93 246 270 285 206
4043 206 138 4 -137 -214 -293 -244 -182 -82 63 163 246 273 234 202 46 -63 -195 -256 -304 -250 -160 -7 90 226 266
4068 266 266 235 122 1 -124 -210 -277 -263 -203 -101 27 164 208 268 274 205 46 -47 -110 -245 -287 -211 -161 -45 74 170
4094 170 211 276 207 85 -19 -90 -182 -273 -276 -203 -102 20 112 194 263 252 201 72 -26 -122 -225 -240 -224 -169 -37 67
4120 67 166 231 218 189 105 11 -88 -171 -231 -183 -183 -116 -9 90 179 239 179 176 48 -23 -152 -196 -229 -206 -178 -51 46 125 217
4149 217 213 191 104 12 -50 -139 -188 -186 -177 -85 17 111 175 225 187 156 78 -25 -102 -190 -203 -168 -105 -26 65 122 179 212 162 114
4179 114 -16 -55 -153 -179 -193 -161 -65 -8 72 158 159 157 124 61 -37 -131 -176 -168 -137 -94 -21 90 148 149 156 131 67 2 -94 -173 -157
4210 -157 -164 -129 -59 49 95 126 179 97 81 44 -40 -91 -137 -136 -132 -66 0 63 113 163 152 119 37 -15 -67 -127 -131 -148 -76 10 69
4241 69 95 151 156 94 57 -27 -51 -115 -124 -98 -89 -35 1 60 128 160 123 76 -3 -34 -111 -98 -129 -117 -61 16 71 102 157 121 77 26
4273 26 12 -80 -139 -133 -138 -23 -12 43 93 121 117 113 45 23 -67 -85 -169 -83 -66 -60 52 82 143 116 165 72 -18 -38 -91 -117 -124 -111
4305 -111 -68 -24 77 130 140 144 92 91 -4 -64 -146 -120 -147 -95 -43 34 110 117 153 106 36 -10 -66 -130 -131 -156 -125 -34 38 94 96 148
4337 148 135 98 49 -25 -98 -133 -150 -126 -64 -16 58 124 159 186 101 70 -27 -69 -153 -172 -165 -101 -42 -5 105 146 172 154 112 21
4367 21 -39 -99 -147 -155 -136 -83 13 92 113 158 176 137 44 -11 -97 -176 -166 -140 -113 -26 49 127 135 117 164 83 23 -85 -126 -177 -165
4398 -165 -112 -92 -31 48 122 160 116 119 50 -36 -126 -138 -181 -170 -139 -65 32 132 151 185 118 121 18 -74 -112 -207 -177 -122 -71 -40
4428 -40 56 159 196 189 126 90 -21 -103 -174 -222 -183 -126 -63 -3 107 156 164 158 95 55 -57 -121 -137 -152 -155 -98 -15 69 122 188
4458 188 182 164 50 15 -101 -184 -170 -177 -153 -61 12 76 148 206 182 114 43 -44 -137 -133 -158 -180 -90 6 71 161 168 216 172 103 -7
4489 -7 -72 -125 -195 -184 -120 -27 24 112 203 176 169 86 44 -37 -111 -171 -202 -143 -111 -40 69 131 150 194 149 79 14 -57 -133 -230 -190
4520 -190 -119 -59 6 125 133 184 181 132 79 5 -81 -160 -187 -196 -124 -69 34 128 145 184 162 121 56 -45 -122 -174 -177 -120 -67 8
4550 8 81 153 135 147 132 99 -22 -112 -129 -200 -172 -157 -68 15 70 123 160 158 116 63 -68 -124 -151 -178 -132 -96 0 55 121 186
4580 186 140 120 82 -11 -62 -126 -170 -172 -158 -51 25 88 135 142 162 96 35 -40 -117 -184 -181 -159 -77 -59 3 100 135 163 144 76 47
4611 47 -32 -108 -140 -129 -81 -85 -27 78 130 148 139 119 61 1 -121 -127 -126 -135 -90 -37 35 81 142 179 140 60 52 -40 -60 -119 -145 -124
4643 -124 -47 21 39 109 135 138 120 25 -17 -97 -88 -129 -127 -101 -49 28 75 109 110 132 93 34 -12 -90 -135 -149 -140 -109 -33 23 81 113
4675 113 127 95 72 24 -25 -90 -136 -139 -107 -54 1 48 67 126 141 82 76 -18 -62 -112 -122 -123 -82 -15 18 55 91 131 119 53 15
4706 15 -37 -111 -120 -112 -98 -36 21 27 125 126 107 93 38 5 -11 -61 -116 -104 -76 -45 13 54 104 102 103 63 59 -8 -48 -83 -105 -109 -27 -42
4740 -42 21 70 96 52 89 41 -6 -24 -75 -94 -64 -66 -61 -16 49 80 53 108 72 53 -21 -29 -104 -91 -50 -47 -49 -29 55 123 93 39 60
4773 60 14 -29 -96 -64 -70 -74 -46 1 24 35 59 56 99 75 -16 -14 -54 -90 -54 -53 -25 41 35 64 41 94 64 12 -22 -23 -43 -74 -43 -50
4807 -50 36 -2 12 51 55 32 36 15 -9 -39 -53 -39 -47 -36 6 22 42 32 67 26 48 -35 -9 -48 -76 -42 -35 17 -14 -17 70 68 24
4840 24 51 -1 -6 -26 -25 -40 -41 5 13 -17 49 38 48 23 16 11 4 0 -72 -67 -51 -38 -10 3 46 81 14 23 5 18 -17 -38 -54 -39 -21
4875 -21 -30 28 9 42 30 39 13 -6 -6 -56 -29 -41 -39 -3 6 27 0 22 24 42 21 -14 -3 -39 -29 -43 -18 -11 13 4 38 -11 31 8
4909 8 -2 15 -32 -7 -4 -4 -23 -33 28 4 2 10 15 10 18 -17 -47 -55 -16 2 8 -2 25 -1 -11 37 9 40 5 -3 -24 -13 7 -13 14 19
4945 19 38 49 9 1 -17 26 13 -43 -19 -5 -8 17 -14 33 -2 48 -7 13 8 -37 19 -49 -32 7 -8 19 6 -6 21 4 31 -3
4977 -3 35 -25 -29 -7 3 42 3 10 46 15 33 6 1 -23 -2 -27 -17 24 9 13 22 31 -20 7 -1 -7 2 -18 -7 -1 -37 0 9 38 16 5
5013 5 -9 -15 -37 -34 14 -23 -11 -9 -16 19 -23 16 16 -5 11 1 15 54 -27 -15 -12 -19 3 12 17 34 49 -1 -20 -24 0 3 -27 -30 -24 -6 13
5050 13 10 19 13 17 28 -37 -24 -33 -16 -18 -23 -10 -16 51 5 -14 -5 19 26 -31 7 -6 -17 0 12 -2 -1 41 26 24 42 21 16 15 30 17 34
5087 34 5 -6 21 -17 10 -6 -4 6 0 -11 28 -21 -5 -5 24 19 7 20 16 9 11 20 12 9 8 -15 -33 -26 -2 -42 16 18 -19 40 9 35 23
5124 23 -10 -16 9 -13 7 20 9 42 16 10 26 -8 27 25 -1 1 -35 -15 -9 -1 22 -4 -6 12 9 11 8 14 13 7 -12 0 16 17 12 -7 42 -13
5162 -13 17 25 5 -9 -4 3 -14 -13 -24 5 -3 26 31 13 -8 -2 18 -14 13 -31 1 -22 -28 23 12 11 22 25 64 13 25 43 -13 15 2
5197 2 30 5 8 -18 33 -19 -6 22 24 -27 -29 -22 5 -10 -26 -52 17 -34 -4 42 30 10 2 30 1 14 7 -17 -37 8 23 -5 10 30
5231 30 23 -16 2 7 -16 -22 -2 -7 -17 2 7 13 35 18 -2 23 22 4 18 -13 -9 9 23 -29 -3 41 31 23 19 10 8 -72 -31 15 -24 -33 -24
5268 -24 -17 9 30 6 -24 -2 -11 -13 13 -25 22 -13 -19 -6 8 3 -4 38 39 37 15 -12 -33 -31 -27 -26 7 4 -10 6 3 37 44 11 20 -6 -26 -26
5306 -26 -25 -49 -16 -16 -1 12 39 19 33 -10 -5 -4 -13 0 -30 -36 -19 8 9 47 18 33 31 1 -15 -6 -49 -16 -62 -18 3 5 29 31 18 3
5342 3 13 24 56 -13 15 4 -18 -34 -4 20 44 15 46 38 11 -2 2 13 -28 -17 -1 -11 15 -1 12 20 29 20 13 -25 6 -24 -9 6
5376 6 13 -5 -13 29 1 2 14 42 7 -5 -25 -27 -11 0 14 -1 53 1 9 21 14 -24 21 -37 -35 15 -23 16 -15 24 41 54 14 24
5410 24 0 -44 -33 -22 -7 -31 3 20 12 29 -6 22 -1 5 35 -4 -25 -40 -51 -26 7 -1 54 0 47 77 -4 52 -13 -51 -27 -24
5442 -24 7 -27 -6 43 17 32 59 -3 19 9 -3 -30 24 -1 11 -29 24 -12 -1 2 38 -7 32 -1 -13 -71 -57 -17 -49 19 15
5473 15 9 23 23 37 -17 1 -16 -35 -14 -3 -13 -9 26 44 11 31 24 8 44 1 -33 -38 -2 -23 -12 14 10 42 15 21 34 15 -18 5
5507 5 -12 -19 -25 -22 -2 30 45 46 41 30 6 4 -17 -46 -40 -13 2 -9 -17 8 20 38 58 -2 30 -8 -5 -46 -32 -29 -3 -4 -5 21 19 26 53 -11
5545 -11 20 -33 -27 22 -3 -34 -19 30 34 16 33 18 -15 35 -4 -26 -27 4 -9 -29 14 -9 9 32 -5 25 25 -39 -32 -10 -26 -1 -16
5578 -16 -23 18 29 -5 18 44 41 11 -13 -15 -9 -50 2 -24 17 32 0 37 28 18 -5 -12 10 -48 -10 -66 -27 1 32 41 0 31 46 16
5612 16 25 -2 -31 -58 -4 -25 4 5 30 4 1 28 18 -3 -16 -18 -22 -57 -41 2 11 21 -1 17 17 46 -1 25 11 -13 -8 -32 3 -7
5646 -7 14 8 -6 37 5 8 1 -2 -39 -32 -10 -1 -32 20 7 30 38 23 26 50 18 -8 -54 -1 -2 -39 -15 49 12 -11 8 -8 -4 7 6 -10
5682 -10 -40 -69 -28 3 -10 18 9 51 17 43 28 23 -36 -30 -9 -4 15 -19 31 30 34 39 22 36 26 13 0 -24 7 -11 -38 22 10 39
5716 39 37 35 69 22 5 11 -28 -82 -10 -23 -30 -24 22 18 46 12 13 17 13 -36 1 -29 -13 5 -4 6 -10 -26 27 19 11 3 -42 12 -21 -35 -24
5753 -24 -31 40 25 12 33 61 51 0 6 0 -3 -29 -26 -3 22 -5 21 43 11 28 33 -19 -17 -13 -10 -45 17 -53 5 60 14 29 31 36 20 17
5789 17 -22 1 -43 -28 26 -7 -2 18 9 18 6 4 11 32 24 -2 -8 -47 20 26 34 33 19 29 35 36 36 -5 0 -5 6 -11 -12 1 6 -2 24 10 54
5828 54 13 3 -33 -2 -16 -41 -8 -13 -1 10 27 14 21 23 11 6 -16 -21 -19 -5 -27 1 20 24 30 21 48 47 4 1 -18 -25 -25 -2 8 2 0 36
5866 36 27 48 2 40 22 -8 -16 -10 -24 1 -9 0 28 25 10 29 31 27 0 -8 -16 -15 -17 -19 -31 -6 -13 35 -1 46 -7 18 -5 5 -16 -17 13
5903 13 15 15 13 -3 2 1 9 13 2 18 8 -27 -11 3 -23 18 5 29 20 23 25 18 22 10 -34 -9 -20 14 -3 -9 2 50 12 -1 20 13 -30
5940 -30 -25 -34 -47 -48 12 2 37 41 13 18 1 3 -18 5 -5 -2 2 8 0 25 5 65 13 20 31 24 16 -6 16 -12 -14 1 -3 32 23 15 34 17 22
5979 22 -11 29 -19 -35 -6 -45 -16 22 12 39 45 3 36 29 14 1 -31 -19 -47 -13 -5 -9 -21 29 39 8 -30 19 4 -20 -27 -32 -19
6012 -19 -8 10 -6 27 3 38 38 26 14 31 20 -10 -25 -24 5 4 -12 -7 15 9 14 24 14 -25 -28 -5 1 -10 -22 1 5 30 11 30 46
6047 46 32 18 -11 -14 -15 0 -7 16 44 5 33 20 2 8 8 -7 -21 24 -7 -8 -3 11 -1 7 41 43 42 4 -23 2 -18 23 -20 9 22
6082 22 -10 12 23 20 47 -14 -42 -30 -27 -1 -24 -11 -21 25 18 20 34 43 4 5 7 -8 -11 -24 -28 -14 25 -11 23 8 25 24 15 -8 -13 9
6118 9 6 -3 9 24 -34 11 23 55 11 1 -24 -24 -21 -14 -18 -10 -12 9 38 0 10 33 21 1 10 8 -18 -34 -15 -15 1 -10 -3 15 43 7 -3
6155 -3 -15 -11 -38 14 -32 7 4 32 6 30 14 -15 4 -4 39 24 8 26 -1 0 23 -6 29 12 21 11 11 -2 21 -35 -3 2 -13 -40
6189 -40 24 -17 -19 16 8 45 -18 -4 6 3 -5 19 -16 -19 1 17 25 15 -5 34 23 -10 -48 23 26 21 0 40 24 20 10 17 24 30 -11 -17 23
6226 23 26 -16 -8 6 14 14 17 7 10 29 9 -37 -49 -9 -13 -28 6 40 4 11 21 -2 -13 8 0 -10 -26 5 -8 23 -11 -13 -31 5 6 6
6262 6 12 7 -16 -8 3 -4 43 -13 34 29 26 -3 1 13 8 19 -2 -39 29 49 24 -10 25 1 29 -23 -9 23 -12 20 -28 -10 11 17 -2
6297 -2 -10 -17 3 -13 8 0 11 3 -5 -14 22 18 -4 10 9 24 30 28 9 -5 -19 10 -11 -7 47 25 -8 33 40 -20 -20 46 -5 10 18 13 7 0 18
6336 18 -9 18 -13 8 29 -17 11 10 0 6 20 5 -14 -5 -12 -10 20 -9 -35 26 -4 25 -15 14 -27 -4 2 15 2 -10 10 -1 22
6369 22 10 -9 -4 23 11 6 6 21 -8 9 34 15 30 11 -10 13 -1 9 -3 12 2 27 -14 28 8 -25 21 -36 27 1 16 5
6401 5 -10 -28 12 9 -12 -2 4 6 13 1 10 4 -4 6 18 32 -1 3 4 6 -14 38 -32 -14 14 18 17 -4 8 20 -3 30 6 0 37 -28 37
6438 37 26 -15 10 -17 4 -22 5 22 19 -2 -12 -22 -31 1 -13 -17 -11 -11 -8 4 4 11 -20 -14 38 32 -11 -1 20 -6 -12 -30 -10 20 23 1
6474 1 27 -2 54 41 9 18 -8 10 -16 5 35 2 7 -6 -23 17 -21 7 -6 30 18 11 17 -27 -14 -10 -18 -25 16 -26 20 2 3 17 29
6509 29 -32 4 14 18 32 -10 30 -5 -5 36 -7 3 -5 25 -13 5 -22 24 11 -17 13 2 0 -18 0 13 16 6 -27 -30 -7 -19 14
6542 14 -29 3 -17 18 -2 -17 -9 8 -1 -8 -15 -18 -32 11 -18 -10 22 17 18 -18 23 10 12 5 32 14 10 23 32 6 25 24 42 -6 5 30 19
6579 19 -22 -4 23 57 -8 8 10 -14 1 -28 37 -12 -25 21 -6 11 7 -6 2 15 37 42 -11 -17 19 2 -9 -11 -27 -17 41 -27 -15
6612 -15 7 2 -23 13 17 39 1 -32 2 -23 -49 20 21 11 -1 11 28 33 22 16 10 -26 19 0 27 5 26 9 27 27 -6 -7 7 -5
6646 -5 -28 -11 7 -30 -17 -13 12 4 4 18 47 37 15 -7 -22 15 16 -25 -2 24 0 23 -21 10 -5 -15 6 -62 -21 -14 -18 16 -9 -7
6680 -7 -28 8 21 -10 31 4 -6 10 4 5 10 5 24 2 31 14 -10 24 1 6 -38 22 17 3 -27 3 22 3 -16 10 -2 0 42 14
6714 14 -20 -19 -28 -42 -11 28 -1 11 8 30 -7 -15 -4 14 22 -20 -26 15 -14 5 -17 24 28 9 22 10 34 -22 -48 -37 20 -28 4 13
6748 13 0 0 0 13 1 43 57 -9 5 -16 -12 -3 -5 9 -7 -35 -4 11 -58 13 -42 -21 -35 -32 26 -12 -31 26 10 15 16 -10 -15 12 -5
6783 -5 -23 -40 50 3 22 20 29 10 -3 17 -11 -11 10 -8 -27 0 -3 9 -14 -49 0 -9 8 25 -11 -8 1 -2 -22 -18 -25 9 4 4 26 7 26
6820 26 -5 -5 -44 0 17 -25 9 -14 17 -14 14 25 19 0 19 -14 4 3 -2 21 14 -21 9 39 -16 -21 -8 61 43 4 18 -1 28
6853 28 2 -45 -16 6 -58 -17 -18 5 -11 -18 -14 -20 -35 1 2 -35 -2 5 10 18 7 -2 8 -4 -7 -2 21 -11 -20 -5 -42 33 12 4 33 -10 -2
6890 -2 3 11 -15 15 -10 16 12 6 11 22 -8 -4 -13 14 10 -11 13 2 5 -4 -7 13 9 1 -3 10 1 -4 -6 -30 -9 -32 5 2 7 14 6 14 25 37 2 10
6932 10 4 9 17 -16 -9 -8 10 6 0 18 -9 16 -5 4 -23 39 7 -30 -7 3 -14 -22 18 29 -3 9 13 15 -20 -34 -22 -23 -21 8 15 9 -5 27
6970 27 11 -53 37 7 15 -46 -8 -22 16 33 1 13 25 -3 5 21 36 28 7 25 -6 12 8 6 21 -18 14 4 -4 3 7 7 3 -7 -14 16
7006 16 -23 28 11 32 19 7 14 -10 -2 6 -32 30 24 3 4 12 -27 -7 3 -18 8 -4 -6 -37 -21 -17 38 25 6 52 3 22 28 3 33
7041 33 3 -5 -1 17 37 -7 30 26 10 5 21 -21 27 -13 19 -19 -20 -10 4 -9 -19 26 10 1 -22 14 10 -15 -23 -21 2 36 2 6 4 21
7077 21 8 5 28 20 17 20 -14 17 17 8 -5 12 25 25 9 4 31 -2 13 -22 10 13 28 35 1 -11 24 4 0 -5 41 -28 0 16 10 31 0
7114 0 31 4 -42 -7 -30 25 -50 0 -34 -14 -11 11 0 17 8 17 -29 -15 -22 10 -2 -13 27 -9 14 20 5 33 11 8 17 2 -19 10
7148 10 -21 -22 -4 3 34 -34 -4 -6 20 11 33 -12 -1 -20 -56 7 0 7 -10 8 19 14 5 37 2 -13 -4 -33 0 -9 -12 -1 -8 -31 30 30 21
7185 21 0 13 -28 -3 9 -20 2 8 14 39 38 29 -31 13 -1 15 -17 -10 31 9 23 3 18 20 13 25 19 13 15 -53 -16 23 -1 16 -14
7220 -14 29 -2 14 11 -4 19 -2 -14 -27 -30 -26 12 -36 -11 13 20 22 37 -21 -5 -13 18 -6 -29 14 17 23 -1 -12 29 3 24 15 -19 42
7255 42 -34 -15 -35 -11 -19 34 -40 22 14 22 5 16 -6 -1 -10 -16 18 -10 -18 46 -3 34 19 -23 -10 24 23 -18 -4 -2 -16 -5 30 10 45
7290 45 5 22 -6 12 4 -26 -14 -5 33 3 7 -10 13 23 29 24 -7 -8 23 -57 7 3 29 -21 -11 6 12 9 33 -11 3 0 -13 -3 17
7325 17 -4 -1 32 -23 21 4 -2 15 21 -22 16 6 -26 -48 33 28 -26 21 19 25 14 17 17 24 12 7 7 -25 -2 -13 41 21 -6 7 25 7
7361 7 -9 13 -9 1 -14 6 -13 11 24 39 -24 -1 32 -9 27 -7 6 10 30 11 5 13 16 33 4 -47 -30 2 -15 2 -20 -20 22
7394 22 3 32 13 17 14 37 35 23 39 7 29 -18 3 6 6 27 28 15 4 5 26 14 1 -6 9 -3 -10 -14 -42 2 1 3 -10 6 -13 -13 -11
7431 -11 -10 35 6 -5 25 8 -2 21 7 43 25 -3 -13 -8 -8 0 -2 26 59 43 28 30 33 2 21 8 54 14 -10 12 -3 -3 3 -13 41
7466 41 24 11 -9 3 -11 18 -6 -2 -3 -8 14 -14 9 14 38 36 -19 -23 -16 8 10 -18 0 24 -11 -5 -20 6 -12 30 24 7 24 13 14 18
7502 18 17 -13 31 13 24 -17 -6 -28 13 -12 -1 15 34 4 21 24 8 -11 5 2 -1 -1 -29 11 -15 21 6 12 -22 22 -3 -16 13
7535 13 3 0 14 -16 -25 -10 18 8 38 13 11 17 -11 -9 -8 3 19 39 -26 22 -38 5 18 10 -11 15 26 1 -1 -16 32 9 -4 7
7569 7 1 31 12 -18 -8 2 30 -27 -31 -25 13 6 -8 -13 21 21 11 -2 0 -1 13 -53 9 -15 -36 -43 8 8 -2 24 2 26 5 -7 21 33
7605 33 -25 -22 -11 -27 32 -12 13 16 28 -1 -9 8 15 -15 5 18 -8 8 -28 -26 25 4 -4 -6 14 4 41 11 11 6 -14 -25 6 -19 8
7640 8 -9 10 -10 -11 -13 -28 -5 -8 49 -2 -26 29 12 18 7 24 7 37 0 16 35 23 0 55 14 37 11 39 12 -4 13 36 -16
7673 -16 -34 -17 29 23 26 19 -11 8 2 6 17 -52 19 39 3 1 7 -54 -9 -7 -32 -34 6 25 7 3 46 21 7 -18 -7 23 0 4 17 6
7709 6 16 1 -1 3 30 -30 19 -18 31 -1 8 26 -7 8 -9 0 5 7 5 32 12 -4 5 29 8 -7 0 -7 22 -30 13 4 -26 -1 2 23 37
7746 37 15 8 5 -15 11 27 24 26 2 36 -12 -33 1 6 28 9 54 54 15 -10 10 23 30 -17 3 0 17 23 23 -2 12 23 -3 3 3 -10
7782 -10 -4 21 -31 -40 6 0 0 -4 -35 -40 -20 3 -9 -44 11 -2 5 28 14 -2 9 18 24 30 -1 1 29 25 -3 0 2 6 8 17 23 39 -8 -14 -16 -2
7822 -2 -2 30 -16 23 21 31 -23 30 -3 8 28 -3 22 -19 -5 -3 -2 12 26 -22 16 -8 4 10 3 -2 24 -19 -17 3 -17 -2 -1 18 22 -2
7858 -2 -11 -6 -16 25 -8 -2 -13 -16 -6 -8 5 24 10 34 11 40 18 2 26 6 -11 37 -22 -9 -5 4 16 -13 -8 15 25 -1 -14 -8 -12 -2
7894 -2 30 13 -9 3 31 -6 -5 12 7 5 -4 -2 -9 16 -10 -19 -4 -3 -15 1 -3 0 -17 12 -29 10 23 12 10 -4 -2 -6 5 21 28 14 11 -15
7932 -15 5 22 -25 -16 27 15 23 6 -16 -14 -18 13 -1 -1 2 -6 -5 28 28 -43 2 8 -11 -1 35 4 14 -2 38 21 12 3 -3 10 15 21 23 -30
7970 -30 15 22 13 22 36 3 7 37 43 -8 -6 15 -14 18 8 1 7 21 11 15 -21 11 1 5 5 -10 4 -37 -26 7 30 44 -27 -12 8 17
8006 17 -31 30 -6 23 -18 29 16 21 2 14 23 21 33 5 42 14 27 -9 46 11 -33 -4 10 12 -18 31 -17 -30 0 -9 9 11 8 -5
8040 -5 2 9 25 -3 35 7 -4 45 -3 -35 17 -10 -2 8 21 -4 18 -3 16 36 12 13 26 -23 -4 13 -2 -35 16 17 30 8 6 11
8074 11 -4 7 -25 11 9 -12 -13 9 44 1 20 2 -4 17 3 -13 -12 2 10 19 18 -7 23 -4 -2 -29 -9 -17 -10 36 -7 -37 -10 2 -10
8109 -10 -11 14 -15 6 11 -27 -3 -20 11 35 -19 -36 13 12 5 -19 17 16 -7 5 19 10 -14 -29 2 18 -7 7 32 16 2 -3 -7 -7 0
8144 0 -36 1 -36 -24 -9 -5 16 0 2 -11 -18 31 12 -3 6 -4 18 8 -17 -7 8 5 13 7 -9 4 4 1 0 -6 3 9 -7 -27 17 -15 10
8181 10 30 -14 4 44 40 23 -5 17 -15 -27
8191b7
##END NTUPLES=NMR FID
##END=
