##TITLE=1H ikalashn
E1b 2410
25.10.2024
##JCAMPDX= 6.0         $$ Bruker NMR JCAMP-DX V2.0
##DATA TYPE= NMR FID
##DATA CLASS= NTUPLES
##ORIGIN= UXNMR, Bruker Analytische Messtechnik GmbH
##OWNER= root
$$ TOPSPIN		Version 1.3
$$ 2024-10-25 10:21:46.656 +0400  Irina@DPX200
$$ Compression mode = diff/dup
##.OBSERVE FREQUENCY= 200.131300845
##.OBSERVE NUCLEUS= ^1H
##.DELAY= (6, 6)
##.ACQUISITION MODE= SIMULTANEOUS
##.ACQUISITION SCHEME= undefined
##.AVERAGES= 64
##.DIGITISER RES= 18
##SPECTROMETER/DATA SYSTEM= spect
##.PULSE SEQUENCE= zg
##.SOLVENT NAME= CDCl3
##.SHIFT REFERENCE= INTERNAL, CDCl3, 1, 17.49637
##AUDIT TRAIL= $$ (NUMBER, WHEN, WHO, WHERE, WHAT)
$$ ##TITLE= Audit trail, TOPSPIN		Version 1.3
$$ ##JCAMPDX= 5.01
$$ ##ORIGIN= Bruker BioSpin GmbH
$$ ##OWNER= Irina
$$ $$ F:/spectra/data/iren/nmr/1H/4/audita.txt
$$ ##AUDIT TRAIL=  $$ (NUMBER, WHEN, WHO, WHERE, VERSION, WHAT)
(   1,<2024-10-25 10:21:12.031 +0400>,<Irina>,<DPX200>,<TOPSPIN 1.3>,
      <created by zg
	started at 2024-10-25 10:16:58.875 +0400,
	POWCHK disabled, PULCHK disabled
       configuration hash MD5:
       BE 6D 3F 07 2A EA 11 49 91 17 2B D3 AF B3 58 0D
       data hash MD5: 16K
       33 9C 4A 64 B4 BE 57 79 EA EF FA 99 10 9D 3C 57>)
$$ ##END=
$$ 
$$ $$ hash MD5
$$ $$ C0 EE FC 9D 7D A5 CB B5 2C F1 B9 CD B1 81 39 11
##$RELAX= 
##$RELAX= 
##$RELAX= 
##$RELAX= 
##$RELAX= 
##$RELAX= 
##$RELAX= 
##$RELAX= 
##$RELAX= 
$$ Bruker specific parameters
$$ --------------------------
##$DU= <F:/spectra>
##$EXPNO= 4
##$NAME= <1H>
##$PROCNO= 1
##$TYPE= <nmr>
##$USER= <iren>
##$AMP= (0..31)
100 100 100 100 100 100 100 100 100 100 100 100 100 100 100 100 100 100 
100 100 100 100 100 100 100 100 100 100 100 100 100 100 
##$ANAVPT= -1
##$AQSEQ= 0
##$AQ_mod= 1
##$AUNM= <au_zg>
##$AUTOPOS= <>
##$BF1= 200.13
##$BF2= 200.13
##$BF3= 200.13
##$BF4= 200.13
##$BF5= 200.13
##$BF6= 200.13
##$BF7= 200.13
##$BF8= 200.13
##$BYTORDA= 1
##$CFDGTYP= 0
##$CFRGTYP= 5
##$CHEMSTR= <none>
##$CNST= (0..63)
1 1 145 1 1 1 1 1 1 1 1 1 1 1 1 1 1 1 1 1 1 1 1 1 1 1 1 1 1 1 1 1 1 1 
1 1 1 1 1 1 1 1 1 1 1 1 1 1 1 1 1 1 1 1 1 1 1 1 1 1 1 1 1 1 
##$CPDPRG= <>
##$CPDPRG1= <>
##$CPDPRG2= <>
##$CPDPRG3= <>
##$CPDPRG4= <mlev>
##$CPDPRG5= <mlev>
##$CPDPRG6= <mlev>
##$CPDPRG7= <mlev>
##$CPDPRG8= <mlev>
##$CPDPRGB= <>
##$CPDPRGT= <>
##$D= (0..63)
0 2 0 0 0 0 0 0 0 0.06 0 0.03 0 0 0 0 0.0002 0 0 0 0 0 0 0 0 0 0 0 0 0 
0 0 0 0 0 0 0 0 0 0 0 0 0 0 0 0 0 0 0 0 0 0 0 0 0 0 0 0 0 0 0 0 0 0 
##$DATE= 1729837270
##$DBL= (0..7)
120 120 120 120 120 120 120 120 
##$DBP= (0..7)
150 150 150 150 150 150 150 150 
##$DBP07= 0
##$DBPNAM0= <>
##$DBPNAM1= <>
##$DBPNAM2= <>
##$DBPNAM3= <>
##$DBPNAM4= <>
##$DBPNAM5= <>
##$DBPNAM6= <>
##$DBPNAM7= <>
##$DBPOAL= (0..7)
0.5 0.5 0.5 0.5 0.5 0.5 0.5 0.5 
##$DBPOFFS= (0..7)
0 0 0 0 0 0 0 0 
##$DE= 6
##$DECBNUC= <off>
##$DECIM= 32
##$DECNUC= <off>
##$DECSTAT= 4
##$DIGMOD= 1
##$DIGTYP= 9
##$DL= (0..7)
0 120 120 120 120 120 120 120 
##$DP= (0..7)
150 150 150 150 150 150 150 150 
##$DP07= 0
##$DPNAME0= <>
$$ [...]
##$SW= 21.9926040160658
##$SWIBOX= (0..15)
0 0 2 0 0 0 0 0 0 0 0 0 0 0 0 0 
##$SW_h= 4401.40845070422
##$TD= 16384
##$TD0= 1
##$TE= 300
##$TE2= 300
##$TE3= 300
##$TEG= 300
##$TL= (0..7)
0 120 120 120 120 120 120 120 
##$TP= (0..7)
150 150 150 150 150 150 150 150 
##$TP07= 0
##$TPNAME0= <>
##$TPNAME1= <>
##$TPNAME2= <>
##$TPNAME3= <>
##$TPNAME4= <>
##$TPNAME5= <>
##$TPNAME6= <>
##$TPNAME7= <>
##$TPOAL= (0..7)
0.5 0.5 0.5 0.5 0.5 0.5 0.5 0.5 
##$TPOFFS= (0..7)
0 0 0 0 0 0 0 0 
##$TUNHIN= 0
##$TUNHOUT= 0
##$TUNXOUT= 0
##$USERA1= <user>
##$USERA2= <user>
##$USERA3= <user>
##$USERA4= <user>
##$USERA5= <user>
##$V9= 5
##$VALIST= <valist>
##$VCLIST= <CCCCCCCCCCCCCCC>
##$VD= 0
##$VDLIST= <DDDDDDDDDDDDDDD>
##$VPLIST= <PPPPPPPPPPPPPPP>
##$VTLIST= <TTTTTTTTTTTTTTT>
##$WBST= 1024
##$WBSW= 25
##$XGAIN= (0..3)
0 0 0 0 
##$XL= 0
##$YL= 0
##$YMAX_a= 708867
##$YMIN_a= -497984
##$ZGOPTNS= <>
##$ZL1= 120
##$ZL2= 120
##$ZL3= 120
##$ZL4= 120
##$ABSF1= 10
##$ABSF2= 0
##$ABSG= 5
##$ABSL= 3
##$ALPHA= 0
##$AQORDER= 0
##$ASSFAC= 0
##$ASSFACI= 0
##$ASSFACX= 0
##$ASSWID= 0
##$AUNMP= <proc_1d>
##$AXLEFT= 0
##$AXRIGHT= 0
##$AXTYPE= 0
##$AXUNIT= <>
##$AZFE= 0.1
##$AZFW= 0.1
##$BCFW= 1
##$BC_mod= 2
##$BYTORDP= 1
##$COROFFS= 0
##$CY= 7568.61572265625
##$DATMOD= 1
##$DC= 2
##$DFILT= <>
##$DTYPP= 0
##$F1P= 17.9538593292236
##$F2P= -4.03888763876832
##$FCOR= 0.5
##$FTSIZE= 32768
##$FT_mod= 4
##$GAMMA= 1
##$GB= 1
##$INTBC= 1
##$INTSCL= 1
##$ISEN= 128
##$LB= 0.1
##$LEV0= 0
##$LPBIN= 0
##$MAXI= 945.577
##$MC2= 0
##$MEAN= 0
##$ME_mod= 0
##$MI= -402.1523
##$NCOEF= 0
##$NC_proc= 0
##$NLEV= 6
##$NOISF1= 8.587773
##$NOISF2= 6.764455
##$NSP= 1
##$NTH_PI= 0
##$NZP= 0
##$OFFSET= 17.49637
##$PC= 1
##$PHC0= 121.9291
##$PHC1= 2.411417
##$PH_mod= 0
##$PKNL= yes
##$PPARMOD= 0
##$PPDIAG= 0
##$PPIPTYP= 0
##$PPMPNUM= 100
##$PPRESOL= 1
##$PSCAL= 0
##$PSIGN= 0
##$REVERSE= no
##$SF= 200.13
##$SI= 32768
##$SIGF1= 18.5376
##$SIGF2= -6.396296
##$SINO= 400
##$SIOLD= 32768
##$SREGLST= <1H.CDCl3>
##$SSB= 3
##$STSI= 0
##$STSR= 0
##$SW_p= 4401.40845070422
##$SYMM= 0
##$S_DEV= 0
##$TDeff= 0
##$TDoff= 0
##$TI= <>
##$TILT= no
##$TM1= 0
##$TM2= 0
##$TOPLEV= 0
##$USERP1= <user>
##$USERP2= <user>
##$USERP3= <user>
##$USERP4= <user>
##$USERP5= <user>
##$WDW= 1
##$XDIM= 8192
##$YMAX_p= 0
##$YMIN_p= 0
$$ End of Bruker specific parameters
$$ ---------------------------------
##NTUPLES= NMR FID
##VAR_NAME=  TIME,          FID/REAL,        FID/IMAG
##SYMBOL=    X,             R,               I
##VAR_TYPE=  INDEPENDENT,   DEPENDENT,       DEPENDENT
##VAR_FORM=  AFFN,          ASDF,            ASDF
##VAR_DIM=   8192,          8192,            8192
##UNITS=     SECONDS,       ARBITRARY UNITS, ARBITRARY UNITS
##FACTOR=    0.0002272,     1,               1
##FIRST=     0,             0,               0
##LAST=      1.8609952,     -214,            576
##MIN=       0,             -497984,         -497984
##MAX=       1.8609952,     708867,          708867
$$ Real data points
##PAGE= N=1
##DATA TABLE= (X++(R..R)), XYDATA
0@%%%%%%%%%%%%%%%%%jO5j28J28j28J28j29J84k47K57k72L35l86M48n12N78o70
34c50P37q36R56j077J204j337J487j661J844k040K262k502K762l048L360l700
50a939M079m494M950n458O022o657P372q189R132j0231J1534j3102J5036j7486
64i431K0716k5216L1912m3140O6721k26032M38837K32471n92746o7800M54424
75B80716J53508n53471l40576L54753M84001j72001m13759Q9915M11876j25267
85A69695n28993q3085M53401J88091k27558o3160K95382J40484k44511k79142
95a79396K9234J64247p998j11062Q0955J96639k4792k05952n6814N7641o1517
106a18815o2231J51119J71920l4178p8989N3252K1987j58295j59765P9226K20844
$$ y = [0, 0, 0, 0, 0, 0, 0, 0, 0, 0, 0, 0, 0, 0, 0, 0, 0, 0, -1, 64, -64, 64, -64, 64, -65, 119, -128, 129, -143, 192, -194, 254, -258, 320, -350, 387, -449, 507, -570, 634, -703, 784, -877, 967, -1073, 1189, -1313, 1449, -1599, 1761, -1939, 2140, -2354, 2596, -2862, 3160, -3497, 3875, -4314, 4818, -5413, 6121, -6981, 8055, -9431, 11285, -13931, 17981, -25159, 41562, -184470, 254367, 486838, -105908, -173708, 280716, 434224, -119247, -459823, -105070, 378931, 206930, -206829, -116914, 294962, 169695, -359298, -442383, 11018, 199109, -28449, -91609, 203773, 344257, 99746, -179396, -150162, 14085, 6087, -104975, -24020, 172619, 147827, -58125, -114939, -57298, -118815, -181046, -29927, 141993, 107815, 28826, 82078, 104065, -54230, -213995, -134769, 86075]
117H6075N1537j38898N437K15062J684l40708j70076K58626J86852k02604j48977
128a95990K40848K21851k05678l29834L4663K83784L3403k40757M175L67087J52839
139C66391l26333k45714K09365J87858k23036k15599K02682K92348p7984k80217
149a10239l1211J98696J5750k41352p1900K77773J93612j75001j70122J43246
159B9252J25501j83192j91248J11687K05301j1512j24931K0539J35980o004j85699
170g4326q0816J53095J08966j03292o2447J41733P8750j52170j36994O0698Q0826
181A4023n0724n4802P2202J08350p640j09275m1516P0350J5177q7562l599J32928
193E7912N0926q9967l5282O0758j0397q9856j3773P7987M5455k8249k1608L3770
$$ y = [86075, 137612, -1286, 4151, 219213, 220897, -119811, -289887, -31261, 155591, -47013, -195990, 44858, 266709, 61031, -268803, -234140, 49644, 83047, -157710, -153535, 213552, 366391, 40058, -205656, 3709, 191567, -31469, -247068, -44386, 247962, 169978, -110239, -141450, 57246, 72996, -168356, -240256, 37517, 231129, 56128, -113994, 29252, 154753, -28439, -219687, -108000, 97301, 85789, -39142, -18603, 117377, 111373, -74326, -155142, -2047, 106919, 3627, -58820, 82913, 161663, 9493, -127501, -66803, 14023, -36701, -91503, -19301, 89049, 81409, -27866, -69382, 968, 16145, -71417, -75016, 57912, 108838, 18871, -16411, 44347, 33950, -55906, -69679, 8308, 53763, 25514, 3906, 37676]
205C7676K3241o8981q5294L2764R0243k7541p7946O0971J08051n4575j28207J8641
217g0957J08047k872q7823L949J17727N7491r9474j04413O4222J06997p2757j33843
229a13706O4572J63232k4709j57248j2163J23041J9499j20893o0449J02434J09843
240I3453n2666j22054K8761J28022j6819j42638p227J37244M6975r4253m5662
251d6864O7760N4298m6174p8230J845P9875K6607o9592l6729O0571L5677n8378
263i334m7483K5125L2562K172j0303j1512O360L0195M760m1648j6477L9673K6907
276C0997j5158j8674K729K2605J8760k6424n0399J6499O3177j0782p0911O77O8228
289C1324O116o2263l1428L8392M5915j5789n6568q75P4283K3287p5213l7629P0985
$$ y = [37676, 60917, -8064, -93358, -60594, 29649, 2108, -75838, -14867, 93184, 38609, -89598, -70957, 37090, 34218, -53605, -49656, 68071, 125562, 26088, -78325, -14103, 92894, 20137, -113706, -49134, 114098, 89389, -67859, -80022, 43019, 62518, -58375, -118824, -16390, 93453, 40787, -81267, -52506, 75516, 58697, -83941, -91168, 46076, 93051, -1202, -46864, 20896, 75194, 29020, -49210, -47365, 32510, 59117, -10475, -47204, 13367, 49044, -9334, -56817, -31692, 870, 3042, -7261, -18773, -12413, 17782, 22542, -19106, -35583, 4090, 30997, 15839, -2835, -106, 22499, 41259, 14835, -35564, -19065, 44112, 33330, -37581, -36904, 31324, 37440, -24823, -56251, -17859, 28056, 12267, -44301, -45176, 29107, 52394, -22819, -60448, 10537]
302A0537N0005n3496m7575L8092N2132j0734n1756j7145M2803L5102m0428n4091
314d6554L0135N7941k4142n8403Q146M3684J558k9042j5035J5668L0236L157l5694
327a8345q815M0875J8611l3709j6306K7770J6465j1745j2719m577P024J5538o254
340A3813k9173k08L1475m002l1428j983J9274K808p696n377n578J2008J8419j1216
354A136k2399J7226K6307j1967j9240J0595J4455j937l689p132o244J4540Q602
367B0253k2718j5688K0960J0355k0124j1323R697M732m29j104j0337N3K2072K481
381H880k3371J246K6274K335j6507j91R010L763L099o601j3429P062J9444j2615
395H399k5455R418J8986r180j6264l42O404N687L547j4756r149K3357J6357k4185
$$ y = [10537, 60542, 7046, -40529, -2437, 49695, 38961, -12795, -29940, 12863, 47965, 7537, -46554, -16419, 41522, 17380, -41023, -32877, 10807, 12365, -16677, -31712, -16044, 14192, 17349, -18345, -27160, 13715, 32326, -1383, -17689, 10081, 26546, 14801, 2082, -2495, 4529, 20067, 13813, -15360, -15568, 15907, 11905, -19523, -21506, -2232, 576, -7120, -12497, -18075, -6067, 12352, 1136, -21263, -4037, 22270, 10303, -8937, 1658, 16113, 14176, 10487, 3355, -2889, 11651, 20253, -2465, -18153, 2807, 13162, -6962, -18285, -8588, -3856, -4285, -5389, -15726, -15673, 6399, 8880, -14491, -13245, 13029, 15364, -1143, -1334, 7676, 11439, 14538, 7937, -5492, 1570, 21014, 8399, -17056, -7638, 11348, 2168, -14096, -14438, -8034, -2347, 1200, -13556, -22705, 652, 17009, -7176]
409g176j4023K4328J8872j5581j2700O477J2901O984r883k0814Q716K6744r269
422A5576l4629M724K9803m091k7607l702J6128P233n104j5174j713K1444J1269
435A4157k2999j2053K5917J4006j9660p367J5834O417m489j935n058k992J0614
448A0392P01j5547k629J4092j838j1527j603j067k904J0468J164j6605K393K5868
462A1358j6k7563J186K4879L821j3920n855J1072J7223n88k5835r788K6824J1636
476B4434l2747j6728L4613J8017l1144k1252J6711J6054j1210j9120J525K5604
488D757J3237k2455j7030K4768J7300k8018j6062L0692J9933k0846j0159J6954
500A3071O491j7870j3308M667J5694j33j6586k06K4217k628l7670p252L5876M934
$$ y = [-7176, -21199, 3129, 22001, 6420, -6280, 197, 13098, 20082, 10199, -10615, -1899, 24845, 15576, -19053, -14329, 15474, 11383, -16224, -19926, -3798, 3435, -1669, -16843, -18556, 2888, 14157, -8842, -20895, 5022, 19028, -632, -7999, 7835, 14252, 9763, 7828, 2770, -222, 10392, 11093, -4454, -7083, 7009, 5171, -6356, -7959, -9026, -11930, -1462, -298, -16903, -14510, 11358, 11342, -16221, -15035, 9844, 13665, -255, -6110, 4962, 22185, 21597, -4238, -14026, 12798, 24434, -8313, -25041, 9572, 27589, -3555, -24807, -8096, 7958, -3252, -22372, -20847, 4757, 17994, -4461, -21491, 3277, 20577, -7441, -23503, 7189, 27122, 6276, -3883, 13071, 19562, 1692, -11616, -6949, 8745, 8612, -7974, -8180, 16037, 13409, -24261, -31513, 4363, 9297]
514I297l4228J400M2103Q754l2129j8481K1787K1476j6447k7739J5047M8271l2
527C9079n1721r444M5333L910n2616j2508M9290K4851l2928k6247J6554K4309
539A7862j8560l8848L756M7262J5060l7461n897L8061L416m2280j1769L2803J4437
552A7842j5459K89J8991O058k0563k0483K586J4126j0358j4531K3664L1345k3323
565A0184l8498J6436K7920k8812l6176L1658N1769p107m1620m11L8847L290n4280
578b6800k5468N6537N3738m0249n1294M1247N4954m6706p8313K0437P2629K749
590C3461n7676p940O0194K4625o6755n9224M3603O5902k7669n6565L7612P4853
602F4421k1231p5551p241N3016R402m2531q447N1172L4612l5567m8967J3602L1746
$$ y = [9297, -24931, -23531, 18572, 27326, -4803, -23284, -1497, 19979, 3532, -24207, -9160, 39111, 39079, -12642, -22086, 23247, 27157, -25459, -37967, 11323, 36174, 3246, -23001, -6447, 17862, -698, -39546, -35790, 11472, 26532, -10929, -16826, 21235, 24651, -17629, -29398, 3405, 17842, 2383, 2672, 21663, 27721, 7158, -13325, -10739, 3387, -6971, -21502, 2162, 33507, 10184, -28314, -11878, 16042, -12770, -48946, -17288, 34481, 27374, -14246, -14657, 24190, 27480, -26800, -52268, 4269, 58007, 17758, -33536, 7711, 62665, 15959, -62354, -41917, 30712, 33461, -24215, -32155, 28039, 52664, -14091, -73315, -29712, 36190, 8521, -48044, -10432, 64421, 43190, -32361, -39602, 13414, 22816, -19715, -28162, 23010, 57622, 22055, -26912, -13310, 18436]
615A8436k5690l7307L1118M9790j3209l4564Q948J5927k6469l0255J4849L6079
627G653N527j5534O825K8125p482n0285j4680M8524J9219m0075o867O0413J7953
640E9316o3176m3699L4333L4809l1388l7536L5468O5312q823p3958j5335N8939
652A4262J0570o8220j6790Q0733M8795n7222m8775L7029L9889m1120n6515K6647
664c0717P4404R679n9973j3607N4733O019p6105l1248O2526M1326l8470k6998
676b8431M1320K9882m2151n0230J3766M6943P98l2653J2075N6348l27o4898j8203
689c5761M4311Q942m3520k172N7496K2674m0676l4775K0419J9755k9487l5399
701d8193K8291N6473n409n0001Q62M2718j4426n8574K032N8902J9652l2607r734
$$ y = [18436, -7254, -44561, -13443, 36347, 23138, -11426, -2478, 13449, -13020, -43275, -28426, 7653, 13180, -2354, 4471, 32596, 25114, -25171, -39851, 8673, 27892, -12183, -19050, 41363, 59316, -3860, -47559, -13226, 21583, -9805, -47341, -11873, 53439, 44616, -29342, -44677, 14262, 24832, -43388, -60178, 20555, 69350, 12128, -36647, 382, 40271, -849, -57364, -30717, 43687, 53366, -6607, -20214, 34519, 40538, -35567, -66815, -4289, 37037, -1433, -28431, 12889, 42771, 620, -49610, -35844, 11099, 11897, -20756, -8681, 47667, 47340, -17558, -35761, 8550, 17492, -26028, -28200, 29296, 51970, 11294, -23481, -3062, 16693, -12794, -48193, -19902, 36571, 31162, -18839, -17977, 24741, 10315, -48259, -46227, 12675, 32327, -280, -10014]
714a0014L5656J2917m2089l6951K3942M2819j1317l2659K0802M3043k1871n9253
726c4975J511M0782l593l3106J0425M7180P071m0583k4124K3681J8795l1338k2905
739d1179M1899M8243k5909m6128K0959L6569k9515m7936J9798N6355K892m2016
751e968j0885L9121R418n1669l5894M1901M8010k7151m1728L0540M8172k8981
763A4886n7051P186M8943P414l4942m830M1807K0435l7477l9674K1394L5232j8405
776D918l2112K3668M0224j2793l9037j271J9041l338k0027J134K4044J2211j3092
789C570j2622R096N310j8440r440K3367J7482j4971n151J9879L453k7235j3510
802a9212J8883J3121j2918j2322J6074K0321j0118l5977k190L3124K246l5289
$$ y = [-10014, 25642, 38559, -3530, -40481, -16539, 26280, 14963, -17696, 3106, 46149, 24278, -34975, -33464, 7318, 3725, -29381, -18956, 28224, 35295, -5288, -29412, -5731, 13064, -18274, -41179, 720, 48963, 23054, -23074, -2115, 34454, 4939, -42997, -23199, 33156, 36048, -5968, -16853, 22268, 31686, -19983, -55877, -13976, 34034, 6883, -34845, -4305, 43867, 14886, -42165, -34979, 13964, 21378, -13564, -18394, 23413, 43848, 6371, -33303, -11909, 23323, 4918, -27194, -3526, 36698, 23905, -15132, -16403, 2638, -700, -20727, -19593, 4451, 16662, 3570, -9052, 44, 5354, -13086, -22526, 841, 18323, 3352, -1799, 18080, 21533, -5702, -19212, -329, 12792, -126, -12448, 3626, 23947, 13829, -22148, -24338, 8786, 11032, -24257]
814b4257j532M2995J2796l6925k1098K5641K2205k1335k5226J6313L8135J407
826B9119l8499r339L3894J0902l9021j6216L4219K4116k3299k3830J2805J9483
838A4334q785k5733k221K4395J2429j8452j1336J8608J2828k0608j3134J5162
850b513J1733o188l878P232M280l360o455l145K647J760l998J572P148k862j1439
865g466J947Q815p049j2540R577J4409o170j0436O552Q652j573r643l417R351
879A009J1645o186j3847R041J5540r220j9221N470J5700l273j3686K89J0668K299
893F228q401r769L319J2521k829j2245L938J3954j090j2763K026R878q00n652
907a685K984K782J202j78m172l30K830Q4o864K2O970l231o382M049L811o410l917
$$ y = [-24257, -25789, 17206, 30002, -6923, -28021, -2380, 19825, -1510, -26736, -10423, 27712, 29119, -9380, -18719, 15175, 26077, -12944, -29160, 5059, 29175, 5876, -17954, -5149, 14334, 5549, -20184, -22405, 1990, 14419, -4033, -15369, 3239, 16067, -4541, -17675, -2513, 9220, 3032, -846, 6386, 10666, 7306, 851, -2294, 353, 2113, -1885, -313, 6835, 3973, -7466, -5519, 3296, -3753, -16293, -6716, 7693, 1523, -8913, -2361, 6291, 4718, -4925, -8342, 1009, 12654, 6468, -7379, 1662, 17202, 7982, -11239, -5769, 9931, 6658, -7028, -6739, 3929, 6228, -2173, -11942, -8623, 3898, 1069, -11176, -7238, 6716, 5626, -7137, -5111, 4767, 3967, -1685, 1299, 4081, 5283, 5105, 933, 603, 3433, 3517, -3347, -3325, 3645, 414, -5968, -1919, 1892, -4518, -8435]
924h435P289J338k564q71J578J963K219j771n356N964O825m342p348N366P154
939I009n311n634K652K484j638k096k352j144N472M46r279r1P545J495o127l92
955d961L836J306K3q7k267K578N433j387o846L904O541k314o435M92L541j456
971A901j69l885l086N205M158q169n475P749N448p158k653L811L805J96j609k903
987b834J619Q025p77q673N00J0135j346p627l55N044l74k103l390j940L013M740
1003C657o557o281N893O940o271n724N020M862q52j465j602J753N924J292q012
1018a423r42Q273J561q872n66N738m54k239j781k575J114M479k527o351J638O875
1034A948k258n950K626L756k72M64j426j186N385M103o509n354Q697M263o634
$$ y = [-8435, -1146, 192, -2372, -3243, -1665, 298, 2517, 746, -4610, 1354, 8179, 3837, -3511, 1855, 9009, 3698, -1936, 716, 3200, 1562, -534, -2886, -4030, 1442, 1888, -7391, -7482, 63, 1558, -4569, -4961, -1125, 181, 204, 117, -2150, 428, 5861, 4474, -2372, 1532, 8073, 5759, -676, -184, 3357, 1901, 1732, -2153, -5239, -34, 4124, -4045, -9520, -1771, 3677, -3481, -6134, -2323, 1482, 1678, 69, -2834, -1215, 6810, 6033, -2640, -2140, 7995, 6649, -978, -1333, 3711, 3337, 1234, -2156, -4096, -1083, 3657, -2900, -9181, -3288, 3652, -2619, -8343, -3323, 1539, 687, -778, -2380, -627, 5297, 6589, -1423, -2365, 5908, 7469, -1403, -1969, 3769, 3315, 1076, -705, -3280, -2166, 2313, -214, -6565, -4927, 1948, -310, -6260, -3634, 122, -150, 314, -1112, -2298, 3087, 7190, 681, -4673, 4024, 8287, 1653]
1049A653m222L131L284r65l097l925L021M906k553r451J672R886k723p497K292
1064d588O945O57n012j501K501M267Q39m119j848O235K829o502l099O283j47m774
1080a034O69J867j689q33J324k458k325K088O12j220J415J26q39L237L430o940
1096b570k797R067L569q989k174J0160K412p206m876K619N544j69q088l852R899
1111B549O155j0739r824J0311Q124j0206p865Q055J0064l113q438M03P338M080
1125F894q511n998Q622J0967p956r267O762O429o916p382M370M608j691k831P36
1140a164J285Q36m663l167N046K754m503m51R798N14j0537r77R569j99q906N07
1156d258J1095L273o889o976L842P318n341j2631K209J8122j405j6204j119J4608
$$ y = [1653, -2569, 562, 3846, 2881, -216, -4141, -1120, 3786, 1233, -8218, -6546, 3340, 617, -6880, -4588, 2357, 3014, -1998, -3499, -998, 3269, 4108, -11, -1859, 4376, 7205, 703, -2396, 3887, 3740, -1034, -365, 1502, -187, -1020, 304, -2154, -4479, -2391, -1779, -2999, -1584, -1458, -2297, 940, 4370, -2570, -5367, 3700, 7269, -1720, -3894, 6266, 8678, 1472, -3404, -785, 4759, 4590, -3498, -7350, 2549, 8704, -2035, -11859, -1548, 6576, -3630, -11495, -3440, 6624, 3511, -4927, -4524, 2814, 6894, -1617, -7615, 1007, 11974, 4018, -5249, 1513, 7942, 1026, -6356, -1986, 2622, 931, -1900, -1164, 121, 957, -3706, -6873, -1827, 927, -3576, -4027, 5771, 6285, -4252, -5229, 4340, 4141, -4765, -4258, 6837, 10110, 3221, -3755, 87, 7405, 2064, -10567, -8358, 9764, 8359, -7845, -8964, 5644]
1170E644J202j7679l946J4951Q997p354r415O361J2990n661j6792J113J9036L042
1184A2489j7038j312J5899L218j7145n677Q775N831o671n197N467J0147l995j4524
1198i733K49J1198j214j1003L854J6814l89j3597QJ0407k379j0482q13J1821O411
1213A1152o720q377O763P930j1238j4910Q495J6903o068j3577O655J3584n353
1226E239j7934m05J3601O054j0178n336J3413J1406j1662j7626Q271J6009o947
1239C905j5191J0012J7981n257j6589k100J0694N61j1242m445J3162J0762j0852
1252A401j1495Q784Q967j3149j1289J1934J4856n416r925P466R365p095j4820
1265a0416J037J4175N140j1211m963J5877N039j7955j3021J3656J1369j1671j0009
$$ y = [5644, 6846, -10833, -14779, 172, 9169, 1815, -7600, -1239, 11751, 6090, -10702, -9589, 9447, 12489, -4549, -5861, 10038, 13256, -3889, -9566, -791, 5040, -1631, -6828, -1361, 8786, 4791, -9733, -9484, 1714, 500, -10503, -6649, 10165, 9776, -3821, -3813, 6594, 4215, -6267, -7080, 4741, 11152, 4432, -3945, 2818, 10748, -490, -15400, -6905, 9998, 3930, -9647, -2992, 10592, 5239, -12695, -13100, 501, 6555, -3623, -8959, 4454, 15860, 4198, -13428, -5157, 10852, 3905, -11286, -1274, 16707, 11450, -5139, -7239, 3455, 4016, -7226, -11671, 1491, 12253, 1401, -10094, -1310, 7657, -5492, -16781, -4847, 10009, 4593, -5332, 2134, 11499, 4404, -10416, -9379, 4796, 9936, -1275, -6238, 9639, 14678, -3277, -16298, -2642, 8727, -2944, -12953]
1278a2953J4024J3523q336j7521J003J3672N51j4280j969K0374J0900j8144j1959
1291a1115J2940R967j4648j1343J2429J4951l487j2526m56J0626k673j5348k721
1304a3404J5367P473j1844n574J3453L105j4360p177J0126Q490o205l601P327
1317C176P952o159j0629J1J0128r66j0258L917J5314r51j6507m341J3960j230
1331C417j4319k540J6580R051j0320j0350O134J0227p392j5928N927K1526k95
1344A1718j7424L08J6325J306j8657o263J3486R822p579r997Q027J1197o593j8320
1358a2644J049J5843J930j4911J382J4780K108j3539n464Q249M500m989l826P150
1372A618Q873l968j0284J926P790m054r689M985J0797k411p694N82O983m554j0051
$$ y = [-12953, 1071, 14594, 6258, -11263, -10260, 3412, 3963, -10317, -12286, 8088, 18988, 844, -11115, 1825, 11792, -2856, -14199, -1770, 13181, 9694, -2832, -3288, 7338, 4665, -10683, -13404, 1963, 9436, -2408, -7982, 5471, 8576, -5784, -12961, -2835, 5655, -550, -4151, 3176, 11128, 4969, -5660, -5649, 4479, 3513, -6745, -2828, 12486, 11535, -4972, -9313, 4647, 3417, -10902, -13442, 3138, 12189, 1869, -8481, -2347, 7880, 488, -15440, -9513, 12013, 11718, -5706, -5398, 10927, 12233, -6424, -12687, 799, 10621, 3042, -6955, 1072, 12269, 5676, -12644, -11595, 4248, 6178, -8733, -7351, 7429, 9537, -4002, -9466, -1217, 3283, -1706, -5532, 1618, 10491, 6523, -3761, -1835, 5955, 1901, -7788, -2803, 7994, 5583, -2111, -1529, 5454, 900, -9151]
1387i151R04P885M333o237k800P218N709r577r438Q236J0853o554q956Q100J0343
1402A0868n200j0586K32Q046J991q374k172Q582O649q683j0665O512Q345o170
1416f25r667O117J0737l197p621N78N763J620o836l327P676O228m400n859M425
1431A612N650o582o915O620M134l080l714K874L666l865l934k174N278J948l959
1446b441k245O772L588p421m956P510L043n367l400O952M884m299l585M85M680
1461D200j075n274k454P387L585p422m547O687K156o319l780M525M283k335j362
1476a745J354K186R29m353j561M214K107k571k301M776J000n027j316M177k011
1491a42p22m43J862P57k064q64m1J329j92l595J942M553j079n690K126N278j325
$$ y = [-9151, -8247, -362, 3971, -2266, -5066, 2152, 7861, -1716, -11154, -2918, 7935, 1381, -7575, 525, 10868, 5668, -4918, -4686, 3360, 5351, -3023, -5195, 3387, 10036, 1353, -9312, -2800, 5545, -625, -10292, -4175, 6562, 3365, -4256, -3678, 2085, 3705, -3131, -6458, 1218, 7446, 3046, -2813, 1612, 7262, 680, -6235, 385, 4519, 1439, -2275, 599, 4265, 400, -3534, -5708, -430, 1518, -2441, -4686, 2086, 5674, -1747, -6703, 807, 3850, -1517, -4917, 2035, 6919, 2620, -965, -480, 4200, 3125, -2149, -4603, 2784, 6369, -1053, -5600, 1087, 3243, -3076, -6856, -2331, 1952, -383, -1745, -391, 1795, 2724, -1629, -3190, 1024, 3131, 560, -1741, 3035, 4035, -992, -2308, 1869, -142, -864, -1307, 555, 1312, -752, -1616, -1657, -328, -520, -4115, -2173, 2380, 1301, -4389, -2263, 3015, 1690]
1508A690m079J143L909K46j196k906J078L691j139n115L10N600l24n410j134M295
1524F59J231n426K64K206R50r0j791o80L963J646l580j138K851K532k935j254
1540e92J530J420j803K15j117n32Q49J549k906j162K138k93j414O88K52n09J991
1557C04j29k040J30M067r52j965M49K378k09j579rP98k44J593k282k089K978J281
1575B480k741k359K698J164j520p12r69J469j94o86j050R14L464k76l090M27L097
1592B116J69j788j14M35N09P5j158r66J029J968k498k114J034K048p16k759J466
1609a264n5OJ059p11j343K075K142j597o75J999R48k396K62M14m04Q66j042q7
1627A97r86K206r02k229L63K432k388q13N47n9O61L26m98p59J394K577j717j607
$$ y = [1690, -2389, -1246, 2663, 2909, 1713, -1193, -115, 3576, 2437, -2678, -2368, 3232, 2908, -2502, -3636, 659, 1890, -3536, -3272, -1066, -116, -206, -1997, -2677, 1286, 2932, -648, -1786, 1065, 3597, 662, -592, 938, 2358, 555, 770, -347, -879, -30, 1519, -1387, -2549, -411, -704, -2118, -1430, -1178, -1687, 304, 175, -1865, -1735, 2332, 1380, -585, -136, 2242, 2033, 454, 445, 1243, 999, 2592, 310, -1779, 1199, 2480, -261, -2620, 78, 1242, -278, -990, -1959, -490, -684, -1370, -2420, -1506, 1958, 1682, -1408, -981, 2116, 2285, 497, 383, 818, 1327, 1402, 244, -722, 307, 2275, -223, -2337, -1303, 745, 29, -2730, -1264, -1319, -1313, -254, -965, -2308, -233, 1909, 312, -363, 1636, 2584, 188, 450, 864, 460, 1326, 284, 197, -789, 1417, 515, -1714, -1351, 1081, -1307, -2120, -1573, -1632, -971, -645, -1143, -1902, -508, 2069, 352, -1255]
1645a255K305J187j206q23L02N56m45J091j850n82K033m50k083p4J792r74j238
1662a714J227M73m61L39l19j399M06K458l30j979J412J41O25O1J109k018K40J481
1680A752L06k992O46K251k225j753J683L11m03j163o41J029L24J781l367K03L283
1697A025R88l738m7M141r70j673L43K149L91m65k463q1J362M99k286o90K522P46
1715A753l510j51K972j962j231J323R81j228R54R24n13m27L95K4j25L381k627
1732I33j588J985J168q50k852J619J808l193j663Q97K732Rk652j417L553K62k196
1749a445k925M378L788k418m200K923L715k707k785J37M452O18l255k117K539
1764F98K578l339l518K935L266k524l342J956L629l415j795L56K866k39p85o0
$$ y = [-1255, 1050, 2237, 1031, 208, 510, 1066, 621, 1712, -138, -720, 1313, 863, -1220, -1294, 498, -476, -1714, -487, -14, -475, -136, -455, -1854, -1448, 1010, 680, -1299, 113, 254, 879, 940, 2049, 31, 271, 1752, 2058, -934, -288, 1963, -262, -2015, -332, -21, -424, -1587, -2228, -1199, -875, 906, -2461, -2258, 1025, 2013, -1725, -1772, 2369, 1399, -274, 69, 2218, 2609, 2144, -319, -400, 962, 1461, -825, -1515, 1007, 1753, -1757, -1908, 1064, -898, -2129, -806, 175, -1053, -99, 825, 312, -115, 280, 304, 179, 3560, 933, -655, 1330, 2498, 1648, -1204, 415, 2223, -970, -2633, -1736, 996, 1005, -1647, -3064, 489, 751, -1445, -4370, 8, 3796, 1378, -2822, 101, 3816, 1109, -1676, -1539, 2913, 3531, 276, -1841, 698, 3276, -63, -3581, -646, 2620, 96, -3246, -1290, 2339, -1076, -2871, -2515, 351, 112, -673, -733]
1780g33J736J812l136j837L729P15l006J78K338K482n189j432M330J37k298k998
1796c172J574L295k65m128r33N306p3n154j785P787K585o633k019O133J851l938
1812D31l694K236M148M79m847n32N074Q26o667k800N753K453m835r32M126J588
1828B807l506l785K352L296j155l171K061M793j20n236J70M684r56n027M99N874
1844C580l10l830q02L602m59l858j961K106M711k154m442K017O493l341p377J620
1860d405P419j049n208R9O578J207n544l466L900N715m209m529L197O976k489
1875D192p413o77P017j243o291R73N068K852m086m287L325K262j364m048K420
1890a300N927j749m955K112M820k265n556M61N880j498k867k80L315R80m574k411
$$ y = [-733, 1003, 2815, -321, -2158, 1571, 2286, -720, -542, 1796, 4278, -911, -2343, 1987, 2124, -174, -3172, -1598, 1697, 1432, -2696, -3629, 1677, 1604, -3550, -5335, 2452, 5037, -1596, -3615, 2518, 4369, 431, -3263, -1027, 3121, 3600, -1247, -1779, 3295, 4121, -2546, -5346, 407, 2860, -1975, -2907, 1219, 2807, -699, -4484, -2132, 1164, 9, -3162, -1101, 3692, 3572, -1664, -1494, 3190, 2234, -2793, -2294, 3580, 3270, -560, -1362, 2240, 1781, -2077, -4038, -1932, 2779, 625, -3817, -1800, 4693, 1352, -6025, -4405, 3014, 1965, -3243, -3144, 3434, 4641, -903, -4369, -469, 5246, 1037, -3492, -295, 6681, 4192, -3221, -3898, 3119, 1876, -4415, -3442, 1626, 4478, 392, -3895, -570, 1692, 328, -3720, -1300, 4627, 2878, -2077, 35, 4855, 2590, -2966, -2505, 3375, 1877, -990, -1270, 2045, 3025, -1549, -3960]
1906c960L570K532l345k703M649M563n525m018K641M163k604m354K606N973J43
1921D331m816j806M301K304n435l842N893M860m283n460L324L971l977m773J575
1936c833O208M18m486j180M323J284m979k391M181M120l479l304N114K548l461
1951A083k912J112J835K77l627J340L143J328n440j127L447J577m286j474N109
1966A385K972n013k719L899J368k463m235L798M676o03n265J197M639m30n915
1981b709o44N112K329m358k532L607K619m378l414K368L676n00l963M71M214Q80
1997B778m465q84M776j87l173p58M503R31l275j829K349J132r75k418N78L755
2013B838j075l711J06K983j131l567M79M369m3l051k22L541K94k536j929L079
$$ y = [-3960, -390, 2142, -1203, -3906, 743, 5306, -219, -4237, -1596, 2567, -37, -4391, -1785, 4188, 4331, -485, -2291, 2010, 4314, -1121, -4963, 930, 5790, 1507, -3953, -629, 3342, -635, -5408, -3833, 2375, 2793, -1693, -2873, 1450, 2734, -2245, -4636, -455, 3665, 186, -3118, 1996, 4544, 1083, -1829, -717, 1118, 1395, -2232, -892, 2251, 3579, -1861, -2988, 459, 2036, -2250, -3724, 1385, 4357, -656, -3375, 524, 1892, -571, -4806, -1008, 3668, 3065, -2200, -1003, 3636, 3206, -2709, -3353, 1759, 4088, -270, -2802, 805, 3424, -954, -4368, -2000, 1676, 1176, -2787, -2316, 1898, 2778, -1687, -2571, 2205, 2018, -1155, -1913, 2590, 3521, 246, -1583, 766, 1898, 923, -1495, -917, 2838, 1763, -1948, -1842, 1141, 10, -3557, -3078, 1291, 1248, -1803, -2025, 1516, 1810, -726, -2655, 424]
2029D24J768j521k536J566L752j379m862O71M743r68k823k04L164L86j880k315
2045b014N31L243j453l872K664K985n74l799K40L617K10l007j43K175J290j566
2061E27r66L44J984j149l050J662K995j233k522N89K265j770k316J728Q03J30
2077B1q24N15J078L74j965M14j67J755j455p85L223N26k717j124J447M85m36j532
2095a167L78J966l05j917n98J037J931j950j451K026J617j382k553K530J121o53
2111F30m47j600K120O14o32j014L10J232P6j598N25J55l3j534O44P16J8r48L26
2130d40J48n72N39k88n31L308k012j77O05K4r50P7J961p74p92K14R55j52j583
2149d40J08O5K58j22p19M03k11P15r39r46J256R92j467K79J487k94L78n33K70
$$ y = [424, 2192, 671, -1865, -299, 3453, 2074, -2788, -2117, 2626, 1658, -1165, -1369, 1795, 2181, 301, -2014, -1483, 1760, 307, -3565, -901, 2084, 1510, -2289, -2049, 1568, 1778, -1229, -1372, 803, 2093, 527, -439, -95, 1889, 740, -2310, -648, 2347, 1114, -1408, -819, 1446, -324, -2640, -912, -109, 21, -803, -288, 790, 1164, -801, -387, -554, 1201, -254, -1039, 2184, 2710, -7, -1131, 316, 801, 365, -1167, -789, 1177, 872, -1045, -1643, -606, 1325, -625, -2076, -50, 1567, 185, -2368, 162, 1283, 630, 183, -1417, 703, 1317, 685, -329, -19, 1213, 1289, -309, 216, 371, 338, -1196, -552, 164, 182, -766, -440, -292, -864, -325, -613, -1144, 2164, 152, -25, 580, 604, -346, -269, 1692, 918, 126, 340, 1295, 1143, -440, -332, -267, -9, -131, -850, -447, -658, 57, -882, -1828, -572, 420, -1047, -768, 719, 425, 803, 270, 540]
2168E40L65Q34j670o02J514O28j223k61m66J234q71j27O17q69j312J596j243k54
2186a570J487M51j457R47Q61j079L00M03o70k75J648m03k86J63L26m19l5J97o78
2205h9q12M21k03n9m85O47K09q06O5J502n39o61J171q1K10J399j524l91k4J593
2225A543j468m42J007k93p65m12J416j754L71J090j327J8P43m27p8n57J583j547
2243a299J218m62R74m50L83K81m75P09K41r03q2R31k56j339Q12l50k65R8j74J82
2263b26p69J067J9j139O33O84J07p75M70OP52j293k69P26J036j17o38n97R50R16
2283A543j564m83J21L62j82K96o79n56J128J63j268j4O97o86R2J288J094j633
2301b81k91J705j511M84n22J950j310o5O99j313M46j6K25k28K19L84n28j050J209
$$ y = [540, 905, 1739, 69, -533, 981, 1609, 386, 125, -341, 893, 22, -105, 512, -357, -1669, -73, -1316, -1570, -83, 368, -1089, -142, 719, -360, -60, 343, -327, -602, 1046, 643, 357, 520, 846, 427, 392, 589, -89, -901, -480, -683, -742, -1227, -580, -371, -1177, -1112, 390, -149, -810, 361, 280, 490, 1889, 365, -26, -50, 1543, 75, -367, 640, 347, -418, -830, 586, -1168, -797, 293, -1034, -1016, -273, -700, -778, -1335, 248, -1299, -81, -543, 431, -19, 364, 645, 170, 879, 1120, 217, 135, 1066, 810, -529, 283, -67, -332, -234, -408, -226, -995, 72, 91, -1048, -415, 269, 376, -399, 71, 77, 829, -464, -733, -7, 1029, 912, 274, -323, 627, 1543, -21, -504, -383, -21, -203, 93, -586, -1142, -14, 149, -1119, -1133, -436, -1122, -1030, 258, 1352, -281, -572, 1133, -378, 106, -416, 1534, 224, 159, 858, -455, -9, -25, 200, -28, 191, 575, 47, -1003, 206]
2320B06o92p98k95J818q77L44Q03j56L6J17N7l98O01o5j117m65K101o82j320Q71
2340H9L06k17l90o97M99Q71n94j202L12J253q72o65k99K029P09j770k95J399N19
2359I85o72M32m62R73j015K75o18L66r3P6l03R63j025j650LK633j183q56Q55k5
2379c41l9m46P36L45R69l47j801P59J374k79k636J341J500K56j214o25J643m37
2397G58p13j463Q10J403p47j919J718J201o73k858J928J262K49j721R42J440j565
2414E2p46L48J061J39k10j993J263K242j454j671O35J113j363j188K054J59r50
2431e09p02O20O54J92r91j7M50K348j888n43K92J838j396j126J326J498j656q72
2449d82L99J225l54q87j548J574J830j974j716K696R50j854j763P12K363j521
$$ y = [206, -486, -1284, -1579, 239, -638, -294, 509, 353, 389, 506, 563, 165, 766, 701, -416, -881, 1220, 538, -782, 89, 395, 178, -212, -909, -410, 461, -133, -1335, -1023, 230, -642, -1307, -1606, 423, 1132, -638, -933, 466, 985, 313, 745, 283, 1256, 241, 516, -102, 264, 171, 247, -56, 907, -118, -1768, -1765, 868, -315, -1171, -316, -341, -380, -826, -90, 255, 1224, 877, -924, -165, 1209, 930, -1706, -365, 1135, 1391, 177, -448, 1195, 758, 45, -1418, -608, 795, 48, -1871, -153, 1048, 375, -2483, -555, 707, 956, -765, 177, 1617, 52, -694, -346, 715, 854, 644, -1349, -86, 2156, 702, -969, -334, 779, -584, -1772, 282, 441, -509, -1211, -591, 63, 255, -736, -753, -303, 2045, 157, -386, -94, 1744, 348, -778, 548, 2046, 390, -482, -83, 1142, 788, -99, -1647, -73, 1757, -217, -1933, 763, 1713, -141, -1904, -1192, 1171, -350]
2465c50l25R50J038k37r81p43J291N99j609q34K479k52j038j554K036K04j209
2482e35r49J546k8j49p72L33J366j42j396j291L357q61j044R04J991Jj951j708
2500a328J442J301j200k406K161J409l10k304j76J676J06r59j570K789J536l231
2516a064j73J887k0r45p15P81J640J70j793K81J856j82l046L25K516j62k783j98
2534a625L061j49k488p69J065J419j504k12O30R31M54j741K9J529R0k886K302
2551A36K150j511j447j61J084Q90j564L30M50P87o35k111P53K435j003k460J280
2568e97Q88M44k258J166J091j19q99p5r9J457p31p81J282J820j826j832M20K241
2586A592j136j656J847o89L94r88m36J58J068p40q49J202R29n06j128J155J391
$$ y = [-350, -675, 275, 1313, 1076, 95, -648, 643, 1242, -367, -1201, 1278, 1026, -12, -1566, 470, 674, -535, -1484, 62, 34, -115, -887, -554, 812, 670, -726, -2017, 1340, 479, -565, 339, 2330, 2331, 380, -1328, 114, 1415, 215, -2191, -30, 1379, 1069, -1235, -1411, 265, 371, -588, -2158, 631, 2167, -1064, -1237, 650, 630, -315, -1030, -249, 1391, 1561, -232, 49, 1905, 1723, -1323, -998, 1518, 1356, -1427, -1625, 1436, 1287, -1201, -1970, -905, 514, -990, -1202, -572, 359, 813, -928, -899, 630, 720, -2166, 136, 2286, 775, -672, -833, 251, 1141, -423, -93, 357, 1144, 509, -1602, -849, 1586, 583, -1877, -597, 291, 735, -1523, -357, 734, 615, -284, -359, -458, 999, 268, -513, 769, 2589, 763, -1069, -649, 1592, 456, -1200, 647, -42, 352, -636, -1072, -914, 154, -586, -1435, -233, 696, 190, -938, 217, 1608]
2603A608j006j567J313J321q62n5r26J267q81p23o86J635J221j281j379O57J836
2620A492j628j675K473N74j692j326J783O55L25j589p5J061L4o78q04J495J160
2637A585j603p78J496J43j416l8L08k8J127j099o6Q0M49k60l77P55j62Q5j256
2656a055O46J206j242O25J77N04p83k62M03P82P84k648k53J096Q94j539O26O33
2674E94%k436J087O27K75o51k25J115M84K4k384P22J007Q83j268n05J466K53k189
2693a121P16K15J035m54j259O40L54J93q59q0N56O37j480L34P13k01O5j74N51
2712C81k90O91n08Kk4O01j431J23J020K46j399Q75k36L97j386Q06R95j026l65
2731e28K44N13l9L87j774J073Q24n09j122R43N23Op85M52N64l29k64m54L65Q7
$$ y = [1608, 602, -965, 348, 1669, 807, 752, -174, 1093, 212, -511, -1197, 438, 1659, 378, -1001, -344, 1492, -136, -1811, 662, 1236, -456, -1782, 1, 656, 981, -608, -683, 378, 412, -266, -1070, 425, 1585, -18, -796, 700, 843, -573, -611, -303, -331, 796, -303, -369, -289, 160, -100, -477, 278, 116, 201, -1055, -409, 797, -445, 180, 357, 861, 78, -184, 219, 1001, 1785, -863, -1116, -20, 874, -665, -39, 594, 594, -1842, -755, -128, 147, -504, -729, 386, 870, 894, -1490, -768, 239, 1122, -146, -651, 815, 1068, -1121, -405, -190, 845, 391, -868, -228, 126, 319, -540, -620, -64, 573, -907, -573, 140, -61, 4, -170, 381, 91, 782, 274, 276, 252, 853, -578, -455, 565, 811, -588, 287, 51, 448, -938, -132, 863, -163, -528, -284, 229, 190, 577, -1197, -124, 700, 191, -931, 12, 535, 541, -244, 208, 772, 443, 179, -275, 90, 177]
2751A77j040O88q76J060L64j020N5L83l47K56m52K07p8L22O56p21J247n79N2n16
2771a62l3K91k71j23J272p24k70Q85k08o26n30Q12n82l42l17M05R2L82o89K77
2791d61J064r18M21k39l06J598j177m7Q91q41K18N00j17o06P7l35L40n44J135
2810F53o82n19K59Q3q04K82m1l4J014k8j398J756O19p25n56Q6P70M61j228O46
2830F14j56k79r11J657j484K62O89k55r81P17k30K35Q21q54L05r03M74M43p93
2849f29P85L45j99m16O31L9k54k66N51o34M69k59k21R4L6k68j97r1Q85r67K95
2870b71K43O40n35M08p23n34J177K99j49j222J491r29jM47j47l78N67m17J67n29
2890c96k7L24q74N50j66O86p69q0J034m2K67r72M33k55N28p5J89j99O9M69j199
$$ y = [177, -863, -175, -1051, 9, 373, -647, -592, -209, -556, -300, -752, -545, -623, -301, 355, -366, 881, 302, 354, -162, -195, 96, -175, -298, 974, 250, -20, 865, 657, 31, -499, 313, -269, -611, -928, -523, -431, -49, -738, -461, 603, -315, 106, -133, -439, 1159, -18, -65, 826, -15, 203, 703, 586, -20, 57, -278, 62, -482, 653, -29, -548, -289, -206, -1010, -728, -769, -803, 211, 183, -1215, 541, 1160, 435, -121, -35, 735, 1196, -32, 614, 458, 179, -732, 925, -559, -297, 392, 137, -844, -127, -357, -122, 699, -155, 150, -753, -279, 164, -629, 156, 501, 302, -114, 517, 556, 302, 36, 587, -47, 422, 163, -58, 36, 72, -196, -393, -484, 401, -566, -271, -28, 612, 77, 485, -238, -772, 405, 704, 555, -667, 824, -105, -106, 341, 194, -184, 383, -34, 133, -396, -423, -99, -973, -423, -589, 97, -672, -752, 282, 240, 507, -465, -32, -287, 241, 166, 355, 156, 225, 694, -505]
2911e05O03p06J631q12K49o93J85J037j406N33p22Q19J17p42Q8Q98p85N61j163
2930h13M29J404o78n15n08J269M35j571L02J172n75L09l07m44j41L87q78M9R98
2949C24L48p03j74N09n19o5K78L96j24j191J376n07m12j7N54P13o13M6n18j41
2969d40J135p62K00M23m97m2j47J57p34P26o33m7J236p70L94l52P85j61N20j355
2989c64N74M00j211J164j053K66N25K23o32P49r49J60n25O17p7k90J77p11O79
3008b78J73m42J210K96j327J016r35P60K07l11k56Q39n05p72N81m95M26r23j39
3027h75P44Q57q11o76O34M53q80j70JJ665o50m04j008J485k93o15l80Q84R61n35
3047C87j196P54o7L65K12j655R98K70n19J43K18j87l93k87PJ593j593M99P91j94
$$ y = [-505, 98, -608, 1023, 211, 460, -233, -48, 989, -417, 116, -606, 213, 330, -412, -324, 574, -211, 350, -813, -384, 1020, 342, -173, -681, 588, 1023, -548, -246, 926, 351, 660, 353, -91, -232, 155, -723, -674, 324, 672, -31, -205, 304, -215, -280, -2, 394, 270, -921, 455, -52, -464, -481, 73, 786, 173, 219, -299, -440, 695, -67, 133, 556, 59, 17, -130, 27, -707, 19, -614, -661, 575, -195, 199, -153, 632, 471, 991, -364, 210, 610, -601, 563, -490, -224, 301, 524, -108, 641, -308, -148, -673, -56, -133, -423, -246, -957, -278, -105, -547, 663, 959, -368, 648, -287, 473, 680, 369, 113, 952, 447, -325, 256, -239, 187, -736, -875, -131, 726, -85, -761, -127, 326, -554, -724, -723, 942, 292, -112, -1120, 365, 72, -543, -923, -39, 922, 387, -809, -55, -122, 243, 455, -1200, -202, 68, -451, -308, -90, -277, -670, -957, -950, 643, -950, -451, 340, 146]
3067A46P87p02n87N95L25j767J806L73m14k75m47J065j013k91L22P42n95j531
3085a461K01L50R57k45p85L21J029l56M6K18l11O79j058J291o77L20m37k99R19
3104G02r18k99N04l39J082j115j26N8O20K39p42o05J606l38M47r52K78Q5q05N19
3124i9J258o98l74K62K65J394j518j724Q83l5O37j259O17J257p92K89j18L36k99
3143B82j173M74J317l97p5k044J838N3O1j411O56N81J74o46N40Q36n40j043k57
3162g74L76R86j241L26N78J22p23L0L39J68k92J08k99Q02n42N21n99N46n7j083
3182g08O00J09L52o09L28p15J105o60K98o16K75J04K12L2O65R5j609l40J270K99
3202D87L9k26l63k59J27r87P30L47k10J33OJ177j209j77q0K09O60o89o34O74J237
$$ y = [146, 933, 231, -356, 239, 564, -1203, 603, 976, 562, 287, -160, 905, -108, -399, -77, 665, 70, -1461, -1260, -910, 47, -198, -983, -662, 367, 11, 57, 275, -36, 643, -415, 876, 199, 519, 82, -217, 702, -216, -515, -11, -350, 732, -383, -509, -451, 169, 408, -334, -939, 667, 329, 776, -176, 102, 187, -618, -99, 1159, 461, 87, 349, 614, 2008, 490, -1234, -351, -386, 251, -1008, -391, 866, 74, 363, 245, 581, 282, -891, -417, 900, 503, 428, -1616, 222, 275, 336, -1075, -419, 162, 336, -310, 230, 1066, 526, -517, -774, -398, 588, -653, -327, 251, 373, -350, -320, 19, 187, -105, 3, -296, 506, -36, 485, -114, 432, 375, -708, -108, 1, 353, -256, 72, -643, 462, -198, 100, -516, -241, -137, 75, 107, 772, 867, -742, -1082, 188, 487, 526, 300, -63, -322, -195, -1182, -452, -105, -315, -182, -176, 1001, -208, -385, -465, -256, 404, -285, -919, -245, 992]
3223I92j159J27m69J027n29R69j987P94Q73p68K36M60K7r1L1J82l36k97P82j101
3243b37O76Nn24r7M71j114L28k3L21K76K30j486J653p18q58R22M0K4n0m88M81
3264a68K67j93j871J194Q24L35l08m30K0l14o5J75P99K91j072j9M62k70O47O6
3284C70p96R00M24j283O89Q18j212K63j88K82O77r30m85J093o64j87P4K28n03
3303d30N85K29l30N46r78k15o81K258o09j725J113N21O39j014N13M91j007L87
3321B93q13P56Q2L13j182M72K54k11n77q5j70J269m31l10O17n10K23j43L19k12
3341d6l07l71R14O2J008j098k96M30J10j252K58j33j20J130m73L62K7n42M71l98
3361b64J250p30j53O1Q55q79n47N40P31r97L64l88K2K7L50l05N56J68p31j50n1
$$ y = [992, -167, -40, -509, 518, -11, 958, -1029, -235, 638, -130, 106, 566, 593, 502, 533, 715, 379, 82, 864, -237, 439, 444, -80, -177, 294, -820, -492, -515, -194, 82, 312, -1174, 479, -239, -1097, -175, -135, -111, -161, -649, -168, 99, -94, -1965, -771, 53, 388, 80, -350, -330, -644, -709, -534, 265, 556, -516, -535, -73, -343, 304, 370, -426, 474, 898, -385, 304, 1122, -90, 173, -15, 267, 944, 14, -471, 622, -42, -229, -155, 73, -430, 155, 384, 54, 600, -378, -593, -1274, 984, 375, -1350, -237, 284, 923, -91, 422, 913, -94, 293, -520, 236, 318, 631, -551, -79, 175, -36, -613, -698, -868, 401, -30, -340, 277, -233, -10, -153, 166, -46, -353, -724, 190, 252, 1260, 162, -134, 296, 406, -846, -588, -721, -841, 289, -184, 178, 205, -337, 134, -264, 986, 256, 103, 164, 1019, 140, -407, 133, 864, -133, 231, -157, -135, -108, 242, -63, 493, 661, -70, -220, -271]
3382b71J648j329m62N12n04L30r90Q14P03M0jl4n16L07j8J85o3l11k38l80M72
3403a06l54J67N94K27p47N72j79l08o80Q90M62k80M84m61K69N40j110k74K38R7
3423D1p55K50N64M12N45j424K14j31n36P15P10j475J153O05r49j180J139l56K34
3442b24J83Q02o13n06L65R2K93M8o85J88k92K64p16N72P86J7r26l55N26p3M56
3463B02J00q09N82m38J157j048P5P35r41K63Q54m45m88O46k13k84L66j020J346
3482F40o55M2K00q47J256j01j018L8L12m86L65m71j6Q74J55j73j49j49L27n28
3502c84J30j45M34K94k12q94P31l79N37k47O31j280M47L80K18n16M08p69j70M11
3522c75N0L53N09k79j562P04O46l36k63J306o78o45J091n25j14k27L01L00p35
$$ y = [-271, 1377, 48, -414, 98, -406, -76, -1066, -252, 451, 491, 490, 456, -60, 247, 229, 414, 351, 40, -198, -578, -106, -460, -293, 301, 528, -219, 353, 174, -134, -814, 76, 538, 258, 742, 281, 550, 1090, -20, -294, -56, 41, -714, -464, 100, 512, 1057, -367, -153, -284, -820, -105, 605, -870, 283, 888, -61, -1241, -102, -458, -224, -41, 761, 148, -358, 7, 99, 392, 440, -245, -57, -349, -85, -801, -229, 557, 574, -352, -707, -181, -254, 202, 302, -507, 75, -363, 794, -254, -179, 556, -385, -122, 732, 287, -201, 445, 232, -52, 314, -706, 640, -15, 27, 227, -620, 636, 535, -483, -445, -133, -619, -254, -725, -741, 133, 288, 115, -34, -183, 144, -384, -254, -399, 35, 329, 117, -777, -46, -425, 112, -135, 496, -784, -337, 43, 261, -255, 153, -616, -786, -375, -325, 28, 537, 258, -1304, -600, 46, -290, -553, 753, 75, -570, 521, -4, -118, -345, -44, 256, -479]
3541d79Q09M01j026O22J40q81K09L73K45n78R47J14j717J062l64J92k26j30N60
3560B73n45J19N71J48j105Q60n05J440j013p4j59o8M48j008N44k50M14j336J503
3579B57j81j84k54N58j486R93O71m03K53q30R91n09Q93n80K53n74J39J29k67j78
3599c09N1N76m94N48m18n06k11P30Jl29J368n93r97Q31o48M33j63K07N01j034
3619d56J070j349J16P67O72j165j129L067k080P4N81k70P91j209J107l8j167O83
3637F5l07k09O15O11n97m19J6R68n49R12n10n56P04j132L32j51N19p69N7M50q5
3658c5m1J18o8J24m61J2J210p4m13r36J411L50k76j146N90K49q37N11k50M11n11
3679f2m61M69J045j473j25O7N89j99n15J60O68QM92p51o01J459n81n11m32Q84
$$ y = [-479, 330, 731, -295, 327, 467, -414, -205, 168, 413, -165, 782, 896, -821, 241, -123, 69, -157, -287, 273, -272, -153, 418, 566, -539, 321, -184, 1256, 243, 169, 10, -58, 390, -618, -74, -324, 90, -1246, 257, 76, -108, -362, 196, -1290, -297, 374, -29, 224, -606, 385, -124, 769, 189, 442, -132, 7, 136, -131, -309, -258, 318, -176, 372, -46, -552, -763, -33, -32, -361, 1007, 414, -583, 248, -400, 33, -130, 77, 578, -456, 614, -735, -619, 148, 820, -345, -1474, 1593, -487, -413, 168, -102, 689, -520, 587, 549, -618, 65, -242, -451, 164, 775, 178, -241, -225, 743, 194, 1106, 596, 40, 744, -388, -56, -207, 312, -457, -400, 50, -35, -76, 42, -26, 98, -363, -351, 859, 785, 372, -564, 847, 1197, 921, -225, 365, 614, -223, 288, 38, 449, -62, -523, -54, 991, -482, -607, -540, 49, -150, -665, -505, 163, 171, 663, -88, -689, 770, 189, -322, -754, 130]
3699A30O12p65j32J024p62j003Q02Ml09k24j30N87O07r53k76N78j22m56K55J276
3719G43o8q59j146J611O02o33q47N39n40J622j060o48J172J4p96m71N85j67m80
3738h27J281j073N03N92j075r9N69P19k107R09Q18j80L25r29Q00O93j19j127J107
3757G80o41o72J180j022P38M7n58m02J92M61k36o80Q33L67r7j038O50K1j011J303
3777B15K61J58j55P61j920J237o38j29O43J31l31q19L92J010n33r63N96m7J066
3796I35m98j504R44R84j653O89m89Q35M58j124R38k72J70j303J287k32N16j62
3814E19p94J58L42j18k37o49Q04J04o56M71J53L92m55l90o1K52m95N92K35K31
3834C98p16K85M17O79q33n19p5M89O52p69j001J036q14P0M88N05L54j014j22N41
$$ y = [130, 742, -23, -155, 869, 107, -896, -94, -90, -399, -623, -753, -166, 441, -512, -788, -210, -332, -788, -533, 743, 675, -184, -1330, 281, 883, 250, -597, -58, -598, 1024, -36, -684, 488, 502, -294, -765, -180, -347, -827, 454, -619, -116, 476, -599, -698, -129, 590, -1517, -608, 210, 30, 355, -574, 226, 919, 800, -327, 780, 139, -533, 647, -375, 363, 410, -148, -550, -358, 103, -133, -813, 20, 387, 290, -748, -98, -77, -1088, 215, 476, 634, 479, 1240, -680, 557, -81, -210, 433, 564, 233, -586, -194, 816, 283, -680, -84, -131, 935, 437, -1067, -123, 861, -792, -103, -592, 243, 701, -423, 515, 243, 413, -890, 397, 165, 681, 519, -275, -117, 225, 107, -130, -779, 25, 129, -527, -56, 97, 489, 34, -356, -417, -165, -660, -68, 167, 398, -318, -33, 384, 1063, 230, -289, -364, 125, 777, 8, -993, 43, -771, -701, -213, 292, 646, -368, -490, 51]
3854E1Q15q59l6j46O76j055P58m50J210o29J49r70P07k37L39j077J008M8k5j019
3874g42L60P09L0r84L28L6O56J2q50P88M7q84m90J332j61j89j88j85J243l80q10
3895c22M96K63l15k5j67k97J71J76k92L48o9l21K16K51L70r04k79O91J96j6n27
3916c56J91J290j775Q52k48o1N25m98M47m98O99j333O06P6k20p0K51J94j14j86
3936b28J18M5M73j91r0j33P78j298N55N70l87J7n87O76m1K48n25%k82j60l52K95
3958d99M24l04M70Pl0N65r98l04O50M64k47K70Rj92K52l21j71n77J496q63K54
3979C55k34m56J633j183l7J92m62j27k77L48n38J358j137J014q5P81j023rO18
3998G31q47j5j32l1P70k35k28m36J47N57J07p63L77J104p99m40k7o98P60Q42l89
$$ y = [51, 866, 7, -29, -175, 501, -554, 204, -246, 964, 335, 484, -486, 221, -16, 323, -754, 254, 302, 277, -742, -382, 327, 357, -627, -299, -263, 393, 405, -445, 343, 390, -494, -984, 348, 187, -2, -190, -375, 868, 488, -322, 174, 437, 122, 97, -70, -367, -196, -20, -312, 36, -33, -354, -138, 113, 483, -421, -700, -9, 187, 171, -356, -165, 1125, -650, 202, -46, -107, 418, -80, 367, -131, 568, -765, -159, -83, -303, -373, -122, 72, -42, -228, -110, -65, 408, 217, 127, -6, 772, -526, 29, 599, 212, 229, -358, 318, 277, 525, 0, 0, -282, -442, -794, -499, -75, -379, 91, 98, 68, 633, -365, -669, -19, 445, 198, 468, 477, 285, 537, 216, 45, -532, 964, 101, 355, 121, -335, 1298, 115, 78, 270, -192, -319, -596, -248, -786, 572, -565, 449, 364, 1145, 122, 113, 731, -116, -131, -263, -294, 476, 241, 13, -423, -276, 281, 388, -375, 2, 1106, 307, -133, -160, -858, -98, 744, 355]
4019C55n26N14K32p09L7m62J349n02j328K39M19L65M88m12l39j09J696j102k82
4038g7L98j132L95L5M31j6l13K29qJ39M24k28J45Q7j88l02K05j13kM61m82J87
4060B75K27n97k35M05l44K98l79n97J453n03JJ52M1qr09O16M34j48L9m44M53k75
4082d5l42j15R57L13n17r13J057j26j22K50m50K55m23l41P56p20n72J568o06k33
4102c69O69m31n05J429o83J27j14j95Q1N49q81K12j84k9O66N36j113K41p47K04
4122e37L48p5K46L67l6j6m18P52j71m68O84j09p20J57P48m05l13N68L96m97N87
4143A088n13n04K77q74Q66n87o52J574o65J44l8r81P68Q74j351R81j136N42P05
4162E18k68j033Q77j61K4Q0M6P18k84k22K19j185pJ223q88O57n35K12j57O91q32
$$ y = [355, -171, 343, 575, -134, -97, -559, 790, 288, -1040, -801, -382, -17, 471, 59, -280, -389, 1307, 205, -77, 321, -811, -416, -381, 50, 34, -279, -50, -58, 81, 505, 277, 422, 509, 321, 19, 224, 111, 109, 570, 88, 275, 502, -95, -330, 75, -269, 29, -350, -947, 506, 3, 4, 156, 197, 189, -720, -104, 330, 182, 221, -223, 230, -45, -387, -502, 455, 768, 251, -662, 395, 269, 147, 397, -53, 202, -221, -562, 194, -526, -1098, 470, -136, -369, 300, -131, -636, 793, 110, 237, 123, -72, 9, 558, -323, -111, -295, -324, 342, 878, -235, 6, -741, -537, -189, -264, -18, 349, 313, 297, -121, 631, 460, -8, 676, 567, -153, 4, 752, 347, 34, 602, 998, 501, 1088, 575, 71, 348, -526, 340, -247, -899, 675, 10, 154, 116, -865, -97, 777, -574, 407, -729, -187, 518, 250, -783, 94, -67, -43, 37, 83, 801, 517, 295, 514, -671, -678, 545, -343, 314, -221, -9, -166, 525, -307]
4183c07N60m80o96J566l33K09p38PL14L6J12p99Q10j723P45N24L61m57l84M17
4203b56l17L84J31M51q58K93M90N1N5q21L22M57j73o3k79l90M89m50M0N36j10
4224a8K52L94q52J489o93r57N36l04kK43r0N79r38P61j05q12O80k29L13m65j04
4245c22O86K42j498O17K1K90m7l1L16n16M94m73m18N51m65P07n84M57L27O6j098
4266f78J289j218N61l00J35m6K27J14n52N35J29r42J68J992j021n05k02J142j050
4285b22l50J01N87M63j224L6O86O38L99j327M7K07L68p73J215j619P14L05M24
4304F75p38J146r87M5m37l04P43J51m86n72R10m36O77J06l26j180K57J231J48
4323F23L76j248J004m96q93P32j30L46m33J27j4P63j017qM98N83k017Q15M45M99
$$ y = [-307, 253, -227, -923, 643, 310, 519, -219, -212, 102, 138, 250, -549, 261, -1462, -717, -193, 168, -289, -673, -256, -573, -189, -58, 393, -465, -172, 318, 369, 424, -397, -75, 382, 209, 146, -133, -523, -34, -484, -444, 92, -18, 234, 628, -224, 1265, 572, -385, 151, -153, -155, 88, -2, 577, -361, 400, 295, -517, 163, -66, 247, -218, -322, 364, 606, -892, -275, -254, 36, -11, -42, 274, -242, 252, -221, -639, -88, -553, 154, -430, 27, 354, 420, -678, 611, -607, -46, -346, -211, -257, -30, 84, -468, 67, 196, -746, -578, 1414, 393, -112, -314, 828, -222, -572, -471, 116, 579, -645, -609, 77, 715, 1114, -213, -166, 41, 409, -364, 851, -768, -54, 251, 675, -63, 1083, 96, 141, -296, -600, 143, 294, -192, -764, 146, -290, 387, 493, 167, -1013, -756, 475, 623, 999, -249, 755, 259, -634, 98, -32, 314, -119, 8, -6, 757, -260, -268, 230, 813, -1204, -389, 56, 555]
4343E55no69m99J070kk66p44J10j05J3J402j326Q69L66j211P27k88l81o3o4J083
4364E72o76L32j71p63J245M5j472P29R14j177L66p44J807q94ML0J13m30jm75M04
4385b42j90n7M13o2J466j004n79J04o1k72P90n65o21J302L86k52q18O15m86L79
4405B46n27K42N41p75P10N29m47m50P30k93l36k60k22n9N53J53p99R35n30q3n0
4426a92l17P51p14O82j63J4J09m08L4r0J48L27k11J70J00p51K18K63L8L47l02
4447E3k49P86l95k5n90N86P2r7n97O27M30n86m15N88j12N77j190M50L70l62K32
4468A53m14P54r3j237L20R57l86k42j062Q35Q24j024k37J81J405J03j178N61N05
4487G25j134K83j9P89l2l21p03J53L89j081J572m87K91L12j132J443n03n39p26
$$ y = [555, 550, -119, -618, 452, 450, 184, -560, -450, -555, -542, 860, -466, 403, 769, -442, 285, -3, -384, -447, -511, 572, -104, 228, 57, -706, 539, 584, -888, -159, 755, -422, -56, -800, 1007, 113, 117, 147, 260, -170, -171, -646, -242, -432, -489, -76, -138, 1328, 324, -255, -151, -212, -484, 306, -259, -880, 422, 808, 556, -262, 353, -133, 246, -281, -39, 502, -273, 437, 966, 519, 69, 799, 506, 170, -90, -312, -371, 182, 335, -464, 471, -59, -142, -192, -509, 242, -472, 210, 47, 61, 170, -238, -204, -294, -146, 181, -30, 140, 240, -511, -293, -30, 8, 355, 53, -196, 590, 195, 170, -420, 166, 238, 141, -456, 171, 601, 15, -400, 188, 76, 653, -537, -87, 283, -79, 153, -261, 493, 400, -837, -517, 440, 54, -188, -1250, -415, 409, -615, -852, -671, 734, 837, -341, 220, 725, -409, -126, -145, 644, 612, 291, -412, -259, 130, -951, 621, 134, 425, 737, -395, 1048, 545, 6, -720]
4506g20J513O0l22o19L09j40J98m18P61p48R56o27j37P53o10M14k96o20N55k35
4526B7J74j057O51L63n33L22O52j286P82j10j59M81n30N90r70J693m64j53q06
4545c33J617K4n39j276O09r78Q48L95q8j446J685k99K01o89k49L10K30j77K17
4564F2M32j358L95l29R33K83L33j596J212n04K52K56o20R62j59n26m57K60L63
4583A94O03j169J064j039j05N16n46o84Q93j17j23Q49j41K1m99J39J370j864k04
4602h42J380M6p97K58o32L34K53p08J229q86J40K99m09n15P13m29J015m75K64
4621B38j232L67K71P95m36K78k50o76J910j387N04l74M7k25l2j18J33M75L1n25
4641b06K07n11N23N0m22L78k00k44P2O84o68j11Q92m56m0n53j32J070q24R66J67
$$ y = [-720, 793, 853, 531, -88, 221, 81, 279, -139, 622, -126, 830, 203, 66, 819, 209, 623, 327, -293, 262, 27, 201, -856, -205, 158, -375, -53, 599, -687, 95, -15, -174, 307, -223, 367, -603, 1090, 626, 473, -333, 1284, 1308, 769, -507, 102, -876, -28, 367, 279, -1167, 518, 219, 420, -269, -518, -208, 22, -155, 62, 494, -864, -469, -798, 135, 418, 751, -845, 367, -137, 115, 371, -249, 713, 554, 28, -429, -169, 194, 797, -372, 692, -347, -452, 64, -482, -1166, -273, -390, -513, 336, 195, 216, -283, -144, 1226, -638, -842, 538, 584, -213, 45, -587, -253, 0, -708, 521, -365, -225, 74, -335, -850, -137, -566, 449, -26, 238, -994, -627, -356, 439, 3, 281, 31, -645, 1265, -122, 382, 8, 55, -170, -202, -320, -187, 288, 319, -206, 1, -510, 13, 63, -359, 19, -181, -425, -353, 331, -337, -448, 444, -12, -52, -605, -737, 333, -491, 475, 642]
4662F42k78n9K39j5j15q23R37j606R15Q57J78r02l98L31N38n78K07L91j47R7p1
4683C40j199N52L87K68j039J403Q14k402R65N38n40k20K18p7q1J10l46l95J553
4702H49n64LQ41j967Q19k7J15J05m44M94P11j326J34N23r21M82K0J22j00j29P83
4723E23j107J154l22p56j08j08K50L13J006p89K11K31j185P99J36K63j12k83N73
4742F89q94J52k51k07l15O98L17n1r05R09m57N56o70M43p9O4K18l57j6%j68O88
4764C64Q22j565l67J108o14J72J64k74n36R27k31M03k87j82L87m2l37%Q59r22
4784a51q36R03r89P18J01K37P24q94K38K4J60o30p9J71J383j394k09J13O66n63
4804c07N12L84q81L19k41M59m52J66j061J643k85q0J79r11P81k01N62j032N00
$$ y = [642, 364, 305, 544, 529, 414, -409, 528, -1078, -163, 694, 872, -30, -428, -97, 441, -137, 70, 461, 314, 411, 340, -859, -307, 80, 348, -691, 712, 1526, -876, 89, 627, 87, -133, 85, 8, -73, 37, -309, -704, 849, 285, 288, 1129, -838, -19, -46, 69, 174, -270, 224, 935, -391, -257, 266, -655, -173, -153, -31, -131, -260, 523, -584, 570, 248, -508, -616, -724, -474, -161, 845, 56, 267, 498, -687, 112, 248, 511, 399, 116, 689, -205, -53, -304, -511, -826, -128, 189, 138, -767, 142, -315, 241, -429, 14, -65, -1, 217, -140, -156, -156, -324, 364, 1186, -379, -746, 362, -252, -80, 84, -190, -726, 201, -30, 373, 86, -96, 291, 249, -88, -88, 771, -151, -987, -84, -1073, -355, -254, -17, 707, -187, 51, 75, 235, -395, -474, -303, 1080, -314, -523, -410, 256, -307, 205, 589, -292, 27, -214, 245, -207, -41, -1102, 541, 256, 176, 355, -556, 225, 24, 586, -446, 54]
4823E4J44p0J68p16R56m73k56L76o1L10o50k28J277n53j12m46l24M20N33l96O
4844d1O48l20k40j10k58N06m56J063n17q10oM9P68o19O93k34o68N72n48m13R72
4865C1o75P35J42m30K46Q88j284Q22l25n82J00N87m64p8P35n52rN71L77j258J58
4886b65k92K86Q20j410P4J502j026N83k16k92K31M14J38j47r86L38P4R39q44l59
4906d38R13m25M63n78j25P01r16J302L87j449K65r3q37O56P07q3q41K46M23r38
4926f60O42P52k30k13N60q95n34k8L19M01l45J248j119L85o53R9R39j252P73k73
4946h4k59q2M60P70q11n42L10k13R15j91l73j3K71J18o67N52K45K34j71m52m48
4967d31O18J64p60P26j366L75L50L02J04l3J67n13M10p06K33O66p4K71p71N24
$$ y = [54, 198, 128, 296, -420, 536, 63, -193, 183, 122, 432, -218, -446, 831, 278, 166, -280, -604, -184, 349, -47, -41, 607, 287, 47, -63, -321, 185, -271, 792, 275, -535, -541, -492, 276, -343, 350, 116, -552, 20, -528, -941, 31, -644, 91, 233, -197, 49, 937, -347, 475, 150, -432, -332, 255, -209, -287, 448, -104, -113, 458, 835, -423, -265, -557, -271, 549, -861, -787, 715, -311, 272, 56, -236, -5, 409, 547, 400, -586, -248, -174, 765, -79, -438, 475, 50, 513, -65, -190, 511, -405, 897, 1284, -165, 100, 7, -830, -174, 533, 450, -391, -145, 278, -660, -18, 734, 504, 291, 851, -44, -578, -606, -287, 114, -231, 1017, -102, 283, -370, -271, 668, -584, 189, -84, -343, -425, 35, 805, -6, -548, -238, -451, 464, 273, -100, -113, 158, 276, -391, 161, 406, 640, 469, 17, -431, 187, 351, -409, 317, -1049, -674, -324, -22, 82, 49, 216, -297, 113, -593, -360, 306, 232, 503, -268, 256]
4987B56K76n23Q2m00O73q86k61Q48k62OM38O9n94j22N50N54p39l3R99j634K01
5008e02M49L98m82K78M96l51L01p43j54M91j16j32k05K27j22Q4KK58P1l24L64
5029B88l58l27J84M08l53M71q26k38J004K67N2L02o69l46O27r53P78M66j0r46
5049a79P04n49o87M03j254J423R0P63j181L36J271j187q79O41J090l21k64N93
5067H13j336R12R2j293J376m57l71Ol6l08K63K95p1J65L12m43k29O44m93L6m61
5088e84P25J34J05lJ96k07K04o16N89o18P56n60J35K8Q28j068j02m18N3Q45l29
5109I3p34J244j156N20N57L48k28r55o7N88k29O33r75J207m07n53j68J84r5K88
5129I5k53j87N79l91k11N74N50o61k26l50L38r9M89m13N1n9L74k07m30Q60j687
$$ y = [256, 532, 9, 91, -309, 364, -522, -783, 65, -197, -191, 247, 316, -278, -400, 150, 704, -35, -68, 931, -703, -502, -53, 345, -137, 141, 637, 286, 587, -156, -310, 181, 65, -67, -272, -45, -167, -83, -81, 177, 248, -76, 288, -70, -397, -213, 195, -158, 313, -513, -751, 253, 520, 572, 874, 205, -141, 486, -467, 311, 777, 767, -179, 525, -24, -711, -308, -1562, -139, -49, 714, -467, -131, 1140, -47, -926, -285, 805, 484, 220, 813, -523, 389, 481, -812, 564, 107, -264, -258, -294, -602, -339, -44, -115, 50, 362, -81, -310, 334, -159, -123, -584, 141, 275, 380, 377, 573, 366, 570, -46, 543, -75, 681, 121, 256, 284, 1112, 44, -58, -476, -423, 422, 93, -641, 603, -553, -33, 524, 872, 644, -311, -378, 210, -19, 614, -361, 846, 439, -114, -282, -98, -193, 95, -158, -345, 234, -157, -368, 206, 756, 95, -131, -481, -143, -242, 247, -166, -115, -174, 200, -7, -437, 423, -1264]
5150a264R78R34j107J07K81o97M48M00n52j15O58m63k6Q27j00p03M28P01L1R1
5170H57p84rm20O5K26j08QQ5N59m7j39l09K55o5l11K02O3n80J087m70r78J87R85
5193C59l90l68l6l50N33J17J251j576M88J284k85j704O62j6n79J149j76j242J209
5212C30o11K68l0o2p6l65NN00O74l21j037J308k80r24R84q7J82p57R01J15j381
5233f64N69k38J98L63J32o35K9M37j97p48N62o52K53P39p9J72J49r20n8J249o63
5254bm79R10n60k07J051n95r16J74J99L6k1M48M50k94m04n4m05J030j057R49K81
5275E34j082J17k02J125l4n81L02P95j462J97N71K61o71J137k053K115j140n01
5293e72L44O27o15J74k97Q06J44o80L31L88m51k55J79n34j1K27O84r35J06Q8j23
$$ y = [-1264, -286, 648, -459, -352, -71, -768, -320, 80, -472, -587, 71, -392, -418, 409, 309, -394, 34, 735, 766, 857, 73, 64, -356, -291, -65, -173, -165, -80, 479, 432, 293, -16, 239, 174, -137, 65, 128, -452, 635, 165, -813, -626, 359, -31, -399, -435, -785, -252, -135, 1116, -460, 28, 1312, 1027, -677, -15, -31, -610, 539, 363, -879, 330, -281, -13, -43, -105, -181, -546, -541, -41, 633, 312, -725, 583, 303, -621, 363, 276, 458, -299, 602, 717, -664, -95, -333, -135, 228, 360, -275, -246, 191, -6, -754, -192, -844, -591, 148, 69, 241, 390, -530, -588, 661, -2, -481, 429, -131, -338, 713, 118, -798, -624, -425, -389, -410, 38, 488, 194, -210, -264, -669, 361, -696, 253, 534, -548, -431, -633, 492, 458, -123, 179, 974, -488, -291, 280, 541, -130, 1007, -1046, 1069, -71, -572, -228, 399, -216, -42, -339, 467, 611, -69, 262, 650, 199, -56, 123, -411, -422, -195, 489, -446, -340, -252, -375]
5314c75M41n93K01J59p9J66j168J900j062N43p74P82N26q64Q26j17j20o29P72
5333E35n98p98L24M32j6p6j232J420n6k40M42k24O68n86l15O46r8N0K97m13m61
5354b99O54o39q0K22n58k9O86N72o7k19L68p38l11l28J631j134p8L66L37o49Q63
5375E70p40k89R88p51n98P32m01K19N33k78m70K51j58K80J70K97p01R52k45j63
5395A98M69j769M58J015p13O54n49N68P2p26J77M0K08n8m8o09Q96p69J07R47l83
5416A85r05J189n64L72o32M93L9q74P49n1k07L79k50N3k92O51p93l4L18J05J82
5437A13n33R00l48j37l1K63k18j75L94n50J309n82r51M00J67Q44l53n53J61j59
5457c9J74M06r19K01M53j21J10j25J44n03Q34j70j299k4J117q5k52j99N31m05
$$ y = [-375, 66, -527, -326, -167, -246, -80, -1248, 652, -410, 133, -641, 141, 667, -197, 629, 512, 392, -237, 535, -63, -861, -537, -105, -121, -197, -1429, -9, -65, -305, 137, -87, 581, -5, -320, 326, 228, 278, 575, 162, -299, 355, -284, -364, -142, -700, -729, -43, 529, 462, 243, 611, -127, -438, -766, 865, -269, -347, 19, 356, -293, 570, -170, -459, 529, -222, -820, -88, -489, -270, 263, -15, -485, -234, -392, -112, 58, 355, -346, 606, 361, 198, 667, -1102, -644, 371, -342, 312, -237, 331, 403, -323, -146, -106, 102, 44, -4, -613, 283, -486, -379, 568, 185, -720, 469, -95, 277, -355, 138, 177, -697, 52, 1, -206, 173, -77, -24, -316, 335, -458, -492, -174, -69, 113, -420, 480, 132, -5, -36, 227, 9, -166, 228, -322, 987, 405, -546, -146, 21, 865, 512, -41, 120, -39, 135, 541, -378, -177, 276, 155, 265, 140, 284, -219, 615, 445, -854, -878, 239, 154, -98, -297, 234, -171]
5477a71L64J26o98M52P54p49N22p02J101q35q98P11K30r44M99L03N16m15m08k33
5497d75R99j34o95M42QJ175j574M91J91o05J24k03j29j71l6q9J206j074J032j175
5517f92k2K55L58L00n28K88K58k6Q2N55j53o48M84L87q72J36J3n20J031l03l16
5538F7K55p7J63k60n05O4N93j192M52L37J07N68j656R91n42R79p58M88m52l97
5558g75M20j01N14K97j44K11k22%r28K58L74m12N64m94j21N3O31m92O39n51R87
5579G08j41q74K52J37Pp59N95L53L82o27o10J83P5Q45p15N50p85L26M21m60m64
5600f01O91j32l41L21o8J95L03n09m70J286q25L2O9O42m91j01K08k11j66K95l06
5621a79J23j095R64j76K42o31N56K06r1R7N03r01Q64k40k52N59q97k55lj06R70
$$ y = [-171, 193, 319, -379, 73, 827, 78, 600, -102, 999, 164, -734, -23, 207, -737, -238, 65, 581, 166, -242, -475, 524, 390, -305, 137, 145, 1320, -254, 237, 428, -177, -53, -256, -385, -556, -592, -681, 525, -549, 483, -692, -714, -459, -101, 199, -329, -41, 217, 191, 273, 828, 675, 27, 511, 898, 26, 162, 175, -345, 686, 383, 67, 322, 245, 408, 148, -357, -293, 300, -892, -440, -103, 4, 572, -1084, -93, -635, 344, -414, 74, -378, -775, -355, -456, 58, 355, 211, 422, 200, 200, -728, -470, -96, -508, 56, -438, -559, -506, 125, -367, 272, -279, 708, 567, -307, -55, 82, 89, -670, -75, 278, 660, 33, -577, -394, -319, 526, -189, 361, -424, -98, 323, -137, -601, 90, -42, -383, -62, -130, 65, 368, -141, -611, 675, -150, -118, -49, 593, 102, 1, 209, -2, -168, 127, -179, -56, -1151, -187, -363, -121, -752, -196, 10, -81, 16, 519, -382, 482, 242, -10, 549, -348, -603, -606, -712, 258]
5642B58j25O34n90m32o52J076M69o63l39j73k38Q16J11m50Q23q16J99l77m19J38
5662g50K40j63J51J499m57n64j63K33m51N07p90L23K58J06N3k52L51M91m30m08
5682b16o7j33J72O11q33M88J049o75q0j045P55K9n42R08k48N25p01j4M5P36j053
5703b89K64n30N83o55O89O16q36M47j117P02m00P83N29r00J62m18Q21k24O18q67
5723b2J35k69R75j390R99N58j542M28m49J598j481k46O17O94o15p14R00q47O60
5742a1o90P64j44l62O43m93J12N69l06J020j390K47J030j083P59q26R85n07m93
5761a76J02R3K59o11N05m14N88p12l0J04J31P10j134N43M83q0j47m6n44P52p8
5782B98P8J40n47O52r53J206r22j59L21Q9o55N62l50n08K89J050p60k31L43q2
$$ y = [258, 133, 767, 177, -255, -907, 169, 638, -25, -364, -537, -775, 41, 152, -298, 525, -291, -92, -469, -888, -750, -510, -673, -522, 977, 520, -44, -207, 26, -425, 82, -708, -385, -127, -21, 32, -220, 131, 622, 192, -216, -283, -416, -244, 367, -466, 22, 1071, 396, 316, -729, 26, 55, -487, 421, 173, 698, -3, -17, 28, 764, -289, -25, -555, 28, -627, 62, 678, -158, 289, -828, -126, -526, 257, 786, -114, 48, -370, 451, 227, 845, -22, 113, -156, 819, -571, 428, 986, -556, -128, -577, 1021, -460, -706, -89, 605, -10, -724, 176, -671, -11, -701, 63, -81, -443, 200, -293, -181, 388, 82, 1102, -288, -41, 989, -94, 665, -161, 824, 317, -176, -74, 19, 278, -333, 172, -242, 346, -366, -396, -292, -161, 549, -585, -42, 441, 361, 214, 168, -376, 376, 298, 376, 516, -31, 621, -332, 874, -48, -207, 114, 203, -452, 110, -240, -748, -459, 591, -169, -400, -57, -139]
5802a39N24q33M00Q09j054L42M9m20k76J002r11K85P6o96M93J78M1o41K96N52
5822G7n93K11k51j63K88O40l02l83L35K32n40J020r60N86l24L88p7l55o7o1J24
5843a75L40k00L8M22r35J305k13p32P7L14J48p44k65J244m17J12r45L97j39R35
5863E67m78j92p03R72Q68q72l74k3l50N63J6o41M88J63j70n84J67J651j551m39
5883i22J049n17m8J655j049p54J562p74r12L31M53n17RP84p27m04J596N52q76
5902D91k50q04R08p90O54m19k75K75P86n55M20M98k51J66j410K74k99O40K68N64
5922H91m39m24l3o06O77k70m43Q46k14l0k26j65N59J39n10j57P01J90o76K51L40
5943D01n70O82j54k51L55n04p04J678r89K75q13O96l01L49J98q01J042j521O16
$$ y = [-139, 385, -448, -48, 761, -293, 49, 98, -322, -598, 404, -507, -222, -146, -842, -349, -171, -130, -771, -475, 77, -516, -305, -556, -719, -431, 209, -93, -476, -141, 91, -449, 571, -389, 197, -127, 261, 184, -171, -238, -299, -175, 165, -35, 3, 425, -510, 795, 582, -150, -73, 241, 389, -355, -620, 624, 207, 319, -626, -229, -368, 567, 89, -103, -806, 166, 1034, 162, -212, -235, -585, -22, -6, -647, -159, 4, -166, -750, -583, 1068, -483, -922, 127, -390, -438, 1217, 168, -586, 976, 202, -710, -379, 74, -443, -434, 350, -377, -781, 815, 1367, 491, 241, -563, 345, -445, 209, -210, -485, -210, 576, 21, 441, 939, 688, 854, -556, -282, -581, 59, 327, 891, 452, 28, -5, -611, 66, -204, -647, 199, -15, -45, -271, -436, 123, 262, -248, -405, 296, 486, -190, 61, 401, -169, 513, 359, 108, 463, -41, -745, 933, -56, 219, -594, 102, -199, 150, 348, -453, 589, -932, -316]
5962c16l26J473n0j331J176L07n02j74K75j430O67K37O67j109k39O40M61J13j28
5981D11R1o95Q59j190J68Q90k75j006O68l03l0K03M67j21m21K58r8L7k22P0L92
6002A53l26R0O28k54l52K28m62p5r28J144M46j198J043l96k7P36N90j40o96p03
6022d99k37R23m3j005Q03o62N03l46N00n22J77R55n05rM4k07M18R27j058O56m80
6043C33L75n1p30J026j423P53o90O52n63p8P57q61M14J97K8m45n94R58p49J228
6063E37J40r93P40j32m61q85J288r80k23J434l28M13n06J68m31K49J8L51P7n37
6083f1N24L16j435Q48J62O0j70n76M07n03L06L94K77K52j426P86m32N09l0n2k93
6104a37K34K92o50L12j01K58L5n78p7Q04q47O31K66L38j093nJ28P38o28N32q88
$$ y = [-316, -642, 831, 781, -550, 626, 933, 431, 257, 532, -898, -231, 6, 673, -436, -675, -35, 426, 539, 411, 502, -193, 666, -524, -356, 534, 259, -747, -79, -382, -412, -209, 258, 137, -284, -26, -124, -87, -309, -239, 153, -173, -83, 545, 291, -61, 167, -295, -370, -1298, -154, 292, -906, 137, -259, -286, 450, 1040, 900, 204, -499, -736, 187, 144, -861, -58, -720, -217, -563, -63, -585, -408, 547, 42, 33, 77, -130, 288, 1215, 157, 813, 333, 708, 657, -73, 953, -470, 283, -407, 245, -318, -396, 361, -500, -86, 111, 139, -306, -900, 58, -691, 537, 677, -316, 424, 292, -169, -1054, 234, -746, -969, 465, 137, 550, 44, 212, -219, 30, 48, 399, 476, -61, 463, 779, -656, 192, 354, 414, 244, -332, 75, -428, -122, 272, 549, 801, -625, 161, -271, 238, 208, 156, -137, 97, 389, -261, 51, -50, 208, 243, -335, -412, 392, -455, 176, 442, 780, -313, -318, -190, 548, -80, 452, -436]
6125d36j59j8r6J040l6K9q42J98L06j45p07J420K76L84j546M53j44k17M00J0r59
6146g89O5P13K85j205J356l32r13M50q3J098q91j23N71O76j037NN48m97N72p95
6166c26J95l33k38N45L93M99n56J18n18O45k26j00j35K27o49J080M5o67l20L79
6186E8l1l10L41O95r67l14N91l73R15n83k64j99J97M97j10R5j054m29O75M24Q7
6207e9j34O10m06n28O98M95l27L57j252N27J93j077J084j033O41L45%N7J12m35
6227a32r89J928j739J112L14o4o84N86k42M60n13M26r72J141l15m00M40j75p51
6246e69J377j156J29o42J115K97j77q12P13J00l72J82m76m27J585j343K12L84
6264A20p1j63J01m12M43O11j11p52L78l09O66J01l95j03J5j64%M54m90k32M52
$$ y = [-436, -595, -613, -709, 331, 295, 324, -518, -320, -14, -159, -866, 554, 830, 1214, -332, 121, -23, -240, 160, 170, -789, -724, -11, 274, -931, 425, 93, -820, -370, -453, 645, -246, -369, 202, 878, -159, -154, 394, -103, 469, -326, -131, -464, -702, -157, 236, 735, 179, 297, -221, 424, 198, 98, -37, 190, -459, 621, 666, -1, -321, 58, 27, -283, 58, 753, -214, -528, 63, -310, 605, 22, -242, -441, -244, 253, 143, 238, -816, -1245, -570, -146, -59, -193, 417, 11, -517, 181, 676, 349, 706, -546, -19, 174, -903, 181, -852, -211, 134, 134, 191, 303, -132, -1121, 807, -932, 180, 494, 430, -254, 332, 90, 550, 37, 463, -509, 632, 317, -83, 357, 182, -569, 808, -348, -219, -861, 254, 551, 374, -438, 275, 375, 3, 185, -291, -718, 867, -476, -264, 120, 49, -114, -13, -425, 18, 629, 518, -234, 144, -165, 501, 602, 207, 104, 119, -45, -45, 409, -81, -313, 139]
6285A39o18O55k61m07M25J541j356j323P85J339j5n86n52K11l3l90Q97j37l91
6304g7o91L55K86K55o60O11M41j011P15p0J53r42R49r12K11k94J351m51L27r23
6324c77P30k58N17j157Q24p52K49N12j175M79j3N84n01o51J224k53j6L71q27L67
6344a23r6Q64j135k37O18k58K39O76j89m29q6n8M71n63M68l70K01K45k76M33J39
6365E34r59l7k67Q98J94m88N50l74q45L80p3K91j86M10J40m32J978k195Q56M31
6385H06p44M46m22l76J061n41l90m32O35m35K84o05Q46n94P92q17Rm66J065M33
6405E55k05m91n37J176m82J07l03o6K36P9j299O35O47K02l75M9k22k35k02P65
6425C4P53l11j290J018N04p41q17JP00J77k2N89j87L55r52r7R05k99l6k94N61
$$ y = [139, -479, 176, -85, -492, -67, 1474, 118, -1205, -420, 919, 904, 318, -234, -23, -56, -446, 451, 314, -77, -768, -413, -127, 128, -532, 79, 520, -491, 224, 154, 307, -635, 314, -598, -387, -681, 670, 219, 546, -377, 353, 95, 612, -545, 279, -473, -224, 288, -887, -408, -421, 163, -338, -989, 235, -18, -34, 337, -490, -123, -219, 645, -490, -727, -109, -367, -128, 548, 359, -70, -156, -214, 257, -306, 162, -208, -7, 238, -38, 395, 534, -425, -462, -729, 169, 363, -125, 425, 51, -794, -414, -487, -196, -382, 28, 168, -264, 1714, -481, 375, 806, 62, 508, 86, -290, 771, 230, -160, -592, 43, -392, -108, -713, 133, -461, 331, -486, -477, -943, 122, 555, 350, -141, -678, 498, 16, 123, -180, -246, -10, 69, -1230, -595, 52, 254, -121, -72, -294, -529, -731, 34, 787, 476, -814, 204, 708, -33, -850, -849, -149, 28, 6, 595, 408, 763, -189, -286, 619, 320, 284, -10, 551]
6446E51o17L64l14k67O09l04r85J527q02j04J75k4k71L09K56r0M83r29J081q90
6466b42K56M8m66J91J0l55J519q86R55j075J14L63L42n40l71p6q9q9j31O2K63
6487a97o68J232K59q00K32k46n9J011o68L65q34k15M81j48O77M09j181R1k55P47
6507B33n36K08R4K22J33l25N53k60J88n96O43k56n05k14k15Q81q13Q63l14k04
6527b20l16J509j419L61L37l52J44k34N15m69k45P40n20k32M33J97K03o09N39
6546C62j20l99M36N26j526pJ01K81R8o78J207n77k81L24O06L78r36k49k43J472
6566G75r39O16j013N87M18m00n29J22O44K68n8q09K17p31O94Q27q58K45J011q71
6586B16k56p5n02J64L02K90J38n42J013j526R56j37M77m90j58Q33j266J099l87
$$ y = [551, -66, 298, -16, -283, 326, 22, -963, 564, -238, -342, -167, -191, -462, -153, 103, 13, 496, -433, 648, -242, 14, 62, -404, -213, -203, -558, 961, 75, 1030, -45, 69, 432, 774, 234, -137, -213, -302, -391, -522, -460, -197, -865, 367, 626, -174, 58, -188, -247, 764, 96, 461, -373, -588, -107, -255, 422, 831, -350, -259, -514, 233, -303, -95, -1, 221, 354, 29, 582, 322, 510, -86, 557, 301, -204, -418, -633, 248, -565, 298, -16, -220, -536, 973, -446, -85, 252, -100, 44, -190, 325, -144, -389, 351, -169, -401, 32, 229, 432, -177, 362, 242, -157, 279, 805, -721, -728, -627, -346, -248, -926, 281, -296, -577, -253, 353, 731, -205, -454, -697, 775, -164, 452, -561, 26, 444, 44, -485, -363, 281, 549, 491, -318, -101, -832, -138, 689, -169, 76, 1087, 216, -40, -115, -617, -453, -151, 139, 277, -265, 748, -778, 178, 41, 518, 28, -130, 703, -563, 536, 149]
6605A49l24O19j98l48O37j557Q08J14R76j670Q39j30L2N78r52J04j32N02M44k95
6625A96N69L04k178P67P21o87P92r13J51P58r54O70l65O40n51J08K34R5K25p60
6645a78P83q00Q57n20L39K22p0q99J084l64m1m58L95J36o36K92O38m42q60P29
6665B07M14n28n06o4L88O95l64o25j84Q28j80M85j237O86m04O88n58L73O88j417
6685f15M60N41o21M89o52Q17l08o21N71O24j754P85L37K01Q8n44R91r56j40O06
6705B99K4k6q00J257j018j84J69o54N20J332j139K29J55q5j61K21k85p91M07M92
6725c8j60M28n5k26J46M6L96r76L10L44K2N2n55m89J515j030L39n67M62L5N20
6746E19j372L94J79P54o56L39L10l44o93J287o65K27j36k8k30K53o08N65M93o41
$$ y = [149, -175, 444, 246, -102, 535, -1022, -214, -100, 876, -794, 45, -85, -53, 525, -427, -323, -455, 47, 491, 196, 765, 1069, -1109, -342, 379, -308, 484, -429, -278, 480, -474, 196, -169, 471, -80, 28, 262, 357, 582, -178, 605, -195, 662, 142, 481, 703, 633, -266, 818, 454, 413, -45, 350, 486, -150, 142, 780, 338, -522, 207, 621, 93, -413, -477, -89, 606, 242, -383, -567, 261, 81, 566, -671, 15, -389, 299, -259, 114, 802, -615, -155, 386, -235, 254, -398, 419, 111, -510, 61, 685, -1069, -284, 53, 254, 342, -202, 789, -167, -307, 299, 323, 297, -503, 754, -264, -448, -279, -933, -413, 919, -220, 9, 164, 79, -82, 139, -146, -937, -530, -38, -198, 230, 175, -51, 95, 141, 537, -439, -129, 215, 237, 289, -266, -755, 760, -270, 69, -498, -36, -1, 519, -853, -459, -280, 474, -182, 157, 467, 123, -570, 717, 52, 279, 143, 115, -115, 138, -470, 95, 588, -53]
6766e3L03q28P83l22J3J251j506K68m9K65j119J440k68p26J23M03l30k11O27l46
6786b82J32N36k18M21k3j074Q00j22J57q8L43q01J74L03o15n68Q32l33J156k67
6806D63m92l96P74o14J2o07J024o3j71O14q86j67P10N23n48J21l60L92q05L7p3
6827e12J051m81n00l54L38p66J719k83m41N94K45j142M92J88q00J06O7k18r3J090
6847C00M35n1o09M78j73n61Q78r58K96L98p65P78n46K45J60r87J214o70k80R07
6867D89o76J88o72R56m66J49n46M49O68j62q31r9q0n69R39K6m17J62j42Q82m10
6888a62k51M61j47L80J62k89J63q8k09k12J159q18m49M73j161l16J067N39k0j81
6908A01n2j85j303J340o11M48n7K6Q07n84M94o66m76L50J90J19J41m04O01Q86
$$ y = [-53, 250, -578, 205, -117, -104, 1147, -359, -91, -140, 125, -994, 446, 178, -548, -425, -22, -352, -563, 64, -282, -150, 386, 168, 589, 566, -508, 292, 170, 327, 239, 582, -219, -45, 258, -357, -925, -93, -426, 730, 463, -29, -425, 349, -265, -253, -860, 164, 101, -70, 544, -342, -509, 201, 724, 176, 297, -63, 329, -476, -439, -512, 539, 58, -442, -796, -458, -1224, 495, 212, -229, 365, 610, -532, -40, 148, -652, -546, -479, -697, -790, 300, 735, 684, 75, 553, 380, -181, 697, -261, 35, 433, -332, 446, -100, 145, 305, -682, 532, -138, -418, 489, -187, 1, -671, 285, -181, -32, -578, -129, 539, 377, -454, -553, -633, -1202, -263, -237, -654, -492, -634, 248, -162, -413, 48, -99, 281, 443, 154, 317, 229, 20, -192, 967, 149, -300, 173, -988, -1304, -237, 302, 282, 101, 49, -136, -1439, -99, -710, -262, -319, -293, 514, -70, 424, -242, -718, -368, -178, -59, 82, -322, 279, 1165]
6928A165j217k91K03k55L09k85L03j125J361l13J60r22J359j245J258k76p41J374
6946H22o63o16L42L29j130J447r34N03r6n29p6J143j65l20m79R40l10m4j90j69
6966a95K24J04m31J067j324M37Q94j185P36k64m38Q70j184R29o95J313Oj65p05
6985fJ0o53M89J53N86r79O27N1o75L03j51O65r25J255p67p95J024j7m40j96jj47
7007e89o2O44j42N88n48J2Q95k10k97j43p54O78j29j1n80Q00l35J08n1P08k71
7028C11n59N22m50K09o39Q05n25N35Q3j95j33J32Q22m23J03k84O47o73O45l42
7048E91p29l00L78l58M95j50j063K008m57j87M73l91j144j1J120m33Q38j109R09
7067D80r64N74nQ92p36N37j066k16O12r94R82o1k18j73P32p65k22K46J85j46M78
$$ y = [1165, -52, -343, -140, -395, -86, -371, -68, -1193, 168, -145, 15, -907, 452, -793, 465, 189, -552, 822, 159, -457, -115, 214, -916, 531, -403, 100, 4, -525, -601, 542, 377, 57, -422, 518, 208, 164, -26, -195, 29, 133, -298, 769, -555, -118, 776, -409, 327, 63, -375, 495, -689, 240, -455, 858, 864, 699, -6, 4, -649, -160, -7, 579, -400, 227, 278, -397, -94, -245, 420, -505, 750, -17, -812, 212, 195, -245, -441, -442, -589, -651, -7, -149, 439, -109, -97, 798, 588, 291, 148, -606, 72, -57, -68, -648, 152, -183, -75, -126, 582, 311, -248, 274, -176, 33, -606, 199, -326, 209, 292, 97, -36, 96, 918, 495, 598, 314, 961, 288, 933, 591, -138, -438, -60, -418, 77, -73, -1136, 872, 415, 228, 701, 310, -834, -845, 275, -158, 680, -429, 480, -484, 90, 85, 977, 241, 778, -288, -504, 108, -886, 96, 35, -183, -356, 376, -389, -611, -365, -180, -326, 152]
7088A52j20J08j44j86P24l37J3o98K3J360j68n25j59M8K38j80P7j57L63r75J177
7109F34nj485K93K33o6J33J035o98L97J76k46n98R03j185K76J070j304M2k79N92
7129h2j93N38p27o25J639j246M74L32j97P27j09p66L61L12L19k079J705m31l41
7148c89M20l42n25N57k14K22K94L99O41p68o94N83O95k181J200j12N14J67J19
7167E86k63j75k61O11l03O15o91M7k21O60j045R92j215J112L81p37n66m46J083
7186A64O2K19j350N02J548o71k17K96n89M36o86P50k55K37j84j96r3m05j45J24
7206d53M96J12j86m8j70p1M21o39J513j173M8n4K74j76j019J355L23o17N32J09
7226E77o20L6l72J347j606R93J99K19J23m10n11j02J19R50j328k31P91J57K58
$$ y = [152, 32, 140, -4, -190, 534, 197, 210, -488, -465, 895, 727, 202, 43, 91, 329, 149, 226, 69, 432, -543, 634, 629, -856, -563, -330, -396, -263, 772, 74, 471, 647, 401, -197, 706, -479, -203, 867, -437, -395, -674, -82, -275, 263, -464, -1089, 550, -696, -222, 110, -87, 640, 531, -235, 126, 438, 757, -1322, 383, -48, -389, 31, -311, -836, -279, -493, -271, 23, 422, 1063, 295, -399, 184, 879, -1302, -102, -214, 300, 467, 586, 323, 148, -113, 498, 195, 810, 119, 166, -55, 605, -440, 552, -663, 449, 830, 93, -473, -919, 164, 226, 445, -905, -403, 1145, 474, 257, 553, -36, 400, -286, 464, 209, 446, 262, 66, -27, -432, -577, -453, 43, 155, -31, -79, -249, -320, 101, -538, 975, -198, -150, -204, 70, -106, -1125, 230, 553, -64, 468, 577, -43, -7, -379, 968, -638, 355, 554, 773, 896, 486, -25, -127, -8, 942, -386, -617, 174, 331, 589]
7245E89q4L4N92j034p93N98k10n20R38q8l22N18p15O70p03l62R70L98lk97R51
7266A127j074j10K03J98k06R4R7j494J555J91j154M73k48m9J96l08O35j24l22
7285c20J85q13J067k27k07Q69r41r8L63L28J97m01m90N91l77R42j232Q22Q11j472
7305d03J83j00J039r62m94J157k88j16k74O75k15q68J27R86m71m37L53Q60r86
7324b34j014J264n09M64O22k48k30m36J072l27n90J98n22P26O4p94N56o62M71
7343a29M20j5j03M48k30r8Q0r44P3O31k6L80q79L72k02L51J14P79p92K21K81m74
7365B58o08o31Q74j27Q38p00K45k63o28K80M51q1Q60q57R11l79K17l31j40M34
7385F23n48J89n41PL3Q32K80m12n49O05n31j6O41l11m57l36K64k51Q8K66Q4J92
$$ y = [589, 505, 539, 1131, 97, -696, -98, -308, -828, 110, 22, -300, 218, -497, 173, -530, -892, 78, 476, 473, 176, 1127, 53, -57, 146, 344, 138, 232, 329, -1165, 390, 581, -573, -100, -348, -397, -201, -509, 126, 2, -320, -135, -948, 119, -108, -315, 554, -387, -485, -122, 206, 403, 2, -488, 103, -274, 668, -564, 258, 1069, -403, -220, -320, 719, -243, -737, 420, 132, 16, -258, 417, 202, -666, -539, 447, -24, -461, -108, 752, -234, -1248, 16, -493, -29, 593, 345, 115, -321, 751, 424, -166, 32, -490, 236, 300, -494, 62, -600, -129, 291, 276, 173, 621, 391, 293, 373, -571, -498, 133, 107, 487, -392, -20, -222, 129, 243, 1022, 230, 451, 732, 258, -350, -981, -107, -234, 604, -96, 149, -114, -742, -462, -11, -92, 768, -89, 822, 443, 660, 329, 189, 623, 75, 264, -277, -270, -237, 595, 875, 463, -86, 519, -12, -28, 613, 302, -155, -491, -227, -478, -390, -124, -40, 152]
7407A52j53N23j065L39J6k44l94J176k79N56m75l99J654j554N57L8M17j053M44
7426B56j004P17N42o4K85j027L54P6Q2j58m17M82l37m40O71n67n29J926r89K82
7446A41l11M1L20k60j96M48n64j02o8J54J18J157n03r62L9M36l1q9P69m94j36
7467i3m36J029k95l61J42N9L96o83M97J3J72q67m78J630j618J368o04K30k94p29
7487i22J422l07M92K75n64p84p04J184J22m93O05r50K2k36J259N53q44l80Q06
7506E56j207j02J395q02j98Q6l72M7K84R6j97M89N9j06K2Q2j81j50N76K99j91
7527D85p32n4J2J86K71k42k48J368j123K93K95q77N99o8M62r55j94Q67k1K38o48
7548h6J34l22q0O69k99J65j52Q44j134K57L6M42j815J046O62p40R11r3r1p38O86
$$ y = [152, -1, 522, -543, -204, -188, -432, -826, 350, 71, 627, 152, -247, 1407, -147, 410, 448, 865, -188, 256, -748, -31, 511, 447, 732, -295, 59, 135, 217, 59, -358, 124, -213, -653, 18, -549, -1078, 848, -141, 141, -170, -129, 191, -69, -265, 183, -381, -483, -551, -397, -279, 878, 375, -587, -548, -112, -143, -232, 537, 43, -93, -529, 500, 205, -156, -14, 45, 441, -242, 255, 268, 440, -427, -905, 725, -893, 475, -129, 101, -193, -922, 500, 193, 685, 960, 396, -388, -1092, 92, 214, -279, 326, -624, -602, -838, 421, 974, 130, -250, 556, -651, -753, 642, -160, -358, -272, -644, -597, -313, -217, -414, 75, 134, 28, 50, 132, -49, -199, 377, 676, 485, -247, -301, -289, -103, 168, -74, -322, 1046, -77, 216, 511, -366, 233, 165, 627, -328, -522, 345, 324, 562, -86, 48, -274, -354, 315, 16, 181, 29, 873, -261, -4, 32, 474, -1341, -295, 367, -373, 538, 445, 354, -384, 302]
7569C02j034J692j717J113j048J440q81N48k6m51Q98r44k11L70m61J069m34j0
7587B15m74J040j324J035J68k13j176O89N55l44j156O42O72p67J307o25q46J20
7605d82J033n81p84J054N69j710N18l74J141r98J285q86J61K5l27J460J10r86
7623B28J10j86k72q5L28K11O69m29J64m48j17r7k6o2j05J39O46m08p33N90n09
7644c92J88J70j011K19P88j09r77J047o28R91p36O90k1J73M27p79M93m11o33M43
7664f8K06k20n57P5J373n90n5n86L76p04L01K89L33j93K05j12n05J53R07j75k01
7685B52l84n30R60j36k29N0K02q4J91j030J011L91o80n7m15R11J16k91o18PN10
7706A47q9q53P13j50N72J49o96K24j99J39q13J125R24p83J0q84J17J97k2L43j40
$$ y = [302, -732, 960, -757, 356, -692, 748, -133, 415, 389, -62, 836, -108, -319, 51, -410, 659, 225, 215, -259, 781, -543, 492, 660, 447, -729, -40, 515, 171, -985, -343, 329, -438, 869, 244, -602, -482, 551, -30, -814, 240, 809, -901, -383, -757, 384, -614, 671, -215, -54, -29, -356, 1104, 1214, 228, 338, 152, -120, -205, 123, 334, 1003, 574, 738, 290, 173, 76, 50, -12, -117, 22, 668, 260, -473, 117, -392, -204, -34, -1045, -826, -38, -147, -1124, -77, -705, 286, -450, 240, 219, 392, 819, 40, 533, 122, -511, -68, 138, -82, -639, -564, 809, 219, 164, -422, -46, -750, -449, -160, 173, -20, 185, 73, -432, -279, 628, 453, 252, -132, -662, 298, 162, -67, -17, 185, 101, 292, -738, 273, 664, -16, -73, -488, 423, 539, 248, -370, -363, 147, 58, -795, -82, -232, 340, 489, -207, 17, -182, -43, -856, 269, 1193, 410, 420, -464, -347, -150, -172, 171, 31]
7727C1J11k24M6J8K00n91P97l54l9m48O61K52o68m11P28j13N62p92p69P22M1R34
7749F94o53n86J002j646J163l90J38L06J77m35M15P36j742J016l9n01N82q93J439
7768G83q34N15j14j61M86j351O62l17o50J224j42J59n32L91K95j122J29P83m19
7787b15J79P62j032q0j54M88J063p29r60N52m71R33k23j76l83N13p72M95R33m79
7807B44m34o03P69m76N73N73j101M30j52k01M56M45n13j073K14J029j012J579
7825G47p55J78p6J94J6M16l85k08M2L60l33Ml1n77P52m64J82k8K1k78O8k92K44
7848b03M07j94j28Q72n28l01j84K15L32k53j94k7J77J36j058J054j274R54M74
7867B77r62J288n0p34P79m40l70j60P40j65n81N93o8K23k4j567J037J267l78p36
$$ y = [31, 142, -82, -36, -18, 182, -409, 388, 34, -5, -453, 208, 460, -208, -619, 109, -4, 558, -234, -1003, -281, -240, 694, 41, -545, 457, -1189, -26, -416, -278, 28, 205, -230, 185, 921, -821, 195, 156, -345, 237, -656, 783, -51, 464, 350, 189, 675, -676, -14, -331, -981, 243, 101, 260, -272, 119, 414, -708, -579, 204, -215, -36, 726, -306, -386, -540, -52, 1011, 282, -678, -126, -597, 336, 113, -63, -446, 67, -705, -210, 723, 244, -190, -793, -24, -500, 73, 646, -455, -25, -177, -378, 78, 523, 10, -1063, -849, 180, -832, 747, -8, 170, 94, 288, 304, 720, 335, 127, 169, 529, 196, 200, 169, -408, 344, -120, 62, 34, 55, -223, -155, -447, -203, 204, 10, -118, 754, 226, -75, -259, -44, 288, 35, -159, -186, -9, 127, -931, 123, -1151, -197, 277, -685, 603, 553, -181, 598, 158, -212, -372, 368, 203, -378, 215, 147, 370, 346, -1221, -184, 1083, 705, -31]
7887c1J280m49p98q8N91m1j474J378r52O73K90k41p46O04k83P36k11k06Q55j348
7907d61R57l38O8p8M49l23j045J31j62J78M75j47R90p24J02k06J81L46j26k08
7927E9J52o41L69J18Q86j062n01J251j103L41j058J188J62j11l76K0j0K21J09
7946A4l02M44r46J119o71K81k43J91K33l47k49N19m34Q21r41N82N57j178R00l42
7966HP05q57K52l23M50M31J1j433L64j82M34P69o12K66m11O66m24Q4l7o29L09
7987a59m11P25q26M24J04O95R3p64R91j220k64N9Q73j021O71j28N37k45o89L88
8007a67Q6M09p61N35j90R52n89m12K31k13j37M22n39p0M63k70j90N18q1j38l12
8028d53L31K29l39J13O8Q06l55p70N96L10p94N37j13o22N23N90q27J99N35m34
$$ y = [-31, 1249, 800, 2, -86, 505, 464, -1010, 368, -584, 89, 379, 138, -608, -4, -287, 449, 238, 32, 887, -461, 496, 158, 226, 148, 597, 274, -771, -640, -802, -624, -149, -296, 694, -30, 72, -134, 47, 393, 267, 59, 211, -430, -61, 57, 943, -119, -620, 631, -472, -131, -1189, -1, 161, 50, -326, -306, -316, -95, 14, -288, 156, -790, 329, -342, -61, -304, -113, 120, -227, -476, 43, -391, 430, -511, 71, 628, -550, 350, 8, 713, -144, 108, -215, 235, 666, 677, -756, -392, -574, -140, 629, 17, 283, -128, 538, 114, 198, 161, -468, -159, -570, 155, -671, -247, -143, 552, 645, -119, 872, -348, -612, -553, 320, -701, -30, -158, 379, 134, -555, -167, -81, 328, -433, 102, -88, 864, 275, -137, 94, -119, -256, 166, -373, -443, 20, -250, -440, 78, -3, -141, -453, -122, 107, -232, -119, -51, 755, 400, -370, 226, 536, -258, 279, 166, -456, 67, 657, -170, 29, 564, 130]
8048A30K88M97j075O28j134N62l29K66P22j892J274M14n00p94J950n65m60l82
8066d00M64L05o10N70L00j234J214j060N68K11K59j200Q50K41k48J34j63m49P2
8085a76l19J03j54J167j84J45n9q05L85m4N97k88M06k84k74k45o97O65J23q58
8105g96O72k29Q31p21o56J128L23r50K57M27j82n84M36p21O71M20m80Q15l53k42
8125F6m2L16n82P1K88p81N7J024j340N44M33K48l45j57j86R68j108P96n18r3J74
8146a67O7N39n96O83j096O39N86n89K64p5j372J337j51n74N06r0K43j96o07P49
8166A00L26q77JM23P65l77m30k29J023j63r78Q42p66k37O60k5j13L82o76M64o02
8187d87Q19j74k53j19
$$ y = [130, 418, 915, -160, 468, -666, -104, -433, -167, 555, -1337, -63, 351, -149, -943, 1007, 442, -18, -400, 64, 369, -241, 329, 629, -605, 609, -451, 117, 328, 587, -613, 237, 478, 230, 364, 201, -248, -176, -495, -392, -546, 621, 437, 582, 523, -282, 103, 59, 656, 368, 774, 490, 216, -29, -726, -61, 62, -796, -124, -353, 478, -243, -899, 229, 552, -398, -141, 286, 104, -480, -44, -765, -94, 326, -154, 661, 308, 66, 24, 340, -242, -171, 117, -664, -607, 417, -923, -379, 54, 302, -43, -200, -386, 582, -526, 270, -248, -341, -167, -100, 439, -157, 526, -570, 69, 655, 66, 330, 255, -1117, 220, 69, -505, 1, -89, 154, -42, -649, 100, 426, -451, -450, -27, 738, 361, -69, -298, 725, 562, -416, 426, -340, -577, 83, 58, -55, 327, -349, 115, -487, 332, 158, -95, -214]
8191b14
$$ Imaginary data points
##PAGE= N=2
##DATA TABLE= (X++(I..I)), XYDATA
0@%%%%%%%%%%%%%%%Jo5J28j28J28j28J43k07K56k58L22l85M50n15N79o98P81q64
33d60R84j115J266j438J608j796K010k229K472k750L056l386L741m128M550n014
49b629N525o086O705p391Q151r001R961j1053J2297j3738J5440j7468J9941k3036
63a2382K7030l2431M0176n2302P4083j25238M58384L31547q14399j02020M03647
74A96095J05199n73784k25494M42173M50364k78037m46518R1283M06646j25502
84D2425m51051M4652N56316J82772l00835j23204K51660O4277l01067k39680J34729
95a39006K33330J1639j22817M7231J36891p7985k37949m0659J26081J5593l3734
106h1385J34527J27932r8036j45954J8782K8385j09950p2474J54388K26737J1516
$$ y = [0, 0, 0, 0, 0, 0, 0, 0, 0, 0, 0, 0, 0, 0, 0, 0, 1, -64, 64, -64, 64, -64, 79, -128, 128, -130, 192, -193, 257, -258, 321, -377, 404, -460, 524, -591, 675, -763, 845, -951, 1059, -1170, 1302, -1448, 1608, -1778, 1963, -2165, 2385, -2629, 2896, -3190, 3515, -3876, 4275, -4726, 5235, -5818, 6479, -7259, 8181, -9287, 10654, -12382, 14648, -17783, 22393, -29909, 44174, -81064, 377320, 708867, -105532, -207552, 196095, 301294, -272490, -497984, -55811, 394553, 116516, -330002, -238719, 167927, 42425, -408626, -363974, 192342, 375114, 74279, -48925, 202735, 267012, -34055, -273735, -139006, 94324, 105963, -16854, 30377, 167268, 89283, -148666, -189325, -63244, -47651, -81385, 53142, 181074, 83038, -62916, -44134, -15749, -125699, -198173, -43785, 182952, 194468]
117A94468j72628l5009J52949k9152k97755q8218L14463J99033k18997j64081
127a44927K12618J61758k49825k93026J20776L24506K3390k39376k436L00768
137B14226N7170l74470k23523K59703K24464j99140j78643K33954K63262j43590
147A33413k99232J1026K34893L0128k04946k8245K73440J36916k42238k09150
157a63995J33314J28413j73326j56139J61824K14134m9932j62781Q892J20004
167F0408k0364j60242k8815J86596J13716j14752q2581J17632N7614j62249j18490
178a51527J07717J16227m4109n7689O3357P5957n5499j24648l1097Q3570L1230
189A3489o9642j125J18200K8714j15288n1594P1889J2220o8403J1742R8840M0752
$$ y = [194468, 21840, -13169, 139780, 110628, -187127, -275345, 39118, 238151, 19154, -144927, 67691, 229449, -20376, -313402, -192626, 131880, 155270, -84106, -86542, 214226, 271396, -103074, -326597, -66894, 157570, -41570, -220213, 13741, 277003, 133413, -165819, -154793, 80100, 110228, -94718, -122963, 150477, 287393, 45155, -163995, -30681, 97732, -75594, -231733, -69909, 144225, 94293, -68488, -59596, 60408, 40044, -120198, -149013, 37583, 151299, 36547, -46034, 71598, 129212, -33037, -151527, -43810, 72417, 28308, -29381, 33976, 109933, 54434, -70214, -101311, -17741, 13489, -56153, -57278, 60922, 89636, -25652, -77246, -5357, 6863, -61540, -49798, 49042, 89794]
201H9794m8829l6071K1467J0840n7274n7460N2096R3121k5512q3628L8873Q5537
213H2954o9052j27854L5649J22074n805r1315R487J04087K3316j12566q4806Q2197
225c1634J10487o0608j11902P5708J54609m5865j65496K487J36088J2980j21930
236d5076l7609J11101Q5318q2137j24793L2504J21406k4827j36116P050J46567
247E3388L3186j15907m4470P9637N1504n6007o3681K8771Q6027J7463p3797l3640
259c7526O4105L2408o2816m4397M1028M1079j2719k4218r322K858J8361m533m0131
272c5823j0325M3182K5874k5753k0852J1444K2272R039k2484l1779K5851O1161
284E1807j1320o7779O932O8618l47p0347j9732N0599L5930k9505n4242N167O2794
$$ y = [89794, 40965, 4894, 26361, 37201, -20073, -77533, -25437, 67684, 42172, -41456, -2583, 82954, 13902, -113952, -78303, 43771, 37966, -53349, -43862, 60225, 83541, -29025, -113831, -31634, 78853, 18245, -93657, -17949, 136660, 90795, -74701, -72214, 63874, 76854, -45076, -82685, 28416, 113734, 31597, -93196, -60692, 60714, 35887, -100229, -93179, 53388, 86574, -29333, -73803, 5834, 57338, 1331, -62350, -33579, 52448, 69911, -3886, -37526, 26579, 58987, -3829, -48226, -7198, 33881, 21162, -3056, -12378, -9520, 8841, 4308, -35823, -46148, -2966, 22908, -2845, -23697, -12253, 10019, 19058, -3426, -35205, -9354, 51807, 40487, -27292, -20360, 48258, 47911, -22436, -42168, 8431, 44361, 14856, -39386, -34219, 28575]
297B8575R701p6966l1526P4682M5436o2228m7321M9484N2630k3477m8832k400
309c2242N1383K9833m0054m5000L6082N6769k8812o0084J3830M9558n154l9304
321a3195j0504J8641K0948p894l3932q886L8697J5093l6083j7404L3715J9121
333A8317j8223j1566N550J2575J1843m248k2084L067L1401k733l1718K53K1959
346A4393k11j4585p628j666O112J1585j3490k1872J3956K6044j5119k2296J3268
359a1509J8010m225n233L32O13J2350J0226j7462j2168K2562J2681k1521j2246
372g590J4629N260q322m374p954j702J4538q09k3634j545K4562J538k1211P92
386a5822J4969L845j059k634n696P760J9457q904k1975J1764K2334r011j9532
$$ y = [28575, 38276, -38690, -70216, 4466, 49902, -12326, -59647, -10163, 42467, 18990, -29842, -32242, 19141, 48974, 8920, -36080, 2, 56771, 27959, -32125, -18295, 31263, 26109, -13195, -23699, -5058, 15890, 7996, -25936, -34822, 3875, 18968, -17115, -34519, -804, 18317, 94, -11472, -5922, 6653, 18496, 14248, -7836, -4769, 26632, 23899, -7819, -7566, 14393, 14182, -403, -8031, -9697, -3585, 8000, -5490, -27362, -13406, 12638, -2481, -24777, -11509, 6501, 2276, -2957, -2625, -2012, 10338, 20564, 3102, -9066, 13496, 26177, 4656, -7590, 7039, 12299, 3977, -397, -8351, -10053, 4485, 3676, -19958, -21503, 3059, 4597, -16614, -15822, -853, 2992, 1933, -701, -6397, 1363, 20820, 11916, -10059, 1705, 24039, 15028, -4504]
399d504L642R187J468m464j2232q950J7424J0973k4957j5738K3704J7250j9167
412f364j5296J2562J4688J909r041j2274J1942K5456n845l1567Q035L3137o224
425B1118l0298O73K0193L058j1830j2983j462J7356L690k3163j2434K3655J4288
438A1861k2703j0556J9294R071r548l071K192K684J0908L329j3024j907J7721
451A6251K57j5720m69L250j376M007n5j4434j269J8559k680k8444p95K5598L889
466F569j7910n104J4251J3033m493k0432l833K9417J4223k8464j3734L4599J7128
479C5250l3599k1283K2382J6809j4639j8546N296K0485L802k5894j7796K1879
491e854J7180k5688j5724L1187K0384k3608j4181J9401Q150j5953q048J4123J5433
$$ y = [-4504, -862, 8325, 9793, 5329, -6903, -15853, 1571, 12544, -12413, -28151, -4447, 12803, -6364, -21660, -9098, 5590, 7499, -1542, -13816, -1874, 23582, 17737, -13830, -5795, 27342, 21118, -9180, -8507, 11686, 14744, 2914, -10069, -11531, 5825, 9515, -13648, -26082, -2427, 11861, -10842, -21398, -2104, 6967, -2581, -5652, -3460, -776, 10132, 13461, 437, -1470, 16251, 16508, 788, 319, 3569, 2193, 6200, 6145, -8289, -9558, 9001, 6321, -22123, -22918, 2680, 6569, -11341, -16445, -2194, 10839, 6346, -14086, -17919, 11498, 25721, -2743, -16477, 18122, 35250, 1651, -19632, 2750, 19559, 4920, -13626, -8330, 12155, 15957, -9937, -27733, -5854, 11326, -14362, -30086, 1101, 21485, -2123, -16304, 3097, 11247, -4706, -12754, 1369, 16802]
504A6802J92j4191j934J8965l913l3524m261L6102P248l6796j864L7323J423m1620
518b0048j5709K7036K0828j6483k1792J8049L9446o902n0366m883M9370Q487m7050
531b0017m340N4321J8202m2516k9094K2916K2037j9724l1529J0491M4395N600
543C0742m4839j2805L4599K340m1396o347M1869J7505k1185m697J6823R55k1614
556h050j3845J3765K0806k644j0916J7295K1625k7825l8581J6064L1825k3614
568d095l1053L3020M4321k0878n0503J49L6085J050m4372j0554O1142M5195m6868
581A2639n3576L9302N1795m5993o6659L6509Q0425n029o4947q343N5677J1168
593D2968o7183m5582N6253O6715l4164n9627L0929O2662l2482q0385N208O7296
$$ y = [16802, 16994, 2803, 869, 19834, 15921, -17603, -21864, 14238, 21486, -15310, -17174, 20149, 21572, -20048, -35757, -8721, 12107, -4376, -26168, -8119, 31327, 24425, -25941, -30824, 18546, 27033, -20017, -24357, 29964, 48166, 5650, -23444, -528, 21509, 1785, -29744, -19253, 25142, 30742, -14097, -26902, 7697, 10037, -31359, -37706, 4163, 21668, 483, -4214, 12609, 13564, -8050, -21895, -8130, 12676, 10032, -884, 16411, 38036, 10211, -28370, -12306, 19519, -4095, -35148, -2128, 42193, 21315, -29188, -29039, 7046, 8096, -36276, -46830, 14312, 59507, 12639, -40937, -1635, 50160, 4167, -62492, -25983, 54442, 49413, -15534, -23877, 31800, 42968, -24215, -69797, -13544, 53171, 19007, -40620, -9691, 52971, 20489, -59896, -54688, 12608]
605A2608J1941m2078m847M9932K0974m4419m5856K2501M2695j6188l0711L2213
617H765M4178k3202m7413M135K0315k0229k2457K3989L6174k083k5962l278J8438
630A1370j1009m1333p17N3008K2772l9087j0135M8355J0086o5705l3577M9809
642f163M3512k8886l2215L5862M9346k6738p6245r459O4544J4055o2041r482P7994
655C4084L1282p2847n2893M3143M3829l7172m2429L9079P2010n456o8906j5473
667c1749N3336P521o5335j6815P4152M0481m8754l6933L5367K4379m7843m2384
679e4577K8408N1850k129l8364N351M3612j2528o4045j0785N7318J8184l8298
691a6003j236N4067J3212n3247l1558K8014K5997k1982k4190L2224M7777j9563
$$ y = [12608, 24549, -17529, -22376, 27556, 48530, 4111, -41745, -19244, 23451, 7263, -23448, 8765, 52943, 29741, -17672, -13537, 6778, -13451, -35908, -11919, 24255, 22172, -3790, -7068, 11370, 361, -40972, -41689, 11319, 34091, -4996, -15131, 33224, 43310, -22395, -55972, -6163, 37349, 8463, -23752, 12110, 61456, 34718, -41527, -50986, 13558, 27613, -34428, -43910, 34084, 65366, -7481, -60374, -17231, 26598, -10574, -53003, -13924, 58086, 52630, -16276, -31749, 21587, 29108, -36227, -53042, 21110, 61591, 12837, -24096, 11271, 35650, -12193, -54577, -26169, 25681, 23552, -14812, -9461, 34151, 21623, -42422, -53207, 4111, 22295, -16003, -17239, 36828, 50040, -3207, -34765, -6751, 19246, -2736, -26926, 5298, 53075, 33512]
703C3512n8252k189M1774r688n1023J1393O3050J2434m6766j5844K9618P486l9552
716b4047k3099L6293M4826j0712l6550J5301L5923k5778n2403J0614N1314K684
728B4366l4267P778L8497o364m9309j9770K9598K1411k3887j8349L9342L6705
740D5751l5891n0454K1603M0056k3035l9677L0056N6516o495m9555r254L7551
752A7172P683m5590k2274M8385M5859l3947m5861K5677M1089l4122n4556J7127
764c3358N5759K878m1045m468L6295J1990m2014l0176L0745M0991j7210k9416
776a9029K2426L6159j9471m1520L037K8114n14j7817L044K1697N907k0145j7201
789a5313O882Q195j2637o795K2706J4348j7254j1298J6545K104k3711p214K5324
$$ y = [33512, -24740, -26929, 14845, 5157, -45866, -34473, 28577, 41011, -5755, -21599, 8019, 15505, -24047, -47146, -10853, 33973, 23261, -13289, 2012, 37935, 12157, -40246, -29632, 21682, 24366, -9901, -2123, 36374, 30010, -19299, -39069, -9471, 11940, -11947, -30296, 9046, 45751, 9860, -40594, -18991, 21065, -1970, -41647, -11591, 44925, 38430, -11125, -20379, 17172, 24855, -20735, -43009, 5376, 51235, 17288, -28573, -2896, 38193, 4071, -50485, -33358, 22401, 25279, -15766, -20234, 16061, 28051, -13963, -44139, -13394, 27597, 10387, -19029, 3397, 39556, 20085, -21435, -18398, 9716, 9202, -8615, -5571, 16126, 22033, 1888, -15313, -8431, -236, -12873, -19668, 3038, 17386, 132, -11166, 5379, 7483, -16228, -23442, 1882]
802A882J6249j2458j0911J4251J5485j6407k9619L393L5422K793l3516k663L8391
815B2292P078m4632j9330L0473K0559k2439k1557K0525L3364p853l9251n283L6171
828A0117J1688l5634j0983L8829K1215k9639k3504J6689J9099j1359k2337M442
840a1377K3989P476k2592j3785J7598R799j9927j3223J7391J4624r799p029O370
853d85M671n284m498J783M433M177n10L89M042j68j0997O53Q910n555j0087P224
869a302J3181q731j2842L700R307m298r186j65R963Q112p284j1774P040J6312
883A2033q492j6751Q658J8704l210j5030K181J1207M93q749q179N401J0380l348
897E298j3548J802J2573l257j4243J582J1195r65o958K075N712m00o95j241j059
$$ y = [1882, 18131, 5673, -5238, 9013, 24498, 8091, -21528, -18135, 17287, 20080, -13436, -16099, 22292, 29370, -15262, -34592, -4119, 16440, -5999, -27556, -7031, 26333, 18480, -20771, -26054, 10117, 21805, -13829, -24812, 14017, 35232, 5593, -17911, -1222, 17877, 6518, -15819, -11377, 12612, 20088, -2504, -16289, 1309, 11108, -8819, -22042, -4651, 9973, 174, -6855, -485, 4186, -1098, -5596, -3813, 620, 4797, 4287, 4676, 8718, 8550, -2447, -1794, 7116, 1561, -8526, -1302, 11879, 3148, -9694, -5994, 3313, -985, -10171, -10336, -373, 7739, 455, -11319, -4279, 12033, 3541, -13210, -4552, 14152, 10942, -4088, -1907, 9300, 9793, 1044, -7135, -1734, 8646, 5298, -8250, -6448, 6125, 2868, -11375, -9793, 1402, 437, -6521, -4446, 1266, 866, 171, -1070, -2129]
912b129M910K263o127J377P694l071o675M828M149p457l686N558J976n356k683
927d429K598J95N79k635l292M367O068m075o363N951P795m860o748N572M931j175
943D479j996j006J26L946Q97q091k067P823N72r092k16M378l15l303J323k920
959e462J691N338j933o209K694P895j551n789J740O162L61j801j604j936N510
974E106J996o835n569P373N258q142o686N190L061j812l133k040K467N704l05
989A633q680J099J0578J56q427N31P785Q32l508j035k60L268K648n216o924O695
1005A175O834q035p577N195N145l705m112n15K250L729P29o134p73Q699J070q062
1021d087M30P488J445l195n28p39J290L544k896o366L141O461m822o830L049L988
$$ y = [-2129, 2781, 5044, -1083, 294, 7988, 4917, -1758, 3070, 7219, -238, -3924, 1634, 3610, -1746, -4429, -1831, -1636, -1057, -3692, -6984, -2617, 3451, -624, -6987, -1036, 6759, 1899, -4849, 723, 5654, 4479, 2483, 1477, 1603, 5549, 6446, -1645, -3712, 4111, 4683, -4409, -4625, -247, -562, -3865, -2542, -5462, -3771, 1567, -366, -6575, -3881, 4014, 2463, -3326, -1586, 4576, 4937, 3136, 1532, -404, 5106, 7102, 267, -5302, 2071, 7329, -813, -7499, -2309, 752, -1060, -4193, -6233, -3766, 1938, 1633, -7047, -5948, 4630, 4786, -3641, -3110, 4675, 5507, 1999, 964, 704, 3972, 6620, 1404, -5520, 1175, 8009, -26, -7603, -2408, 2737, -968, -5080, -5595, -3345, 384, 1113, -5021, -5794, 2905, 3975, -4087, -3657, 3831, 5276, 2081, 1553, 814, 2104, 5648, 2752, -3614, -473, 5988, 1166, -5664, -2615, 1373]
1037A373k875j706j402Q62K359L885m962m607P366O008p224m113N719N148k013
1052C818k268k052K714N341m037q137K270R470l195r452J203P326j819o325R0
1067e053K431K455n0l462j098O774K675p117j686P134J498m359O88K830q69p51
1083B040N11o22l231J680J802k212q31J91j770Q96J362m527l150P897L873q465
1099d556j574R225L201p374m985N552O738j242o901j46R216L829j1359r193J1058
1114A489Q169j0031q620Q959P581n903r802J155O541L473o789n532R745Q022p457
1129A000r000P445P472o045n957P137M904k263m102M45K106r77m230k083L865
1144b83L975m586k548O295j09j0465j597J1151N66q418O74J0316K863j0120m291
$$ y = [1373, -1502, -3208, -4610, -3748, -1389, 2496, -2466, -7073, 293, 6301, -923, -5036, 683, 5831, 3818, 1550, -502, 2212, 7553, 3516, -4621, -2351, 7119, 3924, -5528, -4325, 3001, 1182, -5143, -5053, -2622, -167, -217, -3679, -4777, 1997, 4672, -2445, -4131, 3003, 4501, 142, 830, 3660, 2791, 2040, 2551, 1929, -1302, 378, 2180, -32, -863, -672, -2442, -1546, -184, -4711, -7861, 36, 3909, -4556, -6130, 3095, 6296, -1078, -6063, -511, 6227, 4985, -1916, -2062, 7154, 10983, -376, -9569, 1489, 9658, -373, -8993, -34, 7547, 1644, -8158, -7003, -462, 3011, -3778, -9310, 435, 8457, 1000, -8000, -555, 6917, 872, -5085, 2052, 6956, 4693, 591, 1036, 3142, 2165, -2065, -4148, -283, 3692, -894, -3442, 2853, 2744, -7721, -9318, 1833, 2399, -6019, -5345, 4971, 7834, -2286, -6577]
1159f577O629P122m187r485N701J4146j985j7872j683J5925o44j6946j319J5865
1173D690P149j2210j0433O913J0654o548j4377K892K0595J239j6447k514J7068
1186H671J462j6836l947J3890P719o941p068N803P666o748j2613J484J1489m25
1200C606j1445L039J4025k619j5805L43J0301j556q674K633J2197M812r231q101
1214f475P354P122q730j0701J0997J6480p008j5667M921J3403q298j7036J964
1227a1674J7475K779j1268n376J0426Q580j4784j4876J1144J7259o785j3100R805
1240c95J5294o218j8141J61J3052L177r763j680J2160P319j2515j2576O414R800
1254F089j0219r095J1502J4911r237j2491M699Q885p052j0786M606J5013L694
$$ y = [-6577, 52, 7174, 2987, -6498, -797, 13349, 11364, -6508, -8191, 7734, 7090, -9856, -11175, 4690, 11839, -371, -10804, -3891, 6763, 215, -14162, -11270, 9325, 10564, -5883, -8397, 8671, 10133, -6703, -10650, 3240, 10959, 4018, -3050, 2753, 10419, 3671, -8942, -7458, 4031, 3606, -7839, -4800, 9225, 6606, -9199, -8856, 1445, -111, -8785, -6152, 6045, 10857, 1626, -6475, 879, 8001, -729, -11430, -433, 16047, 9039, -6628, -1707, 11696, 3398, -13638, -11674, 5801, 8580, -2688, -8064, 2362, 10942, -3842, -18718, -7574, 9685, 2900, -10200, -395, 14899, 8681, -9460, -9299, 3753, 6930, -2833, -4513, 7647, 14966, 2451, -10125, -3711, 6089, -4130, -13225, -1723, 13188, 3951, -8540, -3841, 5044, -2008, -12794, -8188, 6825, 10519]
1267A0519j1442m446J3397L787j6813j0961J6817J4061j2540r841J1847J1206
1279A5591j2804j7261L817J5306R80j3757q51J8111N760j9666j1993J4345J1032
1292H610j3621q264J4712J5578r385j4938J974J1210j618j2136j21J5798O851
1305A4650j3535q285J0098M605j5031p199J4118Q716p663n237O802M760q855r625
1319a1681L750J1947Q23r021K776J3682j604j8041k383J4714J610j2643J80J5098
1333I207M781j3452j0431O218R591p981j2075P879J8944k108j9633j536J6618
1346F022L70j7125j736J6529R266j0395r069P174R266o783j5072L647J6870J778
1360A0742j4716p91J3042o12j4954m598J0917M952o039l564O840O438n889r782
$$ y = [10519, -923, -5369, 8028, 11815, -4998, -15959, 858, 14919, 2379, -7462, 4385, 15591, 2787, -14474, -10657, 4649, 5629, -8128, -8979, 9132, 14892, -4774, -16767, -2422, 8610, -5011, -13275, 1437, 17015, 7630, -7308, -5334, 5876, 4258, -7878, -7999, 7799, 14650, 1115, -7170, 2928, 7533, -7498, -14697, -579, 8137, 474, -4763, 2039, 6799, -2056, -11681, -7931, 4016, 4839, -4182, -1406, 12276, 10672, -7369, -9752, 4962, 6572, -6071, -5891, 9207, 13988, 536, -9895, -3677, 5914, -2067, -14142, -6263, 12681, 10573, -9060, -10596, 6022, 6392, -10733, -12469, 4060, 13326, 2931, -6138, 1036, 10302, 3519, -11553, -7906, 8964, 10742, -3974, -4765, 8277, 7665, -7289, -11887, -970, 3982, -2057, -5621, 1219, 7657, 1768, -8014]
1374h014R40R990j153q421N483J1243l360j0273R43P348l598o774L275Q313J001
1389F943q011k385N278K649q716q141R061J0964o767q775O249J0898p366j1386
1403i505L123J0925J394p860j720R325N164j0082r437O636J1156o577r980O454
1417i84J0083l998j1754J694P035n12o351j393P533L992m438p307M975N303m946
1432a068n344O270P441m482l928K588L626l565m996J069M894J192n387j511N923
1447B722R58p059m589P224L878o513k653P718L611n334n173L433L995J149n538
1462b171p64P452K474o368m589N879L656o475l799O247L107m488l091J95K888
1477A53l65l188j078M463K382l880k062M217K330n556M82L038J924l316J362K150
$$ y = [-8014, -7074, 2916, 1763, -6658, -1175, 10068, 6708, -3565, -2622, 4726, 1128, -5646, -2371, 5942, 6943, -1068, -3453, 1825, 4474, -4242, -12383, -3322, 7642, 875, -7900, -1651, 9247, 1881, -9505, -6382, 4543, 5937, -1923, -3643, 5682, 10846, 764, -8673, -2037, 9119, 2542, -7438, -984, 9099, 5101, -6653, -4959, 2076, 1564, -4787, -6180, 1353, 5345, 907, -6400, -1425, 3878, -1068, -6412, -142, 7299, 2817, -1111, 1477, 5103, 1538, -3458, -2389, 2505, 3697, -1690, -3201, 2722, 3680, -3379, -7968, -744, 3134, -3379, -6032, 1686, 5297, -37, -5210, -1777, 2218, 3367, -2171, -2935, 4517, 6991, 623, -3966, 1913, 5569, -906, -4705, 1542, 4649, 161, -2930, -2735, 153, -212, -3400, -4478, -15, 2367, -1513, -3575, 642, 2972, -2584, -2102, 936, 2860, -456, 906, 3056]
1493C056p48j453n68m51R09p28k224R45L750k065n255K868M060j054n974K448
1509b484M963p65k387j961L223K678j009m359O98N688N16o226j03M331n1m414
1525a662l88K510R21n97k976J94J960J965l954k657M424J320j790k577L149J885
1541A727j188l90m22P6J897Q15k671l05K738l78j188q80J099j937K66J390k451
1558a802l31K603n57k925O67L043l60j600N7J583K09N7o3j644K649K455l412j874
1576a245K572J118k254r01J525k69j52j079j635n8L535p72m122J350L976l96l420
1593b227P94J929k20N36j029K33J362J564k069j135N46K417j766j678J093M54
1609H04r23M28j093q87J444J162k999L8J837m35n85l24J792K80j185J775q68m96
$$ y = [3056, 2308, 855, 287, -164, 745, 17, -2207, -1262, 2488, 423, -4832, -1964, 2096, 1042, -4932, -2484, 2479, 1714, -673, -2634, 589, 3267, 2258, -2101, -1403, 4285, 4801, -1425, -1528, 2803, 2752, -1662, -2050, 460, 1381, 784, -2192, -1998, -38, 1927, -2027, -4684, -260, 1060, -730, -3307, -158, 1727, 539, 149, -273, -197, 1700, 2515, -156, -461, 2277, 1899, 711, -169, 930, -1007, -741, 649, -1802, -2133, 470, -87, -3012, -2345, 698, 338, -1262, -1205, 378, 587, 644, 581, -1063, 1586, 4041, 629, -1245, 1327, 2445, 191, -710, 815, 546, 394, -685, -2320, -2378, 1157, 385, -3737, -2387, 1589, 1193, -2227, -1433, 496, 276, 812, -217, 16, 1378, 2942, 873, -262, 284, 2701, 935, -743, 350, 804, -119, 309, -784, -1671, -227, 935, -2064, -2026, -189, -624, -1209, -1533, 259, 539, -646, 1129, 261, -235]
1627b35J955k17j452k61L339j537j896k50J879r63n57l22j738J920Q23j179k556
1644c247K468J201j892J38J380O40n45O36m98o97K269Q74k412k27J969n51j248
1661B58J81%p82M20p9r70j243K173L08k660N64J162K10l18K92r1l73K388j228
1680B12j774K199L170k729k223J921J128j304j795j91J411R61j53k195j556M071
1696A153j039l018K32M303j195k473M24K259O04j933j135P98K079K142l249j55
1712b03K490J70l077j93K590o68j866N43O88j62j810J443p83m9l00k51Q89J301
$$ y = [-235, 1720, 1503, 51, -210, 3129, 1592, -304, -554, 1325, 362, -195, -517, -2255, -335, 488, -691, -3247, -779, 422, -1470, -1332, 48, 688, 143, 779, 281, -416, 1853, 2727, 315, 88, 2057, 1506, 258, 439, 439, -343, 77, -2, -972, -2215, -42, 266, -2394, -1830, -668, -458, -776, -484, -575, -948, 1440, 212, -1562, 637, 3807, 1078, -1145, 776, 1904, 600, -1195, -1386, 25, 986, 833, -1362, -2918, 1153, 114, -2904, -2672, 1631, 436, -2037, -1613, 646, 1250, -683, -1818, -1020, 1059, 3201, -48, -203, 2287, 2457, -620, -813, 1777, 1109, -757, -214, 474, 312, -1498, -55, -838, -887, -1187, -1438, -549, 752]
$$ [...]
8191E76
##END NTUPLES=NMR FID
##END=
