##TITLE=1H ikalashn
E1b 1911
20.11.2024
##JCAMPDX= 6.0         $$ Bruker NMR JCAMP-DX V2.0
##DATA TYPE= NMR FID
##DATA CLASS= NTUPLES
##ORIGIN= UXNMR, Bruker Analytische Messtechnik GmbH
##OWNER= root
$$ TOPSPIN		Version 1.3
$$ 2024-11-20 10:20:10.703 +0400  Irina@DPX200
$$ Compression mode = diff/dup
##.OBSERVE FREQUENCY= 200.131300845
##.OBSERVE NUCLEUS= ^1H
##.DELAY= (6, 6)
##.ACQUISITION MODE= SIMULTANEOUS
##.ACQUISITION SCHEME= undefined
##.AVERAGES= 16
##.DIGITISER RES= 18
##SPECTROMETER/DATA SYSTEM= spect
##.PULSE SEQUENCE= zg
##.SOLVENT NAME= DMSO
##.SHIFT REFERENCE= INTERNAL, DMSO, 1, 17.49637
##AUDIT TRAIL= $$ (NUMBER, WHEN, WHO, WHERE, WHAT)
$$ ##TITLE= Audit trail, TOPSPIN		Version 1.3
$$ ##JCAMPDX= 5.01
$$ ##ORIGIN= Bruker BioSpin GmbH
$$ ##OWNER= Irina
$$ $$ F:/spectra/data/iren/nmr/1H/4/audita.txt
$$ ##AUDIT TRAIL=  $$ (NUMBER, WHEN, WHO, WHERE, VERSION, WHAT)
(   1,<2024-11-20 10:19:54.484 +0400>,<Irina>,<DPX200>,<TOPSPIN 1.3>,
      <created by zg
	started at 2024-11-20 10:18:46.343 +0400,
	POWCHK disabled, PULCHK disabled
       configuration hash MD5:
       BE 6D 3F 07 2A EA 11 49 91 17 2B D3 AF B3 58 0D
       data hash MD5: 16K
       77 92 52 A9 12 D4 67 A0 DA 48 28 5E 5F 42 54 C9>)
$$ ##END=
$$ 
$$ $$ hash MD5
$$ $$ CE A3 8F 48 23 F7 EA 50 AE 50 5C 39 46 63 8E 98
##$RELAX= 
##$RELAX= 
##$RELAX= 
##$RELAX= 
##$RELAX= 
##$RELAX= 
##$RELAX= 
##$RELAX= 
##$RELAX= 
$$ Bruker specific parameters
$$ --------------------------
##$DU= <F:/spectra>
##$EXPNO= 4
##$NAME= <1H>
##$PROCNO= 1
##$TYPE= <nmr>
##$USER= <iren>
##$AMP= (0..31)
100 100 100 100 100 100 100 100 100 100 100 100 100 100 100 100 100 100 
100 100 100 100 100 100 100 100 100 100 100 100 100 100 
##$ANAVPT= -1
##$AQSEQ= 0
##$AQ_mod= 1
##$AUNM= <au_zg>
##$AUTOPOS= <>
##$BF1= 200.13
##$BF2= 200.13
##$BF3= 200.13
##$BF4= 200.13
##$BF5= 200.13
##$BF6= 200.13
##$BF7= 200.13
##$BF8= 200.13
##$BYTORDA= 1
##$CFDGTYP= 0
##$CFRGTYP= 5
##$CHEMSTR= <none>
##$CNST= (0..63)
1 1 145 1 1 1 1 1 1 1 1 1 1 1 1 1 1 1 1 1 1 1 1 1 1 1 1 1 1 1 1 1 1 1 
1 1 1 1 1 1 1 1 1 1 1 1 1 1 1 1 1 1 1 1 1 1 1 1 1 1 1 1 1 1 
##$CPDPRG= <>
##$CPDPRG1= <>
##$CPDPRG2= <>
##$CPDPRG3= <>
##$CPDPRG4= <mlev>
##$CPDPRG5= <mlev>
##$CPDPRG6= <mlev>
##$CPDPRG7= <mlev>
##$CPDPRG8= <mlev>
##$CPDPRGB= <>
##$CPDPRGT= <>
##$D= (0..63)
0 2 0 0 0 0 0 0 0 0.06 0 0.03 0 0 0 0 0.0002 0 0 0 0 0 0 0 0 0 0 0 0 0 
0 0 0 0 0 0 0 0 0 0 0 0 0 0 0 0 0 0 0 0 0 0 0 0 0 0 0 0 0 0 0 0 0 0 
##$DATE= 1732083591
##$DBL= (0..7)
120 120 120 120 120 120 120 120 
##$DBP= (0..7)
150 150 150 150 150 150 150 150 
##$DBP07= 0
##$DBPNAM0= <>
##$DBPNAM1= <>
##$DBPNAM2= <>
##$DBPNAM3= <>
##$DBPNAM4= <>
##$DBPNAM5= <>
##$DBPNAM6= <>
##$DBPNAM7= <>
##$DBPOAL= (0..7)
0.5 0.5 0.5 0.5 0.5 0.5 0.5 0.5 
##$DBPOFFS= (0..7)
0 0 0 0 0 0 0 0 
##$DE= 6
##$DECBNUC= <off>
##$DECIM= 32
##$DECNUC= <off>
##$DECSTAT= 4
##$DIGMOD= 1
##$DIGTYP= 9
##$DL= (0..7)
0 120 120 120 120 120 120 120 
##$DP= (0..7)
150 150 150 150 150 150 150 150 
##$DP07= 0
##$DPNAME0= <>
$$ [...]
##$SW= 21.9926040160658
##$SWIBOX= (0..15)
0 0 2 0 0 0 0 0 0 0 0 0 0 0 0 0 
##$SW_h= 4401.40845070422
##$TD= 16384
##$TD0= 1
##$TE= 300
##$TE2= 300
##$TE3= 300
##$TEG= 300
##$TL= (0..7)
0 120 120 120 120 120 120 120 
##$TP= (0..7)
150 150 150 150 150 150 150 150 
##$TP07= 0
##$TPNAME0= <>
##$TPNAME1= <>
##$TPNAME2= <>
##$TPNAME3= <>
##$TPNAME4= <>
##$TPNAME5= <>
##$TPNAME6= <>
##$TPNAME7= <>
##$TPOAL= (0..7)
0.5 0.5 0.5 0.5 0.5 0.5 0.5 0.5 
##$TPOFFS= (0..7)
0 0 0 0 0 0 0 0 
##$TUNHIN= 0
##$TUNHOUT= 0
##$TUNXOUT= 0
##$USERA1= <user>
##$USERA2= <user>
##$USERA3= <user>
##$USERA4= <user>
##$USERA5= <user>
##$V9= 5
##$VALIST= <valist>
##$VCLIST= <CCCCCCCCCCCCCCC>
##$VD= 0
##$VDLIST= <DDDDDDDDDDDDDDD>
##$VPLIST= <PPPPPPPPPPPPPPP>
##$VTLIST= <TTTTTTTTTTTTTTT>
##$WBST= 1024
##$WBSW= 25
##$XGAIN= (0..3)
0 0 0 0 
##$XL= 0
##$YL= 0
##$YMAX_a= 62545
##$YMIN_a= -87143
##$ZGOPTNS= <>
##$ZL1= 120
##$ZL2= 120
##$ZL3= 120
##$ZL4= 120
##$ABSF1= 10
##$ABSF2= 0
##$ABSG= 5
##$ABSL= 3
##$ALPHA= 0
##$AQORDER= 0
##$ASSFAC= 0
##$ASSFACI= 0
##$ASSFACX= 0
##$ASSWID= 0
##$AUNMP= <proc_1d>
##$AXLEFT= 0
##$AXRIGHT= 0
##$AXTYPE= 0
##$AXUNIT= <>
##$AZFE= 0.1
##$AZFW= 0.1
##$BCFW= 1
##$BC_mod= 2
##$BYTORDP= 1
##$COROFFS= 0
##$CY= 7568.61572265625
##$DATMOD= 1
##$DC= 2
##$DFILT= <>
##$DTYPP= 0
##$F1P= 17.9538593292236
##$F2P= -4.03888763876832
##$FCOR= 0.5
##$FTSIZE= 32768
##$FT_mod= 4
##$GAMMA= 1
##$GB= 1
##$INTBC= 1
##$INTSCL= 1
##$ISEN= 128
##$LB= 0.03
##$LEV0= 0
##$LPBIN= 0
##$MAXI= 945.577
##$MC2= 0
##$MEAN= 0
##$ME_mod= 0
##$MI= -402.1523
##$NCOEF= 0
##$NC_proc= 0
##$NLEV= 6
##$NOISF1= 8.587773
##$NOISF2= 6.764455
##$NSP= 1
##$NTH_PI= 0
##$NZP= 0
##$OFFSET= 17.49637
##$PC= 1
##$PHC0= 201.0145
##$PHC1= 11.39667
##$PH_mod= 0
##$PKNL= yes
##$PPARMOD= 0
##$PPDIAG= 0
##$PPIPTYP= 0
##$PPMPNUM= 100
##$PPRESOL= 1
##$PSCAL= 0
##$PSIGN= 0
##$REVERSE= no
##$SF= 200.13
##$SI= 32768
##$SIGF1= 18.5376
##$SIGF2= -6.396296
##$SINO= 400
##$SIOLD= 32768
##$SREGLST= <1H.CDCl3>
##$SSB= 3
##$STSI= 0
##$STSR= 0
##$SW_p= 4401.40845070422
##$SYMM= 0
##$S_DEV= 0
##$TDeff= 0
##$TDoff= 0
##$TI= <>
##$TILT= no
##$TM1= 0
##$TM2= 0
##$TOPLEV= 0
##$USERP1= <user>
##$USERP2= <user>
##$USERP3= <user>
##$USERP4= <user>
##$USERP5= <user>
##$WDW= 1
##$XDIM= 8192
##$YMAX_p= 0
##$YMIN_p= 0
$$ End of Bruker specific parameters
$$ ---------------------------------
##NTUPLES= NMR FID
##VAR_NAME=  TIME,          FID/REAL,        FID/IMAG
##SYMBOL=    X,             R,               I
##VAR_TYPE=  INDEPENDENT,   DEPENDENT,       DEPENDENT
##VAR_FORM=  AFFN,          ASDF,            ASDF
##VAR_DIM=   8192,          8192,            8192
##UNITS=     SECONDS,       ARBITRARY UNITS, ARBITRARY UNITS
##FACTOR=    0.0002272,     1,               1
##FIRST=     0,             0,               0
##LAST=      1.8609952,     -5,              45
##MIN=       0,             -87143,          -87143
##MAX=       1.8609952,     62545,           62545
$$ Real data points
##PAGE= N=1
##DATA TABLE= (X++(R..R)), XYDATA
$$ plain form
0 0 0 0 0 0 0 0 0 0 0 0 0 0 0 0 0 0 0 0 0 -1 16 -16 16 -16 16 -16 30 -32 32 -33 48 -48 49 -64 65 -80 90 -97 113
39 113 -128 141 -154 172 -191 209 -227 255 -277 306 -338 371 -412 453 -499 555 -612 682 -760
58 -760 850 -957 1087 -1248 1453 -1720 2088 -2634 3517 -5203 9569 -44693 -87143 13783
72 13783 32862 -4186 -6223 50273 38587 -32304 -47559 25192 54883 6030 -19157 31054
84 31054 47599 -17011 -61322 -12618 30774 -8073 -50366 -7753 46414 20890 -31351 -17196
96 -17196 17948 -8900 -51314 -13790 58286 52252 -14919 -31227 7246 8726 -29954 -17609 47527
109 47527 62545 3032 -34298 -8767 3981 -30941 -38667 14164 43405 -2299 -44560 -15807
121 -15807 23437 3351 -27919 -2795 36749 21655 -12346 3025 35595 13157 -36010 -31298
$$ packed form
0@%%%%%%%%%%%%%%%%%%%jJ7l2L2l2L2l2M6o2O4o5Q1r6R7j13J29j45J70j87K10
39A13k41K69k95L26l63M00m36M82n32N83o44P09p83Q65r52J054j167J294j442
58g60J610j807K044k335K701l173L808m722O151q720J4772n4262m2450J00926
72A3783J9079l7048k037N6496j1686p0891j5255P2751K9691m8853k5187N0211
84C1054J6545o4610m4311M8704M3392l8847m2293M2613N4167k5524n2241J4155
96a7196L5144k6848m2414L7524P2076o034o7171j6308L8473J480l8680J2345O5136
109D7527J5018n9513l7330K5531J2748l4922p726N2831K9241m5704m2261K8753
121a5807L9244k0086l1270K5124L9544j5094l4001J5371L2570k2438m9167M712
$$ plain form
133 -31298 14005 21078 -8983 -6777 26443 19217 -31587 -47184 -6069 23012 7635 -1979 17297
146 17297 15564 -25814 -44630 -6160 31521 18740 -5054 6972 23510 3029 -22924 -8271
158 -8271 19871 12015 -13832 -9688 11950 5824 -18677 -16615 5759 3423 -20002 -16905 16142
171 16142 29723 7713 -10422 -4235 -772 -11909 -8821 17773 30387 8053 -16093 -12477 -1099
184 -1099 -6077 -10088 6909 22847 9842 -14603 -17403 -3947 -615 -5527 540 10704 4239 -10328
198 -10328 -7092 10206 13370 -1312 -8620 327 7031 2831 1752 8190 6508 -7883 -16659 -8951
212 -8951 1781 3416 3293 7565 5669 -7830 -17627 -9525 6592 13097 8971 3732 -1184 -7332 -8816
227 -8816 -615 8979 8601 1101 -2882 -1449 -968 -2116 -462 2665 1244 -3996 -6278 -3155 1232 3801
$$ packed form
133c1298M5303P073l0061K206L3220p226n0804j5597M1115K9081j5377r614J9276
146A7297j733m1378j8816L8470L7681j2781k3794J2026J6538k0481k5953J4653
158h271K8142p856k5847M144K1638o126k4501K062K2374k336k3425L097L3047
171A6142J3581k2010j8135O187L463j1137L088K6594J2614k2334k4146L616J1378
184a099m978m011J6997J5938j3005k4445k800J3456L332m912O067J0164o465j4567
198a0328L236J7298L164j4682p308Q947O704m200j079O438j682j4391q776P708
212h951J0732J635j23M272j896j3499r797Q102J6117O505m126n239m916o148j484
227h816Q201R594l78p500l983J433M81j148J654L127j421n240k282L123M387K569
$$ plain form
243 3801 4229 1372 -4682 -8499 -4294 5294 11182 8948 1705 -5348 -8353 -5492 1945 7753 6862 1376
259 1376 -3459 -5805 -6391 -3970 2057 6754 4848 -1497 -5673 -5030 -1825 2382 6223 5743 -918 -7193
275 -7193 -5122 2917 7309 4653 179 -2434 -4432 -4969 -874 5391 6355 762 -4344 -4780 -3786 -2947
291 -2947 1017 7074 7478 -542 -8014 -6647 79 4567 5410 4798 1190 -5178 -7665 -1723 5966 6209
307 6209 588 -2764 -2415 -2850 -3359 359 5644 5084 -1304 -5654 -4121 -971 1196 4037 6193 2346
323 2346 -5672 -8323 -1992 5619 6399 2356 -964 -3099 -4974 -3618 2118 6455 4036 -1712 -4128
338 -4128 -2911 -1893 -586 3137 6012 2815 -4160 -6878 -2869 2587 4810 4109 1607 -2824 -6325
353 -6325 -4239 2467 6633 4143 -1088 -3579 -3288 -2197 38 3546 4993 1831 -3128 -4947 -2880
$$ packed form
243C801M28k857o054l817M205R588N888k234p243p053l005K861P437N808q91n486
259A376m835k346n86K421O027M697j906o345m176O43L205M207L841m80o661o275
275g193K071Q039M392k656m474k613j998n37M095O265R64n593n106m36R94Q39
291b947L964O057M04q020p472J367O726M488Q43o12l608o368k487N942P689K43
307F209n621l352L49m35n09L718N285n60o388m350J533L150K167K841K156l847
323B346q018k651O331P611P80m043l320k135j875J356N736M337k419n748k416
338d128J217J018J307L723K875l197o975k718M009N456K223p01k502m431l501
353f325K086O706M166k490n231k491K91J091K235L508J447l162m959j819K067
$$ plain form
368 -2880 431 3117 4505 2960 -1948 -6204 -4979 901 5558 4966 873 -3034 -4546 -3307 499
383 499 4270 4786 1352 -2680 -4069 -2628 -50 2562 3995 2891 -1037 -4779 -4773 -828 3637 4944
399 4944 2531 -1740 -4874 -4462 -393 4157 5296 2176 -2278 -4270 -2968 144 2910 3954 2474
414 2474 -912 -3818 -3903 -1207 2298 4115 3054 -451 -4170 -5068 -1904 2961 5250 3260 -1114 -4167
430 -4167 -4090 -1003 2918 4708 2906 -900 -3501 -3208 -882 1654 3234 2976 228 -3368 -4465 -1963
446 -1963 1939 3895 3034 130 -3320 -4923 -2501 2727 5737 3635 -958 -3660 -3371 -1547 1293 4106
462 4106 4390 661 -3721 -4330 -1655 848 1990 2926 2361 -1458 -5200 -3872 1504 4537 2589 -400
478 -400 -1593 -2307 -2643 138 4708 4867 -683 -5008 -3211 532 1365 1582 3435 2913 -2698 -7032 -3864
$$ packed form
368b880L311K686J388j545m908m256J225N880M657n92m093l907j512J239L806
383D99L771N16l434m032j389J441K578K612J433j104l928l742OL945M465J307
399D944k413m271l134M12M069M550J139l120m454j992J302L112K766J044j480
414B474l386k906q5K696L505J817j061l505l719q98L164M865K289j990m374l053
430d167P7L087L921J790j802l806k601K93K326K536J580k58k748l596j097K502
446a963L902J956q61k904l450j603K422N228L010k102m593k702K89J824K840K813
462D106K84l729m382o09K675K503J142R36n65l819l742J328N376L033j948k989
478d00j193p14l36K781M570J59n550m325J797L743Q33K17J853n22n611m334L168
$$ plain form
495 -3864 2631 4396 2123 1232 553 -3479 -6605 -2048 5900 6695 371 -3190 -1082 -248 -2290 -758
511 -758 4374 4296 -2555 -5735 -583 3708 981 -1719 1001 2080 -3385 -6324 522 7838 4838 -2895
527 -2895 -3992 -940 -2223 -3868 2337 9644 5594 -5325 -7629 -906 1976 -1250 283 6624 4954
542 4954 -5355 -8747 -650 4881 309 -2879 2416 4777 -2441 -6380 1524 8079 1254 -7439 -3632
557 -3632 4524 2818 -2615 945 6448 -67 -10396 -7069 5440 8039 524 -1032 4036 534 -9986
572 -9986 -9088 4597 10790 2149 -4276 370 2162 -5586 -7628 3622 10891 2232 -6955 -1680 5916
587 5916 521 -7299 -2183 5947 1011 -7794 -2453 8929 6504 -5443 -6597 2065 2104 -5389 -1912
602 -1912 10641 10355 -4885 -12033 -3184 3136 -1809 -2129 8424 11126 -2598 -12515 -4156 5977
$$ packed form
495c864O495J765k273q91o79m032l126M557P948P95o324l561K108Q34k042J532
511g58N132p8o851l180N152M291k727k700K720J079n465k939O846P316l000p733
527b895j097L052j283j645O205P307m050j0919k304O723K882l226J533O341j670
542D954j0309l392Q097N531m572l188N295K361p218l939P904O555o825q693L807
557c632Q156j706n433L560N503o515j0329L327J2509K599p515j556N068l502j0520
572i986Q98J3685O193q641o425M646J792p748k042J1250P269q659r187N275P596
587E916n395p820N116Q130m936q805N341J1382k425j1947j154Q662L9p493L477
602a912J2553k86j5240p148Q849O320m945l20J0553K702j3724r917Q359J0133
$$ plain form
616 5977 1683 -4344 2501 9146 237 -10769 -5146 6530 3672 -6542 -3489 7407 6000 -4178
630 -4178 -3111 6520 3929 -9129 -9806 4033 9771 829 -4036 2458 2721 -8502 -11340 2783 13324
645 13324 6024 -3549 -576 2752 -5616 -11418 -729 11547 6692 -5059 -4093 3733 649 -7450
659 -7450 -3014 8057 6388 -4544 -4632 5536 5693 -5426 -8434 524 3788 -3380 -3718 7102 10515
674 10515 -1370 -10106 -3879 3393 89 -2096 6093 10509 -534 -12466 -8299 2349 2778 -1519
688 -1519 3085 9184 2652 -8694 -7046 3361 4637 -2590 -2428 4969 4142 -4798 -5877 2538 4371
703 4371 -3804 -6160 2713 7975 2357 -2279 1416 2217 -5710 -9414 -438 8590 5585 -1565 -1472 439
719 439 -4353 -7946 -499 9490 8075 -470 -3049 -311 -2209 -6347 -2620 5665 5720 -1675 -3885 1160
$$ packed form
616E977m294o027O845O645q909j1006N623J1676k858j0214L053J0896j407j0178
630d178J067R631k591j3058o77J3839N738q942m865O494K63j1223k838J4123J0541
645A3324p300r573K973L328q368n802J0689J2276m855j1751R66P826l084q099
659g450M436J1071j669j0932q8J0168J57j1119l008Q958L264p168l38J0820L413
674A0515j1885q736O227P272l304k185Q189M416j1043j1932M167J0648M29m297
688a519M604O099o532j1346J648J0407J276p227J62P397q27q940j079Q415J833
703D371q175k356Q873N262n618m636L695Q01p927l704Q976R028l005p150R3J911
719D39m792l593P447R989j415q545k579K738j898m138L727Q285N5p395k210N045
$$ plain form
735 1160 2469 -2275 -3221 1880 3381 -1380 -2592 2978 5178 -914 -6070 -3450 230 -728 -493 4853
751 4853 7388 965 -6391 -5407 -299 1096 853 3912 5622 95 -6930 -6088 -5 2331 934 1885
767 1885 3963 1253 -3772 -3267 1543 2468 -1067 -1983 1020 1688 -869 -982 1873 1354 -3170 -4325 361
784 361 4061 2928 1179 1287 -509 -4935 -5689 -121 4916 3992 814 -232 -1172 -3893 -4112 897 5390
801 5390 3738 -490 -1545 -618 -1724 -2516 341 3269 1329 -2425 -1805 1629 1874 -543 -630 827 -442
818 -442 -2901 -947 3671 4011 -352 -3009 -1835 -1224 -1975 174 4700 4818 -674 -4472 -2725 -55
834 -55 -75 540 3387 3409 -1480 -4959 -2176 1877 1600 -212 771 1758 -886 -3258 -499 3361 2099 -2022
852 -2022 -2433 283 608 -854 645 3296 1430 -3502 -4174 191 2891 1489 588 1645 310 -3740
$$ packed form
735A160J309m744r46N101J501m761j212N570K200o092n156K620L680r58K35N346
751D853K535o423p356R84N108J395k43L059J710n527p025Q42O083K336j397R51
767A885K078k710n025N05M810R25l535r16L003O68k557j13K855n19m524j155M686
784C61L700j133j749J08j796m426p54N568N037r24l178j046r40k721k19N009M493
801E390j652m228j055R27j106p92K857K928j940l754O20L434K45k417q7J457j269
818d42k459J954M618L40m363k657J174O11p51K149M526J18n492l798J747K670
834e5k0O15K847K2m889l479K783M053k77j812R83R87k644k372K759L860j262m121
852b022m11K716L25j462J499K651j866m932o72M365K700j402r01J057j335m050
$$ plain form
868 -3740 -4206 742 4331 2255 -829 -635 -177 -2173 -2620 1288 4373 1696 -2564 -2374 365 509 -697
885 -697 755 2640 392 -3464 -2661 1648 3020 439 -872 200 -477 -2728 -1705 2659 4065 450
901 450 -2793 -1840 -152 -602 -324 2488 3362 -339 -3856 -2435 1099 1707 487 855 1354 -929 -3408
918 -3408 -1586 2415 3002 136 -1367 -574 -584 -1481 -229 2709 2711 -899 -3101 -1434 771 839 675 1620
936 1620 1180 -1739 -3386 -996 2237 2368 389 -421 -522 -1572 -2039 173 2879 2358 -715 -2278 -1252
953 -1252 -164 36 951 2166 1165 -1774 -2896 -807 1570 1681 735 314 -401 -1875 -1990 380 2672
970 2672 1989 -420 -1571 -1252 -799 -199 1255 2347 1015 -1636 -2510 -861 958 1371 1178 817 -416
987 -416 -2046 -1964 278 2225 1806 39 -1059 -1327 -1288 -441 1319 2313 977 -1365 -2152 -1039 315 1116
$$ packed form
868c740m66M948L589k076l084J94M58j996m47L908L085k677m260J90K739J44j206
885f97J452J885k248l856Q03M309J372k581j311J072o77k251J023M364J406l615
901D50l243R53J688m50K78K812Q74l701l517J421L534O08j220L68M99k283k479
918c408J822M001N87k866j503P93j0q97J252K938Kl610k202J667K205O8j64R45
936A620m40k919j647K390L233J31j979q10j01j050m67K212K706n21l073j563J026
953a252J088K00R15J215j001k939j122K089K377J11r46m21p15j474j15K370K292
970B672o83k409j151L19M53O00J454J092j332k651q74J649J819M13j93l61j233
987d16j630Q2K242J947m19j767j098k68L9Q47J760R94j336k342p87J113J354Q01
$$ plain form
1005 1116 1503 1147 -370 -2107 -1927 139 1778 1660 465 -587 -1358 -1585 -542 1387 2237 985 -1011
1022 -1011 -1775 -1167 -160 902 1699 1382 -399 -2015 -1767 -4 1380 1589 949 -137 -1453 -1930 -671
1039 -671 1314 2029 945 -551 -1319 -1453 -750 717 1941 1498 -390 -1768 -1446 -290 719 1376 1383 173
1057 173 -1594 -1968 -497 1220 1591 908 -14 -1080 -1848 -1101 924 2233 1354 -455 -1419 -1356 -872 170
1075 170 1691 2094 335 -1743 -1854 -434 678 948 1269 926 -701 -2202 -1340 981 1850 740 -293
1092 -293 -483 -958 -1400 -152 1981 2035 -326 -2051 -1318 -109 270 765 1856 1363 -1356 -2972 -1240
1109 -1240 1292 1659 683 633 358 -1579 -2631 -518 2418 2138 -289 -1102 -231 -504 -1257 47 2297
1126 2297 1556 -1504 -2349 -19 1435 420 -58 1095 528 -2092 -2513 735 3135 1437 -1063 -973 -312
$$ packed form
1005A116L87l56j517j737J80K066J639j18j195j052p71k27J043J929Q50j252j996
1022a011p64O08J007J062P97l17j781j616K48J763J384K09o40j086j316m77J259
1039f71J985P15j084j496p68j34P03J467J224m43j888j378L22J156J009O57Pj210
1057A73j767l74J471J717L71o83r22j066p68P47K025J309q79j809r64O3M84J042
1075A70J521M03j759k078j11J420J112K70L21l43j627j501Q62K321Q69j110j033
1092b93j90m75m42J248K133N4k361j725P33J209L79M95J091m93k719j616J732
1109a240K532L67r76n0k75j937j052K113K936k80k427q13Q71k73p53J304K250
1126B297p41l060q45K330J454j015m78J153n67k620m21L248K400j698k500R0O61
$$ plain form
1143 -312 -1567 -1777 1353 3804 1655 -2166 -2413 -204 -27 -822 835 2998 1233 -2663 -2810 559
1159 559 1738 -201 -618 1288 933 -1894 -1941 1542 2887 -314 -2710 -802 1124 -128 -790 1800
1175 1800 2876 -799 -4112 -1983 1930 1969 149 973 2029 -867 -4375 -2454 2403 3171 147 -742
1191 -742 899 2 -2914 -2022 2301 3261 -505 -2337 264 1678 -722 -1856 818 1995 -1211 -3065
1207 -3065 326 3554 1556 -1723 -1079 527 -1232 -2816 472 4521 2757 -2109 -3046 -566 -331 -1709
1223 -1709 458 4196 3116 -1997 -3621 -465 1209 -707 -677 2250 2452 -1543 -3203 153 2448 -105
1239 -105 -2269 -46 2093 128 -1557 962 2932 -289 -4018 -2340 1687 1833 4 908 2371 -415
1255 -415 -4441 -3086 1892 3406 933 68 1308 -296 -3899 -3319 1517 3532 681 -1219 452 959
$$ packed form
1143c12j255k10L130K451k149l821k47K209J77p95J657K163j765l896j47L369
1159E59J179j939m17J906l55k827m7L483J345l201k396J908J926j252o62K590
1175A800J076l675l313K129L913L9j820Q24J056k896l508J921M857P68l024q89
1191g42J641q97k916Q92M323R60l766j832K601J414k400j134K674J177l206j854
1207c065L391L228j998l279O44J606j759j584L288M049j764m866r37K480K35j378
1223a709K167L738j080n113j624L156J674j916L0K927K02l995j660L356K295k553
1239a05k164K223K139j965j685K519J970l221l729J678M027J46j829R04J463k786
1255d15m026J355M978J514k473q65J240j604l603N80M836K015k851j900J671N07
$$ plain form
1271 959 -1602 -2333 899 2661 -95 -2249 99 2455 591 -1895 -791 790 -954 -2492 421
1286 421 3991 2653 -1353 -2133 -518 -961 -2006 533 4163 3041 -1684 -3370 -1217 -67 -968 256
1302 256 3344 2892 -1233 -3073 -511 1139 -472 -1208 1041 1923 -680 -2088 439 2196 -293 -2635
1318 -2635 -861 1604 871 -329 1240 2273 -706 -4071 -2603 1345 2177 700 1029 1877 -640 -3930
1334 -3930 -2715 1656 3031 893 28 954 -196 -2983 -2488 1306 2684 106 -1336 510 1365 -745
1350 -745 -1580 657 1624 -863 -2354 367 2770 1047 -1449 -873 202 -1360 -2364 666 3960 2500
1366 2500 -1339 -2079 -508 -877 -1832 481 3649 2451 -1744 -2857 -437 461 -878 -174 2465 2101
1382 2101 -1396 -2477 324 1775 -419 -1698 307 1459 -579 -1530 1025 2642 -181 -2959 -1384
$$ packed form
1271I59k561p31L232J762k756k154K348K356j864k486J104J581j744j538K913
1286D21L570j338m006p80J615m43j045K539L630j122m725j686K153J150r01J224
1302B56L088m52m125j840K562J650j611p36K249Q82k603j408K527J757k489k342
1318b635J774K465p33j200J569J033k979l365J468L948Q32j477L29Q48k517l290
1334c930J215M371J375k138q65R26j150k787M95L794J378k578j442J846Q55k110
1350g45q35K237R67k487j491K721K403j723k496N76J075j562j004L030L294j460
1366B500l839p40J571l69r55K313L168j198m195j113K420Q98j339P04K639l64
1382B101l497j081K801J451k194j279K005J152k038r51K555J617k823k778J575
$$ plain form
1397 -1384 1379 940 -286 1112 2369 -393 -3742 -2407 1434 2200 269 281 1520 -109 -3181 -2366
1413 -2366 1646 2791 189 -1125 413 576 -1654 -1817 1251 2427 -405 -2273 -157 1855 390
1428 390 -1203 231 1365 -838 -2646 -267 2808 1822 -1039 -1228 209 -561 -2038 -84 3146 2499
1444 2499 -1165 -2402 -406 351 -864 -245 2281 2091 -1347 -2755 -327 1598 244 -796 649 1324
1460 1324 -850 -2181 137 2352 813 -1683 -1128 646 161 -989 418 2291 737 -2318 -2179 509
1476 509 1489 201 84 1279 332 -2192 -2276 704 2356 789 -696 -69 253 -1185 -1544 835 2383
1493 2383 603 -1606 -1071 498 240 -497 452 1493 98 -1984 -1295 1069 1594 40 -480 156 -259
1510 -259 -1514 -822 1495 2079 104 -1485 -812 -53 -381 -237 1283 1675 -276 -1988 -1143 609 794
$$ packed form
1397a384K763m39j226J398J257k762l349J335L841P66j931J2J239j629l072Q15
1413b366M012J145k602j314J538J63k230j63L068J176k832j868K116K012j465
1428C90j593J434J134k203j808K379L075r86k861j89J437p70j477J954L230o47
1444B499l664j237J996P57j215O19K526j90l438j408K428J925j354j040J445O75
1460A324k174j331K318K215j539k496N55J774m85j150J407J873j554l055J39K688
1476E09R80j288j17J195r47k524q4K980J652j567j485O27L22j438l59K379J548
1493B383j780k209N35J569k58p37R49J041j395k082O89K364N25j554n20O36m15
1510b59j255O92K317N84j975j589O73P59l28J44J520L92j951j712Q45J752J85
$$ plain form
1527 794 159 409 639 -539 -1693 -714 1249 1484 45 -776 -311 -287 -695 -10 1412 1289 -506 -1615
1545 -1615 -735 377 537 398 764 520 -868 -1630 -488 1122 1227 273 -291 -309 -761 -935 77 1381
1563 1381 1183 -285 -1159 -692 -79 86 511 987 501 -855 -1419 -505 767 931 423 29 -306 -865 -894
1582 -894 169 1247 1050 -157 -898 -756 -371 25 674 1028 491 -783 -1300 -562 485 841 638 315
1600 315 -259 -984 -925 56 1069 961 36 -616 -733 -540 -112 658 1118 560 -580 -1158 -613 244 657 708
1620 708 403 -284 -1000 -985 -28 910 927 248 -451 -738 -696 -232 623 1019 546 -448 -985 -667 12 612 783
1641 783 566 -208 -882 -855 -84 729 925 469 -249 -801 -852 -259 589 1011 612 -202 -825 -790 -208 511 920
1662 920 634 -166 -816 -838 -281 437 837 583 -117 -807 -822 -247 458 797 641 12 -741 -978 -395 506 919
$$ packed form
1527G94o35K50K30j178j154R79J963K35j439q21M65K4m08O85J422j23j795j109
1545a615Q80J112J60j39L66k44j388p62J142J610J05r54n64j8m52j74J012J304
1563A381j98j468q74M67O13J65M25M76m86j356n64R14J272J64n08l94l35n59k9
1582h94J063J078j97j207p41J42L85L96O49L54n37j274n17P38J047L56k03l23
1600C15n74p25N9R81J013j08r25o52j17J93M28P70M60n58j140n78N45Q57M13N1
1620G08l05o87p16J5R57R38J7o79o99k87M2M64Q55L96m73r94n37L18O79O00J71
1641G83k17p74o74K7P71Q13J96m56p18n52n1N93Q48M22l99q14o23L5N82P19M09
1662I20k86q00o50k2N57P18M00k54p00o90j5N75P05L39j56o29p53k37N83R01M13
$$ plain form
1683 919 555 -101 -641 -881 -559 259 1016 860 -55 -779 -760 -321 145 642 831 306 -624 -1051 -344 503
1703 503 719 420 132 -291 -824 -720 270 1107 784 -269 -743 -556 -351 -44 697 1153 434 -914 -1210
1722 -1210 -307 431 501 558 620 -101 -1116 -1142 209 1061 600 -121 -180 -241 -714 -567 561 1178 252 -917
1742 -917 -741 99 203 80 552 782 -278 -1387 -889 687 1107 363 -23 10 -510 -1221 -591 1178 1576
1761 1576 187 -809 -559 -214 -565 -222 1013 1359 -179 -1343 -667 443 302 -152 320 624 -373 -1295
1779 -1295 -285 1177 876 -504 -737 -43 -171 -628 201 1514 949 -996 -1560 -367 442 165 331 1229
1797 1229 771 -1257 -1867 -318 1083 632 -1 428 472 -845 -1476 4 1410 650 -785 -441 475 61
1815 61 -694 35 1098 234 -1383 -947 806 1128 21 -150 409 -214 -1606 -1194 1071 1902 398 -758
$$ packed form
1683I19l64o56n40k40L22Q18P57j56r15p24J9M39M66M97J89n25r30m27P07Q47
1703E03K16k99k88m23n33J04R90Q37l23j053m74J87K05L07P41M56p19j348k96
1722a210R03P38P0N7O2p21j015k6J351Q52m61p21n9o1m73J47J128O17r26j169
1742i17J76Q40J04j23M72K30j060j109M98J576M20p44l86L3n20p11O30J769L98
1761A576j389r96K50L45l51L43J235L46j538j164O76J110j41m54M72L04r97r22
1779a295J010J462l01j380k33O94j28m57Q29J313n65j945n64J193Q09k77J66Q98
1797A229m58k028o10J549J401m51o33M29M4j317o31J480J406p60j435L44R16m14
1815F1p55P29J063q64j617M36J753L22j107j71N59o23j392M12K265Q31j504j156
$$ plain form
1833 -758 -379 -291 -1132 -890 1144 2004 364 -1240 -710 177 -326 -661 532 1464 144 -1365 -601 911
1851 911 578 -667 -402 612 108 -950 -115 1466 1047 -1038 -1523 -158 376 -236 212 1609 1148 -1188
1869 -1188 -2092 -493 937 451 145 1065 915 -1099 -2169 -447 1334 714 -413 157 816 -372 -1443
1886 -1443 -204 1303 491 -1194 -703 899 725 -561 -289 806 87 -1648 -1156 1145 1772 242 -573
1903 -573 94 -167 -1591 -1240 1251 2287 484 -1160 -564 49 -853 -1013 876 2066 480 -1410 -720
1920 -720 614 63 -990 -28 1273 308 -1289 -562 1317 953 -969 -1103 384 399 -709 -146 1633
1937 1633 1262 -1225 -2046 -320 802 38 -40 1376 1357 -1078 -2324 -577 1205 628 -290 599 1103 -575
1955 -575 -1994 -506 1536 834 -858 -406 946 444 -1005 -419 1168 575 -1356 -1211 922 1392 -200
$$ packed form
1833g58L79Q8q41K42K034Q60j640j604N30Q87n03l35J193R32j320j509P64J512
1851I11l33j245K65J014n04j058Q35J581m19k085m85J365N34o12M48J397m61k336
1869a188r04J599J430m86l06R20j50k014j070J722J781o20j127N70O59j188j071
1886a443J239J507q12j685M91J602j74j286K72J095p19j735M92K301O27j530q15
1903e73O67k61j424L51K491J036j803j644N96O13r02j60J889J190j586j890O90
1920g20J334n51j053R62J301r65j597P27J879l64j922j34J487J5j108N63J779
1937A633l71k487q21J726J122p64p8J416j9k435j246J747J782n77r18Q89N04j678
1955e75j419J488K042p02j692M52J352n02j449N86J587n93j931J45K133M70j592
$$ plain form
1972 -200 -573 483 281 -1474 -1478 916 2142 541 -930 -331 130 -1037 -1311 743 2184 651 -1381
1989 -1381 -907 409 -80 -936 162 1596 626 -1339 -944 834 766 -713 -679 668 505 -935 -673 1255
2007 1255 1440 -603 -1594 -239 656 -157 -289 1123 1401 -617 -2008 -712 969 602 -220 531 1111
2024 1111 -337 -1840 -831 1127 1068 -357 -335 605 80 -1102 -589 1068 996 -747 -1099 296 849 -160
2042 -160 -495 527 577 -859 -1361 205 1421 540 -542 -198 228 -687 -1159 206 1640 911 -723 -882
2060 -882 -22 -99 -568 193 1291 714 -923 -1080 218 609 -129 -249 498 460 -688 -874 384 1074 123
2079 123 -706 -281 182 -224 -406 606 1145 29 -1223 -882 243 424 51 339 678 -153 -1151 -798 485
2098 485 890 182 -107 138 -115 -778 -547 629 958 119 -641 -393 58 -61 -52 494 587 -262 -927 -366 529
$$ packed form
1972b00l73J056k02j755mK394J226j601j471N99M61j167k74K054J441j533k032
1989a381M74J316m89q56J098J434r70j965L95J778o8j479L4J347j63j440K62J928
2007A255J85k043r91J355Q95q13j32J412K78k018j391J296J681l67q22P51N80
2024A111j448j503J009J958n9j425K2R40n25j182N13J657p2j743l52J395N53j009
2042a60l35J022N0j436n02J566J216q81j082L44M26r15m72J365J434p29j634j59
2060h82Q60p7m69P61J098n77j637j57J298L91p38j20P47l8j148j86J258O90r51
2079A23q29M25M63m06j82J012N39j116j252L41J125J81l73K88L39q31r98L53J283
2098D85M05p08k89K45k53o63K31J176L29q39p60K48M51j19RN46R3q49o65N61Q95
$$ plain form
2119 529 532 104 1 45 -369 -710 -156 739 762 50 -467 -332 -255 -259 170 802 634 -321 -833 -452 155 288
2141 288 252 277 90 -460 -639 -107 476 457 65 -141 -200 -335 -289 180 594 418 -239 -598 -415 0 295 449
2163 449 447 2 -534 -605 -56 428 562 246 -80 -290 -450 -318 214 548 426 -5 -373 -446 -189 137 440
2184 440 463 52 -435 -582 -235 262 488 334 -19 -386 -491 -244 194 437 386 -19 -428 -484 -277 113 358
2205 358 451 141 -320 -568 -395 136 508 429 86 -337 -468 -339 81 429 490 52 -340 -448 -185 124 361
2226 361 400 214 -186 -485 -435 29 452 431 114 -217 -457 -405 -4 444 559 218 -291 -515 -263 65 301
2247 301 373 198 -191 -481 -425 19 361 437 172 -112 -369 -446 -152 341 593 259 -259 -546 -363 -41 268
2268 268 439 284 -60 -437 -424 4 357 350 144 -55 -284 -409 -249 221 532 354 -143 -419 -319 -123 138
$$ packed form
2119E29Lm28j03M4m14l41N54Q95K3p12n17J35P7mM29O32j68r55n12L81O07J33
2141B88l6K5j87n50j79N32N83j9l92k06n9j35M6M69M14j76o57l59J83M15K95J54
2163D49km45n36p1N49M84J34l16l26k10j60J32N32L34j22m31l68p3K57L26L03
2184D40K3m11m87j47L47M97K26j54l53l67j05K47M38K43n1m05m09n6K07L90K45
2205C58R3l10m61k48J73N31L72p9l43m23j31J29M20L48O1m38l92j08K63L09K37
2226C61L9j86m00k99N0M64M23k1l17l31k40N2M01M48J15l41n09k24K52L28K36
2247C01P2j75l89k90N6M44L42P6k65k84k57p7K94M93K52l34n18k87J83L22L09
2268B68J71j55l44l77J3M28L53pk06j99k29j25J60M70L11j78m97k76J00J96K61
$$ plain form
2289 138 451 437 -61 -510 -547 2 353 340 136 -31 -258 -444 -319 234 497 265 -109 -279 -279 -267 -60 422
2311 422 509 19 -508 -489 -34 243 286 259 129 -227 -558 -269 312 499 176 -156 -209 -196 -308 -76 462 646
2333 646 95 -500 -418 -92 59 180 450 372 -246 -751 -387 302 437 109 -9 -3 -219 -436 -133 474 477 -123
2355 -123 -390 -166 -50 -119 92 528 359 -382 -764 -182 381 352 158 178 37 -497 -669 13 665 486 -103
2376 -103 -217 -54 -255 -446 47 693 442 -275 -473 -95 90 -87 68 466 155 -565 -605 201 624 195
2396 195 -232 -58 -38 -347 -345 413 779 148 -561 -409 -20 -114 -179 399 778 71 -775 -658 114 337 112 173
2418 173 383 -26 -710 -481 415 585 -90 -342 78 172 -277 -226 434 533 -242 -693 -125 374 155 -15 362
2439 362 339 -417 -935 -250 711 569 -20 -82 37 -378 -768 -69 809 650 -202 -380 53 -58 -480 -178 610
$$ packed form
2289A38L13j4m98m49l7N49L51j3k04j67k27j86J25N53K63k32l74j70%J2K07M82
2311D22Q7m90n27J9M55K77M3k7j30l56l31K89N81J87l23l32n3J3j12K32N38J84
2333F46n51n95Q2L26J51J21K70p8o18n05L64O89J35l28j18Ok16k17L03O07Lo00
2355a23k67K24J16o9K11M36j69p41l82N82N63k9j94K0j41n34j72O82O52j79n89
2376a03j14J63k01j91M93O46k51p17j98L78J85j77J55L98l11p20m0Q06M23m29
2396A95m27J74K0l09KP58L66o31p09J52L89r4o5N78L79p07q46J17P72K23k25O1
2418A73K10m09o84K29Q96J70o75k52M20R4m49N1O60R9p75m51N68M99k19j70L77
2439C62k3p56n18O85R61j42n89o2J19m15l90O99Q78j59q52j78M33j11m22L02P88
$$ plain form
2460 610 566 -367 -668 61 433 -34 -231 186 232 -444 -539 343 887 157 -626 -335 116 -128 -283 367 957
2481 957 237 -813 -601 90 119 -139 282 826 255 -850 -790 226 512 10 -146 379 238 -517 -513 366
2501 366 600 -216 -612 33 477 -15 -318 278 528 -296 -966 -295 658 471 -93 68 296 -350 -1014 -334
2521 -334 881 832 -141 -344 86 -105 -681 -327 720 797 -235 -587 94 314 -316 -396 387 611 -286 -692
2541 -692 101 727 176 -520 -161 233 -194 -511 252 984 320 -754 -661 70 91 -280 154 874 400 -776
2561 -776 -852 17 368 -73 -12 502 348 -615 -800 165 664 30 -432 84 405 -162 -467 166 633 -83 -785
2582 -785 -235 512 331 -182 49 490 -102 -901 -435 602 735 32 -237 111 -138 -724 -422 644 823
2601 823 -30 -543 -57 188 -303 -361 344 644 -120 -639 -109 434 79 -347 -38 312 -128 -587 -37 722
$$ packed form
2460F10m4r33l01P29L72m67j97M17M6o76r5Q82N44p30p83K91M51k44j55O50N90
2481I57p20j050K12O91K9k58M21N44n71j105O0J016K86n02j56N25j41p55MQ79
2501C66K34q16l96O45M44m92l03N96K50q24o70O71R53j87n64J61K28o46o64O80
2521c34J215m9r73k03M30j91n76L54J047P7j032l52O81K20o30q0P83K24q97m06
2541f92P93O26n51o96L59L94m27l17P63P32o64j074R3P31K1l71M34P20m74j176
2561g76p6Q69L51m41O1N14j54r63j85R65M99o34m62N16L21n67l05O33M67p16p02
2582g85N50P47j81n13K31M41n92p99M66J037J33p03k69L48k49n86L02J066J79
2601H23q53n13M86K45m91n8P05L00p64n19N30N43l55m26L09L50m40m59N50P59
$$ plain form
2621 722 422 -434 -528 -12 17 -259 91 714 431 -491 -743 -103 300 16 27 518 401 -424 -748 -86 515
2642 515 206 -130 104 216 -221 -481 93 554 201 -457 -292 195 140 -135 68 393 14 -571 -395 275
2662 275 436 94 -28 131 -72 -572 -428 362 642 160 -284 -183 -79 -262 -181 332 483 44 -442 -242
2682 -242 145 51 -58 145 284 -49 -389 -175 315 319 -14 -111 -41 -107 -240 46 454 390 -178 -394 -207 22
2704 22 36 100 350 242 -283 -457 -199 173 186 74 141 40 -293 -394 -58 316 250 -69 -205 -122 -136 -85 129
2727 129 323 82 -286 -314 -39 131 156 139 147 -116 -325 -301 59 318 230 66 -52 -196 -262 -108 220 416 154
2750 154 -173 -231 -140 -72 77 249 214 -87 -301 -145 33 122 156 78 2 -178 -307 -90 226 237 27 -111 -206
2773 -206 -219 -101 165 317 197 -93 -262 -158 -34 120 217 180 -8 -214 -265 -59 130 182 151 24 -129 -259
$$ packed form
2621G22l00q56r4N16K9k76L50O23k83r22k52O40M03k84J1M91j17q25l24O62O01
2642E15l09l36K34J12m37k60N74M61l53o58J65M87n5k75K03L25l79n85J76O70
2662B75J61l42j22J59k03n00J44P90K80m82m44J01J04j83Q1N13J51m39m86K00
2682b42L87r4j09K03J39l33l40K14M90Ml33r7P0o6j33K86M08o4n68k16J87K29
2704B2J4O4K50j08n25j74K58L72J3j12O7j01l33j01L36L74o6l19j36Q3j4N1K14
2727A29J94k41l68k8K75J70K5j7Qk63k09K4L60K59q8j64j18j44o6J54L28J96k62
2750A54l27n8R1O8J49J72l5l01k14J56J78Q9L4p8p6j80j29K17L16J1k10j38r5
2773b06j3J18K66J52j20k90j69J04J24J54R7l7j88k06n1K06J89N2l1j27j53j30
$$ plain form
2795 -259 -145 137 333 168 -75 -212 -172 -84 79 248 251 -8 -222 -188 -44 125 159 138 50 -183 -291 -140 94
2818 94 226 178 -14 -104 -200 -192 8 220 219 -7 -250 -230 -102 -6 150 225 64 -123 -245 -114 119 168 130 57 -61
2843 -61 -224 -190 -15 276 267 36 -137 -141 -122 -34 191 294 106 -173 -251 -162 27 143 134 80 -39 -232 -186 -14 227
2868 227 200 41 -70 -158 -156 -81 109 247 114 -157 -245 -155 -14 100 159 180 -34 -244 -205 -46 176 187 36 -23
2892 -23 -114 -196 -110 151 323 125 -106 -169 -135 -45 98 230 193 -17 -256 -213 -7 122 130 115 37 -135 -259 -153
2916 -153 121 263 96 -89 -162 -112 -134 -2 198 236 -16 -266 -218 -1 94 85 145 79 -153 -302 -141 125 253
2939 253 64 -36 -92 -140 -186 -1 243 241 -46 -203 -152 -44 -3 78 225 145 -133 -286 -97 134 160 52 64 30
2963 30 -155 -244 7 240 179 -70 -144 -56 -82 -96 118 280 98 -224 -269 -87 103 63 101 162 -9 -249 -284 48
$$ packed form
2795b59J14K82J96j65k43j37M0Q8J63J69Lk59k14L4J44J69L4k1q8k33j08J51K34
2818I4J32m8j92r0r6QK00K12jk26k43K0J28R6J56P5j61j87j22J31K33M9l8p3j18
2843f1j63L4J75K91rk31j73mJ9Q8K25J03j88k79p8Q9J89J16rn4j19j93M6J72K41
2868B27k7j59j11q8KP5J90J38j33k71q8R0J41J14N9K1k14k10L9J59K22J1j51n9
2892b3r1q2Q6K61J72j98k31o3L4R0J43J32l7k10k39M3K06J29Qj5p8j72j24J06
2916a53K74J42j67j85p3N0k2J32K00L8k52k50M8K17R5rO0o6k32j49J61K66J28
2939B53j89j00n6m8m6J85K44kk87j57N1J08M1Q1J47q0k78j53J89K31K6j08J2l4
2963C0j85q9K51K33o1k49p4Q8k6j4K14J62j82l22m5J82J90m0L8O1j71k40l5L32
$$ plain form
2987 48 248 162 -9 -46 -70 -176 -141 104 318 87 -206 -162 -19 -18 0 139 200 -12 -287 -155 145 193 53 11
3011 11 47 -57 -253 -110 265 306 -7 -170 -77 -45 -134 -18 287 326 -62 -313 -165 32 26 -20 180 140 -156 -339
3035 -339 -107 203 164 -63 -53 9 -93 -197 -5 318 184 -179 -228 -7 105 -9 94 258 116 -278 -337 20
3057 20 237 138 31 127 12 -282 -323 112 342 161 -108 -22 46 -101 -190 112 307 64 -257 -178 96 74 -85
3080 -85 -32 152 -11 -322 -206 206 291 -24 -148 -48 -2 -230 -142 292 417 -24 -326 -152 9 -71 -49 250
3102 250 348 -56 -324 -143 166 123 -94 39 204 -35 -285 -84 269 223 -160 -183 46 62 -128 -17 260 203
3124 203 -252 -345 -18 214 36 12 179 129 -261 -428 5 295 158 -82 -7 43 -231 -325 -11 326 156 -211
3146 -211 -172 69 6 -174 -42 250 101 -222 -215 207 229 -15 -82 62 64 -207 -196 250 400 107 -236 -89 4
$$ packed form
2987D8K00q6j71l7k4j06L5K45K14k31k93M4J43JJ8J39O1k12k75J32L00M8j40m2
3011A1L6j04j96J43L75M1l13j63R3L2q9J16L05L9l88k51J48J97om6K00m0k96j83
3035c39K32L10l9k27J0O2j02j04J92L23j34l63m9K21J12j14J03J64j42l94n9L57
3057B0K17r9j07R6j15k94m1M35K30j81k69Q6O8j47q9L02J95k43l21P9K74k2j59
3080h5N3J84j63l11J16M12Q5l15j24J00M6k28Q8M34J25m41l02J74J61q0K2K99
3102B50R8m04k68J81L09m3k17J33J65k39k50K01L53m6l83k3K29J6j90J11K77n7
3124B03m55r3L27K32j78k4J67n0l90j67M33K90j37k40P5N0k74r4L14L37j70l67
3146b11L9K41o3j80J32K92j49l23PM22K2k44o7J44Kk71J1M46J50k93l43J47R3
$$ plain form
3169 4 -78 -125 222 376 54 -291 -214 64 67 -38 81 232 12 -308 -183 141 165 -94 -99 94 29 -207 -101 218
3193 218 172 -156 -282 -31 124 -1 -4 170 195 -193 -359 -45 200 148 -31 57 67 -193 -308 -71 270 249 -86
3216 -86 -103 47 -55 -205 3 250 187 -155 -170 50 109 -56 -13 127 78 -194 -194 103 237 15 -137 -51 -9 -142
3240 -142 -112 161 288 83 -262 -204 -19 -36 -81 151 253 20 -260 -195 36 107 -18 32 127 11 -161 -94 137
3263 137 218 -30 -120 -19 -21 -71 -31 207 176 -119 -242 -85 79 95 46 85 92 -154 -276 -35 179 148 35 -15 -36
3288 -36 -112 -169 -50 218 141 -57 -142 -79 -38 -86 6 145 51 -115 -183 12 122 69 9 -8 -11 -123 -131 88 209 76
3314 76 -106 -107 -52 -78 -41 101 222 14 -141 -155 -51 29 8 91 140 -18 -167 -139 11 128 57 9 -18 -39 -116 -70
3340 -70 64 174 -15 -131 -129 -60 -50 61 113 67 -65 -206 -84 76 86 41 23 -12 -100 -191 -14 105 85 12 -96
$$ packed form
3169Dq2m7L47J54l22l45P7K78Lj05J19J51k20l20J25L24K4k59nJ93o5k36J06L19
3193B18m6l28j26K51J55j25lJ74K5l88j66L14K45n2j79Q8J0k60j15K37L41k1l35
3216h6j7J50j02j50K08K47o3l42j5K20N9j65M3J40m9k72%K97J34k22j52Q6M2j33
3240a42L0K73J27k05l45N8J85j7m5K32J02k33k80O5K31P1j25N0R5j16j72O7K31
3263A37Q1k48r0J01kn0M0K38l1k95j23J57J64J6m9L9Pk46j22K41K14l1j13n0k1
3288c6p6n7J19K68p7j98q5O3M1m8R2J39r4j66o8J95J10n3o0j7lj12qK19J21j33
3314G6j82jN5k6L7J42J21k08j55j4J04Q0k1Q3M9j58j49K8J50J17p1m8k7k1p7M6
3340g0J34J10j89j16KO9J0J11N2m6j32j41J22J60J0m5j8l5q8r1J77J19k0p3j08
$$ plain form
3365 -96 -36 -88 -72 77 146 114 -60 -125 -59 65 0 63 82 -4 -138 -130 23 142 91 18 -35 -63 -119 -75 64 127 78
3392 78 -59 -108 -67 -40 -40 87 108 11 -117 -162 7 53 75 86 24 -51 -156 -118 54 134 19 -46 -62 -79 -23 27 84
3419 84 118 11 -109 -69 8 64 0 48 19 -53 -135 -57 27 129 69 14 -41 -54 -91 -23 106 115 16 -71 -83 -35 -13 48 123
3448 123 67 -20 -100 -41 38 59 99 55 -53 -104 -87 -5 66 83 -7 -79 -98 -88 -35 29 76 81 -34 -84 -43 34 43 76 61 2
3478 2 -55 -84 -11 116 93 24 -44 -48 -63 -56 24 101 -2 -21 -106 -65 -13 24 58 31 -4 -92 -105 -34 25 63 22 -25 -75 -97 -20
3509 -20 20 93 38 -49 -112 -47 -13 60 75 78 -8 -111 -81 3 45 100 50 27 -32 -95 -44 47 140 50 -20 -61 -69 -35 21 78 46
3540 46 -13 -53 -90 -5 64 30 77 15 -46 -81 -49 26 91 5 -36 -9 -112 -62 25 95 74 -30 -45 -67 -47 -12 49 96 47
3569 47 -49 -121 -17 38 28 19 46 -23 -61 -82 6 114 70 -18 -38 -7 -86 -19 51 103 40 -57 -116 -37 -29 38 88 69 -19 -86
$$ packed form
3365i6O0n2J6J49O9l2j74o5O6J24o5O3J9q6j34QJ53J19n1p3n3k8n6M4J39O3m9
3392G8j37m9M1K7%J27K1r7j28m5J69M6K2J1o2p5j05L8J72Q0j15o5j6j7N6N0N7
3419H4L4j07j20M0P7N6o4M8k9p2q2P8Q4J02o0n5n5j3l7O8J29Rr9q7j2M8K2O1P5
3448A23n6q7q0N9P9K1M0m4j08n1J7Q2P1J7r0p2j9J0N3O4M7Nj15n0M1P7RL3j5n9
3478Bn7k9P3J27k3o9o8mj5PQ0P7j03j9q5M1N2L7L4k7l5q8j3P1N9L8m1m7n0k2P7
3509b0M0P3n5q7o3O5L4P3J5Lq6j03L0Q4M2N5n0k3n9o3N1R1R3r0p0m1qL4N6N7l2
3540D6n9m0l7Q5O9l4M7o2o1l5L2P5O5q6m1K7j03N0Q7P0k1j04j5k2K0L5O1M7m9
3569D7r6p2J04N5j0rK7o9l8k1Q8J08m4q8k0L1p9O7P0N2o3r7n9P9QO7N0j9q8o7
$$ plain form
3599 -86 -93 10 46 54 -14 -5 -50 -90 -39 34 67 21 -50 -23 -35 -44 -8 96 65 -19 -88 -97 35 22 22 59 70 -69 -85 -14 102
3630 102 112 6 -35 -37 -49 -93 37 136 70 -70 -117 -54 -20 -26 44 84 49 -60 -107 -46 36 36 -21 -29 13 -60 -112 6 85
3659 85 -4 -82 -81 -40 1 -27 39 106 28 -116 -113 -19 72 20 18 82 -32 -94 -63 24 114 45 -19 -14 35 -41 -61 82 147 13
3689 13 -86 -53 28 32 -16 22 91 -32 -122 -77 77 48 14 -18 1 -34 -119 -36 66 90 -3 -68 -49 -36 -34 -45 110 125 -49
3718 -49 -106 -4 61 5 -2 38 45 -62 -105 -5 125 60 -28 -31 17 -7 -55 29 116 59 -81 -111 -17 62 12 44 123 33 -84
3747 -84 -100 7 86 26 -6 16 26 -76 -110 27 123 15 -43 -23 6 10 -65 3 77 17 -94 -69 76 29 12 -6 51 16
3775 16 -150 -48 84 173 50 -49 -45 27 -50 -42 109 136 15 -71 -39 -15 -23 -17 57 112 2 -118 -49 43 31 -18 -16 26 16
3804 16 -67 -52 111 109 -20 -81 -1 20 -27 16 109 58 -72 -126 -3 40 27 -9 62 42 -93 -129 -49 55 26 3 6 19
$$ packed form
3599h6pJ03L6Qo8Rm5m0N1P3L3m6p1K7j2rL6J04l1q4o9rJ32j3%L7J1j39j6P1J16
3630A02J0j06m1kj2m4J30R9o6j40m7O3L4oP0M0l5j09m7O1Q2%n7qM2p3n2J18P9
3659H5q9p8JM1M1k8O6O7p8j44LR4R1n2kO4j14o2L1Q7R0o9o4NM9p6k0J43O5j34
3689A3r9L3Q1Mm8L8O9j23r0M5J54k9l4l2J9l5q5Q3J02K4r3o5J9J3Kj1J55J5j74
3718d9n7J02O5n6pM0Pj07m3J00J30o5q8lM8k4m8Q4Q7n7j40l0R4P9n0L2P9r0j17
3747h4j6J07P9o0l2K2J0j02l4J37R6j08n8K0K9Mp5O8P4o0j11K5J45m7j7j8N7l5
3775A6j66J02J32Q9j23r9MP2p7QJ51K7j21q6L2K4qOP4N5j10j20O9R2j2m9KM2j0
3804A6q3J5J63kj29o1Q0K1m7M3R3n1j30n4J23M3j3l6P1k0j35l6Q0J04k9k3LJ3
$$ plain form
3832 19 -19 -23 18 83 27 -8 -37 24 33 -25 23 64 63 -95 -100 12 82 55 16 16 17 -72 -120 52 102 34 -57 -52 -11 -44 -41 36 83
3865 83 19 -111 -43 -30 12 -38 2 53 32 -59 -78 63 77 11 -33 13 -2 -64 -46 111 67 -21 -95 -47 10 56 9 69 65
3894 65 -30 -60 -42 65 44 27 25 17 -50 -51 -20 117 29 -20 -75 -15 -37 -17 -22 68 31 -61 -62 -37 63 21 -23 -14 30 -56 -91 20
3926 20 47 56 1 -50 -10 -44 -60 2 96 37 -38 -50 -52 -4 -1 43 60 -9 -109 -27 22 50 44 11 22 -3 -42 -32 36 57 71 -26
3958 -26 22 -6 -35 -51 30 49 25 -90 -45 9 32 15 9 -18 -7 -97 -60 29 50 0 -24 -15 -28 -44 9 78 48 42 -65 -25 2
3989 2 22 36 84 17 -9 -47 -4 32 8 44 24 -10 -58 -51 15 53 56 11 -41 -44 13 18 46 43 27 -34 -91 -39 24 49 11 7 -25 -71
4023 -71 -53 -15 35 27 -7 -22 -30 -65 -14 20 26 11 -39 -44 6 -16 7 49 62 -25 -4 -43 1 23 50 43 -7 -4 -42 4 48 71 31
4056 31 -8 0 8 -9 16 8 35 -37 -71 -55 -13 25 50 31 3 -53 -48 -53 11 27 63 -28 -34 -74 -50 -5 19 35 -38 -20 -47 2 -21
$$ packed form
3832A9l8mM1O5n6l5k9O1Rn8M8M1jj58nJ12P0k7l9%Jq9m8J72N0o8r1NM1l3LP7M7
3865H3o4j30O8J3M2n0M0N1k1r1j9J41J4o6m4M6j5o2J8J57m4q8p4M8N7M6m7O0m
3894F5r5l0J8J07k1j7kqo7jL1J37q8m9n5O0k2K0nR0l7r2jK5J00m2m4RM4q6l5J11
3926B0K7Rn5n1M0l4j6O2R4n9p5j2kM8LM4J7o9j00Q2M9K8ol3J1k5l9J0O8K1J4r7
3958b6M8k8k9j6Q1J9k4j15M5N4K3j7ok7J1r0L7Q9K1n0k4Rj3j6N3O9l0oj07M0K7
3989BK0J4M8o7k6l8M3L6k4L6k0l4m8PO6L8Lm5n2lN7NK8lj6o1n7N2O3K5l8ml2m6
4023g1J8L8N0ql4j5ql5N1L4Oj5n0nN0k2K3M2J3q7K1l9M4K2K7pn0Ll8M6M4K3m0
4056C1l9QQj7K5qK7p2l4J6M2L8K5j9k8n6NnO4J6L6r1om0K4M5K4J6p3J8k7M9k3
$$ plain form
4089 -21 22 43 12 13 -33 -29 17 39 7 23 -52 -8 -18 9 41 22 -12 -36 -37 -5 14 37 30 19 -35 -39 -9 30 40 46 -19 -39 -36 -31
4123 -31 15 23 60 2 -9 -25 -45 -41 -1 55 -7 -32 -27 3 14 9 36 -8 -13 -39 -36 -12 49 35 -10 -11 -29 -15 -15 14 52 71 -18 -23 -5
4158 -5 -17 -5 33 55 1 -53 -40 -4 17 36 20 6 -29 -68 -30 12 39 6 -14 -35 -78 -42 -6 -2 39 -16 -66 -35 15 15 20 54
4190 54 19 8 -74 23 29 36 25 -7 -27 -45 -34 8 64 23 -28 -12 -27 -8 -3 21 50 27 -43 -80 -26 -6 29 41 16 7 -18 -26 10
4223 10 48 2 -10 -14 -13 -40 -29 42 54 -4 -43 -23 -46 0 -22 45 15 -2 -47 -32 -4 37 52 25 1 -3 -39 13 50 18 7 -2
4255 -2 -32 14 -9 1 57 39 25 -50 -14 21 19 56 12 14 -22 -42 2 58 57 -34 -10 -30 4 -44 11 27 58 -8 -19 31 -24 -43
4287 -43 -8 20 18 -39 -93 -14 26 1 6 5 17 -37 -45 61 31 25 -46 -14 24 31 -7 -17 61 50 -46 -26 35 56 0 47 41 5 -55
4320 -55 -55 39 58 31 -21 -16 -8 -47 -25 40 81 -30 -41 -36 33 -38 -34 10 -2 21 -94 -33 54 23 -7 -27 7 -52 -74 -26 54 13
$$ packed form
4089b1M3K1l1Jm6MM6K2l2J6p5M4j0K7L2j9l4k4jL2J9K3pj1n4mL0L9J0Oo5k0LN
4123c1M6QL7n8j1j6k0MM0N6o2k5NL0J1nK7m4nk6LK4O1j4m5jj8J4%K9L8J9q9nJ8
4158ej2J2L8K2n4n4J3L6K1J9j6j4l5l9L8M2K7l3k0k1m3L6L6MM1n5n0L1N0%NL4
4190E4l5j1q2R7OPj1l2k0j8J1M2N6m1n1J6j5J9NK4K9k3p0l7N4K0L5J2k5rk5qL6
4223A0L8m6j2mJk7J1P1J2n8l9K0k3M6k2O7l0j7m5J5K8M1J5k7k4ml6N2L7l2j1r
4255bl0M6k3J0N6j8j4p5L6L5kL7m4Kl6k0M4N6jr1K4k0L4m8N5J6L1o6j1N0n5j9
4287d3L5K8kn7n4P9M0k5NjJ2n4qJ06l0op1L2L8Pl8j0P8j1r6K0O1K1n6M7ol6o0
4320e5%R4J9k7n2NQl9K2O5M1j11j1NO9p1MM4j2K3j15O1Q7l1l0k0L4n9k2M8Q0m1
$$ plain form
4352 13 0 -44 14 27 -10 26 89 77 -65 -58 49 61 37 -8 50 29 -26 -32 55 66 22 -2 -30 25 -11 -32 -36 63 29 -58 -64
4383 -64 -8 4 -15 9 50 17 -68 -39 27 45 20 -16 59 4 -33 -76 24 68 25 -5 -31 11 -20 -45 16 61 -14 -74 -20 10
4413 10 61 15 5 28 29 -51 3 40 97 6 -51 11 40 -38 -24 27 67 -18 -58 -10 11 -36 -29 33 72 -34 -39 -28 6 31 -29
4444 -29 2 1 -8 -58 -42 45 40 -27 -28 4 18 -17 18 83 65 -19 -56 3 35 38 30 12 8 -62 -16 -13 32 56 -25 -23 20 -19 -79 18 35
4479 35 44 -41 -37 45 -5 -6 -3 60 25 -28 -41 32 31 6 -9 7 24 -68 -27 9 37 -43 -30 -22 20 -56 -6 -11 83 36 10 5 2 27 -17
4514 -17 39 68 8 -42 4 22 43 -14 -19 -21 17 -25 -21 27 54 -16 -48 -31 -14 1 0 51 37 -2 -56 -25 30 30 -6 22 49 -2 -66
4547 -66 5 -10 41 -37 -57 -15 -13 -38 1 47 18 -17 -44 11 26 -2 25 38 -6 -18 -2 -18 39 31 -15 -6 31 -32 -8 31 63 19
4579 19 -48 -5 21 -10 -7 19 83 12 -45 -43 -17 -3 -14 0 -26 -13 -54 -12 -11 17 -6 -11 3 4 -13 -1 -7 54 16 -8 -48 17 44
$$ packed form
4352A3j3m4N8J3l7L6O3j2j42PJ07J2k4m5N8k1n5oQ7J1m4k4k8N5l6k1mR9l4q7o
4383f4N6J2j9K4M1l3q5K9O6J8k5l6P5n5l7m3J00M4m3l0k6M2l1k5O1M5p5o0N4L0
4413A0N1m6j0K3Jq0N4L7N7r1n7O2K9p8J4N1M0q5m0M8K1m7PO2L9j06nJ1L4K5o0
4444b9L1jrn0J6Q7no7jL2J4l5L5O5j8q4l7N9L2Lqj8mp0M6LM5K4q1KM3l9o0R7J7
4479C5Rq5MQ2n0jLO3l5n3j3P3jk5j5J6J7r2M1L6K8q0J3QM2p6N0nR4m7k6nlK5m4
4514a7N6K9o0n0M6J8K1n7nkL8m2MM8K7p0l2J7J7J5jN1j4l9n4L1N5%l6K8K7n1o4
4547f6P1j5N1p8k0M2Kk5L9M6k9l5k7N5J5k8K7J3m4j2J6j6N7qm6RL7o3K4L9L2m4
4579A9o7M3K6l1LK6O4p1n7KK6J4j1J4k6J3m1M2JK8k3nJ4Jj7J2oO1l8k4m0O5K7
$$ plain form
4612 44 13 2 24 -3 -47 -6 1 43 -11 3 -17 -11 -24 -10 36 23 1 -43 -6 15 12 18 13 23 10 -7 5 3 -11 -5 -3 0 -46 -45 -12
4647 -12 6 -9 -46 -43 -12 -16 -4 -8 -9 16 -16 6 -9 21 1 -13 21 -21 1 -27 10 36 38 24 17 5 30 -9 -3 16 32 -7 24 9
4681 9 14 6 4 22 22 27 -23 23 39 27 0 15 -20 -8 -36 3 -13 -9 -10 15 -18 -42 -26 28 41 9 -19 -21 -30 -3 33 6 0 -28 -42 -26
4717 -26 25 46 35 -2 1 18 -19 13 34 36 -14 4 18 9 8 36 13 52 5 -27 2 42 40 -17 7 -9 -18 -29 6 7 21 1 4 6 -15
4752 -15 -16 -1 -7 21 -31 -59 -30 -7 34 20 -1 30 2 -2 20 30 37 -1 0 0 7 -15 38 23 19 1 3 24 13 -5 39 -4 41 -19 -2
4787 -2 33 17 26 1 -5 -15 -42 1 27 -7 13 -2 -10 -38 -67 1 27 34 9 -2 14 8 20 -3 18 2 -4 -53 3 36 28 -27 22 10
4821 10 8 -43 0 37 6 -17 -33 1 22 -7 17 40 7 -28 -35 3 1 12 9 7 -11 -12 -39 0 -2 -6 -14 -14 12 -32 14 34 53 -10 6
4856 6 -25 -14 -28 -32 23 74 -24 -53 -31 -5 27 7 27 29 13 -60 -15 20 14 -31 -35 -3 -38 29 2 -6 37 -7 -35 2 18 -8 -7 35
$$ packed form
4612D4l1j1K2k7m4M1PM2n4J4k0Oj3J4M6j3k2m4L7K1lOnJ0j3j7J2kj4OKLm6JL3
4647a2J8j5l7LL1mJ2mjK5l2K2j5L0k0j4L4m2K2k8L7K6Kj4pj2K5l9OJ9J6l9L1j5
4681INqkJ8%Nn0M6J6j2k7J5l5J2k8L9j6MjK5l3k4J6N4J3l2k8krK7L6k7ok8j4J6
4717b6N1K1j1l7LJ7l7L2K1Kn0J8J4rjK8k3L9m7l2K9M0kn7K4j6rj1L5JJ4k0LKk1
4752a5jJ5oK8n2k8K9K3M1j4k1L1k8mK2J0Pl8J%Pk2N3j5mj8KK1j1j8M4m3M5o0J7
4787bL5j6Rk5oj0k7M3K6l4K0j5qk8k9O8K6Pk5j1J6oJ2k3K1j6om9N6L3qn5M9j2
4821A0kn1M3L7l1k3j6L4K1k9K4K3l3l5pL8kJ1lkj8jk7L9kmq%K6m4M6K0J9o3J6
4856Fl1J1j4mN5N1r8k9K2K6L2k0K0Kj6p3M5L5om5mL2l5O7k7qM3m4k8L7J6k6JM2
$$ plain form
4890 35 35 -5 -39 1 56 23 -26 -11 -38 -25 -18 -18 50 20 -18 -63 -12 26 -51 -15 5 6 9 -42 24 44 7 -42 -6 30 -38 18 12
4923 12 56 16 -30 -17 -29 19 -3 -4 44 -4 -18 19 16 29 22 -15 43 28 -36 -50 27 50 12 3 12 27 -32 -34 44 76 -12 -60 -42
4956 -42 59 -20 -5 -20 20 -21 -63 -23 8 24 -13 -44 4 12 -97 7 11 27 10 -74 -1 3 -15 -36 27 92 -40 -33 -1 54
4986 54 15 -35 27 67 13 -51 -4 59 58 -18 -24 53 14 7 26 71 -3 -34 -49 -3 1 -26 -19 48 27 -39 -45 -17 3 15 -20 -9 11
5019 11 -42 -55 5 40 6 -24 2 -9 4 -46 -7 34 -32 -59 -17 7 38 16 -18 16 1 -53 -59 13 42 20 -19 -1 29 -42 -1
5050 -1 21 46 -6 -16 -30 74 -7 -33 20 48 -9 -90 -11 15 34 -55 -15 39 5 -29 18 38 46 -53 -37 -10 1 -15 10 40 18
5081 18 -52 -61 14 12 2 -11 -2 76 -9 -35 3 26 7 -25 10 31 -47 -31 36 -2 12 -23 -18 18 46 -31 6 38 15 -14 -55 26
5113 26 42 -15 -1 20 27 -77 -84 5 44 -21 -24 -49 16 -25 -28 -26 50 26 -56 1 14 48 -7 -18 45 13 -28 0 25 13 0 2 7
$$ packed form
4890C5%m0l4M0N5l3m9J5k7J3P%O8l0l8m5N1L8p7L6K0JLn1O6K0l7m9L6L6o8N6o
4923A2M4m0m6J3j2M8k2jM8m8j4L7lJ3pl7N8j5o4j4P7K3l8rRJ5n9kP8L2q8m8J8
4956d2J01p9J5j5M0m1m2M0L1J6l7l1M8Qj09J04MJ6j7q4P3Mj8k1O3O5j32PL2N5
4986E4l9n0O2M0n4o4M7O3jp6oP7l9pJ9M5p4l1j5M6Mk7PO7k1o6oK8K0J2l5J1K0
5019A1n3j3O0L5l4l0K6j1J3n0L9M1o6k7M2K4L1k2l4L4j5n4oP2K9k2l9J8L0p1M1
5050aK2K5n2j0j4J04q1k6N3K8n7q1P9K6J9q9M0N4l4l4M7K0Qr9J6K7J1j6K5L0k2
5081A8p0rP5kj0j3RP8q5k6L8K3j9l2L5K1p8J6O7l8J4l5NL6K8p7L7L2k3k9m1Q1
5113B6J6n7J4K1Pj04pQ9L9o5lk5O5m1lKP6k4q2N7J3L4n5j1O3l2m1K8K5j2j3KN
$$ plain form
5146 7 5 -29 -15 26 32 -45 -40 -57 -5 -4 -5 27 11 24 -51 -45 12 39 -36 31 -15 3 -61 -21 -17 35 -40 -44 -10 -26 -25 -30 53 12 -9 -2
5182 -2 11 35 24 -5 -5 18 -11 -76 27 54 33 -17 -32 29 10 -33 9 65 22 6 -21 28 6 24 -9 32 25 -31 -24 18 16 36
5214 36 -5 -10 -19 -27 14 14 35 -28 -26 -35 -7 -37 -23 -4 30 1 -18 -35 13 12 16 2 14 1 -51 -21 -1 21 0 33 32 26 -49 39 62
5249 62 28 -27 -14 -1 17 -7 25 34 5 -46 -56 -40 5 16 4 6 6 -8 -10 -15 53 33 -13 -23 -6 -27 17 17 24 40 -44 -24 -34 4
5283 4 9 16 31 -20 -17 4 -8 13 -26 9 -17 -20 -37 0 24 49 13 -29 -32 -26 19 17 -7 8 5 -1 -39 -20 45 3 12 -6 -13 -21 22 21 36
5320 36 -36 6 -18 -12 38 -8 3 -4 -43 -36 -26 -52 0 6 -3 13 -29 -44 17 13 9 -1 -4 -3 -15 22 7 41 48 17 5 2 -7 20 46 14
5356 14 41 -14 -4 -9 -4 29 36 -29 6 -46 -13 -6 67 -12 -23 -39 12 12 3 3 21 2 -31 37 -28 13 -5 32 4 -3 -27 -18 30 52 34
5391 34 2 -1 14 -25 -33 17 5 15 -14 -46 14 33 16 35 43 -31 -44 1 23 35 31 3 30 19 15 29 7 39 0 -2 25 2 -19
$$ packed form
5146Gkl4J4M1Op7Nj7N2JjL2j6J3p5ON7K7p5O7m6J8o4M0MN2p5mL4j6JnQ3m1k1P
5182bJ3K4j1k9%K3k9o5J03K7k1n0j5O1j9m3M2N6m3j6k7M9k2J8l3M1pn6PM2kK0
5214C6m1nrqM1%K1o3KrK8l0J4J9L4k9j9j7M8jMj4J2j3n2L0K0K2k1L3jop5Q8K3
5249F2l4n5J3J3J8k4L2Rk9n1j0J6M5J1j2K%j4knO8k0m6j0J7k1M4%PJ6q4K0j0L8
5283DNPJ5n1LK1j2K1l9L5k6lj7L7K4K5l6m2lOM5kk4J5lol8J9O5m2Rj8pqM3jJ5
5320C6p2M2k4ON0m6J1pl9PJ0k6N2OrJ6m2j5O1mmj0lJj2L7j5L4Pl1j2lrK7K6l2
5356A4K7n5J0nNL3Po5L5n2L3PP3p9j1j6N1%r%J8j9l3O8o5M1j8L7k8pk4RM8K2j8
5391C4l2lJ5l9qN0j2J0k9l2O0J9j7J9Qp4j3M5K2J2mk8K7j1mJ4k2L2l9kK7k3k1
$$ plain form
5424 -19 -27 25 14 -11 -47 9 -16 27 6 -9 1 -36 -39 -48 13 59 6 4 17 0 -15 -10 25 5 -23 -40 19 -7 10 32 52 7 -32
5457 -32 4 -6 33 35 8 11 24 -12 -20 34 60 -10 -23 -18 -1 -1 8 26 48 -2 -45 -7 6 31 -45 -21 15 -11 0 -20 30 4 -4 -22
5491 -22 -15 -23 -30 -7 56 20 -6 -46 -5 22 -6 -10 56 25 -54 -37 5 62 14 -15 3 48 0 -50 -6 25 18 4 -43 15 -17 -11 14
5524 14 27 2 -27 1 21 17 -1 -30 62 29 5 4 13 21 -13 -4 -22 23 -15 18 31 21 4 -55 -18 32 26 -28 2 19 11 -58 -36 13
5558 13 34 13 -3 18 -16 -11 -17 28 21 -6 12 22 22 -22 -2 8 54 19 -39 -2 -17 -6 9 6 4 -37 -69 -4 59 3 2 -20 23 -3
5592 -3 -65 -28 10 49 13 -25 29 -15 6 15 36 38 -30 -30 16 49 -6 -9 18 30 -35 -21 21 58 9 -47 -9 11 11 -13 19 40 30
5625 30 -31 -51 29 16 6 7 16 -4 -23 -49 21 37 -41 -3 4 -11 -20 -40 -22 52 -15 -70 16 29 -24 -3 15 28 -23 -28 4 24 54
5658 54 -22 41 46 22 -19 -11 77 13 -9 6 25 1 -54 7 12 37 -20 -33 10 51 -7 -9 30 34 -28 -45 9 40 22 -24 -20 -5 -27
$$ packed form
5424a9qN2j1k5l6N6k5M3k1j5J0l7lrO1M6n3kJ3j7j5NL5k0k8j7N9k6J7K2K0m5l9
5457c2L6j0L9Kk7LJ3l6qN4K6p0j3NJ7%RJ8K2n0m3L8J3K5p6K4L6k6J1k0N0k6qj8
5491b2PqpK3O3l6k6m0M1K7k8mO6l1p9J7M2N7m8k9J8M5m8n0M4L1pj4m7N8l2OK5
5524A4J3k5k9K8K0mj8k9R2l3k4jRQl4Rj8M5l8L3J3j0j7n9L7N0on4L0J7qo9K2M9
5558A3K1k1j6K1l4NoM5pk7J8J0%m4K0J0M6l5n8L7j5J1J5lkm1l2O5O3n6jk2M3k6
5592co2L7L8L9l6l8N4m4K1RK1Ko8%M6L3n5lK7J2o5J4M2L7m9n6L8K0%k4L2K1j0
5625C0o1k0Q0j3j0JRk0j9k6P0J6p8L8Pj5rk0J8P4o7n5Q6J3n3K1J8J3n1nL2K0L0
5658E4p6O3Nk4m1QQ8o4k2J5J9k4n5O1NK5n7j3M3M1n8kL9Mo2j7N4L1j8m6MJ5k2
$$ plain form
5691 -27 -25 15 29 -33 -61 -31 3 15 -23 2 42 8 -32 -34 2 16 0 20 0 7 -7 20 25 32 17 -24 6 10 -5 8 -2 47 -25
5724 -25 -21 14 47 6 -6 -10 -7 51 -3 -61 57 41 -9 -3 -14 -10 -73 -4 33 50 -16 -36 -4 -8 8 -20 5 18 -24 -56 -34 -25 -31 -15
5758 -15 -17 28 -15 -19 6 39 35 14 -6 12 9 -28 -13 19 31 -71 -29 32 40 -9 17 63 33 -14 -6 35 -10 -2 -4 -27 21 -38 -38 -23
5792 -23 13 -33 -51 19 -34 -8 -18 14 -14 9 -75 -31 29 26 -3 -1 20 -14 -6 6 21 31 -10 7 8 -4 -34 -5 69 21 30 -1 1
5825 1 40 50 -1 6 70 -11 13 13 24 42 -48 20 -15 -4 -16 5 32 7 -26 0 27 26 31 -31 24 -12 -21 -33 11 -15 12 39 29
5858 29 -14 -15 -25 -32 25 8 -7 18 3 22 30 44 14 37 28 -15 6 32 -17 19 33 -14 12 -7 -1 34 59 35 -8 7 -21 -13 24
5891 24 5 -36 -19 -23 1 -8 12 29 3 6 -6 5 2 37 -23 12 -22 -53 -12 9 43 53 3 -7 -9 -3 11 -9 51 53 -4 1 -48 24
5925 24 14 -11 40 -23 -7 -15 0 6 40 19 12 -8 30 -34 5 13 14 -2 -2 -18 -24 -12 26 -28 -19 -8 11 -21 8 0 5 13 22 -12 6 -23
$$ packed form
5691b7KM0J4o2k8L0L4J2l8K5M0l4m0kL6J4j6K0k0Pj4K7NPj5m1L0Mj5J3j0M9p2
5724b5ML5L3m1j2mLN8n4n8J18j6n0Oj1Mo3O9L7J7o6k0L2mJ6k8K5J3m2l2K2RoJ6
5758a5kM5m3mK5L3mk1k0J8ll7J5L2J2j02M2O1Qm9K6M6l0m7QM1m5Qkk3M8n9%J5
5792b3L6m6j8P0n3K6j0L2k8K3q4M4O0lk9KK1l4QJ2J5J0m1J7Jj2l0K9P4m8Rl1K
5825AL9J0n1PO4q1K4%J1J8r0O8l5J1j2K1K7k5l3K6K7jNo2N5l6rj2M4k6K7K7j0
5858B9m3jj0pN7j7j5K5j5J9QJ4l0K3rm3K1K6m9L6J4m7K6j9OL5K5k4m3J5k8QL7
5891B4j9m1J7mK4rK0J7k6Lj2J1lL5o0L5l4l1M1K1L4J0n0j0kOJ4k0O0Kn7Nm9P2
5925B4j0k5N1o3J6qJ5OL4k1pk0L8o4L9QJj6%j6oJ2L8n4RJ1J9l2K9qNQRl4J8k9
$$ plain form
5961 -23 4 21 -8 -32 26 13 22 48 24 65 -14 16 23 36 18 11 27 -17 4 14 31 48 19 29 10 9 -3 18 -10 24 -16 -64
5993 -64 -1 15 -2 -33 -6 -1 -9 -11 24 22 20 -15 -8 7 -4 6 9 -15 -1 -15 -20 22 -3 9 13 9 -7 1 -18 7 3 -6 12 5 18 -31 -29 29
6031 29 40 21 25 19 18 23 -5 14 64 37 1 11 -4 -14 0 18 15 6 -22 -27 -37 -33 -3 22 4 13 -20 -27 -6 18 18 -29 -12 -20 -10 -4 19
6068 19 13 -11 -18 11 -3 0 -47 11 35 7 13 -1 70 26 -11 26 24 -1 -34 8 51 -27 -20 1 -6 24 2 41 19 -1 1 -15 14 13 -20
6103 -20 -2 -7 -6 -15 -48 -41 9 -15 -32 -33 5 -1 10 13 50 18 -17 -22 -5 21 27 -13 32 -21 -31 -26 -9 3 -16 4 7 14 -10 -1 13 6 -11
6140 -11 -39 4 -24 -3 2 35 13 -19 0 11 1 -11 -25 -25 9 9 -20 -10 5 12 -7 -30 -5 -15 -22 12 0 9 -48 -16 -50 -8 35
6173 35 -11 -3 20 -7 -26 2 34 17 -4 -2 -1 -17 21 8 3 21 -50 45 -12 23 -25 1 35 -18 0 -41 13 6 18 -12 -1 26 -34
6206 -34 3 19 -7 25 15 -22 -11 -24 -7 4 47 -32 26 25 32 17 19 12 -18 -39 -53 -4 25 14 -6 -16 -11 7 -45 -15 31 61 1
$$ packed form
5961b3K7J7k9k4N8j3RK6k4M1p9L0PJ3j8pJ6m4K1J0J7J7k9J0j9jj2K1k8L4m0m8
5993f4O3J6j7l1K7NqkL5kkl5PJ5j1J0Lk4J4j4nM2k5J2Mmj6Qj9K5mrJ8pJ3m9KN8
6031B9J1j9MojNk8J9N0k7l6J0j5j0J4J8lrk8nj0ML0K5j8Rl3pK1K4%m7J7qJ0OK3
6068A9ok4pK9j4Lm7N8K4k8Oj4P1m4l7L7kk5l3M2M3p8PK1pL0k2L9k2k0Kj6K9jl3
6103b0J8nJrl3PN0k4j7jL8oJ1LL7l2l5nJ7K6Om0M5n3j0NJ7J2j9K0LPk4RJ4pj7
6140a1k8M3k8K1NL3k2l2J9J1j0j2j4%L4%k9J0J5Pj9k3K5j0pL4j2Rn7L2l4M2M3
6173C5m6QK3k7j9K8L2j7k1KJj6L8j3nJ8p1R5n7L5m8K6L4n3J8m1N4pJ2l0J1K7o0
6206c4L7J6k6L2j0l7J1j3J7J1M3p9N8jPj5Kpl0k1j4M9K9j1k0j0NJ8n2L0M6L0o0
$$ plain form
6239 1 -32 12 5 6 28 6 11 11 -4 -1 4 -5 13 37 -12 -14 0 -21 25 -19 -54 23 24 -14 14 -16 20 22 1 -12 64 19 -24 -2 48 22
6275 22 -39 4 45 39 18 16 6 20 -9 -20 27 40 21 27 8 24 38 14 22 52 29 -25 -8 49 13 12 -3 44 -4 -21 2 -20 45
6308 45 16 -39 -19 -11 -2 -14 10 -2 5 -12 -9 8 -13 -47 54 -4 -11 -21 -60 -4 -6 4 -26 24 -2 -36 20 39 -34 25 -8 -37 33
6341 33 -7 11 11 7 -24 -25 10 33 1 19 5 8 35 23 -1 51 18 -6 -27 2 -23 25 -1 11 3 -31 2 10 29 -40 3 -9 -3 -17
6375 -17 -4 24 -10 19 -28 -2 -4 -11 39 65 26 38 3 -16 57 30 9 41 22 9 -30 19 -6 1 22 8 11 8 -3 18 61 -13 4
6408 4 11 6 -46 14 29 41 12 -22 -7 -15 -16 -11 -6 -2 11 7 -4 10 39 34 -15 -5 5 7 11 13 7 3 -25 -3 27 4 -18 18 -3 20 -17 -7
6446 -7 28 17 11 -27 4 9 10 5 2 14 6 -2 -27 4 8 0 -2 26 -3 -21 -43 -11 -21 -31 9 7 35 -44 -20 -3 56 35 12 17 19 -21 26
6483 26 1 13 -10 -14 2 -20 29 0 11 3 -20 -16 18 12 38 3 -48 9 32 2 37 40 5 0 -6 -29 -24 -5 21 14 5 -50 -11 -32 -18
$$ packed form
6239Al3M4pJK2k2N%j5LNrJ8K4m9kJ4k1M6m4l5P7Jl8K8l0L6Kk1j3P6m5m3K2N0k6
6275B2o1M3M1ok1kj0J4k9j1M7J3j9Oj9J6J4k4QL0k3n4J7N7l6jj5M7m8j7K3k2O5
6308D5k9n5K0QRj2K4j2Pj7LJ7k1l4J01n8pj0l9N6kJ0l0N0k6l4N6J9p3N9l3k9P0
6341C3m0J8%ml1jL5K3l2J8j4LK7j2k4N2l3k4k1K9k5M8k6J2ql4L3QJ9o9M3j2Oj4
6375a7J3K8l4K9m7K6kpN0K6l9J2l5j9P3k7k1L2j9j3l9M9k5PK1j4Llj1K1M3p4J7
6408DPnn2O0J5J2k9l4J5qjNNMJ3mj1J4K9nm9J0J0KMKomk8K2L0k3k2L6k1K3l7J0
6446gL5j1ol8L1NJnlJ2qqk5L1MqkK8k9j8k2L2j0j0M0kK8p9K4J7N9k1k3NKm0M7
6483B6k5J2k3mJ6k2M9k9J1qk3ML4oK6l5n1N7K3l0L5Ll5nok3NJ9K6prn5L9k1J4
$$ plain form
6518 -18 23 -1 -13 -28 -5 -12 13 -1 -10 -35 14 5 -13 41 15 -13 22 31 19 -22 2 24 22 30 0 -25 -5 6 -19 10 31 28 -21 3
6552 3 17 24 -11 -12 -17 12 8 1 8 8 27 -6 -9 2 41 9 14 4 4 -26 -17 7 4 -5 -19 -52 -15 19 -8 -17 14 -39 15 18 -6 48 -1 29
6590 29 6 1 -22 11 0 41 -5 -7 31 -4 -3 -6 19 30 34 -18 -12 -1 22 8 8 -4 -15 -15 23 8 -17 38 -36 27 -9 -29 -12 35
6624 35 16 2 -2 -10 -15 -10 0 -3 10 -14 3 2 -4 -12 0 23 -1 -4 -16 -1 14 13 33 -6 39 41 -13 15 32 -31 0 5 -4 -22 -7 19 4
6661 4 18 -21 -13 -14 -6 -6 0 -3 1 -8 9 11 -6 -25 -6 -14 -26 27 11 7 -1 3 0 -25 -1 -37 52 11 -4 -14 -4 -37 6 8 23 10 13 -32 -30
6700 -30 0 -16 3 -3 6 17 24 -39 -21 13 18 -6 39 7 0 -7 25 32 -5 -30 -17 14 3 42 -23 -24 -6 -26 -49 35 17 0 -13 -40
6734 -40 8 -1 5 10 27 -12 15 -8 19 17 -10 15 13 8 -31 -10 38 0 -13 12 3 8 -13 -11 14 2 2 -2 -56 -13 23 18 -15 20 32 -26
6770 -26 -24 15 61 7 -15 3 -6 -9 -15 -12 -10 -26 -68 -39 -12 5 21 -5 -18 -10 -16 -11 -20 16 -6 7 -12 -13 -1 -8 5 50 1 -27 -15 10
$$ packed form
6518a8M1k4j2j5K3pK5j4rk5M9rj8N4k6k8L5Rj2m1K4K2kQl0k5K0J1k5K9K1lm9K4
6552CJ4Pl5jnK9mpP%J9l3lJ1L9l2Nj0%l0RK4lrj4l3L7L4k7rL1n3N4Lk4N4m9L0
6590B9k3nk3L3j1M1m6kL8l5JlK5J1Mn2OJ1K3j4%j2j1%L8j5k5N5p4O3l6k0J7M7
6624C5j9j4mqnNJ0lJ3k4J7joqJ2K3k4lj2J5J5jK0l9M5Kn4K8J7o3L1Nrj8J5K6j5
6661DJ4l9QjQ%OlMrJ7Kj7j9J9qj2N3j6mqMlk5K4l6Q9m1j5j0J0l3M3KJ5j3Lm5K
6700c0L0j6J9oRJ1Po3J8L4Nk4M5l2ppL2Pl7k5J3L1j1L9o5jJ8k0k3Q4j8j7j3k7
6734d0M8rONJ7l9K7k3K7kk7K5knl9K1M8l8j3K5rNk1KK5j2%mn4M3L6nl3L5J2n8
6770b6KL9M6n4k2J8rloLKj6m2K9K7J7J6k6j3QoNrL6k2J3j9jJ2pJ3M5m9k8J2K5
$$ plain form
6806 10 -15 -23 -31 43 17 -5 8 -22 47 -9 1 -6 -25 -7 2 12 -6 -35 9 -5 16 -21 22 11 2 7 -30 37 36 11 15 6 40 -5 -30
6841 -30 -48 26 6 -27 -23 -9 4 -12 -18 2 1 -15 8 10 -26 -14 1 27 2 -32 -1 -30 31 -1 -16 12 -21 -8 0 21 3 20 2
6874 2 19 -10 -4 -6 40 -22 0 -10 25 20 2 37 11 5 2 15 -16 0 -18 -35 2 -12 -26 -20 -11 8 1 13 -6 12 21 -26 -4 2 29 -12
6910 -12 8 30 24 35 18 29 10 -17 -18 13 16 9 -28 34 39 15 -12 34 -2 -9 -31 -33 -19 6 -14 -3 2 -11 -1 -39 20 -11 20 -55
6944 -55 -20 14 -6 -10 26 -20 25 -28 -8 16 -18 37 11 -1 -8 3 14 10 6 -21 38 0 -18 -19 24 41 5 -7 21 11 24 -4 15
6977 15 -2 -6 -4 -39 26 -15 8 8 -5 4 -37 17 2 14 17 -12 -10 6 -14 6 -8 30 28 -1 -25 -19 -10 7 -8 49 16 14 18 -8 23 -11
7013 -11 -2 -7 4 -24 -2 4 6 5 -32 -3 -42 44 13 42 10 33 -4 22 39 -15 -16 33 33 18 12 -2 7 -23 24 -11 23 -1 8 9 -21 11
7049 11 6 -5 -30 -20 -33 4 21 5 -19 20 13 34 -4 -20 4 24 13 -5 51 -11 12 11 6 0 1 17 -6 25 4 -7 -13 -16 -22 8 -37
$$ packed form
6806A0k5qqP4k6k2J3l0O9n6J0pj9J8RJ0j8k9M4j4K1l7M3j1rNl7O7jk5MrL4m5k5
6841c0j8P4k0l3MJ4J3j6oK0jj6K3Kl6J2J5K6k5l4L1k9O1l2j5K8l3J3QK1j8J7j8
6874BJ7k9OkM6o2K2j0L5nj8L5k6olJ3l1J6j8j7L7j4j4ORJ9pJ2j9J8Rm7K2OK7m1
6910a2K0K2oJ1j7J1j9k7jL1Lpl7O2Nk4k7M6l6pk2kJ4K5k0J1Nj3J0l8N9l1L1p5
6944e5L5L4k0mL6m6M5n3K0K4l4N5k6j2pJ1J1mmk7N9l8j8jM3J7l6j2K8j0J3k8J9
6977A5j7mKl5O5m1K3%j3Rm1N4j5J2Lk9KJ6k0K0j4L8kk9k4ORJ7j5N7l3kMk6L1l4
7013a1RnJ1k8K2OKjl7K9l9Q6l1K9l2K3l7K6J7n4jM9%j5oj4Rl0M7l5L4k4RJl0L2
7049A1nj1k5J0j3L7J7j6k4L9pK1l8j6K4K0j1j8N6o2K3jnoJJ6k3L1k1j1oloL0m5
$$ plain form
7084 -37 16 -47 -10 -19 21 5 -12 -21 -4 2 -8 15 10 -18 -40 -41 -35 -12 14 34 8 -29 -56 -7 -11 4 14 -1 12 0 -8 -22 20 11 -3
7119 -3 7 9 -24 13 -6 -33 -8 4 14 5 5 1 30 0 -3 13 -8 9 11 29 40 -13 7 -36 50 -28 -7 -8 30 13 -25 7 -6 23
7153 23 -21 -3 16 -22 -19 11 25 6 -1 -18 -13 -8 -15 30 14 21 15 22 -4 -6 10 45 -3 -4 1 1 12 10 16 7 41 -17 12 -8 -13 30 -8 30
7191 30 -7 11 10 16 28 35 10 -14 -35 -8 7 8 22 31 -3 -1 12 50 -16 0 9 13 24 -9 -21 42 8 7 24 12 6 41 3 -10 36
7226 36 4 1 12 6 9 5 16 -5 -14 -12 -2 -2 8 -9 5 -1 2 4 27 7 -1 -26 -9 -6 -16 -9 14 1 -9 -42 -22 -8 -9 15 19 28 19 -10 7
7265 7 -13 0 25 -1 -4 -37 30 13 7 -14 -21 -42 3 -4 -19 -14 19 -53 10 -6 -19 19 19 0 17 1 -18 14 5 10 9 13 -37 18 24 -3
7301 -3 -13 -14 8 -41 -36 30 44 -26 -16 27 29 -4 -7 27 9 -14 15 -46 -23 4 -7 19 8 -1 -1 -21 4 31 -13 16 18 19 -22 17 -10
7336 -10 3 31 -15 40 5 21 23 12 10 -18 -35 12 -4 34 -14 1 -15 -16 -32 -22 -19 23 -27 -15 -5 17 -5 7 58 -19 -24 -12 -6
$$ packed form
7084c7N3o3L7rM0j6j7rJ7Oj0K3nk8k2jOK3K6K0k6l7k7M9mJ5J0j5J3j2qj4M2rj4
7119cJ0Kl3L7j9k7K5J2J0r%mK9l0lJ6k1J7KJ8J1n3K0m3Q6p8K1jL8j7l8L2j3K9
7153B3m4J8J9l8LL0J4j9pj7NNpM5j6PoPk6kJ6L5m8jN%J1kOrL4n8K9k0nM3l8L8
7191C0l7J8jOJ2Pk5k4k1K7J5JJ4Rl4KJ3L8o6J6RMJ1l3j2O3l4jJ7j2oL5l8j3M6
7226C6l2lJ1oLmJ1k1rKJ0%J0j7J4oLKK3k0qk5J7Lj0PK3j3j0l3K0J4jK4MRrk9J7
7265Gk0J3K5k6ll3O7j7ok1pk1M5pj5NL3p2O3j6j3L8%j9J7j6j9L2rNjMn0N5Ok7
7301cj0jK2m9NO6J4p0J0M3Kl3lL4j8k3K9o1K3K7j1K6j1r%k0K5K7m4K9KJm1L9k7
7336a0J3K8m6N5l5J6Kj1kk8j7M7j6L8m8J5j6jj6J0LM2n0J2J0K2k2J2N1p7nJ2O
$$ plain form
7369 -6 -22 -29 -15 27 10 -19 -7 37 20 36 -11 9 -13 -19 -8 23 -9 -15 -9 5 3 -18 21 54 1 -2 -21 -5 -16 -1 38 -5 34 -10
7403 -10 6 -16 -1 -33 7 -16 -8 -10 -27 28 14 32 -15 -10 2 -15 -15 12 23 0 -2 5 23 12 31 -34 36 17 0 52 10 15 6 -2 -1
7438 -1 47 5 21 18 13 55 1 -11 6 24 -21 6 27 11 -13 -17 1 10 4 19 -21 1 5 33 -14 12 -17 0 -1 -15 -12 -11 -11 17 -33 -18
7474 -18 -18 -6 -18 45 6 2 8 -10 32 18 12 6 1 38 -15 -10 2 -7 -14 -21 -43 22 2 14 -5 35 22 -1 -13 7 19 -2 -21 8 3 -37
7510 -37 -21 -14 25 -1 -22 -1 -6 11 -23 15 20 2 -4 42 9 -21 17 -13 8 14 10 -42 -36 22 1 14 4 0 -21 37 16 -3 20 -23
7544 -23 32 -6 10 8 42 38 -1 -5 -22 -3 9 -5 11 10 41 14 33 20 -4 -5 -5 25 37 -12 -15 12 15 27 -25 20 -17 -29 5 -9
7578 -9 -21 -6 -11 4 31 -14 -6 34 33 -29 -2 34 25 15 10 1 29 -13 40 21 31 14 -8 -13 9 -6 -28 -2 -15 -18 3 -4 20 0 18
7613 18 -1 -31 4 20 -16 19 19 16 -20 -9 44 23 -18 -9 16 -11 -47 40 13 1 11 0 4 -23 -8 -34 17 -50 -2 17 1 -48
$$ packed form
7369fj6pJ4M2j7k9J2M4j7J6m7K0k2oJ1L1l2oOJ4kk1L9L3n3lj9J6j1J5L9m3L9m4
7403a0J6k2J5l2M0k3Qkj7N5j4J8m7NJ2j7%K7J1k3kPJ8j1J9o5P0j9j7N2m2NrqJ
7438aM8m2J6lnM2n4j2J7J8m5K7K1j6k4mJ8RoJ5m0K2MK8m7K6k9J7jj4LJ%K8n0J5
7474a8%J2j2O3l9mOj8M2j4oonL7n3NJ2rppk2O5k0J2j9M0j3k3j2K0J2k1j9K9nm0
7510c7J6PL9k6k1K1nJ7l4L8Nj8oM6l3l0L8l0K1Omn2ON8k1J3j0mk1N8k1j9K3m3
7544b3N5l8J6kL4ml9mj7J9J2j4J6jL1k7J9j3k4j%L0J2m9lK7LJ2n2M5l7j2L4j4
7578ij2J5nJ5K7m5QM0jo2K7L6rj0nrK8m2N3j9J0j7k2nK2j5k2K6j3lK1pK4k0J8
7613A8j9l0L5J6l6L5%ll6J1N3k1m1RK5k7l6Q7k7j2J0j1Mk7J5k6N1o7M8J9j6m9
$$ plain form
7645 -48 24 -10 3 -23 -15 -5 14 -8 24 -13 -26 23 -60 -26 -15 25 -16 -3 -14 -11 15 -27 -13 8 -10 12 8 -2 -14 4 9 -22
7677 -22 2 0 -18 12 4 13 37 14 -1 19 -21 -8 24 -23 -22 -13 -12 7 -41 20 18 19 15 -6 25 29 6 0 -10 -13 9 -18 -2 20 -3 -34
7713 -34 15 -30 -23 27 0 -20 -2 8 -28 26 18 -22 -10 -23 -21 -25 16 -6 1 17 1 -16 -13 1 -2 26 10 18 2 7 -15 5 5 -4 -16 -4
7749 -4 -7 -27 2 -6 -13 -16 -55 12 -16 20 3 -11 3 17 -18 27 5 18 -16 -3 13 -9 2 3 -36 0 35 22 -8 -39 -19 5 -8
7782 -8 -16 -19 -48 4 -13 0 -7 -30 -1 -22 0 -17 15 4 -19 -32 7 27 -5 16 20 3 34 -11 -20 7 1 -12 -18 3 -15 3 -22 3
7816 3 -25 29 32 -32 -17 2 -8 5 15 -14 -10 -46 15 12 35 -4 -19 -25 10 20 23 36 -26 -18 14 1 7 14 11 44 -25 -18 -12 6 -16 -7 8
7853 8 14 -17 -7 2 23 0 16 9 10 28 19 -10 24 -4 -34 0 25 15 -45 -15 5 -12 12 21 25 16 -10 1 12 8 -8 -11 24 42 4 27
7889 27 -11 26 13 6 34 22 -16 -6 -7 -12 -2 -5 -25 -12 -18 3 -17 31 9 52 -18 -10 -16 5 37 29 27 -25 -11 -3 20 38 -4 42 12
$$ packed form
7645d8P2l4J3k6QJ0J9k2L2l7j3M9q3L4J1M0m1J3j1LK6m2J4K1j8K2mj0j2J8Nl1
7677b2K4kj8L0qRK4k3j5K0m0J3L2m7JRJJ9m8O1kJmk1L1Mk3oj0lK2k7J6K2k3l1
7713c4M9m5PN0k7k0J8J0l6N4qm0J2j3KmM1k2PJ6j6j7LJ4lK8j6Qj6Nk2K0%rj2J2
7749dlk0K9qpll9O7k8L6j7j4J4J4l5M5k2J3l4J3J6k2J1Jl9L6L5j3l0l1K0K4j3
7782hqlk9N2j7J3pk3K9k1K2j7L2j1k3j3L9K0l2K1Mj7L1m5rK7oj3oK1j8J8k5K5
7816Ck8N4Lo4J5J9j0J3J0k9Ml6O1lK3l9j5oL5J0LJ3o2QL2j3OPlL3o9POJ8k2RJ5
7853HOl1J0RK1k3J6pJJ8rk9L4k8l0L4K5j0o0L0K0j7K4RMrk6J1J1mj6lL5J8l8K3
7889B7l8L7j3pK8j2l8J0jnJ0lk0J3oK1k0M8k2M3p0QoK1L2qkn2J4QK3J8m2M6l0
$$ plain form
7924 12 -16 -5 -11 -8 31 24 0 -28 -5 -15 34 -17 -1 -7 4 30 5 -40 1 38 -10 16 -24 3 -24 62 -3 -3 0 11 -19 -4 -14
7957 -14 -5 -3 15 50 -6 -15 33 -5 52 -15 -40 2 -25 21 -14 8 3 -18 30 -1 14 3 20 -30 -2 -19 -9 16 19 -41 -36 -8 -5 1
7991 1 -12 30 18 -4 -21 -1 18 44 22 9 19 22 0 3 27 -8 -6 -17 -18 -14 -5 -25 13 21 9 12 48 18 71 -6 -1 16 -44 30 30 12
8027 12 8 2 7 22 -23 36 7 3 2 -9 -8 -13 27 15 11 -6 2 44 -25 -14 -27 15 22 3 16 -23 -2 -4 36 -20 7 -9 -4 -22 -23 -16 21
8064 21 -16 -1 12 20 16 -43 -12 22 -6 -13 32 -5 8 -1 13 12 -3 3 -20 48 22 33 -39 16 41 53 -4 -10 39 -16 -38 -9 -14 19
8098 19 -10 13 5 -13 -25 21 -2 30 20 -20 24 -13 6 8 6 -25 8 -17 28 -1 12 -4 35 35 21 -9 -13 23 -8 -1 -12 1 -39
8131 -39 -17 8 7 -7 -20 8 7 28 5 8 24 8 -9 11 26 -10 -27 -12 -6 34 -19 19 10 6 36 1 9 10 12 8 18 42 13 -2 -2 20
8167 20 47 -17 5 22 -25 14 -4 12 9 -43 8 9 -17 29 14 10 14 -25 12 2 45 -1 -24 -5
$$ packed form
7924A2k8J1oLL9pk4k8K3j0M9n1J6oJ1K6k5m5M1L7m8K6m0K7k7Q6o5%LJ1l0J5j0
7957a4RKJ8L5n6rM8l8N7o7k5M2k7M6l5K2nk1M8l1J5j1J7n0K8j7J0K5Lo0NK8LO
7991Aj3M2j2k2j7K0J9K6k2j3J0Lk2LK4l5Kj1jMRk0L8Qj2LL6l0N3p7NJ7o0P4%j8
8027A2moNJ5m5N9k9mjj1JnM0j2mj7QM2o9J1j3M2Pj9J3l9K1kM0n6K7j6Nj8jPL7
8064B1l7J5J3Qmn9L1L4k8pM5l7J3rJ4jj5Ok3O8k6J1p2N5K5J2n7oM9n5k2K9nL3
8098A9k9K3qj8j2M6k3L2j0m0M4l7J9Kkl1L3k5M5k9J3j6L9%j4l0mL6l1Pj1J3m0
8131c9K2K5jj4j3K8jK1k3LJ6j6j7K0J5l6j7J5OM0n3L8rmL0l5QJKmJ0K4k9j5%K2
8167B0K7o4K2J7m7L9j8J6ln2N1Jk6M6j5mMl9L7j0M3m6k3J9
8191e
$$ Imaginary data points
##PAGE= N=2
##DATA TABLE= (X++(I..I)), XYDATA
$$ plain form
0 0 0 0 0 0 0 0 0 0 0 0 0 0 0 0 0 0 0 0 0 0 0 0 1 -16 16 -16 16 -16 16 -16 26 -32 32 -32 41 -48 49 -60 64 -72 81 -89
42 -89 97 -113 120 -133 145 -161 178 -198 217 -240 265 -294 323 -357 395 -442 490 -551 624 -710
62 -710 819 -956 1145 -1408 1808 -2512 4051 -15312 34356 59098 -11314 -23592 14784 7282
76 7282 -57999 -53904 23855 53899 -3980 -29743 17791 37896 -20407 -48494 10704 58135 15722
89 15722 -26804 11577 56216 16053 -43928 -30382 10394 -9384 -44035 -7706 51396 27556
101 27556 -45508 -52716 2693 18296 -11535 640 54973 53361 -15054 -47214 -7475 18748
113 18748 -7730 -14836 29172 44252 -10200 -50401 -14996 26357 3604 -30189 -6605 29329
125 29329 9437 -27567 -13064 19524 935 -37759 -19969 32373 37530 964 -3488 23913
$$ packed form
0@%%%%%%%%%%%%%%%%%%%%%%Jj7L2l2L2l2L2l2M2n8O4o4P3q9R7j09J24j36J53j70
42h9J86k10K33k53K78l06L39l76M15m57N05n59O17o80P52q37R32j041J175j334
62g10J529j775K101k553L216m320O563j9363M9668K4742p0412j2278L8376p502
76G282o5281M095P7759L0044n7879k5763M7534K0105n8303k8087N9198M7431m2413
89A5722m2526L8381M4639m0163n9981J3546M0776j9778l4651L6329N9102k3840
101B7556p3064p208N5409J5603k9831J2175N4333j612o8415l2160L9739K6223
113A8748k6478p106M4008J5080n4452m0201L5405M1353k2753l3793K3584L5934
125B9329j9892l7004J4503L2588j8589l8694J7790N2342N157l6566m452K7401
$$ plain form
137 23913 14643 -30035 -33966 14360 38809 9843 -13692 -2437 -3349 -34721 -39890 5642 38823
150 38823 15282 -16176 -5700 13110 -2801 -22291 -2359 26679 16152 -11403 -6682 15637
162 15637 9231 -14903 -11721 11118 8739 -13603 -10122 18158 21890 -8599 -27397 -14324 -1545
175 -1545 -6048 -2054 19000 23168 -3582 -23907 -10885 9206 8147 2881 13975 21600 2720
188 2720 -20983 -17558 1952 6599 -1478 -332 6100 -1374 -13975 -8403 8582 9113 -6586 -11451
202 -11451 1416 9826 4408 519 4754 2997 -8305 -11427 1181 12563 10098 3576 2292 -1467
216 -1467 -11958 -15549 -2818 12225 12145 831 -7321 -9023 -8935 -5200 4547 11603 7457 -1893 -4588
231 -4588 -349 2268 1441 2128 3693 1247 -3671 -4338 99 3672 3114 209 -3708 -7296 -7044 -263
$$ packed form
137B3913r270m4678l931M8326K4449k8966k3535J1255r12l1372n169M5532L3181
150C8823k3541l1458J0476J8810j5911j9490J9932K9038j0527k7555M721K2319
162A5637o406k4134L182K2839k379k2342L481K8280L732l0489j8798J3073J2779
175a545m503L994K1054M168k6750k0325J3022K0091j059n266J1094P625j8880
188B720k3703L425J9510M647q077J146O432p474j2601N572J6985N31j5699m865
202a1451J2867Q410n418l889M235j757j1302l122J2608J1382k465o522j284l759
216a467j0491l591J2731J5043q0j1314q152j702Q8L735R747P056m146r350k695
231d588M239K617q27O87J565k446m918o67M437L573n58k905l917l588K52O781
$$ plain form
247 -263 7970 9001 2056 -6140 -9158 -6181 661 7797 9722 4822 -2437 -5767 -4491 -1596 1955
262 1955 5820 6541 1260 -5733 -7519 -3637 1180 3820 4116 955 -5043 -7769 -2393 6039 7767 2069
278 2069 -3400 -4020 -2587 -557 3491 7088 4792 -2444 -6545 -4188 -404 1337 3434 5759 2790
293 2790 -5530 -9738 -4383 4243 6865 3854 357 -3028 -6144 -4850 2583 8444 5364 -2204 -4918
308 -4918 -2340 -427 18 2564 5301 2302 -4509 -6779 -2427 2301 3474 3389 2510 -1929 -7350 -6238
324 -6238 2238 8320 5502 -1221 -4383 -3817 -2596 183 4739 6203 1327 -4736 -5185 -1429 1172 2025
340 2025 3496 3645 -764 -6328 -5831 644 5674 4990 1279 -2137 -4679 -4881 -651 5419 6622 1253
356 1253 -4451 -4979 -1943 691 2486 3905 2981 -1278 -5057 -4228 -26 3483 4120 2699 -415 -4316
$$ packed form
247b63Q233J031o945q196l018K977O842P136J925m900p259l330J276K895L551
262A955L865P21n281o993j786L882M817K640K96l161n998k726N376Q432J728n698
278B069n469o20J433K030M048L597k296p236m101K357L784J741K097K325k969
293B790q320m208N355Q626K622l011l497l385l116J294P433N861l080p568k714
308d918K578J913M45K546K737k999o811k270M352M728J173q5q79m439n421J112
324f238Q476O082k818o723l162N66J221K779M556J464m876o063m49L756K601Q53
340B025J471J49m409n564M97O475N030o84l711l416k542k02M230O070J203n369
356A253n704n28L036K634J795J419r24m259l779Q29M202L509O37j421l114l901
$$ plain form
372 -4316 -5615 -1754 4321 6298 2559 -2865 -5136 -3762 -338 3249 4825 2719 -1768 -4635 -3563
387 -3563 -31 2786 3737 2830 151 -3263 -4669 -2137 2597 5273 3632 -740 -4366 -4881 -1846 2704
403 2704 5190 3399 -1346 -4786 -4226 -667 2809 4017 2736 -198 -3054 -3916 -1725 1922 4193 3541
419 3541 471 -3033 -4684 -2928 1383 4817 4230 -16 -4186 -4975 -2208 1825 4330 3670 123 -3422
435 -3422 -3949 -1421 1790 3475 3103 1063 -1898 -3841 -2770 1019 4012 3650 623 -2684 -4375 -3342
451 -3342 506 4553 4812 477 -4195 -4783 -1889 1385 3363 3926 2085 -2037 -4759 -2999 1251 3498
467 3498 2883 1617 -68 -3018 -4604 -1547 3698 4735 623 -3075 -3038 -1732 -613 1764 4324 2562
483 2562 -3116 -5602 -1504 3279 3424 1640 1555 269 -3965 -5700 -538 5698 5207 232 -2113 -2088 -3664
$$ packed form
372d316j299L861O075J977l739n424k271J374L424L587J576k106m487k867J072
387c563L532K817R51r07k679l414j406K532M734K676j641m372l626n15L035M550
403B704K486j791m745l440N60L559L476J208j281k934k856q62K191L647K271o52
419C541l070l504j651J756M311L434n87m246m170p89K767M033K505o60l547l545
435c422n27K528L211J685l72k040k961j943J071L789K993l62l027l307j691J033
451c342L848M047K59m335m672n88K894L274J978N63j841m122k722J760M250K247
467C498o15j266j685k950j586L057N245J037m112l698L7J306J119K377K560j762
483B562n678k486M098M783J45j784q5j286m234j735N162O236m91m975k345K5j576
$$ plain form
500 -3664 -4171 1113 7153 5070 -2808 -5724 -1668 1027 -294 578 4053 2804 -3613 -5157 1136 5183
516 5183 1352 -2473 -278 1272 -2681 -4193 2405 7594 2093 -6299 -5808 -126 769 -568 3603 7700
532 7700 1571 -8395 -7739 1799 5501 1181 462 4496 1883 -7045 -7800 2041 7268 1200 -3406 1066
548 1066 3406 -2951 -5880 1877 7197 -457 -8160 -2669 6221 3965 -2815 -663 4140 -1296 -8893
563 -8893 -3113 9219 9121 -1526 -4804 380 -1022 -8268 -4926 8258 11179 -658 -8064 -2198 1911
578 1911 -3511 -4378 5791 10408 -195 -9077 -2470 5858 772 -6724 -1308 6762 1894 -6394 -1093
593 -1093 8853 4426 -7810 -7571 2984 4263 -2968 -943 8615 5631 -9278 -13043 -144 8102
607 8102 2465 -373 6612 6769 -6578 -13227 -1603 9379 3921 -4074 849 6322 -2277 -11213 -3477
$$ packed form
500c664n07N284O040k083p878k916M056K695j321Q72L475j249o417j544O293M047
516E183l831l825K195J550l953j512O598N189n501q392M91N682Q95j337M171M097
532G700o129r966O56R538L702m320p19M034k613q928p55R841N227o068m606M472
548A066K340o357k929P757N320p654p703N491Q890k256o780K152M803n436p597
563h893N780J2332r8j0647l278N184j402p246L342J3184K921j1837p406N866M109
578A911n422q67J0169M617j0603q882O607Q328n086p496N416Q070m868q288N301
593a093R946m427j2236K39J0555J279p231K025R558k984j4909l765J2899Q246
607H102n637k838O985J57j3347o649J1624J0982n458p995M923N473q599q936P736
$$ plain form
622 -3477 8496 4793 -5860 -2898 7547 5087 -5738 -4998 4484 2479 -8499 -6774 7482 11103
636 11103 -735 -6955 -175 2110 -6173 -6515 7292 14197 2647 -8932 -5111 860 -4123 -7309
650 -7309 3464 13002 4774 -8230 -6008 3588 2011 -5252 -878 8811 5383 -6105 -5782 4420
664 4420 4326 -6423 -7875 2668 6572 -826 -2490 6116 7091 -5254 -11705 -2293 6840 3067 -1341
679 -1341 3831 5856 -4958 -13399 -4938 7855 7271 254 1649 5685 -1163 -10327 -5953 5757 6248
694 6248 -2413 -3190 3609 2741 -5514 -5530 3458 5216 -2760 -4442 4367 8079 320 -5491 -1637 771
710 771 -4639 -5958 3579 10461 4046 -5168 -4628 -440 -2263 -3884 3399 10355 5245 -5360 -7083
725 -7083 -1751 -922 -3250 562 7153 5079 -3362 -4992 1036 2946 -1685 -2645 2317 3550 -1397 -2901
$$ packed form
622c477J1973l703j0653K962J0445k460j0825P40R482k005j0978J725J4256L621
636A1103j1838o220O780K285q283l42J3807O905j1550j1579L821N971m983l186
650g309J0773R538q228j3004K222R596j577p263M374R689l428j1488L23J0202
664D420r4j0749j452J0543L904p398j664Q606R75j2345o451R412R133l773m408
679a341N172K025j0814q441Q461J2793n84p017J395M036o848r164M374J1710M91
694F248q661p77O799q68q255j6Q988J758p976j682Q809L712p759n811L854K408
710G71n410j319R537O882o415r214N40M188j823j621P283O956n110j0605j723
725g083N332Q29k328L812O591k074q441j630O028J910m631r60M962J233m947j504
$$ plain form
741 -2901 2010 3352 -2872 -6639 -1909 3360 2418 1105 3913 4114 -2773 -8168 -4169 3019 4190 1897
757 1897 2245 2169 -3053 -7649 -3878 3696 5336 1823 715 1665 -899 -4650 -2874 2402 2931 -1209
773 -1209 -2176 1031 1839 -850 -1302 1225 868 -2774 -2616 2397 5061 1942 -1493 -1666 -2115 -4187 -2822
790 -2822 3102 6418 2920 -2000 -2878 -2079 -2500 -1322 3314 5803 2012 -3160 -3398 -928 -590 -920 1475
807 1475 3395 740 -2849 -1531 2122 1964 -1055 -1431 414 -141 -1776 97 3673 2614 -2393 -4250
823 -4250 -1441 782 527 1665 4165 2469 -3294 -5595 -1692 2161 1929 1090 2177 1243 -3121 -4873
839 -4873 -657 3610 2453 -556 -262 778 -1185 -2656 255 3495 1350 -2918 -2522 1038 1683 -150
855 -150 385 2102 36 -3921 -3066 2090 4170 1264 -959 -317 -862 -3324 -2352 2751 4979 1246 -2690
$$ packed form
741b901M911J342o224l767M730N269r42j313K808K01o887n395L999P188J171k293
757A897L48p6n222m596L771P574J640l513j108R50k564l751J776N276N29m140
773a209r67L207Q08k689m52K527l57l642J58N013K664l119l435j73m49k072J365
790b822N924L316l498m920q78P99m21J178M636K489l791n172k38K470L38l30K395
807A475J920k655l589J318L653j58l019l76J845n55j635J873L576j059n007j857
823d250K809K223k55J138K500j696n763k301L903L853k32q39J087r34m364j752
839d873M216M267j157l009K94J040j963j471K911L240k145m268L96L560O45j833
855a50N35J717k066l957Q55N156K080k906k223O42n45k462R72N103K228l733l936
$$ plain form
872 -2690 -2012 -299 -1014 -972 2244 3926 231 -3829 -2486 1241 1558 -215 372 1652 -488 -3388 -1580
889 -1580 2824 3223 -441 -2096 -654 -233 -1520 -310 3206 3160 -1266 -3941 -1609 1175 902 536 2052
906 2052 1876 -1821 -4113 -1261 2681 2575 140 -355 174 -1400 -2660 -214 3310 2660 -1081 -2509
922 -2509 -770 214 -349 566 2462 1473 -2125 -3302 -490 2137 1574 303 402 -129 -2141 -2583 495
939 495 3223 2080 -865 -1775 -953 -867 -748 1227 2858 1243 -2091 -2807 -593 1116 1015 968 1213 -117
957 -117 -2380 -2335 527 2635 1659 -246 -905 -967 -1367 -749 1483 2730 1013 -1701 -2255 -744 432 857
975 857 1463 1468 -307 -2384 -2157 339 2079 1512 323 -447 -1177 -1820 -851 1465 2508 981 -1280 -1868
993 -1868 -1068 -195 728 1728 1596 -299 -2235 -1960 71 1478 1464 790 -67 -1294 -1980 -833 1349 2296
$$ packed form
872b690O78J713p15M2L216J682l695m060J343L727L17j773N87J280k140k900J808
889a580M404L99l664j655J442M21j287J210L516m6m426k675K332K784k73l66J516
906B052j76l697k292K852L942j06k435m95N29j574j260K446L524o50l741j428
922b509J739R84n63R15J896r89l598j177K812K627n63j271R9n31k012m42L078
939D95K728j143k945r10Q22Q6J19J975J631j615l334p16K214J709j01m7K45j330
957a17k263M5K862K108r76j905o59o2m00O18K232J247j717k714n54J511J176M25
975H57O06Nj775k077K27K496J740n67j189p70p30o43R69K316J043j527k261n88
993a868Q00Q73R23J000j32j895j936K75K031J407j4o74q57j227o86J147K182R47
$$ plain form
1011 2296 1085 -726 -1490 -1270 -616 686 1878 1703 -282 -1982 -1750 -214 1009 1440 1256 221 -1365
1028 -1365 -2090 -837 1203 1965 1093 -260 -1204 -1595 -1106 560 1990 1679 -173 -1643 -1606 -661 422
1045 422 1428 1656 369 -1451 -1997 -783 805 1393 1155 382 -835 -1844 -1241 722 1966 1400 -103
1062 -103 -1109 -1364 -1145 73 1754 2073 296 -1611 -1808 -682 346 1075 1646 1099 -884 -2299 -1432
1079 -1432 685 1601 1071 462 -178 -1332 -1864 -325 1850 1926 19 -1249 -955 -574 -441 658 1955
1096 1955 1169 -1378 -2456 -757 1037 1070 788 972 100 -2075 -2536 14 2491 1886 -55 -605 -574 -1534
1114 -1534 -1609 760 2947 1587 -1329 -1895 -316 106 -396 559 2022 762 -2091 -2123 722 2063 415
1131 415 -651 170 -7 -1819 -1538 1700 3190 474 -2355 -1686 -81 -392 -416 1951 3172 115 -3472
$$ packed form
1011B296j211j811p64K20O54J302J192j75j985j700K32J536J223M31j84j035j586
1028a365p25J253K040P62q72j353r44l91M89J666J430l11j852j470L7R45J083
1045D22J006K28j287j820n46J214J588N88k38p73j217j009O03J963J244n66j503
1062a03j006k55K19J218J681L19j777j907j97J126J028P29N71n47j983j415Q67
1079a432K117R16n30o09o40j154n32J539K175P6j907j268K94L81J33J099J297
1096A955p86k547j078J699J794L3k82J84q72k175m61K550K477o05j941n50L1r60
1114a534p5K369K187j360k916n66J579M22n02R55J463j260k853l2K845J341j648
1131D15j066Q21j77j812K81L238J490k716k829O69J605l11k4K367J221l057l587
$$ plain form
1148 -3472 -2583 666 1334 93 850 2042 -78 -3265 -2307 1576 2507 -63 -1048 679 633 -1666 -1444
1165 -1444 1836 2472 -1107 -2975 -388 1990 658 -605 1089 1672 -1658 -3884 -683 3360 2550 -469
1181 -469 -549 489 -1547 -3622 -751 3859 3402 -828 -2059 -59 -128 -2121 -877 2973 2935 -1346 -2961
1198 -2961 140 1798 -538 -1776 735 1835 -1077 -2440 1037 3571 735 -2825 -1750 721 -213
1213 -213 -1421 1387 4048 1139 -3792 -3567 337 1452 -1 1137 3478 1333 -3614 -3995 448 2409
1229 2409 224 -504 1710 1507 -2148 -3083 742 2890 38 -2241 127 2274 212 -1690 396 1936
1245 1936 -1049 -3852 -1096 3134 2641 -362 -410 825 -1289 -3888 -1340 3667 4013 -32 -1749 -441
1261 -441 -986 -3111 -1549 3125 4044 23 -2377 -388 762 -1230 -1636 1441 2670 -401 -2427 104
$$ packed form
1148c472Q89L249O68j241P57J192k120l187R58L883R31k570r85J727m6k299K22
1165a444L280O36l579j868K587K378j332j263J694N83l330k226L201M043q10l019
1181d69q0J038k036k075K871M610m57m230j231K000o9j993J244L850l8m281j615
1198b961L101J658k336j238K511J100k912j363L477K534k836l560J075K471r34
1213b13j208K808K661k909m931K25L904J115j453J138K341k145m947l81M443J961
1229B409k185p28K214k03l655r35L825K148k852k279K368K147k062j902K086J540
1245A936k985k803K756M230m93l003m8J235k114k599K548N007L46m045j717J308
1261d41n45k125J562M674R19m021k400J989J150j992m06L077J229l071k026K531
$$ plain form
1277 104 2324 150 -2370 -936 1235 35 -1235 1275 3708 1188 -3042 -3019 -172 517 -308 1378
1293 1378 3546 1240 -3443 -3923 -263 1690 659 899 2632 1326 -2695 -3577 -74 1966 170 -878
1309 -878 938 1575 -940 -2072 500 2027 -420 -2381 -216 2322 1204 -726 119 945 -1580 -3657
1325 -3657 -996 3111 3011 227 -419 189 -1433 -3340 -1032 3264 3513 68 -1567 -465 -748 -2417
1341 -2417 -1203 2473 3023 -289 -1920 107 1187 -725 -1571 650 1556 -798 -1895 702 2652 358
1357 358 -2342 -1358 510 -317 -947 1544 3621 1024 -2965 -2899 -122 446 -285 1279 3142 1018 -3087
1374 -3087 -3153 319 1732 225 211 1998 1212 -2227 -2554 666 2141 -309 -1673 397 1610 -334
1390 -334 -1366 950 2026 -818 -3033 -664 2377 1541 -468 153 1043 -1285 -3509 -1113 2921 2855
$$ packed form
1277A04K220k174k520J434K171j200j270K510K433k520m230K3K847O89q25J686
1293A378K168k306m683m80L660J953j031K40J733j306m021q82L503K040j796j048
1309h78J816O37k515j132K572J527k447j961K165K538j118j930Q45Q26k525k077
1325c657K661M107j00k784o46O08j622j907K308M296K49l445j635J102k83j669
1341b417J214L676N50l312j631K027J080j912q46K221R06k354j097K597J950k294
1357C58k700R84J868q27o30K491K077k597l989O6K777N68p31J564J863k124m105
1374c087o6L472J413j507j4J787p86l439l27L220J475k450j364K070J213j944
1390c34j032K316J076k844k215K369L041q36k009O21Q90k328k224K396M034o6
$$ plain form
1406 2855 -170 -926 271 -680 -2701 -1150 2664 2954 -534 -2090 -193 522 -1219 -1133 1646 2248 -808
1423 -808 -2386 124 2109 354 -1467 -178 1095 -681 -1944 541 3021 1199 -2073 -1869 350
1438 350 233 -895 652 2949 1401 -2433 -2904 76 1402 37 74 1821 1104 -2108 -2741 385 2275
1455 2275 485 -1044 202 898 -910 -1788 548 2347 324 -2127 -1145 1096 755 -576 294 1597
1471 1597 -26 -2557 -1629 1490 2127 147 -550 354 -213 -2012 -1337 1686 2696 251 -1561 -621 206
1488 206 -755 -762 1273 2177 -85 -2127 -1016 990 749 -344 184 929 -349 -1930 -713 1666 1619 -424
1506 -424 -1126 -180 -95 -872 -98 1722 1614 -791 -2045 -730 605 363 201 1035 965 -1033 -2110 -556
1524 -556 1397 1227 -35 -153 69 -700 -1259 -14 1651 1263 -578 -1259 -359 129 -64 326 1204 658
$$ packed form
1406B855l025p56J197r51k021J551L814K90l488j556J897P15j741Q6K779O02l056
1423h08j578K510J985j755j821J289J273j776j263K485K480j822l272K04K219
1438C50j17j128J547K297j548l834m71K980J326j365L7J747p17l212o33L126J890
1455B275j790j529J246O96j808q78K336J799k023k451R82K241l41j331Q70J303
1471A597j623k531R28L119O37j980o97R04n67j799O75L023J010k445j812R40Q27
1488B06r61pK035R04k262k042J111K006k41j093N28P45j278j581J217K379m7k043
1506d24p02R46Q5p77P74J820j08k405j254J315J335k42j62Q34p0j998j077J554
1524e56J953j70j262j18K22p69n59J245J665l88j841o81R00M88j93L90Q78n46
$$ plain form
1542 658 -1084 -1651 -231 1105 872 185 173 -94 -1021 -1208 239 1607 1066 -398 -960 -594 -403 -267
1560 -267 573 1354 579 -999 -1410 -365 567 598 505 433 -150 -1133 -1197 184 1260 934 -72 -573 -582 -613 -311
1581 -311 707 1291 549 -824 -1223 -487 283 563 740 610 -155 -1127 -1083 117 1095 919 183 -378 -651
1600 -651 -800 -342 661 1207 561 -597 -1019 -567 21 476 799 695 -167 -1075 -1047 -43 816 817 341 -189
1620 -189 -668 -894 -405 618 1162 589 -325 -902 -672 -166 400 868 751 -62 -940 -949 -157 655 877 559
1640 559 17 -638 -922 -406 489 1000 648 -154 -750 -783 -375 345 909 773 42 -747 -914 -374 365 842
1660 842 726 67 -723 -898 -464 300 800 709 107 -682 -933 -463 335 807 666 107 -543 -898 -639 236
1680 236 941 808 28 -684 -802 -494 74 764 1013 357 -632 -1030 -469 236 596 653 437 -220 -906 -825 165
$$ packed form
1542F58j742n67J420J336k33o87j2k67r27j87J447J368n41j464n62L66J91J36
1560b67Q40P81p75j578m11J045R32L1r3p2n83r83o4J381J076l26j006n01rl1L02
1581c11J018N84p42j373l99P36P70K80J77j30p65r72M4J200R78j76p36n61k73
1600f51j49M58J003N46o46j158m22M52N88M55L23j04q62r08K8J004Q59Jm76n30
1620a89m79k26M89J023N44n73r14n77K30N06N66M68j17q13q78rP92Q12K22l18
1640E59n42o55k84N16Q95N11l52q02n96l3M08P20N64j36p31p89j67N40P39M77
1660H42j16o59p90j75M34P64N00r1o02p89k51M70P98M72j41n59o50l55K59Q75
1680B36P05j33p80p12j18L08N68O90K49o56r89l98N61P05L60N7k16o57o86Q1R90
$$ plain form
1701 165 930 725 27 -377 -517 -588 -235 746 1062 307 -840 -968 -276 211 401 705 702 -236 -1267 -970
1721 -970 328 929 627 182 -19 -552 -1123 -576 755 1270 334 -627 -555 -227 -333 -75 782 978 -189
1740 -189 -1215 -577 489 594 162 230 263 -546 -1181 -284 1195 1246 -47 -685 -386 -419 -669 147 1464 1244
1760 1244 -487 -1426 -629 152 55 220 1005 817 -725 -1535 -381 902 569 -203 37 339 -484 -993 105
1779 105 1310 611 -921 -937 120 299 -151 364 1156 390 -1487 -1526 246 1190 514 181 577 18 -1479
1798 -1479 -1509 530 1708 758 -392 -155 76 -836 -1020 502 1637 450 -1089 -620 514 210 -531
1815 -531 43 857 -16 -1317 -645 1169 1194 -323 -754 -4 -246 -1149 -330 1604 1691 -349 -1515 -702 -13
1834 -13 -408 -69 1484 1638 -414 -1866 -804 539 244 -255 599 1131 -230 -1499 -457 1139 646
$$ packed form
1701A65P65k05o98m04j40p1L53R81L16p55j147j28O92M87J90L04lr38j031K97
1721i70J298O01l02m45k01n33n71N47J331N15r36r61P2L28j06K58Q57J96j167
1740a89j026O38J066J05m32O8L3q09o35Q97J479N1j293o38K99l3k50Q16J317k20
1760A244j731r39P97P81r7J65P85j88j542q10J154J283l33p72K40L02q23n09J098
1779A05J205o99j532j6J057J79m50N15P92p66j877l9J772R44o76l33L96n59j497
1798a479l0K039J178r50j150K37K31r12j84J522J135j187j539M69J134l04p41
1815e31N74Q14q73j301O72J814K5j517m31P50k42r03Q19J934Q7k040j166Q13O89
1834a3l95L39J553J54k052j452J062J343k95m99Q54N32j361j269J042J596m93
$$ plain form
1851 646 -777 -478 651 271 -716 -22 1290 548 -1469 -1496 358 1099 254 143 1018 319 -1706 -1859
1869 -1859 345 1724 753 -176 279 143 -1409 -1805 335 1906 815 -721 -334 457 -433 -1191 67
1886 67 1428 365 -1262 -605 1059 784 -709 -549 581 70 -1288 -529 1630 1712 -367 -1324 -373 -31
1904 -31 -911 -371 1735 2034 -352 -1878 -816 405 -129 -310 1170 1758 -220 -1895 -797 855 332
1921 332 -732 46 1191 144 -1319 -463 1281 688 -1271 -1151 630 808 -395 -132 1216 572 -1721
1938 -1721 -1907 376 1582 475 -200 701 552 -1537 -2098 206 1930 852 -547 -15 511 -821 -1703
1955 -1703 84 1911 877 -1064 -606 872 382 -993 -420 1061 434 -1289 -825 1295 1391 -478 -1063
1972 -1063 108 235 -1033 -777 1395 1993 -167 -1712 -723 261 -418 -601 1193 1944 -44 -1978 -1017
$$ packed form
1851F46j423K99J129l80r87O94J312p42k017k7J854P41q45j11Q75o99k025j53
1869a859K204J379r71r29M55j36j552l96K140J571j091j536L87P91q90p58J258
1886F7J361j063j627O57J664k75j493J60J130n11j358P59K159Q2k079r57R51L42
1904c1q80N40K106K99k386j526J062J221n34j81J480N88j978j675J098J652n23
1921C32j064P78J145j047j463Q56J744n93j959J20J781J78j203K63J348o44k293
1938a721j86K283J206j107o75R01j49k089n61K304J724j078j399N32N26j332q82
1955a703J787J827j034j941M58J478m90j375N73J481o27j723M64K120R6j869n85
1972a063J171J27j268K56K172N98k160j545R89R84o79j83J794P51j988j934R61
$$ plain form
1989 -1017 708 405 -543 293 1375 193 -1560 -872 1048 888 -740 -730 686 588 -735 -480 1145
2006 1145 1058 -1028 -1628 120 1211 274 -250 733 768 -1088 -1920 -100 1646 936 -367 1 483 -652
2024 -652 -1665 -205 1652 1104 -655 -761 298 66 -931 -300 1181 833 -976 -1134 479 1028 -174
2041 -174 -676 239 417 -734 -994 674 1535 272 -1030 -523 247 -342 -576 654 1649 401 -1301 -1118
2059 -1118 238 425 -101 335 1024 232 -1252 -1055 510 954 -28 -316 325 279 -648 -677 600 1053 -131
2078 -131 -980 -329 380 67 -201 525 767 -410 -1338 -544 735 756 31 -32 198 -427 -1079 -387 867 977
2098 977 -28 -542 -150 -125 -476 -103 805 854 -233 -932 -284 322 204 63 283 330 -454 -819 -70 810
2118 810 606 -153 -345 -140 -261 -397 208 854 552 -400 -738 -291 34 108 337 639 228 -661 -889 -158
$$ packed form
1989a017J725l03r48Q36J082j182j753O88J920j60j628J0J416r8j323K55J625
2006A145q7k086o00J748J091r37n24R83L5j856q32J820J746p10j303L68M82j135
2024f52j013J460J857n48j759j06J059k32r97O31J481l48j809j58J613N49j202
2041a74n02R15J78j151k60J668Q61j263j302N07P70n89k34J230R95j248j702J83
2059a118J356J87n26M36O89p92j484J97J565M44r82k88O41m6r27k9J277M53j184
2078a31q49O51P09l13k68P26K42j177r28P94J279K1p25o3K30o25o52O92J254J10
2098I77j005n14L92K5l51L73R08M9j087o99O48O06j18j41K20M7p84l65P49Q80
2118H10k04p59j92K05j21j36O05O46l02r52l38M47L25P4K29L02m11q89k28P31
$$ plain form
2138 -158 515 497 113 -17 -166 -516 -441 162 642 390 -244 -453 -290 -132 -3 340 569 138 -529 -668 -109
2159 -109 388 468 349 79 -322 -615 -354 288 667 418 -95 -390 -391 -259 24 430 527 140 -362 -544 -271
2180 -271 110 358 382 171 -280 -587 -418 93 517 449 29 -359 -485 -263 26 358 470 120 -321 -509 -326
2201 -326 68 373 439 234 -137 -452 -411 -23 446 551 240 -280 -507 -349 10 412 507 263 -222 -449 -316
2222 -316 69 375 423 215 -96 -366 -398 -149 361 517 262 -172 -477 -375 -97 273 535 331 -186 -551 -452
2243 -452 -34 310 358 173 -123 -364 -441 -144 335 482 300 -55 -334 -408 -237 166 496 413 -11 -498 -490 -91
2265 -91 326 433 315 -9 -343 -483 -215 299 485 233 -82 -243 -302 -227 52 405 434 68 -345 -478 -133
2286 -133 179 318 339 106 -344 -616 -281 274 516 266 -82 -278 -329 -340 -32 393 473 43 -410 -410 -147 -7
$$ packed form
2138a58O73j8l84j30j49l50P5O03M80k52o34k09J63J58J29L43K29m31o67j39N59
2159a09M97Q0j19k70m01k93K61O42L79k49n13k95jJ32K83M06R7l87n02j82K73
2180b71L81K48K4k11m51l07J69N11M24o8m20l88j26K22K89L32J12l50m41j88J83
2201c26L94L05O6k05l71l15M1L88M69J05l11n20k27J58L59M02R5k44m85k27J33
2222c16L85L06M8k08l11k70l2K49N10J56k55m34l05J02K78L70K62k04n17l65R9
2243d52M18L44M8j85k96k41p7K97M79J47j82l55k79p4J71M03L30q3m24m87QL99
2265i1M17J07j18l24l34j40K68N14J86k52l15j61n9P5K79L53K9l66m13j33L45
2286a33L12J39K1k33m50k72L35N55K42k50l48j96n1j1L08M25Q0m30m53%K63J40
$$ plain form
2308 -7 186 402 308 -181 -607 -373 266 488 245 1 -116 -308 -356 24 522 475 -41 -407 -282 -72 -50 155
2330 155 555 400 -243 -629 -332 197 346 211 235 46 -414 -669 -103 569 502 -69 -274 -147 -173 -221 72
2351 72 548 305 -360 -517 -105 135 47 137 376 100 -523 -653 40 639 405 -45 -149 -157 -426 -357 318 800
2373 800 343 -395 -422 -49 -63 -132 274 615 258 -545 -539 39 333 50 51 272 -28 -568 -412 396 672 18
2395 18 -469 -224 18 -144 -98 448 575 -169 -766 -374 178 202 45 347 443 -214 -864 -465 442 601 115
2416 115 -14 140 -183 -612 -193 632 597 -201 -464 41 243 -159 -123 382 403 -367 -634 47 608 239 -129
2437 -129 81 126 -527 -686 156 929 480 -376 -432 -67 -258 -457 196 893 447 -555 -648 -11 115 -269 -25
2458 -25 616 333 -544 -626 232 541 -36 -336 77 239 -300 -346 456 753 -114 -820 -358 316 168 -39 387
$$ packed form
2308gJ93K16r4m89m26K34O39K22k43k44j17j92m8L80M98m7n16l66J25K10K2K05
2330A55M00j55o43l86K97N29J49j35K4j89m60k55N66O72o7n71k05J27k6m8K93
2351G2M76k43o65j57M12K40q8R0K39k76o23j30O93N99k34m50j04qk69O9O75M82
2373H00m57p38k7L73j4o9M06L41l57q03ON78K94k83JK21l00n40J56Q08K76o54
2395A8m87K45K42j62M6N46J27p44n97L92N52K4j57L02R6o57o50L99R07J59m86
2416A15j29J54l23m29M19Q25l5p98k63N05K02m02L6N05K1p70k67O81N61l69l68
2437a29K10M5o53j59Q42P73m49q56n6L65j91j99O53O97m46j002r3O37J26l84K44
2458b5O41k83q77q2Q58L09n77l00M13J62n39m6Q02K97q67p06M62O74j48k07M26
$$ plain form
2479 387 665 -142 -979 -532 414 484 46 164 481 -114 -950 -595 551 749 -49 -273 190 149 -499 -402 457
2500 457 573 -335 -635 108 570 17 -344 132 364 -359 -818 31 876 522 -339 -223 68 -337 -678 127
2520 127 1123 675 -457 -682 -5 56 -396 -33 781 632 -463 -706 70 389 -151 -285 391 482 -350 -615
2540 -615 192 786 43 -664 -226 337 -3 -308 296 781 -28 -993 -571 379 404 -68 143 593 23 -987
2560 -987 -756 360 667 48 -128 297 126 -681 -642 429 821 -1 -549 45 380 -90 -377 209 554 -164
2580 -164 -681 -58 714 385 -295 -158 273 -179 -722 -112 915 734 -268 -533 -41 -71 -468 -76 835 718
2600 718 -356 -801 -140 309 -101 -219 367 542 -237 -701 -75 523 73 -355 -106 292 -72 -462 82 715
2620 715 219 -643 -528 193 265 -8 125 536 166 -697 -651 235 581 148 -29 271 148 -554 -606 229 732
$$ packed form
2479C87K78q07q37M47R46P0m38J18L17n95q36L55J146J98p98k24M63m1o48R7Q59
2500D57J16r08l00P43M62n53l61M76K32p23m59Q49Q45l54q61J16K91m05l41Q05
2520A27R96m48j132k25O77O1m52L63Q14j49j095k43P76L19n40j34O76R1q32k65
2540f15Q07N94p43p07M38N63l40l05O04M85q09r65M22R50K5m72K11M50n70j010
2560i87K31J116L07o19j76M25j71q07L9J071L92q22n48N94L35m70k87N86L45p18
2580a64n17O23P72l29o80J37M31m52n43O10J027j81j002k65M92l0l97L92R11j17
2600G18j074m45O61M49m10j18N86J75p79m64O26N98m50m28K49L98l64l90N44O33
2620G15m96q62J15P21P2k73J33M11l70q63M6Q86L46m33j77L00j23p02n2Q35N03
$$ plain form
2641 732 234 -259 -86 117 -237 -348 190 552 35 -551 -261 360 226 -133 -19 251 -68 -560 -229 439
2661 439 512 -64 -281 -58 -136 -397 -141 570 611 -52 -535 -297 13 -28 13 377 387 -147 -591 -183 288 183
2683 183 -18 51 207 -89 -368 -50 373 312 -154 -268 -14 3 -62 116 432 171 -360 -504 -50 251 152 123
2705 123 187 5 -397 -426 -7 364 221 25 -76 -84 -298 -227 162 413 177 -233 -293 -82 12 26 181 222 -35
2728 -35 -336 -284 138 300 131 26 -17 -124 -277 -123 287 397 140 -132 -165 -157 -134 94 360 317 -48 -325 -252
2751 -252 34 118 164 196 93 -195 -329 -105 187 206 70 -40 -164 -259 -153 67 280 148 -100 -232 -189 -56
2773 -56 67 242 254 -24 -269 -298 -108 158 188 193 86 -128 -240 -156 109 309 217 8 -102 -183 -146 -17 256
2796 256 279 37 -234 -202 -46 77 168 232 97 -166 -276 -132 97 195 146 46 -92 -245 -213 -15 190 233 33
$$ packed form
2641G32m98m93J73K03l54j11N38L62n17n86K90O21j34l59J14K70l19m92L31O68
2661D39P3n76k17K23p8k61K56P11M1o63m83K38L10m1M1L64J0n34m44M08M71j05
2683A83k01O9J56k96k79L18M23o1m66j14K54J7o5J78L16k61n31j44M54L01r9k9
2705A23O4j82m02k9M19L71j43j96j01qk14P1L89K51k36m10o0K11R4J4J55M1k57
2728c5l01N2M22J62j69j05m3j07j53J54M10J10k57k72l3QK3K28K66m3l65k77P3
2751b52K86Q4M6L2j03k88j34K24K92J9j36j10j24r5J06K20K13j32k48j32M3J33
2773e6J23J75J2k78k45k9J90K66L0Nj07k14j12Q4K65K00r2k09j10q1L7J29K73
2796B56K3k42k71L2J56J23R1O4j35k63j10J44K29R8m9j00j38j53L2J98K05M3k00
$$ plain form
2819 33 -139 -198 -166 -29 147 285 110 -152 -262 -167 61 146 187 91 -45 -191 -216 55 231 238 43 -53 -164 -213
2843 -213 -70 169 279 182 -87 -192 -121 10 115 197 197 -62 -257 -235 -11 195 155 85 -39 -179 -243 -104 179
2866 179 265 154 -117 -227 -146 -90 27 221 223 -33 -275 -263 -20 172 162 140 -5 -115 -285 -194 155 253 97
2889 97 -56 -161 -118 -91 47 249 263 9 -195 -194 15 83 160 164 91 -182 -287 -159 132 254 96 -16 -100 -190
2913 -190 -203 -9 212 231 -58 -224 -184 -72 -7 121 174 113 -150 -295 -117 111 192 97 15 -31 -150 -182 -5 268
2937 268 254 -2 -141 -127 -45 6 116 295 151 -152 -246 -89 94 139 144 137 47 -210 -240 53 246 178 -13 -74 -56
2962 -56 -153 -133 88 257 72 -164 -203 -2 -5 42 131 133 1 -296 -274 64 218 129 -21 49 -92 -257 -151 204
2986 204 309 53 -121 -119 -32 -47 -18 207 311 17 -275 -128 73 111 44 132 161 -127 -270 -54 218 241 -10
$$ packed form
2819C3j72n9L2J37J76J38j75k62j10R5K28Q5M1r6j36j46k5K71J76Pj95r6j11m9
2843b13J43K39J10r7k69j05P1J31J05Q2%k59j95K2K24K06m0p0j24j40o4J39K83
2866A79Q6j11k71j10Q1N6J17J94Kk56k42J2K43J92j0k2j45j10j70R1L49R8j56
2889I7j53j05M3K7J38K02J4k54k04JK09O8P7Mp3k73j05J28K91J22j58j12q4r0
2913a90j3J94K21J9k89j66M0J12O5J28N3o1k63j45J78K28Q1r5q2m6j19l2J77K73
2937B68j4k56j39J4Q2N1J10J79j44l03r4J57J83M5Npr0k57l0K93J93o8j91o1J8
2962e6r7K0K21J69j85k36l9K01lM7Q9Kj32k97K2L38J54q9j50P0j41j65J06L55
2986B04J05k56j74KQ7j5K9K25J04k94k92J47K01L8o7Q8K9k88j43K16K72K3k51
$$ plain form
3009 -10 -90 -52 -55 -182 -17 283 215 -102 -329 -110 49 15 111 248 126 -234 -394 -115 154 147 12 93 52 -181
3033 -181 -307 -15 303 169 -104 -130 44 -13 -79 76 260 81 -216 -232 109 185 67 47 137 13 -308 -258 212
3056 212 347 128 -55 -34 -39 -198 -146 207 367 38 -231 -197 60 -62 -90 132 270 15 -330 -138 135 102
3078 102 -130 -69 77 -36 -278 -100 316 244 -95 -252 -57 4 -94 -2 327 322 -171 -388 -129 151 94 22 195
3101 195 220 -183 -359 -60 303 191 -78 7 151 -50 -225 -30 299 167 -211 -201 109 147 -47 -15 198 46
3123 46 -318 -283 110 339 67 -83 32 21 -291 -303 117 361 154 -208 -147 22 -144 -200 134 406 132 -258
3145 -258 -194 125 75 -79 25 243 78 -243 -123 224 287 -63 -208 6 67 -115 -102 268 344 -87 -315 -145
3167 -145 120 -11 -9 213 248 -97 -404 -163 204 132 -45 34 159 -97 -334 -115 233 195 -159 -131 69 67 -140
$$ packed form
3009a0q0L8lj27J65L00o8l17k27K19J59l4R6J37j22l60j60K79K69pj35Q1m1k33
3033a81j26K92L18j34k73k6J74n7o6J55J84j79k97j6L41P6j18k0R0j24l21N0M70
3056B12J35k19j83K1nj59N2L53J60l29k69L4K57j22k8K22J38k55l45J92K73l3
3078A02k32O1J46j13k42J78M16p2l39j57J95O1r8R2L29nm93k17K59K80n7p2J73
3101A95K5m03j76K99L63j12k69Q5J44k01j75J95L29j32l78J0L10L8j94L2K13j52
3123D6l64L5L93K29k72j50J15j1l12j2M20K44k07l62O1J69j66n6L34K72k74l90
3145b58O4L19n0j54J04K18j65l21J20L47O3l50j45K14O1j82J3L70P6m31k28J70
3167a45K65j31KK22L5l45l07K41L67p2j77P9J25k56k37K19L48l8l54K8K00kk07
$$ plain form
3190 -140 -72 220 151 -208 -254 37 235 44 -40 102 49 -193 -273 71 381 206 -46 -43 12 -109 -214 137 386
3213 386 180 -152 -149 9 -4 -99 75 270 144 -248 -214 98 186 -36 -74 53 6 -188 -157 183 268 -9 -244
3236 -244 -119 30 -40 -21 151 250 -29 -317 -190 111 104 -2 95 188 -30 -255 -165 168 195 14 -31 63 -47 -150
3260 -150 -34 173 166 -62 -189 -21 121 27 -2 95 99 -115 -241 -23 181 89 6 -7 -13 -149 -201 31 210 157 -89
3285 -89 -112 -46 -61 -105 51 210 69 -144 -147 -6 27 -12 4 81 40 -190 -146 89 206 50 -67 -17 -29 -97 -11 146
3311 146 211 22 -183 -133 -9 14 42 129 160 -57 -207 -121 76 122 49 76 54 -68 -171 -60 113 155 11 -91
3335 -91 -61 -46 -80 9 111 113 -60 -143 -77 32 44 26 87 18 -130 -177 3 162 155 -4 -27 -32 -77 -73 55 209 113 -46
3363 -46 -112 -19 -5 10 36 150 47 -81 -136 -6 87 114 15 22 -30 -105 -70 38 160 26 -61 -95 -80 -68 -23 74 107
$$ packed form
3190a40O8K92o9l59m6K91J98j91q4J42n3k42q0L44L10j75k52LN5j21j05L51K49
3213C86k06l32LJ58j3r5J74J95j26l92L4L12Q8k22l8J27m7j94L1L40Q5k77k35
3236b44J25J49p0J9J72R9k79k88J27L01pj06R7R3k18k25R0L33K7j81m5R4j10j03
3260a50J16K07pk28j27J68J42r4k9R7Mk14j26K18K04r2q3j3oj36n2K32J79n3k46
3285h9k3O6j5m4J56J59j41k13lJ41L3l9J6P7m1k30M4K35J17j56j17N0j2o8Q6J57
3311A46O5j89k05N0J24K3K8Q7L1k17j50Q6J97M6p3K7k2j22j03J11J73M2j44j02
3335i1L0J5l4Q9J02Kj73q3O6J09J2j8O1o9j48m7J80J59pj59k3nm5MJ28J54r6j59
3363d6o6R3J4J5K6J14j03j28n5J30R3K7r9Pn2p5L5J08J22j34q7l4J5J2M5R7L3
$$ plain form
3390 107 -14 -154 -138 -23 38 56 62 47 -44 -126 -78 64 112 64 -9 -43 -68 -37 11 76 121 37 -56 -35 18 -3 53 88
3418 88 67 -39 -113 -33 55 102 65 69 -20 -46 -99 5 141 129 -2 -96 -65 -39 -30 8 95 48 -69 -128 -59 60 37 56
3446 56 90 -26 -95 -109 -39 53 97 11 -26 -68 -85 -43 77 133 88 -38 -112 -33 37 67 103 68 35 -86 -78 18 85 107 44
3475 44 0 -45 -59 -41 77 89 85 -11 -84 -80 -33 -9 70 76 -32 -119 -113 -52 12 63 38 2 -28 -108 -39 12 69 69 -44 -86 -32
3506 -32 -37 28 97 81 -7 -90 -73 -28 28 76 70 59 -59 -89 -33 59 112 49 35 -13 -56 -62 24 124 82 20 -55 -84 -34 3 18
3537 18 68 56 -61 -141 -64 18 67 67 39 -32 -107 -108 -9 61 61 8 -85 -68 -38 -8 46 115 74 -57 -92 -52 64 40 56 53 6
3568 6 -65 -30 24 63 71 42 33 -28 -13 -33 62 103 81 -8 -33 -53 -13 35 78 69 -47 -122 -93 -10 41 58 26 -4 -79 -83 -60 58
3600 58 68 13 -51 -65 -89 -65 2 83 66 -36 -87 -80 25 -20 40 60 18 -69 -78 -7 81 98 64 12 22 -25 -62 53 137 74
$$ packed form
3390A07j21j40J6J15O1J8Oj5r1q2M8J42M8m8p3l4k5L1M8O5M5q4r3K1N3k1N6L5
3418H8k1j06p4Q0Q8M7l7Mq9k6n3J04J36j2j31r4L1K6RL8Q7m7j17n9O9J19k3J9
3446E6L4j16o9j4P0R2M4q6l7m2j7M2J20N6m5j26p4P9P0L0L6l5l3j21QR6O7K2o3
3475D4m4m5j4J8J18J2mr6p3MM7K4P9Oj08q7OO1O4N1k5l6l0q0O9N1N7%j13m2N4
3506c2nO5O9j6q8q3J7M5N6M8oj1j18l0N6R2N3o3j4m8m3oQ6J00m2o2p5k9N0L7J5
3537A8N0j2j17q0P7Q2M9%k8p1p5jR9P0%n3r3J7L0L0N4O9m1j31l5M0J16k4J6lm7
3568Fp1L5N4L9Qk9ro1J5k0R5M1k2q9k5k0M0M8M3rj16p5K9Q3N1J7l2l0p5mK3J18
3600E8J0n5o4j4k4K4O7Q1j7j02n1PJ05m5O0K0m2q7rP1Q8J7l4n2J0m7l7J15Q4o3
$$ plain form
3630 74 -39 -70 -32 -13 11 72 106 36 -74 -93 -7 23 2 23 91 9 -111 -76 -5 85 24 -52 -17 3 -42 -53 34 67 17
3659 17 -100 -95 -1 13 6 35 94 7 -117 -109 47 94 62 18 30 -5 -83 -54 84 156 45 -49 1 -7 -11 -2 108 108 -11 -60
3689 -60 5 55 49 -29 27 18 -24 -127 -26 87 42 -30 -60 -22 -47 -62 -25 128 67 -77 -99 -38 0 -44 26 77 91 -74
3717 -74 -120 11 103 60 -15 69 60 -43 -82 35 116 90 -35 -53 15 19 -25 65 80 27 -105 -48 86 72 -10 20 80 12
3745 12 -105 -84 43 113 6 -25 2 20 -48 -98 60 90 -19 -121 -68 -16 9 -34 24 86 -28 -111 -55 75 68 -5 6
3772 6 4 -13 -34 -34 126 134 -15 -84 0 58 -24 29 115 128 -43 -130 12 52 26 11 68 46 -20 -108 -28 81 92 -44 -45 39
3802 39 -11 -69 -21 113 43 -73 -86 10 76 7 -6 60 2 -109 -156 30 123 75 -24 5 36 -89 -106 9 171 40
3828 40 -14 -23 20 -13 -42 48 100 55 -40 -34 45 57 56 15 37 31 -60 -3 60 93 1 -88 -18 -34 -37 -46 40 102 -11 -103 -65 -26 -5
$$ packed form
3630G4j13l1L8J9K4O1L4p0j10j9Q6L0k1K1O8q2j20L5P1R0o1p6L5K0m5j1Q7L3n0
3659A7j17NR4J4pK9N9q7j24QJ56M7l2m4J2l5p8K9J38P2j11r4N0qmRJ10%j19m9
3689f0O5N0op8N6rm2j03J01J13m5p2l0L8k5j5L7J53o1j44k2O1L8m4P0N1J4j65
3717g4m6J31R2m3p5Q4rj03l9J17Q1k6j25j8O8Mm4R0J5n3j32N7J34j4q2L0O0o8
3745A2j17K1J27P0j07l1K7J8o8n0J58L0j09j02N3N2K5m3N8O2j14q3N6J30pp3J1
3772Fkj7k1%J60Qj49o9Q4N8q2N3Q6J3j71q7J42M0k6j5N7k2o6q8Q0J09J1j36jQ4
3802C9n0n8M8J34p0j16j3R6O6o9j3O6n8j11m7J86R3m8r9K9L1j25j7J15J62j31
3828D0n4rM3l3k9R0N2m5r5OP9J2jm1K2or1N7O3L3r2q9P0j6lrQ6O2j13r2L8L9K1
$$ plain form
3861 -5 12 41 48 -42 -56 -59 18 76 12 -50 40 0 -85 -3 72 63 -9 -70 -9 43 30 7 63 23 -32 -66 -1 75 37 29 70 5 -34
3894 -34 -73 19 113 34 -3 -16 2 -37 -51 -1 54 24 -47 -41 18 13 -13 -3 14 -27 -82 -116 10 83 17 -34 -4 -11 -37 -35 45 98
3926 98 57 -43 -22 -17 -2 -18 49 108 29 -20 -24 32 85 44 -3 58 8 -62 -40 32 85 -28 -8 -38 -41 -23 -6 39 50 -52
3956 -52 -44 -45 20 -4 -25 31 53 -39 -95 -19 49 12 11 -5 -15 -59 -69 13 61 37 -1 -47 -11 -19 -4 46 68 42 -33 -46 -76 4
3988 4 40 53 32 2 -30 -16 2 84 58 3 -25 -28 -8 1 26 53 38 -64 -58 -22 9 -8 -13 1 -11 -47 -52 -10 28 2 -7 -6 -40 -31
4022 -31 -32 32 42 -27 -34 -26 -56 8 13 32 34 0 -76 -49 33 30 38 31 19 -28 -70 -3 20 35 48 -27 -15 -7 9 28 30 46 -42 -19 -25 -7
4058 -7 25 29 27 9 -14 -49 -43 20 -18 22 -30 -19 -45 -37 -25 -14 58 -19 -73 -46 -56 20 20 10 46 -17 -36 -15 9 48 55 -9 -17 -38
4092 -38 -14 -2 31 44 28 -15 -13 14 -24 17 57 4 -20 -33 9 28 -5 17 22 -19 -47 -49 4 15 27 26 -17 -53 -34 -32 44 26 6
$$ packed form
3861eJ7K9Pr0j4lP7N8o4o2R0m0q5Q2P5rp2o1O1N2j3k3N6m0n5l4O5P6l8qM1o5l9
3894c4l9R2R4p9l7j3J8l9j4N0N5l0p1ON9nk6J0J7m1n5l4J26P3o6n1L0pk6KQ0N3
3926I8m1j00K1NJ5j6O7N9p9m9mN6N3m1m7O1n0p0K2P2N3j13K0l0lJ8J7M5J1j02
3956e2QjO5k4k1N6K2r2n6P6O8l7jj6j0m4j0Q2M8k4l8m6L6qJ5N0K2k6p5j3l0Q0
3988DL6J3k1l0l2J4J8Q2k6n5k8lK0RK5K7j5j02OL6L1j7nJ4j2l6nM2L8k6rJl4R
4022c1jO4J0o9pQl0O4NJ9Kl4p6K7Q2lQpj2m7m2O7K3J5J3p5J2QJ6J9KJ6q8K3oJ8
4058gL2Mkj8k3l5OO3l8M0n2J1k6QJ2J1P2p7n4K7j0P6%j0L6o3j9K1K4L9Po4qk1
4092c8K4J2L3J3j6m3KK7l8M1M0n3k4j3M2J9l3K2Nm1k8kN3J1J2jm3l6J9KP6j8k0
$$ plain form
4125 6 -33 -70 -37 -14 14 26 20 1 -71 -29 4 26 21 12 21 -31 -14 -9 34 87 4 -51 -37 -2 -10 39 48 52 19 -52 -46 -1 29 -35 14
4160 14 12 -20 -74 -41 8 45 -9 3 -5 -20 -16 13 44 13 -11 -60 -57 -44 -3 13 37 -16 -11 -49 23 29 22 48 40 20 -18 -14 40 55 64
4195 64 -24 -32 -19 -8 9 38 56 57 -24 -8 -33 1 8 27 56 0 -66 7 53 33 -9 27 -10 22 -39 5 17 28 3 -90 -57 -40
4227 -40 -4 -11 50 30 -30 -76 -45 10 31 7 34 25 -14 -47 -38 66 20 24 -11 20 -15 -21 58 57 93 -13 -29 33 19 0 23 32 58
4260 58 -31 -52 11 23 35 -20 7 28 -17 -26 -4 37 26 -60 -86 -10 -27 18 0 12 -8 -66 -66 -6 16 2 2 -14 15 -71 -43 17
4292 17 22 20 -4 1 20 7 -35 30 50 34 -75 -30 29 10 -15 -2 13 4 -90 -60 52 51 -12 -24 28 4 -70 -46 22 56 -14 -53
4324 -53 -44 -3 -11 -11 11 21 -13 -96 -62 15 -2 -63 -12 19 -34 -9 -14 28 68 -46 -36 14 19 -22 6 65 46 -47 -71 17 33 7
4356 7 15 52 33 -19 -56 4 48 34 -11 16 -32 -57 -53 44 49 10 -94 -29 14 -9 -28 -7 58 -31 -93 -63 45 0 7 20 7 -26
$$ packed form
4125Fl9l7L3K3K8J2oj9p2M2L3K2nrRn2J7NM3N3q3n5J4L5qM9RMl3p1OM5L0o4M9
4160A4kl2n4L3M9L7n4J2qj5MK9L1l1k4m9LJ3M1J6K4n3Nl8P2OpK6qk0l8MN4J5R
4195F4q8qJ3J1J7K9J8Jq1J6k5L4PJ9K9n6o6P3M6k0m2L6l7L2o1M4J2J1k5r3L3J7
4227d0L6pO1k0o0m6L1N5K1k4K7rl9l3RJ04m6Ml5L1l5oP9jL6j06j6O2j4j9K3RK6
4260E8q9k1O3J2J2n5K7K1m5rK2M1j1q6k6P6j7M5j8J2k0n8%O0K2j4%j6K9q6K8O0
4292A7Nkk4NJ9j3m2O5K0j6j09M5N9j9k5J3J5rr4L0J12jo3j2N2k4p4K4O8L4p0l9
4324e3RM1q%K2J0l4q3L4P7j7o1N1L1n3K5nM2M0j14J0N0Nm1K8N9j9r3k4Q8J6k6
4356GQL7j9n2l7O0M4j4m5K7m8k5MR7Nl9j04O5M3k3j9K1O5q9o2L0J08m5PJ3j3l3
$$ plain form
4388 -26 -64 -57 16 73 -23 -68 -16 20 -53 -11 38 64 -8 -40 -1 33 -3 -17 11 50 12 -38 0 55 26 20 -22 30 -10 0 -16
4419 -16 61 23 -33 -29 12 47 -20 -11 57 15 -79 -58 -11 13 -27 -20 27 23 -44 -71 -36 19 40 -29 -4 44 -22 -43 -12 50 5 -45
4451 -45 -44 25 33 7 7 44 22 -52 -34 -7 43 8 -19 -10 30 -36 -70 29 49 16 -33 1 -16 -29 -26 -14 63 9 -64 -44 -19 20 -14
4484 -14 -13 10 -38 -57 -50 39 32 -20 -21 -14 -11 -43 -22 -8 38 -14 -67 -32 64 -2 9 33 39 22 -9 -7 44 27 -10 17 21 -16 -35 11 48
4519 48 50 15 -24 2 22 -18 -6 57 5 -34 -57 25 39 -6 -53 -9 -33 -35 -57 -36 16 11 -52 -13 8 -18 -47 30 38 -33 -29 -39 9
4552 9 -4 -58 17 15 -12 -67 -9 22 36 29 -16 3 9 -28 12 27 73 41 -35 19 8 26 -11 -9 36 -13 -71 -17 -36 -5 -18 -5 -5
$$ packed form
4388b6l8PP3N7r6m5N2L6p3M2M9K6p2l2L9L4l6j4K8L9l8n0L8N5k9om2N2m0J0j6
4419a6P7l8n6MM1L5o7RO8m2r4K1M7K4m0PM7mo7k7L5N5K1o9K5M8o6k1L1O2m5n0
4451d5JO9Qk6%L7k2p4J8K7N0l5k7RM0o6l4R9K0l3m9L4j7j3LJ2P7n4p3K0K5L9l4
4484a4JK3m8j9PQ9pn2jPLl2K1J4M6n2n3L5R6o6J1K4Oj7l1KN1j7l7K7Ml7j9M6L7
4519D8Kl5l9K6K0m0J2O3n2l9k3Q2J4m5m7M4k4kk2K1N2no3L9K1k6k9P7Qp1Mj0M8
4552Ij3n4P5kk7n5N8L1J4pm5J9Ol7M0J5M6l2p6N4j1J8l7KM5m9n8N4j9L1j3J3%
$$ [...]
8191D5
##END NTUPLES=NMR FID
##END=
