##TITLE=1H ikalashn
E1b 1811
19.11.2024
##JCAMPDX= 6.0         $$ Bruker NMR JCAMP-DX V2.0
##DATA TYPE= NMR FID
##DATA CLASS= NTUPLES
##ORIGIN= UXNMR, Bruker Analytische Messtechnik GmbH
##OWNER= root
$$ TOPSPIN		Version 1.3
$$ 2024-11-19 09:31:26.718 +0400  Irina@DPX200
$$ Compression mode = diff/dup
##.OBSERVE FREQUENCY= 200.131300845
##.OBSERVE NUCLEUS= ^1H
##.DELAY= (6, 6)
##.ACQUISITION MODE= SIMULTANEOUS
##.ACQUISITION SCHEME= undefined
##.AVERAGES= 17
##.DIGITISER RES= 18
##SPECTROMETER/DATA SYSTEM= spect
##.PULSE SEQUENCE= zg
##.SOLVENT NAME= CDCl3
##.SHIFT REFERENCE= INTERNAL, CDCl3, 1, 17.49637
##AUDIT TRAIL= $$ (NUMBER, WHEN, WHO, WHERE, WHAT)
$$ ##TITLE= Audit trail, TOPSPIN		Version 1.3
$$ ##JCAMPDX= 5.01
$$ ##ORIGIN= Bruker BioSpin GmbH
$$ ##OWNER= Irina
$$ $$ F:/spectra/data/iren/nmr/1H/4/audita.txt
$$ ##AUDIT TRAIL=  $$ (NUMBER, WHEN, WHO, WHERE, VERSION, WHAT)
(   1,<2024-11-19 09:31:10.062 +0400>,<Irina>,<DPX200>,<TOPSPIN 1.3>,
      <created by zg
	started at 2024-11-19 09:29:59.484 +0400,
	POWCHK disabled, PULCHK disabled
       terminated by command 'halt'
       configuration hash MD5:
       BE 6D 3F 07 2A EA 11 49 91 17 2B D3 AF B3 58 0D
       data hash MD5: 16K
       88 80 91 B7 75 5F E7 4D CC 2B F7 A0 A6 EF 97 52>)
$$ ##END=
$$ 
$$ $$ hash MD5
$$ $$ 03 79 AE 94 C6 E3 90 1A 92 4C CA 8D ED DC 04 49
##$RELAX= 
##$RELAX= 
##$RELAX= 
##$RELAX= 
##$RELAX= 
##$RELAX= 
##$RELAX= 
##$RELAX= 
##$RELAX= 
$$ Bruker specific parameters
$$ --------------------------
##$DU= <F:/spectra>
##$EXPNO= 4
##$NAME= <1H>
##$PROCNO= 1
##$TYPE= <nmr>
##$USER= <iren>
##$AMP= (0..31)
100 100 100 100 100 100 100 100 100 100 100 100 100 100 100 100 100 100 
100 100 100 100 100 100 100 100 100 100 100 100 100 100 
##$ANAVPT= -1
##$AQSEQ= 0
##$AQ_mod= 1
##$AUNM= <au_zg>
##$AUTOPOS= <>
##$BF1= 200.13
##$BF2= 200.13
##$BF3= 200.13
##$BF4= 200.13
##$BF5= 200.13
##$BF6= 200.13
##$BF7= 200.13
##$BF8= 200.13
##$BYTORDA= 1
##$CFDGTYP= 0
##$CFRGTYP= 5
##$CHEMSTR= <none>
##$CNST= (0..63)
1 1 145 1 1 1 1 1 1 1 1 1 1 1 1 1 1 1 1 1 1 1 1 1 1 1 1 1 1 1 1 1 1 1 
1 1 1 1 1 1 1 1 1 1 1 1 1 1 1 1 1 1 1 1 1 1 1 1 1 1 1 1 1 1 
##$CPDPRG= <>
##$CPDPRG1= <>
##$CPDPRG2= <>
##$CPDPRG3= <>
##$CPDPRG4= <mlev>
##$CPDPRG5= <mlev>
##$CPDPRG6= <mlev>
##$CPDPRG7= <mlev>
##$CPDPRG8= <mlev>
##$CPDPRGB= <>
##$CPDPRGT= <>
##$D= (0..63)
0 2 0 0 0 0 0 0 0 0.06 0 0.03 0 0 0 0 0.0002 0 0 0 0 0 0 0 0 0 0 0 0 0 
0 0 0 0 0 0 0 0 0 0 0 0 0 0 0 0 0 0 0 0 0 0 0 0 0 0 0 0 0 0 0 0 0 0 
##$DATE= 1731994268
##$DBL= (0..7)
120 120 120 120 120 120 120 120 
##$DBP= (0..7)
150 150 150 150 150 150 150 150 
##$DBP07= 0
##$DBPNAM0= <>
##$DBPNAM1= <>
##$DBPNAM2= <>
##$DBPNAM3= <>
##$DBPNAM4= <>
##$DBPNAM5= <>
##$DBPNAM6= <>
##$DBPNAM7= <>
##$DBPOAL= (0..7)
0.5 0.5 0.5 0.5 0.5 0.5 0.5 0.5 
##$DBPOFFS= (0..7)
0 0 0 0 0 0 0 0 
##$DE= 6
##$DECBNUC= <off>
##$DECIM= 32
##$DECNUC= <off>
##$DECSTAT= 4
##$DIGMOD= 1
##$DIGTYP= 9
##$DL= (0..7)
0 120 120 120 120 120 120 120 
##$DP= (0..7)
$$ [...]
##$SW= 21.9926040160658
##$SWIBOX= (0..15)
0 0 2 0 0 0 0 0 0 0 0 0 0 0 0 0 
##$SW_h= 4401.40845070422
##$TD= 16384
##$TD0= 1
##$TE= 300
##$TE2= 300
##$TE3= 300
##$TEG= 300
##$TL= (0..7)
0 120 120 120 120 120 120 120 
##$TP= (0..7)
150 150 150 150 150 150 150 150 
##$TP07= 0
##$TPNAME0= <>
##$TPNAME1= <>
##$TPNAME2= <>
##$TPNAME3= <>
##$TPNAME4= <>
##$TPNAME5= <>
##$TPNAME6= <>
##$TPNAME7= <>
##$TPOAL= (0..7)
0.5 0.5 0.5 0.5 0.5 0.5 0.5 0.5 
##$TPOFFS= (0..7)
0 0 0 0 0 0 0 0 
##$TUNHIN= 0
##$TUNHOUT= 0
##$TUNXOUT= 0
##$USERA1= <user>
##$USERA2= <user>
##$USERA3= <user>
##$USERA4= <user>
##$USERA5= <user>
##$V9= 5
##$VALIST= <valist>
##$VCLIST= <CCCCCCCCCCCCCCC>
##$VD= 0
##$VDLIST= <DDDDDDDDDDDDDDD>
##$VPLIST= <PPPPPPPPPPPPPPP>
##$VTLIST= <TTTTTTTTTTTTTTT>
##$WBST= 1024
##$WBSW= 25
##$XGAIN= (0..3)
0 0 0 0 
##$XL= 0
##$YL= 0
##$YMAX_a= 96199
##$YMIN_a= -135753
##$ZGOPTNS= <>
##$ZL1= 120
##$ZL2= 120
##$ZL3= 120
##$ZL4= 120
##$ABSF1= 10
##$ABSF2= 0
##$ABSG= 5
##$ABSL= 3
##$ALPHA= 0
##$AQORDER= 0
##$ASSFAC= 0
##$ASSFACI= 0
##$ASSFACX= 0
##$ASSWID= 0
##$AUNMP= <proc_1d>
##$AXLEFT= 0
##$AXRIGHT= 0
##$AXTYPE= 0
##$AXUNIT= <>
##$AZFE= 0.1
##$AZFW= 0.1
##$BCFW= 1
##$BC_mod= 2
##$BYTORDP= 1
##$COROFFS= 0
##$CY= 7568.61572265625
##$DATMOD= 1
##$DC= 2
##$DFILT= <>
##$DTYPP= 0
##$F1P= 17.9538593292236
##$F2P= -4.03888763876832
##$FCOR= 0.5
##$FTSIZE= 32768
##$FT_mod= 4
##$GAMMA= 1
##$GB= 1
##$INTBC= 1
##$INTSCL= 1
##$ISEN= 128
##$LB= 0.02
##$LEV0= 0
##$LPBIN= 0
##$MAXI= 945.577
##$MC2= 0
##$MEAN= 0
##$ME_mod= 0
##$MI= -402.1523
##$NCOEF= 0
##$NC_proc= 0
##$NLEV= 6
##$NOISF1= 8.587773
##$NOISF2= 6.764455
##$NSP= 1
##$NTH_PI= 0
##$NZP= 0
##$OFFSET= 17.49637
##$PC= 1
##$PHC0= 319.5555
##$PHC1= 6.878844
##$PH_mod= 0
##$PKNL= yes
##$PPARMOD= 0
##$PPDIAG= 0
##$PPIPTYP= 0
##$PPMPNUM= 100
##$PPRESOL= 1
##$PSCAL= 0
##$PSIGN= 0
##$REVERSE= no
##$SF= 200.13
##$SI= 32768
##$SIGF1= 18.5376
##$SIGF2= -6.396296
##$SINO= 400
##$SIOLD= 32768
##$SREGLST= <1H.CDCl3>
##$SSB= 3
##$STSI= 0
##$STSR= 0
##$SW_p= 4401.40845070422
##$SYMM= 0
##$S_DEV= 0
##$TDeff= 0
##$TDoff= 0
##$TI= <>
##$TILT= no
##$TM1= 0
##$TM2= 0
##$TOPLEV= 0
##$USERP1= <user>
##$USERP2= <user>
##$USERP3= <user>
##$USERP4= <user>
##$USERP5= <user>
##$WDW= 1
##$XDIM= 8192
##$YMAX_p= 0
##$YMIN_p= 0
$$ End of Bruker specific parameters
$$ ---------------------------------
##NTUPLES= NMR FID
##VAR_NAME=  TIME,          FID/REAL,        FID/IMAG
##SYMBOL=    X,             R,               I
##VAR_TYPE=  INDEPENDENT,   DEPENDENT,       DEPENDENT
##VAR_FORM=  AFFN,          ASDF,            ASDF
##VAR_DIM=   8192,          8192,            8192
##UNITS=     SECONDS,       ARBITRARY UNITS, ARBITRARY UNITS
##FACTOR=    0.0002272,     1,               1
##FIRST=     0,             0,               0
##LAST=      1.8609952,     107,             -14
##MIN=       0,             -135753,         -135753
##MAX=       1.8609952,     96199,           96199
$$ Real data points
##PAGE= N=1
##DATA TABLE= (X++(R..R)), XYDATA
0@%%%%%%%%%%%%%%%%%%jJ8l4L4l4L4l5N2o8O9q1R7j03J20j37J55j82J99k23K57
38A37k91L25l60L95m32M82n37N90o52P21p92Q74r66J064j173J293j428J579j747
57i18J942k169K432k746L124l594M197m999O130p846J0803j7309N7161m1376r2934
72h8102Q6410L9957p4211o6039Q9036R4684m3019j07024J2000P9310o508q2146
84f5652J2402J07171M2278p4481m6547M1674K2628o5121m6890N0530O9105j1218
96C5879m2674J0167L1832k8341n8073N88N0946J6644k0847N931L0688j0014m7085
109b4359j6271K5651J2724r111J5659M1108O407m0053k4972J4493j91l5530o175
122d0620N1490L2693l5953l5281K5263K3755m2067m2951M0404P0487l703n2481
$$ plain form
0 0 0 0 0 0 0 0 0 0 0 0 0 0 0 0 0 0 0 0 -1 17 -17 17 -17 17 -18 34 -34 35 -46 51 -52 68 -69 86 -96 103 -120 137
38 137 -154 171 -189 206 -226 256 -281 309 -343 378 -414 460 -506 558 -615 678 -750 829 -918
57 -918 1024 -1145 1287 -1459 1665 -1929 2268 -2731 3399 -4447 6356 -10953 46208 4832 -88102
72 -88102 -1692 38265 -35946 -101985 -12949 81735 38716 -68308 -56308 23002 16494 -65652
84 -65652 -53250 53921 96199 21718 -24829 16845 39473 -25648 -72538 -22008 47097 35879
96 35879 -6795 3372 35204 6863 -51210 -50622 324 16968 -3879 2052 32740 22726 -24359
109 -24359 -40630 -14979 -2255 -11366 4293 45401 51808 11755 -13217 1276 1085 -34445 -40620
122 -40620 10870 43563 7610 -27671 -2408 21347 -20720 -63671 -23267 47220 43517 -8964
134h964M328N2643r966p9662k5025O8986M4245m7418l7843N0801M8332n0826p3918
147f4287K0433P1371O52n5973L874O8383J3792p2021m3033M5774M0979l5889l5860
160d1805M2546N5997k2579n9358j185M1891j156m2992k703N0422K2890l7397k9961
173b5390K0690J8628k6428k4837K5278L7664l070k3374K187J5957r341k5830k217
186b0083K1941J0080r279j261J0937l508j9881o533J1578L629o444Q118J8811
199A8105j063k0490o784J2757R68j8324k805K6460J6971j9460k0561J4000J8306
212A8080j8586k7319J4477L5255j279l0675l301K7653L968l3233j6504K8637K5994
225B3167j7632k4080J6338K7492j3578l4282K652L1981N339k5344o023K5713J1603
$$ plain form
134 -8964 -4636 48007 38041 -41621 -66646 2340 46585 -833 -38676 12125 60457 9631 -64287
147 -64287 -43854 27517 28169 -27804 -23930 44453 58245 -13776 -56809 -11035 29944 -5945 -41805
160 -41805 741 56738 34159 -25199 -26384 15507 14351 -28641 -31344 19078 41968 4571 -25390
173 -25390 -4700 13928 -12500 -37337 -12059 25605 22535 -839 1348 17305 7964 -17866 -20083
186 -20083 1858 11938 2659 1398 12335 8827 -11054 -17587 -6009 -2380 -8824 -706 18105
199 18105 17042 -3448 -10232 2525 3493 -14831 -17636 8824 25795 6335 -14226 -226 18080
212 18080 -506 -27825 -13348 21907 20628 -10047 -13348 14305 18273 -14960 -31464 -2827 23167
225 23167 5535 -18545 -2207 25285 11707 -22575 -19923 12058 17397 -7947 -13970 11743 23346
238B3346k4688k0950J5002K1185r998j9641R620K4038l529k4356m177J8120N144
251I116j5667o323J5609J2032r890j3755L954J1176l236j1369K008J2423K828
264H906q141l693M146J340m115k366K086K981J178j54j211j834j055J034J125
279B27j946j880M004N447k972p178J149P269q62q052l15R055L733p347n865N189
295c44O820m436r008K601J0290Q5r979j971Q947K814q343m813O709O456m012o891
311e075K518P516p38q050j113P954K677o739l432N796M153m433n258K329N285
326C390n53n351j110N165K342m696l612L606M136k337l932R70L800P05k939j955
342b371K143L068j071l425J93L498N73k950j450J875J699q89k112m87K092J366
$$ plain form
238 23346 -1342 -22292 -7290 13895 3897 -15744 -6124 17914 14385 -9971 -14148 3972 9116
251 9116 -6551 -12874 2735 14767 4877 -8878 -4924 6252 3016 -8353 -6345 6078 8906
264 8906 765 -2928 1218 2558 -1557 -3923 -1837 1144 2322 2168 957 -877 -1932 -898 227
279 227 -1719 -3599 405 5852 2880 -4298 -3149 4120 3258 -4794 -5109 3946 7679 332 -5533 -344
295 -344 6476 2040 -6968 -4367 5923 6008 -3971 -5942 3005 5819 -2524 -7337 -628 5828 1816 -5075
311 -5075 -2557 4959 4221 -3829 -4942 3012 5689 -1050 -4482 1314 5467 1034 -4224 -1895 3390
326 3390 2837 -2514 -3624 1541 3883 -813 -4425 -819 3317 980 -2952 -1982 1818 2523 -416 -2371
342 -2371 -228 2840 1769 -1656 -1463 2035 2608 -342 -1792 83 1782 893 -1219 -1706 386 1752
358A752k048k026J670K156j006j959M69J694L22j008p35O55J373k21j553k4J677
375A188M8j499j37J033n4o55j47Q7J86J2m28l11P37K77r79j23J118J65r99Q2R09
396E10J89m61l09K51O37J53r30n51J143O64j349r01J188P51j077r15O12P24k34
415I5p29j29R87M82j013n76J270P42j475n37J843P02j718o81J614P40j514j399
433a296R89J918n03k382o8K801K83l462j050L316J667k838j786K618K359j861
449G05k914P41L125K82k982m13L345J136l358j730K397J361k205j059K103J435
465A969j497j642O85R59j139j378J431K385p40k165J052K205j886l257J636L795
481B413o00l148J104L608q39m770j274M261K093l882j982M798L437n077n502L481
$$ plain form
358 1752 -296 -2322 -652 1504 498 -1461 -992 702 1024 16 -719 -64 1309 1088 -465 -489 1188
375 1188 1236 -263 -400 633 579 -76 -223 -136 50 62 -366 -677 60 337 -642 -765 353 518 -481 -399 510
396 510 699 238 -71 180 817 970 40 -511 632 1296 -53 -954 234 985 -92 -1007 -395 329 95
415 95 -634 -763 224 706 -307 -883 387 1129 -346 -883 960 1662 -56 -737 877 1617 103 -1296
433 -1296 -307 1611 1108 -1274 -1342 1459 1742 -1720 -2770 546 2213 -625 -2411 207 2566 705
449 705 -2209 -1468 1657 1939 -1043 -1456 1889 3025 -333 -2063 334 1695 -510 -1569 534 1969
465 1969 472 -1170 -485 474 -665 -2043 -612 1773 1033 -1132 -80 2125 239 -3018 -1382 2413
481 2413 1813 -1335 -231 3377 2538 -2232 -3506 755 2848 -1034 -3016 1782 5219 142 -5360 -1879
497a879N276l244n226L647P349j447p787r12O762J240p504k440Q684N887o913
512A493p135N377O592n905q681M303J0325m67r103r00Q358J228j0104m633Q976
527b76P387n862o358O048P094o119r500K491Q831k33o616J286Q032L95r079m084
543f563O121L311n484k025P852M819o498o182L456L587n023m334N998P720k389
558D366o594J264N293l617q383J933J0200J850p411n94Q019l93j1235m313R060
573e55O113o262m316Q351P085q641j1709L947J0772k538r834M414J4096o11j4923
588d611m633J0933L909j1191m662J3410J0947r067j2900M871J0545o446j3435
601a2330M718J6857J633j3549l455J1138J797j3950o445J2538J1122o405q663
$$ plain form
497 -1879 3397 153 -5073 -1426 5923 4476 -3311 -4223 2539 3779 -3725 -6165 2519 8406 1493
512 1493 -5642 -265 6327 422 -8259 -3956 6369 5902 -3201 -4101 4257 5485 -4619 -9252 -276
527 -276 7111 1249 -5109 939 8033 1914 -7586 -5095 3736 3503 -3113 -1827 6205 6600 -2479 -6563
543 -6563 -442 2869 -2615 -4640 3212 8031 1533 -4649 -1193 2394 -2629 -6963 -965 6755 4366
558 4366 -2228 -964 4329 712 -7671 -5738 4462 6312 -1099 -1693 6326 5933 -5302 -9615 -555
573 -555 5558 -704 -5020 3331 10416 1775 -9934 -5987 4785 2247 -7587 -3173 10923 10312 -4611
588 -4611 -9244 1689 5598 -5593 -10255 3155 14102 5035 -7865 -2994 7551 1105 -12330
601 -12330 -7612 9245 10878 -2671 -6126 5012 6809 -7141 -13586 -1048 10074 3669 -4994
614d994O838Q666q277j3611L254J2731L43q871K353J0909r72j3134m758Q486M363
629C326o679k098J0599O298q988r367M134N644o210o007Q185J1055l227r558J105
644a788O575m165j0173K164J2802L499q896k556Q656O78j3170o349J0884R250
658G411o444o271Q778Q421r337j4029L134J2885n96j0668K813J4851J232j6315
672d135p390J1287O554j0581o035J3096J2131q566j4020K947J0670m344j2762
685a1148L093J6392L276j3059n093R938K932j2486o469J1589J0896n460q339N130
699A192P526o913j1945K248J1714J415p850R50R558m81j1741m605P780M467n596
714b281j863Q588N096p528q374L015N385m076n182O339R513k342q836K61N985
$$ plain form
614 -4994 1844 10510 2233 -11378 -8124 4607 4950 -3921 -1568 9341 8369 -4765 -9523 -1037 3326
629 3326 -3353 -5451 5148 11446 2458 -6909 -2775 2869 -3341 -9348 -1163 9892 6665 -2893 -1788
644 -1788 4787 622 -9551 -7387 5415 8914 18 -2538 6118 6796 -6374 -12723 -1839 7411
658 7411 967 -5304 3474 11895 2558 -11471 -8337 4548 3952 -6716 -3903 10948 12180 -4135
672 -4135 -11525 -238 6316 -4265 -10300 2796 14927 6361 -7659 -4712 5958 1614 -11148
685 -11148 -8055 8337 11613 -1446 -6539 3399 6331 -6155 -12624 -1035 9861 4401 -3938 1192
699 1192 8718 1805 -10140 -7892 3822 5237 -2613 -1663 7895 7414 -4327 -8932 -1152 3315 -2281
714 -2281 -4144 4444 9540 2012 -6362 -3347 2038 -2038 -7220 -881 8632 6290 -2546 -2285 3700
729C700k848q583J727J0731K927p622k892O772J446j0019n716Q733Q637m955o623
744d585O014P814o672j1692K040J0767N79q528N65J0731K225j1528o684P839O606
759E491o712n971Q101R364n303j0708J267Q078j755q539J103J0568L017q312m574
774d885O005L198p285m921O990P679l351o095K510N149l623p223J014P133J545
789C840m673n60N176N93o517l333M539L318l174j744M511K995m131m491J964L076
805A389j968k809L121M952j352n019Q6L770j182m991Q13O141J450n011j749M257
821A898J337n352l343M693M840k632m432K639M787k566o362N66O177R10m960n93
837b393N318J669n221l633L624L644k503l658K748M733j713n318O6M258n8l927
$$ plain form
729 3700 852 -7731 -6004 4727 7654 32 -2860 3912 5358 -4661 -10377 -1644 6993 2038 -4585
744 -4585 1429 9243 2571 -9121 -7081 3686 4265 -4263 -3698 7033 9258 -2270 -8954 -1115 5491
759 5491 -1221 -7192 909 10273 4970 -5738 -4471 3607 1852 -6687 -5584 4984 8001 -311 -4885
774 -4885 1120 4318 -2967 -7888 -898 6781 3430 -2665 -155 4994 1371 -5852 -4838 2295 3840
789 3840 -833 -1393 3783 4376 -2141 -5474 -935 2383 -791 -2535 1976 4971 840 -3651 -1687 1389
805 1389 -579 -3388 -267 4685 3333 -1686 -1600 2170 988 -4003 -3190 2951 4401 -610 -2359 1898
821 1898 3235 -2117 -5460 -767 4073 1441 -2991 -352 4435 1869 -4493 -3927 2250 3160 -1800 -2393
837 -2393 2925 4594 -627 -4260 -636 3008 505 -3153 -405 4328 2615 -2703 -2637 1621 1563 -2364
853b364k21M369J574l414k336K347K061k243k565K015L493q55l004M20K541o56
869A162k744o9K447P46j505o75J325N43j558j128J061J094o89o22J089P79j141
886A15j083Q57Q01r28o53J296J110q71j262L92J279n31j563K22J946L42j934p04
904a169J800N52j721j091J527J432r58j453O60J577l31j778q9J798N10j486o08
921h28J492P07j360r32R27J008o55j078L83J108j15j208k68J124M10r95n95R97
939A22P47o80p16L58P22o4n97j13N39M45m95n23K87N34j49o05M1L36J28k10l02
960a95l8L08J62l22k56L33L00j42l08L7K16K39q0l04K3M57N7n19m9L61J13l55
982C8j51J94J19l5k20j33J86K25k91j31K04K23l11j17L79M4j48q0J05J53j2j17
$$ plain form
853 -2364 -2585 1784 3358 -56 -2392 -45 2016 -227 -2792 -777 2716 1861 -1143 -723 1818 1162
869 1162 -1582 -1651 796 1542 37 -638 687 1230 -328 -1456 -395 699 10 -612 477 1256 115
886 115 -968 -111 690 -238 -891 405 1515 644 -618 -226 1053 522 -1041 -819 1127 1469 -465 -1169
904 -1169 631 1183 -538 -1629 -102 1330 372 -1081 -421 1156 825 -953 -1042 756 1266 -220 -828
921 -828 664 1371 11 -921 6 1014 359 -719 -336 772 657 -551 -819 305 715 -280 -875 122
939 122 869 189 -527 -169 553 489 -108 -221 318 763 268 -255 32 566 417 -188 -147 189 317 107 -195
960 -195 -233 75 237 -85 -341 -8 292 150 -158 -121 95 334 254 -50 -27 430 487 -32 -81 280 393 38
982 38 -113 81 200 165 -55 -188 -2 223 -68 -199 5 228 -83 -200 179 223 75 -5 100 253 241 124
1004A24j09J66K53l45k88L65K36l23l21K26K73j03k96p9K43J86p9m48J72N19j70
1025B02l28J16L61q3j85oR9M0lj25pR8L3j63kJ02k22r4L17Ol95J9M51J9l63j91
1051c04L62K60j68l25J41N09J7o77l8N60K09o77j89O86K26o28k79M19J75l70l55
1072d46K59O64k16o61K65N91k08p97J78J006o9q39Q3Q62Rq66l79P35O67o99o76
1093e37O06R39o17j227K41J227k75j056J66J254J21j160l98R27M30q99n72J134
1111C04J036r53j111P45J099q56j513Q22J613k86j550R7J419j4j657o11J586J170
1129A340j325j100J354J357j358j855Q70J824m19j447M23J763j55j908n85J499
1145B78P92j494o46J699J194j637j407J015J155j232j319J294J885n27j827K53
$$ plain form
1004 124 15 181 434 89 -199 166 402 79 -242 -16 257 154 -142 -221 22 208 129 -319 -147 372 202
1025 202 -126 -10 351 268 83 77 176 216 213 88 81 179 212 49 47 149 -73 -167 150 156 -239 -220 231 250 -113 -304
1051 -304 58 318 150 -175 -34 475 492 -185 -223 337 546 -131 -320 366 592 -36 -315 104 279 -91 -446
1072 -446 -187 477 261 -400 -135 456 248 -549 -371 635 566 -273 -190 672 681 -185 -564 171 838 139 -537
1093 -537 69 1008 391 -836 -595 632 357 -699 -533 721 842 -318 -716 211 641 -258 -830 304
1111 304 1340 387 -724 21 1120 264 -1249 -427 1186 900 -650 -553 866 852 -805 -1416 170 1340
1129 1340 15 -1085 269 1626 268 -1587 -717 1107 688 -759 -336 1427 1272 -636 -1221 278
1145 278 1070 -424 -1070 629 1823 186 -1221 -206 949 -283 -1602 -308 1577 1050 -777 -524
1161e24J619m04k078n9K426Q23j959o93J849P02k270j454J752J860j150j510J276
1178B06J772j166k590L27K270Kk001K47K700L21k771j080K016J014j991j010K344
1195F10K064j628k503R27K103j124k742Q80L348K03k845n07K379L76k969j306
1211b734K774K082j569j792J534J991j757l000Q56K961n1k297N45K607j24l157
1227a131r91K309J024j882q47K476J793k169k486J125J991j319k129J617L065
1242B446n85k814k0K182l83k632j57L033J371k127j389J907J134k554k125K029
1258f84K612j052j983J245K254j362l188J62K792L73k247O3K886Q15l158j894
1274b366K186J692k011j519K407K698j580l082N14K392p80k679M34L528P73k872
$$ plain form
1161 -524 1095 691 -1387 -1446 980 1803 -156 -849 1000 1702 -568 -2022 -270 1590 440 -1070 206
1178 206 1978 812 -1778 -1451 819 821 -1180 -933 1767 2088 -683 -1763 253 1267 -724 -1734 610
1195 610 2674 1046 -1457 -530 1573 449 -2293 -1413 1935 2138 -707 -1214 1165 1541 -1428 -2734
1211 -2734 40 2122 553 -1239 295 2286 529 -2471 -1615 1346 1295 -1002 -457 2150 2026 -1131
1227 -1131 -2122 187 1211 -671 -1518 958 2751 582 -1904 -779 1212 -107 -2236 -619 2446
1242 2446 1861 -953 -973 1209 826 -1806 -1963 1070 2441 314 -1075 832 1966 -588 -2713 -684
1258 -684 1928 876 -1107 138 2392 1030 -2158 -1996 796 1169 -1078 -1015 1871 2686 -472 -2366
1274 -2366 -180 1512 -499 -2018 389 3087 1507 -1575 -1061 1331 551 -2128 -1694 1834 2607 -265
1290b65j241K224R26k879j568K598K541j463j965J240J943j506k886O13K860L10
1306A482k166J2K615K07l129j287K292J292j788r45K132J825j877k453Q05J972
1322I89q08j953J062K720q3k546n32J904N5k223l41K589J317j723j296J413R45
1339A489j795j793J409K280o33j891P93J959q21k695m4K321O34j813l24K220Q67
1356B163k280j761J509J704j288j573J500K287r80k383M1J965k21k065J09K423
1372A150P54j952j117J375R68j671j306J527J948q55j630O93J514q54j971K81
1388a146J958L54j448k54J527M61j850j115J360J215j072r23J238J220j030j520
1404a025L66J306l22j187L79J537J25j411m73J134K85j241m27J304R52r87q52
$$ plain form
1290 -265 -1506 718 1644 -1235 -2803 -205 2336 873 -1092 148 2091 585 -2301 -1688 1172 1482
1306 1482 -684 -672 1943 2150 -979 -2266 26 1318 -470 -1415 717 2542 665 -1788 -983 989
1322 989 181 -1772 -710 2010 1927 -619 -1151 753 808 -1415 -1756 833 2150 427 -869 544 1489
1339 1489 -306 -2099 -690 1590 957 -934 -141 1818 997 -1698 -1742 579 1213 -600 -924 1296 2163
1356 2163 -117 -1878 -369 1335 47 -1526 -26 2261 1281 -1102 -1061 904 683 -1382 -1273 1150
1372 1150 1904 -48 -1165 210 1178 -493 -1799 -272 1676 821 -809 -116 1398 544 -1427 -1146
1388 -1146 812 1166 -282 -536 991 1452 -398 -1513 -153 1062 -10 -933 305 1525 495 -1025
1404 -1025 -659 647 325 -862 -483 1054 1179 -232 -705 429 714 -527 -954 350 1302 315 -537
1421e37P08P09r35j041P04J248k45j081K13J147j77j449k77J388M41j041l10J112
1439E77N72j057r71O96R40m47q92M00J185j75j332j04J041J33j059j94J102N25
1457I40r35o14O35N73n75o80M69Q86j18r27J85P52j30q60r6Q28K30n88j87M96
1477B84K75o00m26L63M96k32m24K38M78q7o55K0N27j1m10R0N01J02n01j43K92
1498A77J34l08j64K90L99l76l49K43L42l17l91K01M44q3l98k4M46N8m55j46L55
1519G8L15l19k74L82K25k56l83J79L23q0k41lK62O9l75o4K52R1j93j15J82J84
1541B39j96j10J97J02r2k02Q2K29o6q6m6R1J49j55j70J23J34p7j80Q2J45o9j08
1564A6j3J18r5K4n4J9Q6m2n5O7L8k5rR0k5p5M4J56j80n6M5N8j4p1n0Q1N0p2j32
$$ plain form
1421 -537 171 880 -55 -1096 -392 856 611 -470 -257 890 713 -736 -1013 375 816 -225 -535 577
1439 577 1149 92 -879 -183 757 310 -582 -182 1003 828 -504 -608 433 566 -493 -687 415 940
1457 940 5 -609 26 599 24 -656 -187 699 581 -346 -161 591 461 -399 -495 333 563 -25 -212 284
1477 284 559 -41 -467 -104 392 160 -264 -26 452 365 -290 -270 257 246 -164 -74 427 529 28 -115 177
1498 177 311 3 -161 129 528 152 -197 46 388 71 -320 -119 325 242 -156 -180 266 324 -131 -277 78
1519 78 393 74 -200 182 407 151 -232 -53 270 190 -51 -54 208 277 -98 -162 90 181 -12 -127 55 239
1541 239 43 -67 130 232 140 -62 20 249 183 97 51 142 291 136 -34 89 223 146 -34 48 193 124 16
1564 16 3 121 26 50 -4 15 101 59 4 71 109 84 75 165 140 65 109 265 85 29 74 132 118 47 -3 78 128 56 -76
1593g6J46JL4j11QJ25J1m9q8O3O2J1J5p5N6L7q8%M4oj21K5O1l0pK8n7PP7lm7N
1625E8l6k5RJ09M3j18R8Jl1m1l0Q0L6N3j26j5R7l9o4n5J01Ko5P9p6j5P3l4j1L4
1655I2L%l6J05p3j5Q5P1j99K0N6M3m7j49Q7J35o8j24M2P4J8j42MP1J09q0j30J07
1683E9J51j10q4O5Q8m1n8L8R0l5j46N0Q5K8k11j07L43mk38k5K18J22k59j51J18
1708a4J81o3k05J51J76O8l33jK34J07l64pK12J25j57j30J22L1n4j99J63J24p0
1731I7j87P8K98q1l48J1L57k4k34o1L76mk96j21K36K10k23k63J99L70p3m80K0
1754a43L12N9l90K4L31J01l27j26K65J43k53k55L16K93k29k69K52K58k20m12J97
1775g3L66j8l50j5L83P7m23k78L59K85l58k26L77L97k68m91J90L50j32m54K14
$$ plain form
1593 -76 70 71 105 -6 2 127 138 89 1 64 126 137 152 77 133 170 82 82 126 120 -1 24 85 55 48 76 19 26 103 100 53 58
1625 58 22 -3 6 115 158 40 138 139 108 67 37 117 153 206 80 65 162 123 59 4 105 107 42 121 45 30 103 69 58 92
1655 92 95 95 59 164 91 76 161 232 33 53 109 152 105 -44 43 178 110 -14 28 102 120 -22 -18 53 162 82 -48 59
1683 59 210 100 16 81 169 128 70 108 198 163 17 67 152 180 -31 -138 205 201 -37 -62 156 278 19 -132 -14
1708 -14 167 104 -101 50 226 294 -39 -40 194 301 -63 -70 142 267 110 -20 102 133 79 -120 43 167 97
1731 97 -90 -12 286 205 -143 -132 225 201 -33 -94 282 278 -18 -139 97 307 84 -179 20 390 317 -163 -143
1754 -143 169 228 -162 -138 193 294 -33 -159 106 249 -4 -259 57 350 121 -148 104 362 142 -270 -73
1775 -73 293 275 -75 -90 293 370 -53 -331 28 313 -45 -271 106 503 235 -256 -66 284 152 -302 -88
1796h8M71K0m23j80L80Q8l93j62L94L74l30m03L55L10l73m49K25N86j60l61O2
1817e7M82m0n98j93N87K82m00l34M93L78m78m22J24N29j24n03J75N65l5m52k82
1838c03M98N3m81q8M67L43m37k66K99L31l49m62L90M34j15m72J16N16j59o76j5
1859c76N92K74n66j36N47J88n25m49L31M12j29m38K89N09j61n89K0M67m4m18O1
1880a41N24K51n90k73M05K26n24k83M53N22l38m83J67N63l05o20R2O46J39m86
1900e5j03N35J32n47l88L56N65l07m00K99M66j93n85n6N20nm66R7N63N6n93j18
1922b27L13K27m20k09M47L60k60m59K77L99l13n38J77O24j2m61l0L94J41o02k78
1943d50N35L69l68l43L81L31k75n43J48N06p6l43N4N18n9n35q3M30J15l98j61
$$ plain form
1796 -88 383 403 -20 -200 180 268 -125 -287 107 481 151 -252 103 413 40 -409 -184 402 242 -119 -57
1817 -57 425 385 -213 -406 181 463 63 -271 222 600 122 -300 -176 353 229 -274 -99 466 431 -21 -303
1838 -303 195 248 -233 -321 146 489 52 -214 85 416 67 -395 -5 429 314 -158 -42 474 315 -361 -376
1859 -376 216 490 -76 -212 335 523 -2 -451 -120 292 163 -275 14 523 362 -227 -207 260 216 -202 -141
1880 -141 383 634 44 -229 176 402 -122 -405 48 570 232 -251 -84 479 174 -446 -354 292 431 -55
1900 -55 -158 377 509 -38 -426 -70 495 188 -212 87 553 360 -225 -281 239 234 -232 -135 428 484 -109 -227
1922 -227 86 313 -107 -316 131 491 231 -228 49 448 135 -403 -226 398 386 -75 -105 289 430 -172 -450
1943 -450 85 454 86 -257 124 455 180 -363 -215 291 215 -128 -74 444 385 -150 -233 197 312 -86 -247
1964b47N05K81l58m17L58K95m25m03L15N34o5m97l0M62j1m92j64N20K46k69l36
1985a98L77K72l55m28K36M52j16l86J22L79m1m94q8M47J1l20r8M86K01m18k92
2006b51L07J87k07l01K83M14j12l87m1M29r7m04k2M55J20l52j60L15J60l20k37
2027b21J68L54j64k78J44K93j91k97L7M14m1k90k6M39L2m13r6K15K22k87j73K32
2049G3K98j33l89J03L69j62l25m4M19M3k41j23K64O4j92j63K11K55j68k24J40
2070G5K11j74k04O4K52Lk41KK64m4k76n0K55J05k33j26J43K26j36j81O1K38j43
2093I1j39M0K61j7j96o6J17P1j65n7J21J42q8j18J5J24j25o5J10R6l2j26M9J40
2117A83l1j52l0J93K1j33r2K22Kj75J3O8J13j09n7k7J34O2k21k5P6O8m9r6J08
$$ plain form
1964 -247 258 539 181 -236 122 417 -8 -411 -96 438 373 -124 -154 308 297 -195 -359 161 407 138 -198
1985 -198 179 451 96 -332 -96 356 240 -146 -24 355 314 -180 -268 179 190 -130 -228 258 459 41 -251
2006 -251 56 243 36 -265 18 432 320 -67 -108 321 224 -180 -202 253 373 21 -139 176 336 16 -221
2027 -221 -53 301 137 -141 3 296 105 -192 -155 259 218 -72 -98 341 373 -40 -136 79 301 14 -159 73
2049 73 371 238 -151 -48 321 159 -166 -210 209 252 11 -112 152 216 24 -139 72 327 159 -65 75
2070 75 286 112 -92 -28 224 227 -14 -12 252 208 -68 -118 137 242 9 -117 26 252 116 -65 -4 234 91
2093 91 -48 -8 253 236 40 -26 91 162 -3 -60 61 203 115 -3 12 136 11 -54 56 152 120 -6 43 183
2117 183 152 0 -30 163 184 51 -41 181 183 8 21 89 202 93 36 9 143 205 -16 -41 35 103 54 -42 66
2142F6J10j57l4Q8J03p6o4O1j7nn3j4J82o0j07K0L7L5p0j06J74J8m4r0L3J01l6
2169I5o2M4P2Jn9q3J41m2n2k0Q5%o9K6K0j5k2R6j22J8K5n6M2L6j00m0Q1M1l8M3
2199H6J4j2m1j7jR3k8k5j5K2L1p4k2O5kJ7l0%N2j07M8K0M5j8jl2PrP9j09P7M9
2231A62n6l9Q5j6q8J3%O8j1l4n2P4k3k0J8k6L3j3m1L0l2L8Mk7k4K9P1m3L1l3j6
2262F2J7M2m0jK1Rj4j1k9K5K4l4k5K3J16j07nl9O4K7p2%K7P3r2k0P4J5k5k0m1
2293D4O4j5l9L2k2k9j8L7K4k9M8o6L8J08j33k6Q0O9j34%kJ30k3r1o5K16Kj78K9
2322E1Q4j9n8l6Q9%m9o7R5L5m4m2J2J25r4n2J7J22p1j65Q6J39Q1k49N0N3O2j43
2350A2n1R3J80j37j34L8J72j26j67J13J63k3j15p2J77J20j84j38J72J09j50p8
$$ plain form
2142 66 176 19 -15 73 176 100 36 97 80 75 22 8 190 130 23 43 80 115 45 -61 113 131 87 -3 30 131 95
2169 95 33 77 149 150 91 8 149 107 55 35 120 120 51 77 97 82 60 156 34 52 77 21 63 99 -1 -41 40 81 43 86
2199 86 100 88 47 30 29 122 94 69 54 76 107 33 11 76 74 91 61 61 113 6 54 74 119 101 100 68 75 66 145 36 113 162
2231 162 106 67 152 136 48 61 61 129 118 84 32 106 83 63 81 55 88 75 34 64 32 70 74 47 23 52 123 80 111 78 62
2262 62 79 121 81 80 101 110 96 85 56 81 105 71 46 69 185 78 73 34 98 125 53 53 80 153 61 41 115 130 105 85 44
2293 44 108 93 54 86 64 35 17 54 78 49 97 31 69 177 44 18 98 167 33 33 31 161 138 47 -18 198 200 22 51
2322 51 135 116 58 22 111 111 62 -5 90 125 81 39 51 176 82 30 47 169 98 -67 19 158 239 -10 40 93 155 12
2350 12 -39 54 234 97 -37 1 173 47 -120 -7 156 133 18 -54 123 243 59 -79 93 202 52 -26
2372b6J49J51j68j90J28J99j34j42M0K15L6k60j17K65O1k25p0K39J79k49j96J95
2394H0J56j32l18K40K04l7k63M4J96Ql08O1K11J06k24j04J78J52l34o2J69K42
2416B65j17j78Q9L10j71l28P1K59lk75j9M04R1l32k63L39J19k48j96K48K96k51
2438A10k45P6L03j27k90JM54N4l94o7M22J2m53j9K10L25k19k58J64L11k22m43
2460b95J95M04n1l96J11L61n9l93j65L78J94l58j35L80K88l55l18J55M18k00l40
2481a81J58L90o0m07nM11l9l84j26L86K59l71k01L01K92m93k45K99M05k55k74
2502a40J61L84j15m91%M29R6m20j02M31K14m32k23K96K83l89k45L30L88k42m19
2523b06J79K92n5m41N2M67Q1m28p1L70J68m85j47L57K68k45k43J86L11j73n34
$$ plain form
2372 -26 123 274 106 -84 44 243 109 -33 7 222 258 -2 -119 146 207 -18 -88 151 330 81 -115 80
2394 80 236 104 -214 26 230 193 -70 -26 170 178 -130 -69 142 248 24 -80 98 250 -84 -146 23 265
2416 265 148 -30 59 369 198 -130 -59 200 197 -78 -97 307 398 66 -197 142 261 13 -183 65 361 110
2438 110 -135 -59 244 117 -173 -172 282 336 -58 -125 297 309 -144 -163 47 372 153 -105 59 370 148 -295
2460 -295 -100 304 253 -143 -32 329 270 -123 -288 90 284 -74 -209 171 459 104 -214 -59 359 159 -181
2481 -181 -23 367 307 -100 -105 306 267 -117 -243 143 402 31 -170 131 423 -70 -315 -16 389 134 -140
2502 -140 21 405 290 -201 -201 228 324 -96 -198 233 447 15 -208 88 371 -18 -263 67 455 213 -206
2523 -206 -27 265 210 -231 -179 288 369 -59 -130 240 408 -77 -224 133 401 156 -87 99 410 237 -297
2544b97J07M85k8m36M9M74O4n01j69L75J93l50k38M46L05l54l11J20L44j12m21
2565b55J68N36q5n23M4L41N1m59q5M69J87l93k14L21K81k96m06K08M60q7m30J38
2587b9M76j12m54m1L52J42l66j15L98J41k91l12J81L27k69k20K16L47j68l48P4
2608g1L13o0l67N1M41O7l02j82K69K10l53j92K68K56k09k23R3K69q3m46R2L76
2630B17K3l02k5L08J77m54j12K06K17k03j16J96K23k03k94J37K34o9k22K3L71
2651C32p8k44j07K35Q9k97j15L22K33l30j17J79J55j80j99O4L08o2k52Q5K51n2
2673B20k89l1K27J10k05j44L07R9k22k06J37K20k16r3P2K69k8k83K1K16j3k63
2695i5O3K36J4k01lR8N5q3j13K6K76j21j53MJ84l6k21j5K22Qj49l7J58Q4j83o6
$$ plain form
2544 -297 -190 295 267 -169 -120 354 418 -83 -252 123 316 -34 -272 174 479 125 -186 -66 278 166 -255
2565 -255 -87 449 364 -159 -115 226 277 -182 -267 202 389 -4 -218 103 384 88 -318 -110 350 263 -167 -29
2587 -29 447 335 -119 -160 192 334 -32 -147 251 392 101 -211 -30 297 28 -192 24 371 203 -145 -71
2608 -71 242 182 -185 -134 307 374 72 -110 159 369 16 -176 92 348 139 -84 9 278 195 -251 -159 217
2630 217 240 -62 -87 221 398 -56 -168 38 255 52 -64 132 355 152 -142 -5 229 160 -62 -39 332
2651 332 254 10 -97 138 227 -70 -185 137 370 40 -77 102 257 77 -122 -58 250 188 -64 21 272 220
2673 220 -69 -100 127 237 32 -112 195 294 72 -134 3 223 7 -86 -14 255 227 -56 -35 181 168 -95
2695 -95 -32 204 218 17 14 112 167 84 -29 -3 273 152 -1 3 187 151 -70 -85 137 145 -4 -41 117 201 18 -48
2721d8J37R7r9q8Q0J57p9j94O8J89r9j21K5J21rj21l4Q1O9j7j18J04N8q5m8NO4
2748I5p9QJ2J38q1J4m2P0l0o0j1P7j2p2l9N0O3q4n5Q1O4l0m4n%M0k2K0Q0k4m0
2779H2m5J49n0m5n8J27r1Q0m6m5j5K5nj3k4P4J8p1M4k2Nk5L2M9j64J34J0N5r9
2808F6J5K7l5J08j42O1l0N3l8K4j3oRj3qJ9l5j0k9Q2o0M0l6O3K0j02J6O2O3j80
2838iJ15j3K3k4l1PKon6QN9n7j8P9K2Qj6J5p7N0J3o4M3PjJJ8n1M5L4j00K8pL3
2872H0m1N2Pp6O1Jk5M9Np9O7n4k3R2n8l4N7j8NL9l2O2l5Lj24P6M3k7o0MM7K3m6
2905D1m6Q3N6r0L7jpL9j34O4J07j11J3n6J21k0q4K6L0N4p5k4J2K8L4p8j8J00k9
2934G2o1L5P5J8j7j25J28Jp7J3J19o8m8L8M1jk2j15Q2QP3j46K5O4o3m1M1L0K3
$$ plain form
2721 -48 89 186 87 -1 79 236 157 -37 31 220 121 0 25 146 137 16 -18 63 132 115 -3 101 159 74 26 31 95
2748 95 16 24 36 174 93 107 65 135 105 45 34 111 99 27 -12 38 101 17 -38 43 107 77 33 28 28 68 46 66 146 122 82
2779 82 37 186 136 91 33 160 69 149 103 58 43 68 63 50 26 100 118 47 91 69 74 49 81 130 -34 100 110 165 66
2808 66 81 108 73 181 39 100 70 123 85 109 96 90 99 86 78 97 62 52 23 105 45 85 49 112 132 30 46 108 171 -9
2838 -9 106 93 116 92 61 68 70 64 8 16 75 18 0 79 101 109 93 108 31 81 94 30 73 80 79 80 98 47 92 126 26 54 47 80
2872 80 39 91 98 22 83 84 59 108 113 34 101 47 24 116 58 24 81 63 68 107 75 137 102 105 -19 57 100 73 13 17 64 87 41
2905 41 -5 78 134 44 81 80 73 112 -22 42 149 38 51 -5 116 96 12 38 68 122 47 23 35 63 97 19 1 101 72
2934 72 11 46 121 139 122 -3 125 126 49 62 181 113 65 103 144 143 121 6 88 96 169 23 48 112 49 8 49 79 102
2963A02m4m9RJ02o8j7K5Q2o8n0N7R7l8k08P8Q0Mj05K3J23p0m3k4L0J26j40j13
2990i9J85J18j06j59J22J41n7j41Q8J11l4r2M8Q7o2j13j05K20J5j07o7J38N2j12
3014G1k01J57J18p0j00K6J91j10j32L1K17j09r8J5J06R1j98p5J22J40j44j28P7
3037cJ96p7j71M4J74j7j64n3K44M9k15o3K39N9k25q1J46J90j61j37J17J02r9j88
3061i4O1K51j06j16MK35n7k38j6J28J35j57j36K27Q4j09k23J66J46q6k05P0K97
3084B61n5k54J4K55n9j74n8J64J68j98j03J29J52j49k92J62L37k21r3O5K38j33
3106A56k53L2K31Mj35q5K22J10k68j37K52P9j31j77J13K86k06k31L3K52l4k36
3128a23O5K14Q7k38q8J58J57k10j52J93K02j09k25J48J68j91j99P0K08N5k02n8
$$ plain form
2963 102 58 9 18 120 52 35 60 142 74 24 81 178 140 -68 10 90 94 -11 12 135 65 22 -2 28 154 14 -99
2990 -99 86 204 98 -61 61 202 145 4 92 203 169 77 125 212 150 37 -68 152 167 60 -7 131 183 71
3014 71 -130 27 145 75 -25 1 192 82 -50 -19 198 89 -9 6 112 203 5 -70 52 192 48 -80 -3
3037 -3 193 116 -55 -11 163 146 -18 -71 173 222 7 -56 183 242 17 -64 82 272 111 -26 91 193 94 -94
3061 -94 -33 218 112 -4 0 235 178 -60 -76 52 187 30 -106 121 205 96 -127 39 185 99 -106 -36 261
3084 261 206 -48 -34 221 162 -12 -70 94 262 64 -39 90 242 93 -199 -37 300 79 -14 51 289 156
3106 156 -97 -65 166 170 35 -50 172 282 14 -123 129 208 77 -100 13 299 93 -138 -105 147 113 -123
3128 -123 -58 156 243 5 -83 75 232 22 -130 63 265 156 -69 79 247 56 -143 -73 135 190 -12 -70
3150g0K39O4k22j26J53J95j40k24K51J33j46j21N1J92j23j99N6K12O4k88k6K30
3172A55l8j73q7K37J54j88j13J17J44j16k44J91K23r7k13P4K08o0k38l6K44N2
3194A96j50j13J78J26j62j72J23J68j17j53J24K11q6k06jK35o5k21O5J91O8k17
3216B2r7J61J24j29j30J31J00m4j42R6J30n7k06m6K34K7j71jJ50Mj19j07J47P2
3240A49l9j16J36Q9n7j92P8J41j09j62N9K38k7j48j0N8P7j98NJ24J11j03j03J6
3264A7J43j01j50J10K32r8j51KJ37Kj38j3Q8M5n3p6J11P1j22q0R8N4q6m9K7J15
3290A35m0j26J9Q8J2o7l8R3J22j60n8P3M7l0n6Q0P5m7j43R9P0J1j38M0Q2k7p3
3317D3%P8N4q9m6N5N0m4p9O4M3q0q3R0O5n3l7k3Q6Qm2o3N2N7n2o5P8M7j7q4M9
$$ plain form
3150 -70 169 233 11 -115 38 233 93 -131 120 253 107 -14 37 229 106 -93 -37 175 239 -49 -75 155
3172 155 117 -56 -143 94 248 60 -53 64 208 92 -152 39 262 165 -48 26 234 174 -64 -100 144 196
3194 196 46 -67 111 237 75 -97 26 194 77 -76 48 259 173 -33 -34 201 136 -85 -20 171 239 22
3216 22 -75 86 210 81 -49 82 182 138 -4 92 222 165 -41 -87 147 174 3 2 152 156 37 -70 77 149
3240 149 110 -6 130 219 162 -30 48 189 80 -82 -23 215 188 40 30 88 165 -33 -28 96 207 104 1 17
3264 17 160 59 -91 19 251 153 2 4 141 143 5 -8 80 125 72 -4 107 178 56 -24 74 128 42 -7 20 135
3290 135 95 -31 -12 76 88 21 -17 76 198 38 -20 53 100 70 14 94 169 122 -21 78 148 159 21 61 143 116 43
3317 43 43 121 175 86 40 95 145 101 22 86 129 49 -34 56 121 68 31 8 94 102 60 -3 49 106 54 -11 67 114 97 13 62
3348F2M2n0k3R3j2J0l2QlJ4m9NKJ20j43l7O6M7k9q5P9Nl1K8L3Jj03J4M5oL3l6
3380F8j8M7Nl0m9L9M8q1M4N5j0j7p1L2N1q2O7o8Q0n9kj7Q9k6Lm3K4K7m0M1L7p7
3412F7N2oJ4pm9J9l1P5Lm6l5K2p0Q9m9j6M3M3l8Q7p3m7k0N8j8jNp1P7k6ol9O3
3445F9j6RJ0m0NK3PJ0OK5j0P2o3m3J9mK0mj2j0RJ9K6m8k4Q3q5O0oq7lN1nl8NK0
3481E0n4O0L1m8K6L3n0K8rj9LNK1j1J2K0k9Q2NOj14J2M5l4L2o6L2L1l0k8J7Pq
3514E8j4N6o6NK7QKM5n9P3%j8n8pO6n4L6n0J1Ln0L8RNL0r5O6N7o4l3m8J90r2m
3548G3kRN8p2l%K7L3n8mJ9k6pk9L6M9m4rK0MJ6p5K0N5n0kL3N1ro7N9K7Lj34MM4
3584D9rN9l3K7L5l0p8J5Q3r0L8m7R8r2L1O2ko4PM2j1J2m0j7NQ9p3mK6P8q4k9N0
$$ plain form
3348 62 104 54 31 124 112 122 90 98 95 109 60 65 67 187 44 7 73 120 91 6 85 90 59 87 120 121 18 32 77 71 104 68
3380 68 50 97 102 72 23 62 110 29 73 128 118 101 30 62 113 31 98 30 110 51 49 32 121 95 98 55 79 106 66 107 144 67
3412 67 119 113 127 120 71 90 59 134 137 91 56 78 8 97 48 32 75 118 80 167 94 47 27 85 67 66 71 0 77 51 45 6 69
3445 69 53 62 72 32 37 60 67 77 83 108 98 170 107 64 83 79 99 95 83 73 82 101 127 79 55 138 53 113 107 20 17 68 63 25 30 50
3481 50 -4 56 87 39 65 98 48 76 67 48 51 56 77 66 78 98 69 151 156 162 48 60 105 71 103 37 69 100 70 42 59 66 58
3514 58 44 100 34 39 66 74 76 121 62 135 135 117 59 52 118 64 100 50 61 64 14 52 61 66 96 1 67 124 60 27 -21 169 77 73
3548 73 71 80 138 66 63 63 90 123 65 61 80 54 47 18 54 103 59 50 70 74 90 15 35 90 40 38 71 122 113 46 105 132 135 1 5 49
3584 49 40 99 66 93 128 98 20 35 118 28 66 19 117 25 56 118 116 52 59 101 90 102 62 45 50 139 66 62 88 166 82 53 103
3617A03Ooj7m3N3K5p3l0N0P0j09j9M5L4J4l9mJ8m1n6P5J23r0m3N3k1l1o6K6J02
3647A09l1Oq5J43q7pq7J10Mqj01J48N0o8q6R8P0o1o5J1KM9m6p6J17j8m3Mk5J19
3677A46j28J7Q6l8J9o9KJ11k9p8K6K8Op3n8J32j0lp5P0N9m4m9k1P7o7P9o5M4j3
3707H2n8P4%N0o1j01J05K6q3Q3p5N9m3o0J19N6k7j34kR9M8q9K2m5P8p5M4Jj1p9
3737CJ5P7k6L2j61N4J53m3r7M1L1J4k2m7P7qp9K2L4L5l2p4J22l3rj0m1J03k5k8
3767G8m5M8O3j58J36J4p2Nm2N7M0l0m3K8j9m7K4N7N8j09oM1L1l3on8M8J1j9m0
3797A2P8R1j65K8K7Q2j09k4L0J01j04K8Lk4N2n8l2M6Q1J4r1N3k8k6%N6L5n1k3
3826H2lNj8Rj6J7Lj4M1J0Rnp1L3M5r2qN2M8l1j03O9Mk8K7m1L2K0k3J6M8J0l5k4
$$ plain form
3617 103 109 103 86 43 96 121 48 18 68 138 29 10 55 89 103 64 60 78 37 -19 56 179 89 46 99 78 47 -19 7 109
3647 109 78 84 -1 142 55 48 -39 71 75 67 -34 114 164 96 10 108 178 117 52 63 65 114 68 -8 109 91 48 52 27 146
3677 146 18 35 121 83 102 33 35 146 117 39 65 93 99 26 -32 100 90 87 12 82 141 97 48 27 104 37 116 51 95 82
3707 82 24 98 98 148 87 -14 91 117 34 117 42 101 58 -2 117 173 146 12 10 109 157 68 90 45 123 48 92 93 82 3
3737 3 18 95 69 101 -60 -6 147 104 7 48 79 93 71 24 101 93 14 36 70 105 73 -1 121 88 79 69 28 131 106 78
3767 78 33 81 144 -14 122 136 64 69 27 84 124 94 51 79 60 13 37 94 152 43 37 78 109 76 70 12 60 71 52 12
3797 12 90 181 16 44 71 153 44 20 50 151 47 75 78 54 106 48 16 62 143 157 66 119 91 65 65 121 156 105 82
3826 82 79 84 66 75 59 76 79 65 106 116 125 120 49 82 127 35 27 79 127 96 -7 62 66 38 65 24 56 76 53 69 117 127 92 68
3860F8k7Q1%l7k1N8l3n6O6Pl2j3p8R4J9j7m8j9R7Ql4k9J15o4l9l4K3L2m8M6P3
3891A58j04J6k6L5%l8J9k0lpNj0Rj3N3j5J2lm5N3Moj1j5NL7l7ok4J6P0n2J6L9
3925A12n0k2P4l4J5l1L1k0K7Lj13J45m6l4K8j7M3p6M0l9L6Rj8l1M9l0j7M5o1K8
3955D6ON2%r4L1N5K6o7K1j0o8N9L7l5MQ9o6ok2N9j6Kl1J9k3O7l5j8KRn0R6m4o8
3989B7J04q4l7J9j0N5n2M3n9N6mNRK1p6nJ8R2n0j8J5J3m0M0ol6Q6l2m2M0l2J1
4021G1M0l0J2l4j6L4j0L1o1l8M9lL4L1k7M1Pm6j6%qP7r5N7j0o3J21j32M7N8j4
4052A07Ml8l3oO0r7N3J2k7J8j6N3M8j38J01n5Q2o8Kj2R1r7j6L4N2j7q4L3Q3k8
4082A01r7P4N0m2J8L8n2j4m6J11l5L8r6K2J2j06M5J02j15L9JQ1j9n6L0l5MLmo0
$$ plain form
3860 68 41 122 122 85 64 122 89 33 99 106 74 61 -17 77 96 79 31 12 109 117 83 54 169 105 66 32 55 87 39 85 158
3891 158 54 70 44 79 79 41 60 40 37 30 35 25 34 21 74 59 71 68 23 76 80 74 63 48 53 90 53 47 23 39 109 57 73 112
3925 112 62 40 114 80 95 64 95 75 102 105 -8 137 91 57 85 68 111 35 75 36 72 81 63 32 81 51 34 79 18 46
3955 46 52 104 104 10 41 96 122 55 76 66 -2 57 94 59 63 152 86 80 58 117 101 103 72 91 68 135 100 82 84 93 43 139 95 27
3989 27 131 47 10 29 19 74 22 65 6 62 58 63 72 93 17 12 30 122 72 54 69 82 42 82 76 40 126 94 52 92 60 71
4021 71 111 81 93 59 43 77 67 98 37 -1 48 45 79 110 83 124 131 85 69 69 61 138 43 100 90 27 148 16 63 121 107
4052 107 111 73 40 34 94 -3 50 62 35 53 37 90 138 0 101 46 128 60 62 50 141 44 28 62 114 97 13 46 129 101
4082 101 4 78 128 86 104 142 90 76 30 141 106 144 48 70 82 -24 21 123 8 47 48 129 110 54 84 49 53 56 52 -8
4112hJ01n4j1J8P3k5m0N5n0j5L8L4l0k3l4O8k6N3l1K6k6p1K9Q9j6p2jL9Nl2M9
4143A12jnm2J2O6p3l6j9P5mkK4l4n5Q4k4l2m3O8L2k4k8L7k1K4lm4Q4m1J6n4LJ3
4176F5k0K1L8j8J6m2L2kk2P3p4Rl8M4kM9l3lROo5R1n1rn6Q2l5JPK9n2%O5m5k2
4211D8O5o2J2l0J0M4qK1MQo1L5L0l6j4O8J0q2J2l5O2qll4P5n2L5nm7K1o6J13j6
4244A14m7oL6j8j4Q1j06k0O0L9j1n8J6j0m9O9l3K9K2l8k7K1O2k7m8P5k6m5m9J10
4274A02o4MN9m5M5m8Q4r2L9N5l6j7lJ6o2RP5l8J2MLk3kRl3NL0m1J2Q2n0k1jK3
4308I2rl2K5OL5j9r9nJ24j0n8K3J8rj8LM3j8mJ6j9o3Q2r8o3J18K2k0P9p6J3M6
4340A25j3oQ4j30ORN2K1j18O5l3N6n8l6Q8o4j5j3M0j7pK1j0P8l8m4RQ3r1L1j5
$$ plain form
4112 -8 93 39 28 46 119 94 54 109 59 44 82 116 86 63 29 97 71 124 93 119 93 22 51 140 124 52 51 90 95 63 112
4143 112 111 106 64 76 142 69 33 14 89 85 83 107 73 18 102 78 46 3 71 103 79 51 88 67 91 88 44 128 87 103 49 52 65
4176 65 45 66 104 86 102 60 92 90 68 141 67 76 38 82 80 129 96 93 102 108 43 134 83 74 18 100 65 66 73 102 50 50 115 70 48
4211 48 113 51 63 33 43 87 79 100 104 112 51 86 116 80 66 134 144 62 74 39 101 93 90 56 131 79 114 109 62 83 17 130 114
4244 114 67 61 97 79 65 146 40 20 80 119 108 50 66 56 7 76 43 72 94 56 29 50 112 85 37 112 86 41 -8 102
4274 102 38 42 101 56 101 53 137 45 84 139 103 86 83 99 37 46 121 83 95 99 102 79 77 86 53 58 88 47 59 141 91 70 69 92
4308 92 83 51 76 82 117 98 -1 -6 118 108 50 73 91 82 64 67 110 92 88 104 85 22 104 6 -57 61 83 63 142 66 79 125
4340 125 112 106 190 60 66 75 127 148 30 95 62 118 60 24 112 48 33 20 60 43 36 57 47 125 87 43 52 135 44 75 60
4371F0MJ5q5K6J42r7k3RO2o2L5pL0j6j9K9RL1m4o8L5K9Nm3K5J5J0j25M8N3N8n7
4403H4jj2M7j9MJ3j4M5k4m9L3l0l2L0n6J4L9k3L6n3O0lJ6Rn7l5M9NJ0K2q9N2Q4
4436A55p1o5J15kk1r8P5k0m0%K7K0%l7M3K0Jq9J7O3l9j6k5O8K5l8l0M5O5q8j05
4467d5J06J09j31K3k3P0m2K6m9J05l0j19N0j0J18j00k7O1l9K1J4K1O2r9m9K4M0
4494H7l5j6J8P0k6m5nMk4kM8K5m1OM5k9%K8m3K0L6p3l5N1j3N2J7p1RJ2l7k0P8
4527I1k4j2M3N4k4j4n6M6j4qj5qP8p9M3J8k1Jk3l9M6Jj09P2L1N5j12O9K8l0n4
4558C4N0m7J01m1j1n3J6Q7n4m2L5j2l8O8m7Q8q6L7nJ11o8o9J03p1k1l7pN4J1%
4588H6r2rQ2K8o6O3L0o3p0J11R1q7l2kM2r1L4q7J45L0n5n8N0j7k5%L9J4%m6n5
$$ plain form
4371 60 64 79 -6 20 162 65 42 51 113 51 86 79 109 93 74 103 112 143 99 31 66 95 100 57 82 97 107 -18 30 83 141 84
4403 84 83 71 118 99 103 116 102 147 123 74 107 77 45 75 19 33 72 49 85 32 92 89 105 114 57 22 71 76 86 108 19 71 155
4436 155 84 19 134 132 111 13 88 68 28 28 55 75 75 38 81 101 102 13 30 93 54 38 13 81 106 68 38 83 148 60 -45
4467 -45 61 170 39 62 39 109 67 93 44 149 119 0 50 40 158 58 31 92 53 74 88 109 171 72 23 47 87
4494 87 52 36 54 124 98 53 48 52 28 26 74 99 58 64 109 80 80 108 65 85 121 48 13 64 51 103 120 49 58 70 33 13 91
4527 91 67 55 98 152 128 114 58 104 90 82 67 59 137 58 101 119 98 99 76 37 83 84 -25 47 78 133 21 90 118 88 34
4558 34 84 37 138 97 86 33 49 136 82 40 75 63 25 93 46 134 48 85 80 191 123 54 157 86 65 28 21 75 86 86
4588 86 -6 -15 67 95 29 92 122 59 -11 100 191 104 72 70 112 21 55 -32 113 143 88 30 80 63 38 38 77 91 91 45 -10
4619a0L6P0o4O3jK2o7J2L1m6K0j7nJ1j2M6m9M6pj1K1Jn1J07r4O9n2M6Pp0N3ol4
4652F5J1L7m5J1k0K7k8kO4n2J0L2On4m9K7J4L8mn9MM6J2mK1Qp7L2k9M5M0r1O2
4685I8J7q5P6p9L5J4M2m3l1L9M9n7L0l7M4o3L8L%qmk3M1j7pJJ2k7j5K5M3m7l6
4718B8RM9j07P4M9k7k8k0N2ml7L7j4p3J80p5l8m5kQ4K5o4p1J48l5Rl3J2qoRnk6
4751D7L0K8m3n3P1Pj6L9km3j8L8n0M4o8MK2L5n9Q2o0j6J27r5J05q8m5L8J1k6K4
4782G0k8K3J6p4J38j02N8o9K8R4q7j2M5p4O2NL3m0l4J05r6M6j1q9J15q6O5K5j8
4811A08J2n3k9M5k2L5o2J9k2O4L7p3Pn3N1J0mN9m0k3Q3n4J6ln5o1J16l0K5q3O0
4842H0L3o9L9LK0j3k0NL1l0n4M6R1j00NL4J9j7j1l3Q1k0o3J9L6jl3q3Q1J9m6m5
$$ plain form
4619 -10 26 96 32 95 94 116 49 61 92 46 66 49 44 55 43 89 40 86 79 68 89 90 39 146 52 121 69 115 122 52 105 99 65
4652 65 76 113 68 79 59 86 58 56 120 68 78 110 116 62 13 40 54 92 88 29 33 79 91 87 108 116 39 71 42 87 127 36 98
4685 98 115 30 106 27 62 76 118 75 44 83 132 75 105 68 112 49 87 90 90 82 78 55 96 79 72 73 85 58 43 68 111 64 28
4718 28 37 86 -21 53 102 75 47 27 79 75 38 75 61 -12 168 93 55 10 8 92 117 53 -18 130 95 104 71 83 75 69 78 73 47
4751 47 77 105 62 9 80 87 71 110 108 65 47 85 35 79 11 15 37 72 13 95 35 19 146 51 156 68 23 61 72 46 70
4782 70 42 65 81 7 145 43 101 32 60 154 67 55 100 26 88 93 126 86 52 157 61 107 96 7 122 36 101 126 108
4811 108 120 67 38 83 61 96 34 53 31 95 132 59 66 13 64 74 70 129 89 66 149 95 111 108 53 -8 108 78 103 20 80
4842 80 113 44 83 86 106 93 73 78 109 79 25 71 162 62 67 101 120 103 92 59 140 120 57 76 112 111 78 -5 76 95 49 4
4874DR3m9K8q0J10k0k9N9o4M4J5%r6M7M2j7j9o2N4N3j16N3K5Mn9OJ07n8n4j1J25
4905A35q7N8q5O4N2p7k7N1O5o3j3m5O6or5K4J12o4l0m4J19l5k0J4J1M2j8j13N3
4934D4Q7n7n0K8O8J4j10l4P4lknK4ml6k2L8M4Po6J7l4O9j6j3LK7J8n4K0l1%QJ24
4968A77n3l4m4O2J2j6m8J8J8l1m8Q6Mk6k9Q0l1mq6M2L8r3J04r6Q3P2m3o0MJ05
4998A63r1q9J45j6o0jk9J03J6j00J9N7J0ok1n1P7o2j0M8m9m4l6P2n6J24o2rK9
5027G1K7k3K1K6q6J25j45QJ64j40K4O5n6O7q3j9P4Oj6j33J47k3m5Q6m2j7l9jO4
5056A07M4q5jK7qK0o7N7P3n7n8J5O3n0j4lN0qn0J4k4L4O6j00J5L9m8m3O8L2J8
5087A26o1o7N7J01p3qK1J9k8j7J08o5n6l3K3N7L4r0N1M6p9O5j20O9M8o7m2N3O
$$ plain form
4874 4 97 48 76 -4 106 86 57 116 52 96 111 111 15 62 104 87 68 6 60 113 -3 50 75 79 20 26 133 75 21 10 135
4905 135 48 106 21 85 137 60 33 84 149 86 73 28 94 88 -7 17 129 65 35 -9 110 75 55 69 80 122 104 -9 44
4934 44 131 74 24 52 120 134 24 -10 64 61 59 54 78 74 38 16 54 98 105 39 56 22 91 75 62 65 92 110 56 76 45 45 53 177
4968 177 124 90 46 108 120 104 56 74 92 61 13 99 103 77 48 128 97 93 7 49 87 -6 98 2 85 157 114 54 58 163
4998 163 72 -17 128 112 52 51 22 125 141 41 60 117 127 121 100 49 126 64 54 102 53 9 -27 45 -11 113 51 42 71
5027 71 98 75 96 122 36 161 16 24 188 48 72 137 81 148 65 46 120 126 110 -23 124 101 56 142 100 83 44 43 107
5056 107 151 66 65 92 84 104 37 94 167 110 52 67 130 80 66 63 113 105 55 69 45 79 145 45 60 99 51 8 76 108 126
5087 126 65 -2 55 156 83 75 96 115 87 70 178 113 57 24 47 104 138 48 99 145 66 131 11 80 128 61 19 72 78
5116G8Pq4J17jj1q3N4L8o9O2q2R2l5n8Q9k9j0nPK7lj4k0m7J06j02J5M9lM8j10
5147B3j1K0R2j33O0JL0J8k5N8%On6M7m2l2O1Jk8M1n7l4N6J8n4K2m3O0n6NM0KK6
5180A16o0O6l7N1m8l9N8Kn1QK7J4l6o3L3N6l5j4K4m0P6k2l8L3K5l0j9j5J20q3
5210G9Q1l3m5M4p0Q1j6k8n8N4K9p5L1j2L2k5j9pK1K5n0J03p0J6Mm1L2n5K1J1L1
5241I1m8N1qKJ6lk6L2nr0O1K8j7M6K7j10j6P8k8k2M4J1qj9j5J4kK8l8L0l6M5o5
5274D8on3K6Q5J1jk6j3L0Jmk4K0J8k6q7R9k6%N6q7J4M0p2MM4J6m1qK4L5J2k0j4
5308G5O6k9n7J9KK3q6O4K6l2JJ9l3k2M5%J3K5m5LJ0J0M2o9l1l1O6q1R4n3N1Jq3
5341CO8J4k8oM9l0K1j18J1P6J2M2Mlq0j4N1k0L0L8q2L2j6L9M3l2k4qJ0K0M3l3
$$ plain form
5116 78 85 1 118 117 106 23 77 115 46 108 26 118 83 25 114 85 75 70 77 104 101 87 67 20 126 24 39 88 85 133 23
5147 23 12 32 124 -9 51 52 82 100 75 133 133 139 83 130 88 56 117 118 90 131 74 40 96 114 60 82 39 99 43 48 88 90 116
5180 116 56 122 85 136 88 49 107 109 58 66 93 107 71 8 41 97 62 48 72 32 108 86 48 81 106 76 57 42 162 79
5210 79 160 127 82 126 56 137 121 93 35 89 118 43 74 62 94 69 50 43 64 89 39 142 72 88 92 51 83 28 49 60 91
5241 91 43 94 86 88 104 101 75 107 102 12 73 101 84 130 157 47 31 109 81 59 103 114 106 87 72 86 84 112 74 104 68 113 48
5274 48 42 -11 15 100 111 110 84 71 101 102 98 74 94 112 86 -1 98 72 72 128 41 55 95 23 27 71 87 46 38 62 97 109 89 75
5308 75 141 112 55 74 76 99 13 77 103 71 72 91 58 36 81 81 94 119 74 77 87 97 139 70 39 8 74 -7 87 34 85 86 3
5341 3 71 85 57 51 100 70 91 -27 -16 60 72 114 118 115 35 21 72 52 82 120 38 70 54 93 136 104 80 72 82 102 145 112
5373A12l3j1j8O7j1m9K6j3L1j3J0o3M1Lk5M0n2M6pJ0j8J5j08J17poLj3N0o1J9
5404H2nnl0K0MJ1p8M2m1RJ4M8k4M4M2k8m8P8r0O3p5K0N5l6Jk9L2K0k7K9pm0N7
5437A08m5k3L3l6L4J6J8l1Lj0NKj8j2RRl1M5K6J3q0j7Q0k3Pm9J03m0lj16J40M6
5469A63j37M7J8L7j0ml2M1rm4M3n4L5K6n7n6Q9j9lN6n6k5jO0qk7m7MJ6L8r8R8
5501H4K7n5k8Rl2O4l4KP7n5K4kn3K4P1r7J6K9L3m2PN0Qmn6N3r0O0ko4Q4on9M4
5535H7M7k4k6n6R1o4j3N5rM0k4m5L5j4n7O0k3N1k6QL2p6oo1kJ06k8l5J5L6j0m
5567F0%lO2l4j8L8J7m2j5J1N7r9KR2k8k9J9j6m0K9lK9j9n9J5L6n9R2l9m6J05L
5599A18o8L8j0o1P2k0l2P9r7K0k0PR7J3p5M7K2o5l4O3K5m8k0QL2L0j25Q2j4mL7
$$ plain form
5373 112 79 68 50 117 106 57 83 70 101 88 98 35 76 79 54 94 42 88 81 91 73 88 -20 97 90 84 87 74 124 63 82
5404 82 77 72 42 62 66 77 -1 41 0 9 23 71 47 91 133 105 57 135 45 108 33 53 108 72 73 44 76 96 69 98 91 51 108
5437 108 63 40 73 37 71 87 105 74 77 67 72 74 56 44 53 62 31 76 102 115 35 18 98 75 82 33 136 96 93 -23 117 163
5469 163 26 73 91 128 118 114 82 123 114 70 113 59 94 120 63 7 96 77 74 130 74 49 48 108 100 73 26 30 46 84 -14 84
5501 84 111 56 28 37 5 69 35 37 114 59 83 81 28 52 123 26 42 71 104 62 69 119 127 123 67 120 30 90 88 24 108 102 43 87
5535 87 134 110 84 28 119 55 42 97 88 128 104 59 94 80 23 83 60 111 85 93 125 49 43 -18 -20 86 58 23 38 74 64 60
5567 60 60 57 119 85 67 105 122 80 65 76 133 34 36 128 100 71 90 74 34 63 60 89 70 11 26 62 3 95 56 10 115 118
5599 118 50 88 78 17 89 69 37 116 19 39 19 26 123 136 61 108 130 65 31 94 119 71 51 59 91 121 -4 78 64 60 97
5630I7o3O1N7m5q2L9l8R0o8M8Lj3j2J1N7p2Kl0M7O3q9K9M3p9K9j5mO2j29J22p8
5661D3Q0n2l7RNJ5k1k8P8l8O2l7J0N1k0m7L4L5l9l0NMl0K8J3M0m8oQm7K8K5K2
5694A15K5o3n5j5P8n5pJ1L0K2m3J6J2K6k9jj1M1m3o3O8k2K0k6k3L3L9rk5P2n1
5725F7j8M4JK9o9K9n3Q2Qq9rnJ48r1jK5j5j5l8J13r4j9K5%K9k0q1J01n4M0l3P3
5757A10p1L7L0Jo0N1m6K1J1K3k0o9P7l4j4J2N6Rm4nj3N5l0k4J2L5k3lRj8N2p1
5789E6Nj9M7lm0j7J6O9j1j5L2l6k2L8q9J04n8M2m2j5kk8K7L3Jjo1N0Lom7N4M1
5822A06p7j5O5qJ8m8OR2o3K9o5M7jKj2k7L9j5j7J8L4Jp3J8j1NONK2l2M5km0oj4
5857C2K4j1M6J8l3O6q9J3j5JK6K3j4mk7rm2M0L7J8k4J1p%L7o3O0J2q1P6L1p5M1
$$ plain form
5630 97 34 95 152 107 25 64 26 116 48 96 99 86 74 85 142 70 72 42 89 152 63 92 135 56 85 70 66 128 -1 121 43
5661 43 123 71 34 43 48 63 42 14 92 54 116 79 89 140 120 73 107 142 103 73 78 82 52 80 93 133 85 79 87 40 68 93 115
5694 115 140 77 22 7 85 30 23 34 64 86 43 59 71 97 68 67 56 97 54 -9 59 37 57 31 8 41 80 71 46 118 67
5725 67 49 93 94 123 54 83 30 112 120 31 22 17 165 74 73 98 83 68 30 143 49 30 55 55 84 64 -17 84 30 70 37 110
5757 110 39 76 106 107 47 98 52 73 84 107 87 18 95 61 47 59 115 124 80 75 62 117 87 63 75 110 87 84 93 75 127 56
5789 56 61 42 89 86 46 29 45 114 103 88 120 84 62 100 11 115 57 99 57 42 40 12 39 72 73 72 11 61 64 58 11 65 106
5822 106 29 14 79 71 89 41 47 139 76 105 40 87 86 88 76 49 88 73 56 74 108 109 36 54 43 48 54 59 81 49 94 92 52 46 32
5857 32 56 45 91 109 76 142 53 66 51 52 78 101 87 83 56 47 5 45 82 100 76 87 80 80 117 54 114 126 45 121 152 77 118
5890A18p8P3m7J0mK6lL2Pk1l5l9J1J7Omj7Mk0kN0l8N2j4rp0P0n6N1j7nM6Rm7J8
5925G4l7N6l5N0M2n6m8J6L3q2P1l5NK9j6J8l1K9m1J3J4M7n9O2p0rK6n4P1Nk7J4
5957G5J8j5o4N9j5k9j4J01qp1K5Rk4J7kk0P5j18J08j4j1k0Nl1J1J01n5j9K7j3
5987H8K8m5m6M2KK2m0j3J01o0j2KO5k9j3M9m8l5L0Kk6M3o2L3oLm0J5oJ4J5jj7
6020E5j6RL2jk8N9j1j1j5J0m7L2P6m5j5Lj1J8k5J00j15N4P4j28k5%M4J3j3k8j2
6051C3J3O0lm2L8n6O1l2l4L2mK2n8J1P3n1mO0m6j2K8l0O0r7M7J4J2j2kpk0k9Q0
6084A05Lq6M6L3M5l4k2J3M1j5p7J11j08K4MJ4Rp2MK5k9MK7j3K8j5K0pm6K0K5m8
6116B9K3oL2l5L9N9m2J8j02QQ9l2M5n4jM5l9o5L0N3o5J8O2r0O8K7J2p7J09p1K7
$$ plain form
5890 118 40 113 66 76 72 98 95 127 134 113 78 39 50 67 73 69 52 56 36 34 84 46 98 84 75 5 75 19 70 53 48 94 103 56 74
5925 74 37 93 58 108 150 94 46 62 95 13 84 49 54 83 67 85 54 83 42 55 69 116 57 119 49 40 66 12 83 88 61 75
5957 75 93 78 14 73 58 29 15 116 108 37 62 71 47 64 62 42 117 -1 107 93 82 62 67 36 47 148 93 74 101 88
5987 88 116 71 25 67 69 91 51 38 139 79 67 69 134 105 92 141 93 58 88 90 64 107 45 78 72 75 35 50 44 58 73 72 55
6020 55 39 48 80 79 51 110 99 88 73 83 36 68 144 99 84 87 76 94 69 169 54 108 182 54 29 29 73 86 73 45 33
6051 33 46 106 103 61 99 43 104 72 38 70 66 88 30 41 114 63 59 119 73 61 89 59 119 22 69 83 95 83 81 74 54 25 105
6084 105 108 22 68 101 146 112 90 103 144 129 52 163 55 79 83 97 106 34 38 63 34 38 65 52 80 65 85 78 32 52 77 29
6116 29 52 46 78 43 82 141 99 117 15 23 112 80 125 71 70 115 76 11 41 94 29 47 109 19 87 114 126 49 158 87 114
6147A14j5K5j1J0j9rL6n6l4J5O5k8J6m9K7Kl4R7o5mo3RJ34o2l2K4Lm6O1n7L5n5
6179C4K4K4n7Q0n9k9N1O7m3Ql8P6l2m2j8M1L6m5nM2j1K2m7K0k6K1J2j2n5L1M7
6210A17l1l9MM9J0j7n9J5j4Q5J2j17O8J3J0k3r2M9M9l0k0M4O0n9%J0k3N5nlj5
6241A03J8n2j2J0K3jlN6o7J6M0r8L9qK3m4N6k4j6%K7l9K9j2oL4k6P5j04O7q4O0
6273H0n3J6K5Q7j36L8L2j5pN2Q1j44O5q4qP1J6m7N5m2l2j9Q4m1m3R0o3R8n0j9
6303H7k0J9Lq1J16l3K4l0n2N9J8r6J09l1K3n6k4kJ2N2k8RJ6j04L0N6J7ppL3r0
6334B2J07l7j7pj0l0P4oL3q7R5n3L5l9M9k0j5n1j0O9k9rJ3qK1nmM2j7l7MK2j8
6367G7j7P6j53O5O5o7K6%oM0ro8M7o9P0K7p9M0%nK5k9j9R2k3rJl2L7l7N0Ln1l3
$$ plain form
6147 114 99 124 113 123 104 95 131 75 41 56 121 93 109 60 87 89 55 152 87 83 20 29 163 101 69 93 96 50 111 54 89 34
6179 34 58 82 25 105 46 17 68 135 92 100 62 138 106 64 46 87 123 78 73 115 104 126 79 99 73 94 106 94 39 70 117
6210 117 86 47 51 100 110 93 34 49 35 120 132 15 83 96 106 83 -9 40 89 59 39 83 143 84 84 94 71 126 121 118 103
6241 103 121 69 57 67 90 89 86 142 75 91 131 33 72 64 87 43 99 75 59 59 86 47 76 64 58 92 66 141 37 104 20 80
6273 80 27 43 68 155 19 57 89 74 67 119 200 56 121 37 29 100 116 69 124 82 50 31 115 74 31 121 58 156 106 87
6303 87 67 86 89 8 124 91 115 85 33 92 110 14 123 92 115 59 35 33 45 97 69 78 94 -10 20 76 93 86 79 112 22
6334 22 129 92 75 68 58 28 102 96 129 42 137 84 119 80 129 109 94 43 33 102 73 64 77 69 90 85 81 123 106 69 73 95 77
6367 77 60 136 -17 48 113 46 72 72 66 106 97 29 76 7 77 104 25 65 65 60 85 56 37 129 106 97 98 66 103 66 116 119 68 35
6401C5M7L0j9l5jj5O6nj4k2n1L5N4k8Qj2QJ7qk5P8r3k0oN0l0J7L7rn4O0Jk1o3
6435A2J08q4J9J7jO7p1lJ8O5q8P1O9j41L6m1n4J04l3J6o3P5M7o1L7m2o5J01j4
6464A01L8k0o7K8Pp1P5lk8M8l2Jkl1N7l2K7ln7pJ9R2j10O2o9J17n6L1o0j6rN3
6496H3Mm6M2K4jm8O4m9P9m9m6P2m1j7L6O1n4L3q8M3k2o5R7k4Mp0O4r7N6J9koQ2
6529A38n3M4m3J5q6J19j15KN8LL3j07L6J43j19pP0j14J3N8k6L1k5J1Qp6O2j3M
6558F4K3l9K9J4k2L0Q1p9kJ8k4mN4n4m2jN0kj1Jk1ROkk8QK2j2L1l0K3k2nL6p8
6593B1j8N6jP8r0J8J7K6r7N8L3J9l5j4N4l8l7k3J17l1l7k5NK5J6l3OMk6P1m5p
6625F7N5n6Mj7j8J7J3J6J4j9k8k8J1Q4l8j5L4kj8l9J6M6l1K6l1Mk4M7K1k0j4L0
$$ plain form
6401 35 82 112 93 58 57 42 108 103 89 67 16 51 105 77 85 73 81 98 90 65 143 50 30 24 74 44 61 98 89 35 95 96 75 12
6435 12 120 36 55 72 71 138 67 64 82 147 59 130 199 58 94 53 -1 103 70 86 23 98 145 84 121 79 14 115 101
6464 101 139 119 52 80 87 16 91 88 60 108 76 77 75 44 101 69 96 93 36 29 48 140 30 92 23 140 84 115 55 39 30 83
6496 83 87 41 83 107 106 58 122 73 152 103 57 129 88 71 107 168 114 147 59 102 80 15 112 88 92 22 86 -11 45 64 62 56 138
6529 138 85 129 86 101 15 134 19 21 79 82 115 8 44 187 68 61 131 17 30 88 62 93 68 79 87 11 73 60 64
6558 64 87 48 77 91 69 99 180 101 99 117 93 89 143 89 47 46 96 94 83 84 63 72 78 76 48 56 78 66 97 67 90 68 63 99 21
6593 21 3 59 58 136 46 64 81 107 10 68 101 120 85 71 125 87 50 27 144 113 76 51 56 81 97 64 70 74 48 119 74 67
6625 67 122 66 70 53 35 52 65 81 95 76 48 20 31 115 77 62 96 94 76 37 53 99 68 94 63 67 43 90 111 91 77 107
6657A07j5M3j06Q2n1%j3P8n4P0k0Qp2Nj4K7M0n1J1m8Q9k3lm1M8j7lO2j08pM2q
6689E8K1mL1l4MOl7qO4q6O1M6q8N2K6J8Po5PK2rJ5j3k1n4M4Kl6P5n9K8rPJ1j5
6724F7K0M0q5j1O5j1m1N6K4j43M3Q0j7j6K2jNj4K4m9j4K3l4J10k2pl4J7L0j40
6754a3J32q4OJ7Q8k6m8J01j82R7J1L1n1j0J9o3N5k3oLJ06q4rJ1m2OmpO0M9q5J
6786E6K0L1m3j1nO1p2K7M4l2l7J1J6MO4k3k7jj7OMJ5M1o1O5n2Lm7L4kN6n7O6j1
6820A26j4J3l9L4q1M2J3O7n2r4Q6n8K5n3R3l0l4k5L8O3m1M7n2QlL3p4M0l8N0n9
6851C1NM5k1pJ2K5mj7n5LN4J8j0M1m0K4j8O6p5LJn1NK0pjj4M7k1K7l0Q4j04K6
6885F2L1o2J6M9mj06J13mj1L9n0Nko1O7K4p9M7pj0O3o3L2j4K6lJ3k0Jk7J07q3
$$ plain form
6657 107 92 135 29 111 60 60 47 125 71 141 121 129 57 62 48 75 115 64 75 27 116 93 90 49 97 80 77 139 31 24 66 58
6689 58 79 75 106 72 76 82 45 37 101 15 76 122 34 86 112 130 137 72 79 101 92 107 94 73 19 63 65 29 104 45 73 64 71 82 67
6724 67 87 127 42 31 96 85 44 100 124 -19 24 104 87 71 93 92 97 83 107 58 44 67 33 143 121 114 80 97 127 -13
6754 -13 119 35 41 58 146 120 72 173 -9 88 99 130 79 69 88 25 80 57 51 54 160 76 67 78 36 42 38 31 91 140 55 56
6786 56 76 107 64 53 48 109 37 64 108 76 39 50 66 70 134 111 84 83 66 72 76 91 132 71 136 84 87 40 74 72 128 71 137 126
6820 126 112 125 86 120 39 81 94 161 109 15 101 43 68 15 108 78 44 19 57 120 79 126 74 82 79 112 38 78 40 90 31
6851 31 36 81 60 53 65 90 86 69 14 17 71 89 79 120 80 104 86 152 77 80 81 30 35 55 48 47 33 80 59 86 56 140 36 62
6885 62 93 31 47 96 92 -14 99 95 84 123 73 78 76 15 82 106 27 74 67 57 120 57 89 75 101 98 111 91 92 65 172 89
6917H9m3LJ4L9Kk1l7P5l4k6J1L0m8K4m3N3k4Qj0M4Kq0M5N9j09K1M1L5r0P4Nm6
6949F3K3k0nl3O5l8j3O8n8N2m5k6mK4l5L8J3K4l1J7Qm3pO2mQNm5J8K1K7k5m2j7
6983D5L5j6M3n6M3M5o5nl6P1Pro7P4n2j5RrL9R%j8N8j04J08j2k4QQk3O1m5m3L8
7017A02n5M1M3qK4k7j3q3O4n8K7LJ1j9j7k5O7l1K1%o3L7j7M2k4L1l0O4k9j6J6
7048G8m2pM7j6JL3p2Q3ro8N8m4P4j01N6lmN0J6k8j5j3L3j6K4k2RJ4m2O4j18O0
7080H0k9N0n2N1J0l3l7P2j0kj9rK9%m6j8J8N6J4p7Q6j35O7j6M7n7N0Ll5N5o5N6
7112A04l0L0J3m5L3M3q8K3qK4J8k4m7O2L9j33O4nL2J9o2j4P0n2%n0Q0ol0M1m0
7143F1J2l6L2l9L6j5J8j1l9J08q5J6N0K6p2qoM3j8j0P7j15J9J5QP0p5J7J5n3N0
$$ plain form
6917 89 46 49 63 102 104 83 46 121 87 61 72 102 54 78 35 88 64 72 62 106 108 28 73 132 23 44 85 120 30 104 109 63
6949 63 86 66 61 28 93 55 42 110 52 104 59 33 29 53 18 56 69 93 62 79 87 44 37 99 95 103 108 63 81 102 129 104 62 45
6983 45 80 64 107 51 94 139 74 69 33 104 111 102 35 109 57 42 51 42 81 90 90 72 130 26 134 122 98 106 114 91 152 107 64 102
7017 102 47 88 131 123 147 120 107 24 88 30 57 60 71 52 35 10 77 46 67 67 4 41 24 66 42 73 43 107 78 62 78
7048 78 36 29 76 60 61 94 22 105 96 28 86 42 116 15 71 68 64 114 130 102 87 74 107 91 115 93 102 116 74 138 20 80
7080 80 51 101 49 100 110 77 40 112 102 100 81 72 101 101 55 37 55 111 125 48 134 -1 66 50 97 40 90 93 58 113 48 104
7112 104 74 104 117 72 105 148 60 83 75 99 117 93 46 108 147 14 78 73 105 124 62 48 118 66 66 16 96 90 60 101 61
7143 61 73 37 69 30 66 51 69 58 19 127 42 58 108 134 62 54 48 91 73 63 140 25 44 59 67 137 62 79 94 41 91
7174I1l1L2J2j8j7K7o5M5k6N1q6N5Ro1M7o6R2K8k1l1M0o2P8q7L5K9k7J8o7Q5N
7205A14OJ0p8m0L7L5q0L5N9j7N4Jp1L1l3KK9J4n6P3r6O9rlL6j8k4J2m3rN1m0J1
7238F2N4o7L2l9J6Rk5K6Nm3Q4J0j7Qk5Rk2J3Jj6k7m2O3J8k0o8P3M7o6N6J9n5n
7271F8oP1j1o1lj0J13p4K8j5m8L2M4r8K5Q3q9P1m3K6o4k6N3k2R0k8Jlm0l2P7o2
7303D7K4n1J10K8j27jM0m4O0l9n3J27n9J4n3L2O4m1N8r1R4K1r3L8k0J2k1RNl0
7333F0M4o4K1J2M1N1j8q2J6l0P6r6J18j01M3k5K8n1M4Kl2Ol9N1n8J6J0jqK7kJ
7365F0K5K2k7l8N3L2q1K1J5l2KL1m3O6l4P2J5r9J7kM1j9kL2o1J8l2RJ1J8%L2p7
7398D5k2Qk8QjQ8Km7MkL5j8k3K4j3J0N5o8L9j02J7N1K0l1J1O4m2k1J3Jj1J4q7
$$ plain form
7174 91 60 92 104 86 69 96 31 76 50 101 15 70 79 18 65 -1 91 119 98 67 107 45 123 36 71 100 73 91 24 109 114
7205 114 120 130 52 12 49 84 4 39 98 81 135 136 65 96 63 65 94 108 52 125 29 98 89 86 122 104 80 92 49 40 91 51 62
7238 62 116 49 81 42 58 67 42 68 73 30 114 124 107 115 90 99 77 90 91 75 48 6 69 87 67 -1 72 119 53 109 128 73 68
7271 68 62 133 122 61 58 48 161 87 115 100 52 84 128 30 55 138 49 120 77 103 39 13 66 44 134 106 107 104 64 32 109 47
7303 47 71 20 130 158 31 30 70 26 86 47 -6 121 62 76 23 55 119 78 136 45 139 160 67 105 85 97 76 85 90 60
7333 60 104 40 61 73 114 165 147 65 81 51 127 31 149 48 91 66 94 43 87 89 57 63 24 75 17 33 43 42 34 61 59 60
7365 60 85 107 80 42 95 127 46 67 82 50 52 83 40 106 72 144 159 60 77 75 116 97 95 127 66 84 52 61 72 90 90 122 45
7398 45 23 31 3 11 10 98 100 53 57 55 90 72 49 73 60 70 125 57 96 -6 11 62 82 51 62 126 84 63 76 77 66 80 -7
7431gQ4M5k7l1J4j1k9O7m8Kj4L3l3Q0r0K4M1qJ1k1PM1j15J25p0kJ9r2O7o3J36
7462A35m4j7NM5o6K6k1L8l1K1j1n0O2Ol7kM5J0j8j0m8j8Q6j6j2P1k8j42Q7J9K6
7493A11k9k4L7Nj9l1K6k9J1M0k3K2l9k7l5K8J25j43QM8O2k9kJ2l7M0k9%m5j8R7
7524A13k7lk2qRL9L8Qr7P9o1N1L4j05lN1Qn5M1L6p1k8K4M9J8l9J8k6l8P0K8o3
7556F8k3M0j1p3O8rrl4Q6n8R5Pj48J02m8J5N7j19P2J5J5j4k4K5m6k6L0L5n6K2
7586E4J7L0L5p4OnM1K6l4q8P5rj0Pk1mj7P9J5n0k9k3K4J4K5j2J8j2j0n6N6n9J03
7619A12n0j4K9K8ll4LM4o9M1M3o7j3%PL5kmo8M9J3J6n7L0J9j1Pk5K6K2r0N5k3
7652D9L4l2Kl3L3N5q4P1m9O0m5ol9J05j1l0J%k9L8l1nJ8L5l3m7J6M5jj4mj4M3
$$ plain form
7431 -7 77 122 95 64 78 67 38 105 57 59 45 78 45 125 35 59 100 92 103 82 89 130 15 140 70 68 87 -5 62 -1 135
7462 135 91 74 79 124 58 84 63 101 70 91 80 30 92 98 61 59 104 114 96 86 38 20 106 90 78 149 121 -21 66 85 111
7493 111 82 58 95 100 81 50 76 47 58 98 75 97 58 31 -4 24 149 6 14 62 124 95 93 105 68 108 79 79 34 16 113
7524 113 86 83 61 53 62 101 139 147 50 129 68 119 153 48 45 96 104 49 90 126 55 27 51 100 118 79 97 71 33 103 131 68
7556 68 45 85 74 1 69 60 51 17 103 45 140 147 -1 101 53 68 125 6 78 93 108 94 70 95 49 23 53 88 32 54
7586 54 71 101 136 62 68 63 104 130 96 8 83 74 64 71 50 46 29 108 123 73 44 21 45 59 84 72 90 78 68 12 68 9 112
7619 112 62 48 77 105 102 68 71 115 46 87 130 63 50 50 57 92 90 86 18 67 80 96 39 69 88 77 84 59 85 107 17 72 49
7652 49 83 51 53 20 53 108 24 95 46 106 61 55 16 121 110 80 81 81 52 90 59 54 72 107 74 27 43 88 87 73 69 55 98
7685I8J2n4lM5nk8N9k6Qk5qJ15p9J8l6mm8M2Nm9l3N8QK5m0K8m0j4jN2j2j0L3j5
7719G6OPk1k1N3k2KM8n1N8o8kM5o6Q3k7N6m3J7k2o3M3OM3q7N4j8Lj1M9l4k3M0
7752A10j17J02l2mol4K8RJ9n1O4l3O0Op8K0M5j8%L8j08J73j38p1J26K3j20P2m2
7781D3k7M5L2ok5JP3q2P0Rk4k5K6k9K2k2qO3J1nn7l0L9j7kJ6POj19J16L3r5M9
7814H8j1m1KN2o4R6n8K2k6J7Pm0K7NL8n4ll2J01K9n3k6l0P4j4m0L2k8JoM3m6N5
7847A17p0P1j3m4L2L2no4J9k1L5J6KN2q4kj1O1j17K7L1j4M1%M2l1J9k1lln3l1
7879A0N4J4Pj5pk1M8M5p0K9j4j3j2J2P2l9o8L7K5k2O7l1o9j4J29l7j06J09r6N6
7909H0pQ2o2J1j8%M1j12R7m3n2P2k8K3Rk2p8MN2%K3J4J0j3rJ7L6p8j8O4kn8Q5
$$ plain form
7685 98 110 56 53 98 93 65 124 98 106 81 73 188 109 127 91 87 39 81 86 37 4 62 70 95 55 83 43 29 28 80 68 58 91 76
7719 76 82 89 68 47 100 78 80 128 77 135 67 65 110 44 127 100 156 113 130 108 45 88 94 137 50 104 86 89 78 127 93 70 110
7752 110 -7 95 63 59 53 19 47 56 75 24 88 55 115 121 43 63 108 90 90 128 20 193 55 -16 110 133 13 85 43
7781 43 16 61 93 87 62 63 136 54 124 133 109 84 110 81 103 81 73 136 147 142 85 55 94 77 75 91 98 104 -15 101 134 39 88
7814 88 77 36 38 90 26 122 64 86 60 77 84 44 71 76 114 60 57 25 126 155 102 76 46 120 106 66 98 70 71 65 108 62 117
7847 117 47 118 105 61 93 125 120 56 75 54 89 105 107 159 75 73 62 123 6 33 64 50 91 91 133 102 121 100 97 94 41 10
7879 10 64 78 85 70 63 42 90 135 65 94 80 67 55 67 139 100 32 69 94 72 139 108 39 25 154 117 11 120 24 80
7909 80 73 155 93 104 86 86 127 15 112 69 17 89 61 84 93 71 -7 -3 49 49 72 86 96 83 74 91 127 49 31 95 93 35 120
7942A20o0M0j2m0O7m1O1l0Ll0M8n0k8lN7p0O0L3p5L8l6n1M2ON6n8rO1l3K7Qp0
7974C1PM1k0M5k4kK0k4j4kJ2K7om4M2j00O2L3K7J4j12J10p2K1%L5o2N9mJ8n9k8
8006C1M5m9O8J7k9k3L5Po6m1J27p7J0M2K1q0Ml6M2L0j0J1K5j5J6m5J1J4k7K2n
8037G5m9J01r6L6n1R8q0%J3l0J24j12N1J2J0n2K8j7O5n0%j2k4OL5L7K7o0mj1L
8068G3Lk4pJ9k0nl9J13m2Q6q1j7N1k3n2j4O2j3J2K7n0lL9m7M4m3RK7om6N5o8O4
8101H4J2l1j0N3n2kM9j02J18q1O2lM8J0j02J4m9Q3m2N4n7J3k7M6l6J03o6j6N4
8130A27o5J7j0QJ4p2L2%O7n0M3n7Q1lj3l9JM2n0j7P1p4Q9n9j4RM6k9J5L3n5ll7
8163D8L8QJ1l5j2j6J6MK3q2O0Q2n3rJ2Mp0K6Mk0P7k6L3l8K7l2m9P6
$$ plain form
7942 120 60 100 88 48 115 74 135 105 108 78 126 76 48 45 102 32 92 125 50 88 52 1 43 49 105 47 38 99 66 93 101 31
7974 31 38 79 59 104 80 78 98 74 60 58 70 97 91 47 89 -11 51 84 111 125 13 123 51 72 72 107 45 104 100 118 59 31
8006 31 76 27 95 112 83 60 95 102 36 -5 122 45 55 97 118 38 42 6 48 78 68 79 104 89 105 60 71 85 58 80 75
8037 75 26 127 31 67 16 114 34 34 47 17 141 29 80 92 102 50 78 61 126 76 76 64 40 46 81 118 145 85 81 70 73
8068 73 76 52 45 64 44 39 0 113 71 157 76 59 110 87 35 21 83 70 82 109 59 56 95 48 92 49 58 85 79 33 88 20 84
8101 84 96 65 55 108 56 54 103 1 119 38 100 97 145 155 53 67 18 101 59 113 56 69 42 88 52 155 89 73 127
8130 127 62 79 69 77 91 19 51 51 118 68 111 54 135 132 119 80 81 123 73 56 127 53 142 83 69 78 124 95 110 143 88 85 48
8163 48 86 94 105 70 58 42 58 62 85 3 63 145 92 83 95 99 29 55 59 39 116 90 123 85 112 80 31 107
8191A07
$$ Imaginary data points
##PAGE= N=2
##DATA TABLE= (X++(I..I)), XYDATA
0@%%%%%%%%%%%%%%%%%%%%Jj8L4l4L4l4L4m9O6o8O9q6J02j03J20j37J54j71J89
39A03k22K39k57K91l25L60l95M39m90N37n88O51p20P90q74R68j071J187j319J477
59G81j661J884k158K501k949L560m448N862q470J4838n7283q8210J11973N9128
73C5348o4117m8844R3332Q0086o5181j07226K7462R3525k007p5102J6927R6356
85H0559J3044j00418n4566M8201L1061n3131k9086O4596O4357k9656n8938L946
97b0031L1349k2627m3758J9476O2184J4496l2666p083K1068j3440m2002k668M0832
110E130K0968j1387L735K2382j1716m9221k3279K3326J2882k0494L110M8314K0855
123D4605m5595l7334K7855K8736l1038k7465M7944O1504k1507o5094k215M5835
$$ plain form
0 0 0 0 0 0 0 0 0 0 0 0 0 0 0 0 0 0 0 0 0 0 1 -17 17 -17 17 -17 17 -32 34 -34 35 -51 51 -52 68 -69 85 -86 103
39 103 -119 120 -137 154 -171 189 -206 233 -257 280 -308 343 -377 413 -461 507 -564 623 -696 781
59 781 -880 1004 -1154 1347 -1602 1958 -2490 3372 -5098 9740 -47543 -135753 -23780 35348
73 35348 -28769 -77613 15719 95805 30624 -76602 -49140 44385 42378 -32724 -15797 80559
85 80559 93603 -6815 -61381 -13180 17881 -35250 -64336 260 64617 34961 -23977 -20031
97 -20031 11318 -11309 -55067 -35591 26593 41089 8423 1340 22408 8968 -33034 -35702 5130
110 5130 26098 14711 18446 40828 29112 -20109 -43388 -20062 -7180 -27674 -24564 23750 44605
123 44605 -990 -38324 -10469 18267 -12771 -40236 7708 69212 47705 -17389 -19604 26231
135B6231j2424o8058n299P9252L9371n6051m1811M6251L9008n4343o2252L7975
147c2150P7428n404o1358J389N9624Q14p4531l0355O0510M6210l6276l4925M0485
160A1461M4610l6310o2241P484N0226J710l9710J840M8030J2061m6778k9966K6858
173a0725K4466k1376j8073K9705L3870j4024l2679r26J6390p389k0746N386K6607
186A0486Q480j5000p074P889l534j6630j184J7537P846o601L213J1692o914k2427
200a2221m804J5880M629j3604N49K3928J0038k4300k0570J5305J8782j5929k1233
213b3550J8626L2890p766l4163k667K7565K579l0542r191L2738K2890k2604k5750
226a8945J5765K4501j6228l1609Q700L4488K590k8124n845K4900P842k6155j6658
$$ plain form
135 26231 13807 -54251 -59550 19702 59073 3022 -38789 7462 46470 -7873 -70125 -32150
147 -32150 45278 39874 -21484 -20095 39529 40343 -34188 -64543 -4033 42177 5901 -29024 11461
160 11461 56071 19761 -42480 -34996 15230 16940 -22770 -20930 27100 39161 -7617 -37583 -10725
173 -10725 13741 -7635 -25708 3997 37867 23843 -8836 -9762 6628 -761 -21507 -16121 10486
186 10486 18966 3966 -3108 4781 1247 -15383 -16567 970 8816 2215 5428 17120 10206 -12221
200 -12221 -17025 -1145 3484 -10120 -9571 14357 24395 95 -20475 -5170 13612 -2317 -23550
213 -23550 -4924 27966 20200 -13963 -16630 10935 13514 -17028 -26219 6519 29409 6805 -18945
226 -18945 -3180 21321 5093 -26516 -17816 16672 19262 -8862 -14707 10193 18035 -8120 -24778
239b4778K0473K2325j1200j9559J0039K1539p601k5349j094K1251N223j6362n162
252a0255J5841Q849j3522j3872O235J2495l082j0556L255J2385O82j0651m000
265f196N893K446l843j343L677L194k35j862j963j352j52J356J109j189j190L062
281A412L366l973o870J921P343q86p328O58Q913K224q424n002O301O411m750p618
297f302L769R803j264j0379j258R259K180q847l833P644N690n408o807L128P025
312D400j638p804j07Q295K054p225l059O405L875n099m736L556N358j402n251
327b378l63N135J725n054l303M002M003l034m132J542L854j07l559j302K585K631
343B245j417l338P91L619L01l181r64K508J592j235j982J08K136Q67k112j868
$$ plain form
239 -24778 -4305 18020 6820 -12739 -2700 18839 11238 -14111 -15205 6046 11269 -5093 -10255
252 -10255 5586 14435 913 -12959 -6724 5771 2689 -7867 -4612 7773 8455 -2196 -6196
265 -6196 -303 2143 -1700 -3043 634 3828 3593 1731 -232 -1584 -1736 -380 729 -460 -1650 1412
281 1412 4778 805 -6065 -4144 3199 2313 -5015 -4357 4556 6780 -1644 -6646 -345 6066 1316 -6302
297 -6302 -2533 7270 6006 -4373 -5631 3628 5808 -3039 -6872 772 6462 1054 -5753 -2625 4400
312 4400 2762 -5042 -5149 3146 5200 -2025 -5084 1321 5196 97 -4639 -1083 4275 2873 -2378
327 -2378 -2741 2394 4119 -935 -4238 -236 3767 733 -3399 -1857 1997 1890 -1669 -2971 -386 2245
343 2245 828 -2510 -1719 1900 2201 -980 -1944 564 2156 921 -1061 -953 1183 2050 -62 -1930
359a930J784K049j458k198O87J740j16j357m74P82J129k57j444P3J754J29j444
376e51K6J275P0q31qM71R4j28l76k32M44K08q86l07R49L5j132o3J076K5o53k04
398f98N04M95Po27l34J087Q00j230p54J314P92j187q23Q24O29m93p33J6O75K20
418D84r92o14J101O51j392n23J623O45j572o75J731P20j460r17J359J701p92k112
436a034J27K588N6l172p60L429J341l189j836K615K014k399k666J317L170p8k900
453a377l94L133Q79l391j469K929J797k098j110K133J237j929j801R74J281q76
469h2j112J320J889j229k424O98J950j538k601K067L786r59l445Q17L182j232
485A087m166m0M733J975l796k046M290K444n319m758M278N494l088n053L488O198
$$ plain form
359 -1930 -146 1903 445 -1753 -1066 674 558 -799 -1273 -491 638 381 -1063 -990 764 893 -551
376 -551 -525 750 820 -11 -19 452 546 418 42 -190 254 462 -424 -731 218 253 -879 -942 134 159 -494 -698
398 -698 -194 301 308 -319 -653 434 1234 4 -750 564 1356 169 -654 170 799 306 -427 -411 264 484
418 484 -508 -1122 -21 630 -762 -1285 338 983 -589 -1264 467 1187 -273 -1190 169 1870 1078 -1034
436 -1034 -907 1681 1737 -1435 -2195 1234 2575 -614 -2450 165 2179 -220 -2886 -1569 1601 1523 -1377
453 -1377 -1771 1362 2241 -1150 -2619 310 2107 9 -1101 1032 2269 340 -1461 -487 794 -82
469 -82 -1194 126 2015 786 -1638 -940 1010 -528 -3129 -1062 2724 1765 -1680 -863 2319 1087
485 1087 -3079 -3119 1614 3589 -207 -2253 2037 4481 -838 -5596 -1318 4176 1088 -3965 -477 5721
501E721k916q047J31P166J172o664j390Q395M244q057o844N908O712n476p242
516g187N532R865k299r992p65Q318P52r266k764J0037O491p307p072N523O063
531E929o470q409M591R803p60p376P39O931q99r027k353P839M279n104k219O689
547D183L033p833o163M359M962l838l354O082O227m382p783J029N464k513o339
562f866L473J0161N09r024j740O924n13r825j669J0937O092p103n187O806M928
577G903r362r908O421J1887k561r757L716J1645l372j5409k620J3010M880j0181
591c708l381J2913P774j1973j2829O175J1580n312j1186O490J5807j549j5870
604e069l543J1431K128j2297l394J4225R655r347j0384N585P716q238j1202O427
$$ plain form
501 5721 2805 -5242 -5111 2055 3227 -3437 -4827 3568 7812 -245 -7089 -1181 5531 55 -7187
516 -7187 -1655 8210 5911 -4081 -4846 3472 4224 -5042 -7806 2231 8722 1415 -5657 -134 5929
531 5929 -541 -8950 -4359 5444 4684 -2692 -1953 4978 4079 -4948 -7301 538 4817 -287 -2506 4183
547 4183 7216 -617 -6780 -2421 2541 -1297 -4651 1431 7658 3276 -4507 -3478 1986 -527 -6866
562 -6866 -3393 6768 7277 -1747 -3487 3437 2924 -6901 -8570 2367 8459 1356 -3831 2975 7903
577 7903 -1459 -11367 -4946 6941 4380 -5377 -1661 9984 6612 -8797 -11417 1593 6473 -3708
591 -3708 -7089 5824 13598 1625 -11204 -5029 6551 1239 -9947 -3457 12350 10801 -5069
604 -5069 -8612 2819 4947 -7350 -10744 3481 13136 3789 -6595 -1010 6706 -1532 -12734 -6307
618f307J4257l67j0356P76R234k622j2758k061J1335N588o650k632Q577L316j0898
633a568q805N935P810m328m905Q103Q723o198j1142J110P453k603p584M224J2462
648H687J036j1149l824P680Q47j1034k947J3204Q867q155p904O949O259j0140
662a624j1785O619J4267q86j1055J745J2226j686j6622m901J3974P915r696n530
676g039J2316Q869j1695j4214M896J2384l175j0850M713J5117j7j5468n235J0628
690A230L682j0909l822J2967R359q409j0348M353P032o517r646N372J2978L92
704G714r403n19Q022j642j1275k271J0411N447n910k842O898K779r113p510N050
719d164P125k715m432N869P415m818j0123N42P031j318o684L164J0350R13r551
$$ plain form
618 -6307 7950 7583 -2773 -1997 7237 4615 -8143 -10204 1131 6719 69 -2563 6014 9330 -1568
633 -1568 -10373 -4438 3372 -956 -5861 2242 10965 4767 -6375 -5265 2188 -415 -7999 -3775 8687
648 8687 9723 -1426 -5250 2430 3277 -7757 -10704 2500 11367 3212 -4692 2257 8516 -1624
662 -1624 -13409 -6790 7477 6591 -4464 -2719 9507 7821 -8801 -13702 272 8187 -1509 -7039
676 -7039 5277 14146 2451 -11763 -6867 5517 2342 -8508 -3795 11322 11305 -4163 -9398 1230
690 1230 4912 -5997 -9819 3148 12507 4098 -6250 -1897 5135 -1382 -11028 -5656 7322 7714
704 7714 -1689 -2208 5814 4172 -7103 -9374 1037 6484 574 -2268 4630 7409 -1704 -9214 -4164
719 -4164 2961 246 -4186 1683 9098 4280 -5843 -5301 1730 412 -6272 -3108 7242 8155 -1396
734a396l546O348J675q326l149J0257P821o471p863M867O424p104j0026M589J2055
749F155j58r200J1R326J15j1843m632R874P364o679n705P654P337p362j0697K922
765e518R341j072p682J979R828P81r940m540O696L678o326l583P591O744n167
780B810p269K450N053l261n950K828P780P28n804j227M465M3o198j872N902L718
796D196l508k398L722J873m821m109K912M002j503k596K886L801k452n403M46
811b952M279m90m125J414N966L49n776j857M318J240m695k024N310M239l563m827
827c194K342M216k747n715J724O622L18n331q49N008R00n426k786M659L932k788
843H85l543K703M022k441n161P99M737R6l966N6M232P77m146k178K740K180k252
$$ plain form
734 -1396 -4942 1406 3081 -5245 -8394 1863 9684 3213 -4650 217 6641 -463 -10489 -5900 6155
749 6155 5997 -3203 -3192 6134 6249 -5594 -10226 -352 7012 333 -5372 2282 9619 2257 -8440 -5518
765 -5518 3823 2751 -4931 -2952 6876 7657 -2283 -6823 -127 3551 -2775 -6358 1233 7977 2810
780 2810 -4459 -2009 3044 -217 -6167 -3339 4441 5169 -635 -1862 2603 2646 -3552 -5424 478 4196
796 4196 688 -1710 2012 3885 -936 -5045 -2133 1869 366 -2230 656 4457 2005 -3398 -2952
811 -2952 1327 837 -3288 -1874 4092 4441 -1335 -3192 1126 2366 -2329 -4353 957 5196 1633 -3194
827 -3194 -852 3364 617 -5098 -3374 3248 3566 -1765 -2614 2394 3294 -2132 -4918 -259 3673 885
843 885 -2658 45 4067 1626 -3535 -2736 2001 2097 -1869 -1813 2419 3196 -950 -3128 -388 1792 -460
860d60k120K290L114j433l300M57K728n77k501M45K780N14j996q10J313M71j483
877e68p96J304J229q06q80P42P14j297j045J074R47q82n90J221P81j098j155N58
895e47J291m06j357M99J876J7j987n65J772O30j772r14J838J187j303j462O89
912e14J468n65j667J76J823L14j615n23J518O50j509p27J207J051p28j015M68
929a88J059k28j203j53J152L67j064n77J056M81p70p58N39O78k31o36n6P33K92
948D93n20n23M33O20k67m88O5N63k9k74j19j8K08K07l96k31K10K64k51k84J28
969b09J75N2j11k79J00M89k7l94r9M72J47l74o4K38J48r1j30j05J45J88k50k32
991b11J83K30k75k23L13Q2k66k1R5L9j6m1n9J83K19k60j58L33K47k51l81L31K02
$$ plain form
860 -460 -2580 -290 2824 1391 -1909 -1452 1276 699 -1802 -1357 1423 1937 -59 -869 444 915 -568
877 -568 -1364 -60 1169 363 -517 225 939 -358 -1403 -329 618 -264 -854 367 1148 50 -1105 -547
895 -547 744 338 -1019 -520 1356 1373 -614 -1179 593 1223 -549 -1463 375 1562 259 -1203 -514
912 -514 954 389 -1278 -1102 721 1035 -580 -1103 415 1065 -444 -1171 36 1087 359 -656 -188
929 -188 871 643 -560 -713 439 806 -258 -835 221 702 -68 -826 -287 391 160 -476 -532 201 493
948 493 -27 -550 -117 503 236 -252 -187 376 347 73 -46 -64 144 351 -45 -276 -66 198 -53 -337 -209
969 -209 -34 18 -93 -372 -272 217 190 -204 -303 169 316 -58 -122 116 264 173 43 -62 83 271 21 -211
991 -211 -28 202 -73 -296 17 99 -167 -188 -93 -54 -70 -111 -170 13 232 -28 -186 147 394 143 -238 93 295
1014B95j93k04n8J90J55j38l69J40L56j46m09J61L62j46k40N4J97O7l3p0LJ84
1036A58K2j83mK15k46o7K99K9l77m3L89K2m27j91M72Q6j83l56K13M40o2n07j49
1059d50O80J64n73j46P17J58o91k14M66K66l92k81L39M31l35n33L9O37k23o71
1079f12K01R03o8q95L0Q20j0q69k05Q97N51n95p68O99P79n79j159L87J367l41
1099E33j132K04J121j17j277k83J028M84r41m75J084Q42r75j122P58J077q36j116
1117a143R13J613n56j570J00J364K7j724k20J842P92j495j109J263J059j416j579
1134a839J216J915o05j596M77J583m58j861k44J836O67j381n57J685P78j817j391
1151a592J269J357j079j134J265J538q55k024L23J583k58j782K47K401N01k216
$$ plain form
1014 295 102 -102 -160 30 185 47 -322 -182 174 28 -381 -220 142 -4 -244 -190 7 74 41 -29 -26 158
1036 158 180 -3 -7 208 -38 -105 194 223 -154 -197 192 214 -213 -404 68 154 -29 -385 -172 268 206 -301 -450
1059 -450 230 394 -179 -325 392 550 -141 -355 111 377 -15 -296 43 474 139 -394 -355 282 59 -612
1079 -612 -411 492 424 -471 -441 379 369 -500 -705 192 743 148 -620 79 858 279 -880 -493 874 533
1099 533 -599 -395 726 609 -668 -951 77 561 -380 -855 229 1071 96 -1026 -268 809 -27 -1143
1117 -1143 -230 1383 827 -743 -643 721 748 -976 -1196 646 1438 -57 -1166 97 1156 -260 -1839
1134 -1839 -623 1292 687 -909 -432 1151 693 -1168 -1412 424 1091 -290 -847 838 1616 -201 -1592
1151 -1592 -323 1034 -45 -1179 86 1624 769 -1255 -932 651 393 -1389 -1142 1259 1760 -456
1167d56r07J831O43k049j088K156J829j388j599J072J494j290k269O67K540P1
1183A257k140J65K277j27k857q66K507J095j858r15K298J524k138k404J192K322
1199A332q91k270J099L124k36l277n94K550L61k685o78K955J871k226k113J415
1215b63J834j803k434J403L160k34k662K33K402m55l006m86K818J128j840q20
1231a025K172J171k543k309J612K302j161j885J576K706j266l082pK435j67k288
1247a759K82L103Q86k631j526J755J196k243j487K469K524j388k438J041J948
1262A732j559k721P82L127L21k367j67K473J87l236j511K730K007j940j567K464
1278G55K068k224l050R69K703n56k392Q40L179J93l326j280K475R49k524j124
$$ plain form
1167 -456 -1363 468 1111 -938 -2026 130 1959 571 -1028 44 1538 248 -2021 -1354 1186 1257
1183 1257 -883 -718 1559 1432 -1425 -2291 216 1311 -547 -1462 836 2360 222 -2182 -990 1332
1199 1332 441 -1829 -730 2394 2158 -1119 -1713 837 1198 -1487 -2165 790 2661 435 -1678 -263
1215 -263 1571 -232 -2666 -1263 1897 1663 -999 -766 1636 1181 -1825 -2311 507 1635 -205 -1025
1231 -1025 1147 2318 -225 -2534 -922 1380 219 -1666 -90 2616 1350 -1732 -1739 696 529 -1759
1247 -1759 -1477 1626 2512 -119 -1645 110 1306 -937 -2424 45 2569 1181 -1257 -216 1732
1262 1732 173 -2548 -1766 1361 1682 -685 -852 1621 1808 -1428 -2939 -209 1798 -142 -1709 755
1278 755 2823 599 -2451 -1482 1221 665 -1727 -887 2292 2485 -841 -2121 354 1303 -1221 -2345
1294b345K924K160k034k335J175J802j532k290J187L039M5k485j75K284j39l005
1310a724o23K739J480j859j054J963J186k304k149J240K257o63j813J081K332
1325B089p37k810k90K144L43k002o5K662Q56k196j479J437J043j629j301J808
1341a27K203q91k203N72J746r64k323M54K589M20j970m28J946M09k344j393J920
1358c84J836j215j435J391J839j369k510N28K234j35j896L07K266L01k282j113
1374a637J594J002j532r99J731J703j230j904O76J525p69j739O29K070J60j746
1390d66k78J429K47j742q01J670J253j085r91J057R92j178j512O36J416k46j151
1407g50M50J295j99j483m14J239M41j147k11J333O47j215r16Q84O60q10q28Q91
$$ plain form
1294 -2345 579 2739 705 -1630 -455 1347 -185 -2475 -1288 1751 1796 -689 -864 1420 1281 -1724
1310 -1724 -2347 392 1872 13 -1041 922 2108 -196 -2345 -1105 1152 489 -1324 -243 2089
1325 2089 1352 -1458 -1748 396 739 -1263 -1328 1334 2190 -6 -1485 -48 995 -634 -1935 -127
1341 -127 2076 1185 -1018 -446 1300 336 -1987 -1533 1056 1476 -494 -922 1024 1433 -911 -2304 -384
1358 -384 1452 237 -1198 193 2032 663 -1847 -1319 915 780 -1116 -809 1457 1758 -524 -1637
1374 -1637 -43 959 -573 -1572 159 1862 632 -1272 -596 929 160 -1579 -950 1120 1280 -466
1390 -466 -744 685 932 -810 -1611 59 1312 227 -764 293 1285 107 -1405 -769 647 401 -750
1407 -750 -300 995 796 -687 -1101 138 579 -568 -779 554 1201 -14 -930 -46 614 -196 -1024 -133
1425a33J238m81j235J31J079k48j362k1J561L62j127m38J020L87j080p88R16R97
1443G78n90p61M04J040l87j166p9J210J12r60j28J063L30j058o25P25N19m39o86
1462f98N50Q52k86r35J73P05j61p02%R29J45o84k55N59K45o60l31N30M97l02m76
1483c05J92N29l35o06J68N57Rm26PM96j02m69m4L47K25k73k53L94K98m00k57J82
1505f6L61l14k90K23L99j39m03P3K95nl63j39M33J85l22k23L22K08k92k88K15
1526a30L64j46l11J54L03p7l10m5K89J33k83j56K63J70l21j10J85J06j30r5N0
1547i7K20q3j70J8J61Q1j70r3J64J58j70j33J10J04j02q6M4K3L5j3J7o8P6n8p5
1572a07j4J03q5O1JJ1J0J7L0l1o5J16K0l8p2K5L1K6J0j43N7J29q6j71J03J07o3
$$ plain form
1425 -133 1105 624 -611 -480 599 351 -1011 -1032 529 891 -236 -674 346 733 -347 -1135 -219 778
1443 778 188 -573 -169 871 484 -682 -761 449 561 -399 -527 536 866 -192 -817 -92 427 -12 -698
1462 -698 -148 704 418 -517 -344 361 200 -502 -502 427 572 -112 -367 192 437 -223 -554 -24 473 171 -305
1483 -305 -113 416 81 -525 -357 200 209 -217 -210 286 184 -285 -329 18 243 -30 -283 111 409 9 -248 -66
1505 -66 295 -19 -309 -86 313 174 -229 -156 139 134 -229 -368 65 250 -72 -295 27 235 -57 -345 -130
1526 -130 234 88 -223 -69 234 157 -153 -198 91 224 -59 -215 48 218 -103 -213 -28 78 -52 -147 -97
1547 -97 123 40 -130 -112 49 130 -40 -133 31 189 19 -114 -4 100 -2 -88 -44 -21 14 1 18 -50 26 -32 -107
1572 -107 -121 -18 -103 -42 -41 -30 -20 -3 27 -4 -69 47 67 29 -43 -18 13 39 49 -94 -37 92 6 -165 -62 45 -18
1599a8j8l2M2Oj4l2J6O3Jm8o0K16rq3k2j4M6j2j2O2p1J0n8N2l2M3j50M7J27Oj65
1630a13J22Nl6l9N6L8m7M4l4q2J00M8p5m4N8K7r4l1LP0l9O3m0j2pJ00o6m6O8j34
1660a37J94m1o8m8J78L6j39m3J41R3j47p2K9J04n8j14l5J58pl8j83J54J60j38
1684b1j11Q7J07j38J4k2J07J5n8k0R8lk11J0K18O2j64o8K21J9k36j27J86J59j36
1709a2j88J05L11q0k74q1L58k0k33j5J75J39j46j73J40J08j04j87R6K41m8k89
1731a77R9K37j30l37J49K91l5k89M1L23R5m31j35K41K71j63k31J53L44j69l40
1752a93j9L66o6k68J0L35J26l77j06J34K25k64k00L16K09k25k26K24K43k25m08
1773c89K10M42n5l93N6L29P7n46q6L49K55k33k68K68L27l80m15K62L79p5l98J16
$$ plain form
1599 -18 -36 -68 -26 -20 -34 -66 -50 13 14 -34 -94 122 113 30 8 -6 40 28 16 78 7 17 -41 11 -21 22 -128 -81 46 52 -113
1630 -113 9 14 -22 -61 -5 33 -14 30 -4 -86 14 62 -13 -57 1 28 -66 -97 -94 -24 -63 0 -40 -52 -59 41 -25 -71 -3 -137
1660 -137 57 16 -52 -100 78 114 -25 -68 73 166 19 -53 -24 80 22 -92 -127 31 24 -14 -197 -43 117 -21
1684 -21 -132 -45 62 -76 -62 -84 23 38 -20 -40 58 55 -156 -146 72 134 -30 -98 123 142 -94 -221 -35 124 -12
1709 -12 -200 -95 216 136 -138 -219 139 119 -114 -129 46 185 39 -134 6 114 10 -177 -81 160 112 -177
1731 -177 -78 159 29 -308 -159 132 97 -192 -151 172 267 -164 -299 -58 213 50 -181 -28 316 147 -193
1752 -193 -212 154 88 -180 -170 165 291 -86 -192 -58 167 -97 -297 19 228 3 -223 1 244 19 -389
1773 -389 -179 263 208 -185 -129 200 277 -269 -355 -6 249 16 -252 16 343 -37 -452 -190 189 114 -284 -168
1795a68L96J6m18j61M06R4l94r1M53K85m08l27L49K11l48k76K89M10j84l25l2
1816b23N33j16n26j04N16L28m86k39M65J97m14l95L48M57k07l06O8N40j53o00
1836c17j7M88N5l27j36M68J75m68k86K66L63m59k63L87N47j96n96P4N22j74n47
1857d41J00O23J93n34k47M48K52n26m50M64M85k75l98K65M29k18o45Q0O10m4m16
1878b45J3N84O1n61k93M87K35m13k49M42M01k87n17J45N00k37n79J79O83N4o06
1899b03j71N70O7m98l19O19L64l08m60L29M22l07n49J24O14l9m87P8N03l7n17
1920b05k21M78J62l03k33N01K76m03m51K59M32l15m05K35P26j70n78q4M61J19
1940B81n84r6N18K65k67l55K85L26m26l77K48M79j51l80J41L90j19m75j39N40
$$ plain form
1795 -168 228 244 -174 -335 71 165 -229 -320 133 418 10 -317 32 243 -105 -381 -92 318 134 -191 -223
1816 -223 310 194 -332 -436 80 408 -78 -317 148 345 -69 -464 -116 341 134 -172 -104 436 283 -317
1836 -317 -334 154 209 -118 -254 214 389 -79 -365 -99 264 -195 -458 -71 476 280 -316 -242 280 106 -441
1857 -441 -341 282 475 -59 -306 142 394 -132 -582 -118 367 92 -306 -41 388 170 -475 -395 215 171 -245
1878 -245 -232 352 413 -148 -441 46 281 -132 -381 61 462 175 -342 -197 303 66 -513 -334 349 403 -203
1899 -203 -374 196 263 -235 -554 65 429 121 -339 -10 412 105 -444 -320 294 255 -232 -154 349 312 -205
1920 -205 -426 52 214 -89 -322 179 455 52 -399 -140 292 -23 -428 -193 533 363 -215 -299 162 281
1940 281 -303 -399 119 384 117 -238 47 373 -53 -430 -182 297 146 -234 -93 297 178 -297 -436 104
1960A04J26l90r8M50K26l91m63L17L74l12l39L39N72k11n37k0M33j8m49q3M44
1981G4L12l81l03K84K62l72l01L03M45j14l93J07L24p2m79K8L98R3l71r1M10J37
2003C00m98j16K53K95k63k94K79K99j72m06J37L83p6m16K0M98Q9l77k20L55J45
2024B15k98k56L26K85j95k52Q1L24j89l75Q7L85R0m41L9L78K0m15j34L23K21k48
2046b9j75K29K89j47m66J30L78n1l60Q7L20n1k81p3K42J2k07j08K21K55j62k38
2068a85J15J87j49j84J64J83j6k83J25J97K2l00m3K85J1j57o6J44J59j76k64O8
2090a63K55n9j43O2K00p3j54m3J41O7k26M8J64M9j38j65J13J47q1p6N6J48j21
2113Hj01Q0P4k4j38J2J51O1k19j1J21O6j36j20J70J12j11j06Q3J73o4j00p2R3
$$ plain form
1960 104 230 -160 -258 192 418 27 -436 -119 255 -57 -396 -57 515 304 -233 -253 180 162 -287 -370 74
1981 74 386 5 -298 -14 248 -124 -425 -122 323 209 -184 -77 247 175 -304 -276 122 215 -156 -247 163 300
2003 300 -198 -314 -61 234 -29 -323 -44 255 83 -323 -186 197 121 -295 -275 223 312 -65 -285 70 215
2024 215 -83 -339 -13 272 77 -175 -94 230 41 -334 -247 138 228 -213 -174 204 224 -191 -325 -2 219 -29
2046 -29 -204 25 314 167 -299 -169 209 158 -202 -115 205 154 -127 -200 42 54 -153 -261 -40 215 53 -185
2068 -185 -70 117 -32 -216 -52 131 115 -168 -43 154 176 -124 -167 118 129 -28 -94 50 209 33 -231 -163
2090 -163 92 33 -110 -48 152 79 -75 -118 23 90 -136 -88 76 125 -13 -178 -65 82 1 -75 -19 129 8
2113 8 -93 -13 61 37 -101 -89 62 123 -96 -107 14 80 -56 -176 -6 106 -5 -111 -28 145 81 -19 -91 2
2137BQ1j55k2J01N9j00j03Q2PJ3o7O0O1l5K3q3J05jj47P5O9O4j47l1J37O2k31
2164a21LJ10kn1l6PJ19J9m4j00Q1O2l3j6l8Q1q9N5ql2P8j1j0L1j22L9P7l4qo2
2194e5K0L5J3q1K4O8p3k7K7M8M1n8rRK8J8rL2k4l6r1R6K7k5k4j0J2p7J09o8O7
2225Gr8R2l3L6j0j2JrO4n5nL4M5m5K7m7R1n0nr8O5j9J0k8k2lL5Rm1K0l1K7k7J2
2259f3Q6p5J2RK3o2N9J4O9q0m5J00m1o2M1mM5k8l0RKJ00j18lK6K8r3M2P5n9J7
2290fn2O0J6Kl0l7O0Ml7j4P4l0j20Q3N4o5r3L0P2N6rj45P8N3j0o0o4J70j2j25
2320i7QJ26J9r7M2L9J6j20K0N3L3q6m1L6O2j5m8kJ08l4j27N0J40j3j58p9J80K3
2348C8r0j8Q8P3p6j43Q4J65j16j82P2J93o0j31l2J99k9j30j24K42M6p2q9J28J16
$$ plain form
2137 2 83 -72 -94 7 66 -34 -137 -55 -48 -35 -102 -42 19 -16 7 -76 29 28 -119 -44 25 89 -58 -89 48 110 -121
2164 -121 -118 -8 -10 -61 -97 -90 29 48 4 -96 -15 47 14 -2 -40 41 -48 7 -1 -33 45 34 24 55 -67 -28 49 15 7 -55
2194 -55 -35 0 13 -68 -44 24 -49 -76 -49 -1 40 -18 -27 -18 10 28 19 51 27 -9 -100 -4 23 -2 -26 -36 -24 -101 8 -60 7
2225 7 -91 1 -32 4 -6 -18 -17 -26 38 -17 -22 12 57 12 39 -8 83 33 28 -70 -5 -24 -14 -42 -64 -67 -32 -23 -64 -44 -75 -48 -75 -63
2259 -63 23 -52 -40 -31 -8 -70 -11 3 72 -8 -53 47 6 -56 -15 -19 26 -2 -32 -23 -21 79 -39 -42 -16 12 -81 -39 36 -23 -6
2290 -6 -58 2 18 20 -10 -47 13 17 -20 -34 40 10 -110 -27 27 -38 -131 -101 -29 27 18 -127 -49 4 -6 -66 -130 40 28 -97
2320 -97 -89 37 56 -41 1 40 56 -64 -44 9 42 -44 -85 -49 13 -2 -50 -52 56 22 -105 -55 85 72 -86 -165 15 38
2348 38 -52 -70 18 91 15 -128 -44 121 5 -177 -105 88 28 -103 -135 64 35 -95 -219 23 69 -3 -92 36 152
2373A52j53j50J61J80j57j83J41J64o8k44lK14R2k11j45K48K14k92j66J78K42
2394B14k17k30K05K16j26j43p2K47K9l00oL11Q0k37j69K15J68k75j70K34K44k18
2416@k24J83J94j11l08J09L01K3l42l1L81P7m84k9L12J56k96j29K15K66j93l58
2438b88J17L07j04k84J13L75Rm93K4K79R8l48j71M65J98l12k16K37K43k62l42
2459c55K59L40l7l99O0L98j49l33j38M49R7l18j14L60J87l58l31K21L75j47m04
2480c37J81N11j62m06J6L70n7l76M3M17P4l30j88K99J59l42k38L06L89k49l94
2501c14K64K75k03l98J04M79J03m82o4M08J74n30k45M16L26k86l15L00M24l69
2521F7m39J83L07Jm15Q5M34R1m31j69L98J22l73j98M65K15k60l53K86K36k87l51
$$ plain form
2373 152 -1 -151 10 190 33 -150 -9 155 87 -157 -160 54 146 -65 -210 38 252 -40 -206 -28 214
2394 214 -3 -233 -28 188 62 -81 -153 94 123 -177 -183 128 208 -29 -198 17 185 -90 -260 -26 218 0
2416 0 -224 -41 153 42 -266 -157 144 167 -175 -206 175 252 -232 -261 51 207 -89 -218 -3 263 70 -288
2438 -288 -171 136 32 -252 -139 236 245 -248 -224 55 153 -195 -366 99 297 -15 -231 6 249 -13 -355
2459 -355 -96 244 207 -192 -132 266 117 -216 -354 95 192 -126 -240 120 307 -51 -382 -161 214 67 -337
2480 -337 -156 355 193 -213 -197 173 116 -260 -217 200 274 -56 -244 55 214 -128 -366 -60 329 80 -314
2501 -314 -50 225 22 -376 -272 207 310 -172 -236 172 346 -184 -429 -13 313 27 -288 12 436 67
2521 67 -372 -189 118 119 -296 -211 223 314 -117 -286 112 234 -139 -337 128 343 83 -270 16 252 -35 -386
2543c86K49M05k4m06l5L71lm19j71M70K36m24j44M03K49m05l03K19L08r4l80K10
2565g4M02p2m94o0M44J0m15k3N03J12l80k07K06K96l52k85L31L21q7l97L3L62
2587A74l1m32K4M37R0l47r1K93J49l72k03K35L41k44k82K43L33k32m21R2L59j7
2609I8l71N1M55pl62j84L41K22l50j31K91K54j73l30J57K27j87k74J34K97O8l43
2631a17mK51L5k88j50K66K48l23j42K78J80k76k13J30L03j73j17PK84p9l04k1
2653b25K85R7k95rK58Q9k52j96J12L52k81j62J48K68j29k86J09K39J5l58J0K72
2675F1J57k73j47K76R5k16j17J41J51q7k30J56J47p6k13J9K48Jk26K8J99M3j89
2698e2j51K12J45j99j18J39K10j48j57l7K75r9j62O2J66m2j33l7K07l3j46l3J02
$$ plain form
2543 -386 -137 268 244 -162 -197 174 171 -248 -419 51 287 -137 -281 122 371 -34 -337 -118 190 96 -284 -74
2565 -74 328 256 -238 -298 146 156 -259 -282 221 333 -47 -254 -48 248 -104 -389 -58 263 176 -221 -188 174
2587 174 143 -289 -265 172 262 -85 -176 117 266 -106 -309 -74 267 23 -259 -16 317 85 -336 -244 115 98
2609 98 -273 -222 233 226 -136 -320 21 243 -107 -238 53 307 134 -196 -39 188 1 -273 -139 158 226 -117
2631 -117 -121 130 165 -123 -273 -7 241 -82 -224 54 234 -42 -255 -125 178 5 -112 -105 179 100 -204 -225
2653 -225 60 157 -138 -147 111 200 -52 -248 -136 216 -65 -227 -79 189 60 -226 -117 122 137 -221 -211 61
2675 61 218 -55 -202 74 169 -47 -164 -23 128 41 -189 -33 114 38 -175 -156 92 93 -133 -105 94 137 -52
2698 -52 -203 9 154 -45 -163 -24 186 38 -119 -156 119 20 -142 -80 86 44 -89 -126 81 48 -98 -131 -29
2721b9Q7l4j88O0J62n2j13P3J68m1k11J47M0M2j42k3K5P2k6j31J16R1r4k23J57
2746f7Q3o9l8K6Q9N5j42J5Q3J4q7j2O1Q1n8j41J53N9r7r8J9P3M2j11L0N1L4j23
2774g5L3R1m4o9m8R5J5n0QOK2J1n8J4O1Jq6N0P0n4l9J2pL5p7N9K3l7M2j16J10
2805bm3Q1n7J4nk0J7n4J08n8m2lP3kk4K9q6Q9rqj0j6K2L0q5LL1r5R6P3j9n2l2
2838e6Q7o9K9N7n7Q0q7o7R2Rk3J6q6K5N6j24M7L4k3M1j9j4M9j0ok1NM8j6J1J9
2869B7j9j4j3QK4m6poL4J7M1q3L9l1o1N6L5n0j1R9q4M4p4O2J03j08j3K2LR6j16
2900b6k2O8k1l1OQ9o7j3J2o5Q2l0p7O7J4k5j3Q0p3O0j07RR1M0l5o0Q6m7k6J2J33
2931A11n2n1o9K6N8J3j07k8P6R8j48j6J94j08k1r7J19K6m2j0O6L2n8p3M2J25j16
$$ plain form
2721 -29 58 24 -164 -104 58 6 -107 -34 134 93 -118 29 69 111 -31 -54 -29 43 17 -114 2 93 -1 -224 -67
2746 -67 16 -53 -91 -65 24 79 -63 -48 35 49 -38 -50 11 92 34 -107 46 105 8 -90 -71 2 44 -67 -37 14 48 -75
2774 -75 -42 49 5 -64 -112 -17 -2 -52 -44 -38 -16 -5 -63 -49 12 13 -73 -23 47 -7 -46 -34 -41 -6 -83 -24 -1 -38 4 -112 -2
2805 -2 -45 36 -21 -7 -12 -32 -15 -69 39 -19 -61 -64 9 7 -17 12 -74 15 6 -2 -12 -28 -6 24 -61 -58 -27 -122 -26 47 28 -24 -56
2838 -56 31 -38 -9 48 -9 71 -16 -83 9 18 -5 11 -75 -50 6 -118 -71 -37 -60 -19 -38 -52 -3 -13 -19 -40 -35 13 -3 8 27
2869 27 8 -6 -19 -11 13 -33 -40 -46 -12 5 46 -37 2 -29 -90 -34 1 -49 -60 39 -45 -1 -75 -13 90 -18 -31 -9 -6 90 -26
2900 -26 -48 20 -1 -32 -26 63 -4 -17 -5 -70 12 -18 -95 -28 -14 -39 -52 28 -45 15 -92 -83 8 48 13 -47 39 -8 -34 -22 111
2931 111 59 8 -61 -35 23 36 -71 -99 -23 75 -73 -89 105 -3 -24 -121 -2 24 -18 -28 38 70 12 -61 -19 106 -10
2958a0o4j2L4N2m5RP0J1j09k1M9J12j29m0J07No8l6K2J84q4j62J10N3n1n3J4N7
2986EQ0r9l6O0Qp7j02J29N3j3j00K3J25k9j06n0J42Q4j80o1J97J03j79k2P6J34
3012A65j96j10J11J38q0j09k8J49Nj89j2J92Q4j95JP6J84k51j09J99P8j78q8J60
3036cJ55j21j86O8Q1R0k61R3K37j2k92K6J40J30k18j31K94J7j21j31J49J04j85
3059g7p0M8K76l1k68O9J58K2k76r8L11L2k16K9J86L7k07j31P8K75j18j92J07K16
3083A60j15r7o2K49j7k32J9J29J43j96j59J60J81j70j74R9K51q0k86J34J51K0
3105A08l04l8L09R2k73lK36j9j97j21J41K26j43j83J39K05j69j77P0J96m5k15
3127a65K5K01K1j99k3J61P6j47j98K63J80j60j48Q6J93j36j64P3K58o6k01mJ97
$$ plain form
2958 -10 -74 -86 -52 0 -45 -36 34 45 -64 -85 -36 76 -53 -93 14 19 -49 -85 -63 121 37 -125 -15 38 -13 -66 -52 5
2986 5 85 -14 -50 10 18 -59 -161 -32 21 8 -92 -69 56 27 -79 -129 13 97 -83 -144 53 156 -23 -45 31 165
3012 165 -31 -141 -30 108 28 -81 -109 40 45 -144 -156 36 120 -75 -74 2 186 -65 -174 25 103 -75 -163 -3
3036 -3 152 31 -155 -87 -6 84 -177 -84 153 141 -151 -125 15 145 -73 -204 90 107 -14 -145 4 108 -77
3059 -77 -147 -99 177 146 -122 -53 105 127 -149 -247 64 96 -120 -91 95 132 -75 -206 -128 147 29 -163 -56 160
3083 160 45 -52 -114 135 118 -114 -95 34 177 -19 -178 -18 163 -7 -181 -82 169 89 -197 -63 88 108
3105 108 -196 -234 75 167 -106 -109 127 108 -89 -210 -69 157 14 -169 -30 175 6 -171 -101 95 50 -165
3127 -165 -140 61 82 -117 -140 21 97 -50 -248 15 195 35 -113 -27 166 30 -134 -61 197 131 -70 -74 123
3150A23L9k64j29K50J04j79j02J79J41k14j16O3K00j6k01L1K45k0l06Q1J60O3
3172A32k17j78L49Q1j67k17J69K11j92j11K1K63n5k35l5K73n5k31kL05P7k44q4
3195a42J51J72k80r8J71J99j43j83J55J20n2k21OK28k1j83J3K12O2k48q4J87J15
3218A36k05r2J36K15j67k19J49K03r3j87O3J12O3j72o8K00J6j29j18R5K00p6j93
3241a31R4J34j42J1K8J06j11r3N2N2J01k09J4J67J1j92O4O3J06j42l6QQ2k3j22
3266a08K1J37k8j65M8J36O3k53JK37qj47o7J01Q6j51j1R3R5q8q5L4J48o4r8j5
3292h8J38n9m2k3N8J30j63j23J19J64j68JQR3Mj34j6J02j8m7K0J45q3r6K5R1o4
3319b6Po3N5N7o7q8J37Lm7n3M3Q9j6j30O4Q1l0p4K1P0j6k2o1R9Ko5m2PJ03o8j
$$ plain form
3150 123 162 -102 -231 19 123 -56 -158 21 162 -52 -168 -105 95 79 -122 -91 154 134 -172 -91 69 132
3172 132 -85 -263 86 167 0 -217 -48 163 -29 -140 -119 144 89 -146 -181 92 37 -194 -196 109 186 -58 -142
3195 -142 9 181 -99 -197 -26 173 30 -153 2 122 70 -151 -145 83 62 -121 -108 104 166 -82 -166 21 136
3218 136 -69 -161 -25 190 23 -196 -47 156 63 -124 -61 51 114 -58 -126 74 90 -39 -157 -62 138 62 -131
3241 -131 -37 97 -45 -34 -6 100 -11 -104 -52 0 101 -108 -94 73 84 -108 -44 19 125 -17 -53 -45 37 14 -108
3266 -108 -87 50 22 -143 -95 41 104 -149 -148 89 81 -66 -133 -32 54 -97 -108 -15 80 -8 -93 -59 89 25 -73 -88
3292 -88 50 -9 -51 -74 -16 114 -49 -172 -53 111 -57 -56 -48 45 49 -85 -101 1 -17 -64 -44 101 18 -78 -53 38 -26
3319 -26 -19 -82 -27 30 -37 -125 12 15 -32 -85 -42 47 31 -99 -35 46 16 -58 -37 33 17 -5 -66 33 35 -30 -72 -65 38 -30 -31
3350c1q1K25p9r4RJ04n1J7r5J55Jj32rM6Q3q6J3K5k5M2p1O2mrn5k1Q1n3l4M5L
3381a9J6l6N8m5Q3o4q4J11n3Kl0M3L4p1L3m2P1Lk8j1M2m6L8q2P8j2%jN0l6Rn5
3413d4LP0K8o7k0M4m1P2o6lP5n8Qm3OM4l1J8l0rK8M8n5j2kK1L3n8JO4m0n1J04
3446C7j11N1jJ05nn7J5r6Q8n7NO2n6K8L0l2J9m7k2J4J9J7jK1k5o6Q4j6m8N1n2
3477d6MJN0o2Q8o4j1RQ4n2q0N6qRK6m3l8L6mM9L8n7p3Q8l8J0R7n4m6k1R5p2oM5
3511A0n8lJ1%O6r1K0QL5j3k6K3o2Q5o2QR5q5PJ2L2k5j8J6M4J5m1OLm1K9p9R6m4
3545b7L8j02J3K4N3l8nJ9N9jl1n7K1N8j04R0J6p0l5R3L2k1l3o1K5O8l3pl3j6O2
3576cm4j4J21j08M4o9R2m4k9O7l0O1n6k6M7Rl3k7J5j0kJ4k7O5j1rm8L2M2j6l5
$$ plain form
3350 -31 -112 113 34 -60 -51 53 2 19 -76 79 80 -52 -61 -15 68 -18 -5 20 -5 37 -34 28 24 15 -40 -61 20 -33 -67 -22 -19
3381 -19 -3 -39 19 -26 57 -7 -91 20 -33 -31 -61 -18 16 -55 -22 -64 7 10 -18 -29 13 -33 5 -77 1 -11 -11 -12 38 2 11 -44
3413 -44 -41 29 57 -10 -30 14 -27 45 -21 -24 51 -7 1 -42 -36 8 -23 -5 -35 -44 -16 32 -23 -35 -37 -16 17 -41 -40 24 -16 -67 37
3446 37 -74 -23 -24 81 76 19 34 -62 26 -31 -26 36 -20 8 38 6 25 -22 -44 -30 -11 6 5 26 1 -65 19 3 -45 6 -46
3477 -46 -42 -41 9 -53 35 -29 -40 -31 53 1 -79 -23 -31 -22 4 -39 -77 -41 -45 4 42 -15 -88 0 -38 -28 69 15 -31 -52 43 -29 -35 10
3511 10 -48 -51 -40 -40 26 -65 -45 -37 -2 -15 -41 -18 -80 5 -57 -49 46 -39 -32 -20 12 -13 -31 -15 29 44 3 9 12 -29 0 -79 17 -27
3545 -27 11 -91 -78 -54 -1 -39 -44 -25 34 33 2 -55 -34 24 -80 10 26 -44 -79 14 46 25 -8 -69 -44 24 -9 -16 -49 -65 -3
3576 -3 -47 -61 60 -48 -4 -73 19 -25 -54 13 -17 44 -12 -38 9 18 -15 -42 -27 -37 -39 -25 -52 13 2 -7 -55 -23 19 3 -32
3607c2J8K8o1QM6K9m6m5J2Q3p9m0M7J0N1o6j2K7%j9L7m8N6m4l8M6k0K2k3K0L1
3638bMpJ2m8M3q8M9M2j4k6LRl5L4k6M8Prj05O6O0j5o7J6R9j8n1l2O9l0pn1J00
3671C0J4n2o0Q5L3l7j42N7R1ro2K3O8k9Kj2K1m9l1j9M4R2j10J3N6K6j30K4J7R5
3701D9l8o9k2J31l8k9J1LK0j13J01J7k7o3K3K1N8j3r3k3J15Rp1N6J0o2m0O7N0
3730D0Lp6p4R7N3j55M0O7Mj8n3J4Q7r6P0o2R6m0M9m6K0k5m8j3K5L6k5k8R2l8k2
3761b6j5m7J49n1o5j4Q8no2K7M8k3Rq6Q6M3m0q2N2Mk2qrJ5jk3K6N6p3K7l4J30
3793G4m2m4k0Q5K9j06qL9J9Jk4o3N7J0o5J2K9M1q4N2N5j2l4r1J07lr0kO6j1j6
3824c9LJ05j2o7Pq7O8M9k2k9J5J2l4j3K2O6r0J3K6J6l7l8KR4L2j45L5K2q1N5N8
$$ plain form
3607 -32 -14 14 -47 -39 7 36 -10 -55 -43 40 -39 -79 -32 -22 29 -37 -49 -22 -22 -41 -4 -52 4 -40 -78 -32 -52 -30 -53 -33 -2
3638 -2 2 -5 7 -41 2 -86 -37 5 -9 -35 -32 -23 -58 -24 -50 -2 5 -4 -109 -43 17 2 -65 -49 50 32 -19 -51 18 -12 -19 -70 30
3671 30 44 -8 -68 17 50 13 -129 -72 19 10 -52 -29 39 10 12 0 21 -28 -59 -78 -34 58 -52 -39 17 43 -87 -63 -46 49
3701 49 11 -58 -80 51 13 -16 -5 -2 18 -95 6 23 -4 -67 -44 -23 35 22 -71 -94 21 30 -41 15 25 -37 -77 -10 40
3730 40 43 -33 -107 -10 43 -112 -72 -5 -1 -19 -72 -58 29 -67 3 -59 37 -3 46 0 20 -5 -53 -66 -41 -5 -30 -58 34 -4 -26
3761 -26 -41 -88 61 10 -55 -69 19 14 -48 -21 27 4 13 -73 13 56 16 -66 -14 -10 -32 -40 -49 -34 -35 -58 -32 24 -49 -22 -56 74
3793 74 32 -12 -32 53 82 -24 -32 7 26 27 3 -60 -3 7 -58 -46 -17 24 -60 -8 47 35 1 -90 17 14 -76 -78 -12 -23 -39
3824 -39 -36 69 57 -10 -3 -90 -22 27 5 -24 -9 3 -31 -44 -22 44 -46 -33 -7 9 -28 -66 -64 30 62 -83 -48 -26 -107 -52 6
3855Fj7M6q1N1L3l0l8Oj8K4L0o5N1J2pNj09J23J6j50P7L1K5l5kL6k4J3n8J05n5
3886Ap9M9N6m6J7l5jPK4k1J6l7PK3L7K3o3l0L8j2K4pl0M9k6J8L2k8p3M5M5m1l2
3919e0jJ29j35R1m9n2K9L4n5%JK6K3mJ2k1%L0j3J2lL7q7J8PJN1m0JK5j7j6J3k2
3953b5N8p0K2kj8J3k3j3M3J8Oj7J8k1M9j8J2o6QJ4L1l7j7RM4l8M3l8kLlO1k9k5
3987a0qN8q4J4l7K9J2j8P5l9J1L9m1m6K2NM0k4p3N9k9J4L9QLk3K0k2L1kl7K5j4
4020cqOk1RL4k4l9L5K8K5k6O4o1j4L3k5o2M5Nl4J4JkM7j8m9K2m3N0J9j0qj7M0
4054A3l5K6J4j7m5%N8m3M6p5P4m8jK9Mk6RP8k3k1l9K8k4j5K1N1m4po3K2L8l9N4
4087@jk8Mj2K3L5J1m4Ml2K6M4j08N5M5J1k8J7n3O6k7o4P0N1j09N2m0J3j1o1N9
$$ plain form
3855 6 -11 35 -46 5 38 8 -30 -24 -42 -18 12 -53 -2 10 3 8 -101 22 38 -112 -35 -4 21 -14 -16 20 -4 9 -49 56 1
3886 1 -78 -29 27 -19 -2 -37 -38 -31 -7 -28 -12 -49 -42 -19 18 41 -22 -52 -14 -26 -2 -9 -39 10 -16 2 34 6 -67 -22 23 -18 -50
3919 -50 -51 78 -57 34 -15 -67 -38 -4 -59 -59 -58 -32 -9 -13 -1 -22 -22 8 -5 7 4 41 -46 -28 -21 -20 31 -9 -8 17 0 -16 -3 -25
3953 -25 33 -37 -15 -17 -35 -22 -45 -58 -15 3 9 -8 10 -11 38 20 32 -34 -26 -12 19 -18 -35 -26 18 -20 23 -15 -17 -14 -17 44 15 -10
3987 -10 -18 40 -44 -30 -67 -38 -26 -44 31 -8 3 42 1 -45 -23 -18 22 -2 -75 -16 -45 -31 8 16 19 -4 16 -6 25 23 -14 11 -3
4020 -3 -11 -5 -26 -17 17 -7 -46 -11 17 42 16 80 19 5 38 13 -49 -4 1 -33 -19 -18 -20 27 9 -40 -18 -61 -11 8 -2 -10 -27 13
4054 13 -22 4 18 1 -44 -44 14 -29 17 -58 16 -32 -33 -4 0 -26 -17 61 38 17 -22 6 -18 -33 -12 39 -5 -12 -75 -53 -15 -54 0
4087 0 -1 -29 -25 -37 -14 21 32 -12 -8 -40 -14 30 -78 -23 22 33 5 22 -31 35 8 -56 14 65 -44 8 -32 -19 -30 -91 -32
4118c2J4M7p8N0o3R4k9nJ5L2m5o8M6p2J37n9N6p4K4j5N7l9mKJ1k3l5P6k6k2K4
4149dJ5%ll6j5J4k4J3Np%M9m8P4n8Q5p1m2M3l3j0mP3j6J2l5k0K3J0K2J2kp2L9
4183a1mJ7J4k0r0O8L2k1P9m6j1O4j01K2O0o2Mk8J5k4N8N3o2%p6O5q3J13n9N4L
4214B3m7J8p6R3j4K4j8m9L1k6j5K3l1P9m8J1j6R1n3pj4L9k7l0k4K8MM9j2j8M2
4245C0mm1MM1k6j1p0P6k4o8J01m5M0J3j6j9L9l0l3R7k3k4j14O9L1K3o0mO5J7n2
4276a8k4N5l4K7p2P6k1J6m9m4J06m7M6j0J5l1j3kqK9k9L8k3K7k0J9K7o1Nj6L1
4307el3m5K1P6J2p5kO7mj8Ll7O3J4j46J05k8K8j4j3L0k5oJ4N1o0K0j7K4K3J4j5
4339B2j23J17l7lj7M9j8QKM2n7Nqk2L0M2n5L2m2J0M1j14J23J6j7q9O5M6q9O4l1
$$ plain form
4118 -32 -18 29 -49 1 -62 32 3 -2 13 45 0 -68 -22 -94 43 -16 40 -34 -10 -25 32 -7 -11 -9 2 -21 -56 20 -6 -28 -4
4149 -4 11 11 8 -28 -43 -29 -53 -40 -35 -42 -42 7 -41 33 -25 60 -11 -53 -10 -43 -53 -57 16 0 12 -23 -43 -20 -10 12 24 22 -50 -11
4183 -11 -15 2 16 -4 -94 -26 6 -15 64 18 7 71 -30 -8 52 -10 -6 -34 -19 -43 15 68 6 6 -70 -5 -88 25 -34 20 23
4214 23 -24 -6 -82 11 -3 21 3 -46 -15 -41 -56 -33 -64 15 -33 -22 -38 53 0 -7 -21 18 -9 -39 -63 -35 -31 18 6 -12 30
4245 30 26 -15 -11 30 4 -7 -77 -1 -25 -93 8 -37 3 16 0 -19 20 -10 -43 54 31 7 -107 -38 -7 16 -44 -48 17 34 -18
4276 -18 -42 13 -21 6 -66 10 -11 5 -44 -88 18 -29 17 7 22 -9 -22 -24 -32 -3 -32 6 -17 10 -10 9 36 -25 -20 -36 -5
4307 -5 -38 -83 -62 14 26 -49 -51 16 12 -6 -3 -40 23 37 -109 -4 -32 -4 -18 -31 -1 -26 -32 -18 33 -27 -7 -24 0 23 37 22
4339 22 -101 16 -21 -24 -41 8 -10 -2 0 42 -15 -10 -18 -40 -10 32 -23 9 -33 -23 18 -96 27 43 26 -63 2 48 -41 23 -8
4370hL3mj6m8L2MJ9n4J11j09J7JO9m2p3Q4kqm6mR5rk5q5J01K1r8j3K1P9k4n0m3
4403g4J9J07o6p3N6O9n6p1O1K0Kk7rJ48j21l5Q5m7N1j01O7k5KJ6n%OJ2m5M4o0
4434e0Q2q8O1M5J4j08K8J3NPp3Q8Rr9L1M1Mj2p2R4m7K1j0o4LN1k8K4M0j6k0O4
4466C8l9O0r9k4L9K8k1L0Jk2J5m4O9j8l9L4o6M6O0p8m5R9N6p6M3l4n0J37m4p7
4496b1P7n5q0O5K6n0J0M0%ml5Jk1N8m9L3K1M1r7M4l4O0K1j13M9k2L2Jl6P5l9l3
4528c5M3K3n1mm6P7j8oP%K5k5l6k0Q0o3pO7n0N8lj06Q3L4n5L5j0K9o5J1M7l0Q5
4561G4r1j2P8l5l5K1Rm9L3j9KM6k7j5l0R2m0n3P7l5L5k0rk8M0k5j9j9M1k3NO6
4593C5m4n1Q6m2kj7K2LK4L9r6N4qPK0j0mk7l3k0M8J2%qLm4l6O4OJJ4k0k7J3J10
$$ plain form
4370 -8 25 21 5 -43 -11 -7 12 -42 69 -40 -23 -22 47 5 -68 16 14 6 -40 -44 51 42 17 -68 33 54 -44 -57 -36 43 19 -31 -74
4403 -74 -55 52 -14 -87 -31 38 -18 -89 -28 -8 -6 -33 -42 106 -15 -50 35 -12 39 -62 5 -20 -18 -2 -7 -7 -1 11 -34 10 -50
4434 -50 32 -56 5 50 64 -44 -16 -3 2 9 -64 24 33 -66 -35 6 10 -2 -74 20 -27 -6 -16 -80 -77 -26 -54 -30 10 -6 -26 38
4466 38 -1 59 -40 -64 -25 3 -18 12 13 -9 6 -38 31 13 -26 8 -58 -12 48 -30 -75 24 80 4 47 13 -37 100 56 -21
4496 -21 56 1 -79 -14 12 -38 -28 12 12 8 -27 -26 -47 11 -38 -5 16 57 -40 4 -30 30 51 -62 -13 -35 -3 -2 -38 37 -2 -35
4528 -35 8 31 -20 -24 -70 7 -11 -17 -10 -10 15 -10 -46 -66 14 -49 -56 11 -39 19 16 -90 -7 27 -28 7 -3 26 -39 -28 19 -11 74
4561 74 -17 -29 49 14 -21 0 9 -40 -7 -26 -24 22 -5 -20 -50 42 2 -51 26 -9 26 6 -3 -31 9 -16 -35 -54 -13 -36 -31 35
4593 35 -9 -60 26 -16 -18 -35 -13 -10 14 53 -43 11 3 10 30 20 16 -11 -44 -64 -16 -4 -4 -12 -9 -53 -89 -25 -19 -18 -4 -24 -51 -38 72
4628G2m2o9j1J0j6M2k9P8o2K5oL5r0M6J3M4n5L7o6M5K2l6oJ5M8Lq8O1qJ2l2l3
4660d1QJ3N9p2J3N0l2k7J4k1N3nl1l0M8L9j05Q6j2j4Jk5L5J2mPo1j2M9l8K4K9
4692A0Mo2N8m0L0k9O2oq5N7P6l6l6j15J11Rml8P7M4r8kL2k8k0j0Q3m8jk3NLmK5
4726An9N6J7kp3Q5m6l8Q3n9K4pm2R4l2n0P8l8Kj6N3n5N3k2J0pK0rq2N1N4J1q0
4759b5PN1l6k3j3J6K8Qm9N4m7L6n1J0K3KP4L3r5J4j00M1l1L3O3l2J3j3Oo4P7l8
4791b8J5k8P0M8m0l3lm9QM7K9Mq2j2PPQ8r0kK6J9m9M2J4n3O8k0j8K8j5P3j22L0
4824b1J2j3J5j6J5k3l6K7J8J3kn2O8L9j11O3Q6p8l5j3M5kj9MrO0k0p6R9r4J44
4855H8j09n3M0M3pl9L5pK8j5N1j9n3l1j9R7o5K7pM8k5r1Q1m1Q2p2l8R9n7L5n6
$$ plain form
4628 72 30 -39 -50 -40 -56 -14 -43 35 -27 -2 -8 27 -63 -17 -4 40 -15 22 -44 1 23 -13 -19 -4 44 47 -41 20 12 24 -8 -41
4660 -41 -33 -20 39 -33 -20 30 -2 -29 -15 -36 17 12 -19 -49 -1 38 -67 19 7 -7 -6 -31 4 16 12 19 -42 -54 -5 -43 -19 10
4692 10 14 -48 10 -30 0 -29 33 27 -58 -1 75 39 3 -112 -1 8 4 -34 43 87 -11 -13 19 -9 -29 -39 44 -4 -5 -28 -23 -20 -24 1
4726 1 -58 -2 15 13 -60 25 -21 -59 24 -35 -11 -18 -60 34 2 -48 30 -8 -6 -22 31 -24 29 7 17 10 30 21 -61 -10 44 55 -25
4759 -25 -18 33 -3 -26 -39 -23 5 13 -36 18 -29 7 -44 -34 -11 -9 65 98 3 17 -83 -42 -73 -40 23 -9 4 -9 -3 -67 10 -28
4791 -28 -13 -41 29 77 37 4 1 -48 -40 7 36 40 -42 -54 -47 -40 48 -42 -44 -18 1 -48 -6 8 -45 23 3 -15 13 -2 71 -51 -21
4824 -21 -9 -22 -7 -23 -8 -31 -67 -40 -22 -9 -11 -63 5 44 -67 -4 82 4 -31 -44 1 -1 -20 -16 -25 35 15 -61 38 -56 88
4855 88 -21 -74 -34 9 2 -37 -2 -9 19 4 55 36 -17 -48 -67 30 -35 -8 -15 33 8 -83 -2 -43 39 -33 -71 28 -29 6 -50
4886e0k1N6j3J2q4J18m5M1j6j1Kk4K7N0m5m3k0P9P8j45K2K3L0k1k6M6k6mm0J7
4916c3P8k6r1Q4j4m8O3m6Q7m8m3l7Q6oj9j4J2P3p7k2R3k3k5m3o6N4Q6p0KJ6J21
4947A04j07l6J35p0j3r2N8K4Jj1m0O5oj06K8N2k7k9jJ08n5j4m3j4J19p6M1M7K6
4976F8q1p6J3J10j6n4j3LO4qj9l7L7po0P9km2m9N8N7m5l2k7J20k4l4o7J15Kr7
5007f4J1O9op4l3O7L5j3o8P0J3j7j4l2R8n6K2RJ0j7rK2m1Q0p0p8P2j2mJ3m6J05
5039D2k6l0lJ3N1j19J0K1N6n9N9p5P9j9n9K9O8K5j33P3j3pp1Q9L6k9p1L2O5J0
5069D4q0m4P6J5nj04R2KoK3Nqm5J6k0O9Qj41K2Q2m7N3l1N4j3m6L3K3j7m1km1J19
5102D5l4Lpn0P9m6qJ5N2pj02O4J2o5pk1P8k3q3J11O5m4r5O7Ll1J7n3Q7n8K4nL0
$$ plain form
4886 -50 -71 -15 -28 -16 -100 18 -27 14 -2 -13 -11 -35 -8 42 -3 -46 -66 13 91 -54 -32 -9 21 0 -26 20 -6 -10 -50 -33
4916 -33 45 19 -72 12 -2 -50 13 -33 54 6 -37 -74 12 6 -13 -27 -15 58 -19 -41 52 29 4 -39 -105 -51 35 -35 -33 -17 104
4947 104 -3 -39 96 26 13 -79 -21 3 4 -7 -47 18 12 -94 -66 -14 -41 -70 -71 37 -18 -32 -75 -89 30 -46 -5 42 68
4976 68 -13 -89 -76 34 18 -36 -49 -46 18 10 -9 -46 -9 -16 -76 3 1 -41 -90 -32 25 -20 -52 -79 41 17 -17 -84 31 33 -64
5007 -64 -53 16 10 -64 -97 -30 5 -8 -76 -6 7 -10 -24 -56 42 -14 8 17 27 10 1 23 -18 62 -8 -86 -14 -26 -30 -17 -63 42
5039 42 16 -14 -17 -4 47 -72 -62 -41 15 -44 15 -60 19 0 -59 -30 38 63 -70 3 -10 -17 -88 1 37 8 -63 -31 34 44
5069 44 -36 -80 -4 11 6 -98 -6 -4 -10 13 18 10 -35 -19 -39 30 38 -103 -81 1 -46 7 -24 30 17 -29 4 27 10 -31 -33 -74 45
5102 45 11 14 7 -43 36 -10 -18 -3 49 42 -60 4 16 -49 -56 -77 1 -22 -105 6 71 27 -68 -1 2 -29 -12 -65 22 -36 -12 -17 13
5135A3m2k4O6L2n9lk2L8K1Pl5m4L3M2k9m4K9J5N1q3j9J0M2q6J18Llm6L6J0k1j
5167Ej7L2N9n7p2K5L5l9K5j0L5m4JK7J4M1n3p4K7P6l6k5O3j26N0J7M8o1l5j4M5
5198c8K0Q1p6K1J2o2P2l4L9n2k2qQ7j5q2J35o6j4L3n2N6m7L0o0L2J9m6J3P4r3
5228d3J13j14m5P4K2r4k9P0qN4p2K5K6J5o0O0j1j8M9j9k1L5n6nN8l5J9Pj3K3N0
5259E7o6K9Pr9M7k0K3KK4k3P1n6m2J4l2P8M2r4L0no5J06l2M5o9NNK3l1L3k3O8
$$ plain form
5135 13 -29 -53 13 45 -14 -17 -39 -1 20 27 -8 -52 -19 23 -6 -50 -21 -6 45 -38 -57 -47 -5 -91 27 30 27 -19 17 27 6 5
5167 5 -12 20 79 22 -50 -25 10 -29 -4 -14 21 -23 -22 5 19 60 7 -67 -40 36 0 -25 38 -88 -38 -21 27 -34 -69 -83 -38
5198 -38 -18 63 -13 8 20 -42 30 -4 35 -17 -39 -47 40 25 -57 78 12 -2 31 -21 35 -12 18 -42 -10 9 -37 -24 50 -43
5228 -43 70 -44 -89 -15 7 -87 -116 -46 -54 0 -72 -47 -21 -6 -66 -6 -17 -35 14 -5 -26 9 -47 -52 6 -29 -10 -3 -16 7 57
5259 57 -9 20 27 -72 -25 -45 -22 -20 4 -19 52 -4 -46 -32 -64 14 56 -38 -8 -13 -78 28 -4 41 -28 -23 -18 5 -26 7 -16 52
$$ [...]
8191a4
##END NTUPLES=NMR FID
##END=
