##TITLE=1H ikalashn
DMAE 1911
20.11.2024
##JCAMPDX= 6.0         $$ Bruker NMR JCAMP-DX V2.0
##DATA TYPE= NMR FID
##DATA CLASS= NTUPLES
##ORIGIN= UXNMR, Bruker Analytische Messtechnik GmbH
##OWNER= root
$$ TOPSPIN		Version 1.3
$$ 2024-11-20 10:01:58.546 +0400  Irina@DPX200
$$ Compression mode = diff/dup
##.OBSERVE FREQUENCY= 200.131300845
##.OBSERVE NUCLEUS= ^1H
##.DELAY= (6, 6)
##.ACQUISITION MODE= SIMULTANEOUS
##.ACQUISITION SCHEME= undefined
##.AVERAGES= 8
##.DIGITISER RES= 18
##SPECTROMETER/DATA SYSTEM= spect
##.PULSE SEQUENCE= zg
##.SOLVENT NAME= CDCl3
##.SHIFT REFERENCE= INTERNAL, CDCl3, 1, 17.49637
##AUDIT TRAIL= $$ (NUMBER, WHEN, WHO, WHERE, WHAT)
$$ ##TITLE= Audit trail, TOPSPIN		Version 1.3
$$ ##JCAMPDX= 5.01
$$ ##ORIGIN= Bruker BioSpin GmbH
$$ ##OWNER= Irina
$$ $$ F:/spectra/data/iren/nmr/1H/4/audita.txt
$$ ##AUDIT TRAIL=  $$ (NUMBER, WHEN, WHO, WHERE, VERSION, WHAT)
(   1,<2024-11-20 10:01:43.421 +0400>,<Irina>,<DPX200>,<TOPSPIN 1.3>,
      <created by zg
	started at 2024-11-20 10:01:06.421 +0400,
	POWCHK disabled, PULCHK disabled
       terminated by command 'halt'
       configuration hash MD5:
       BE 6D 3F 07 2A EA 11 49 91 17 2B D3 AF B3 58 0D
       data hash MD5: 16K
       4C F8 05 8F 91 EF FD 87 86 D9 21 16 26 9A 24 CC>)
$$ ##END=
$$ 
$$ $$ hash MD5
$$ $$ 4F DF C1 A8 A8 EB D7 B6 A8 5B CD 26 76 7A F1 E5
##$RELAX= 
##$RELAX= 
##$RELAX= 
##$RELAX= 
##$RELAX= 
##$RELAX= 
##$RELAX= 
##$RELAX= 
##$RELAX= 
$$ Bruker specific parameters
$$ --------------------------
##$DU= <F:/spectra>
##$EXPNO= 4
##$NAME= <1H>
##$PROCNO= 1
##$TYPE= <nmr>
##$USER= <iren>
##$AMP= (0..31)
100 100 100 100 100 100 100 100 100 100 100 100 100 100 100 100 100 100 
100 100 100 100 100 100 100 100 100 100 100 100 100 100 
##$ANAVPT= -1
##$AQSEQ= 0
##$AQ_mod= 1
##$AUNM= <au_zg>
##$AUTOPOS= <>
##$BF1= 200.13
##$BF2= 200.13
##$BF3= 200.13
##$BF4= 200.13
##$BF5= 200.13
##$BF6= 200.13
##$BF7= 200.13
##$BF8= 200.13
##$BYTORDA= 1
##$CFDGTYP= 0
##$CFRGTYP= 5
##$CHEMSTR= <none>
##$CNST= (0..63)
1 1 145 1 1 1 1 1 1 1 1 1 1 1 1 1 1 1 1 1 1 1 1 1 1 1 1 1 1 1 1 1 1 1 
1 1 1 1 1 1 1 1 1 1 1 1 1 1 1 1 1 1 1 1 1 1 1 1 1 1 1 1 1 1 
##$CPDPRG= <>
##$CPDPRG1= <>
##$CPDPRG2= <>
##$CPDPRG3= <>
##$CPDPRG4= <mlev>
##$CPDPRG5= <mlev>
##$CPDPRG6= <mlev>
##$CPDPRG7= <mlev>
##$CPDPRG8= <mlev>
##$CPDPRGB= <>
##$CPDPRGT= <>
##$D= (0..63)
0 2 0 0 0 0 0 0 0 0.06 0 0.03 0 0 0 0 0.0002 0 0 0 0 0 0 0 0 0 0 0 0 0 
0 0 0 0 0 0 0 0 0 0 0 0 0 0 0 0 0 0 0 0 0 0 0 0 0 0 0 0 0 0 0 0 0 0 
##$DATE= 1732082500
##$DBL= (0..7)
120 120 120 120 120 120 120 120 
##$DBP= (0..7)
150 150 150 150 150 150 150 150 
##$DBP07= 0
##$DBPNAM0= <>
##$DBPNAM1= <>
##$DBPNAM2= <>
##$DBPNAM3= <>
##$DBPNAM4= <>
##$DBPNAM5= <>
##$DBPNAM6= <>
##$DBPNAM7= <>
##$DBPOAL= (0..7)
0.5 0.5 0.5 0.5 0.5 0.5 0.5 0.5 
##$DBPOFFS= (0..7)
0 0 0 0 0 0 0 0 
##$DE= 6
##$DECBNUC= <off>
##$DECIM= 32
##$DECNUC= <off>
##$DECSTAT= 4
##$DIGMOD= 1
##$DIGTYP= 9
##$DL= (0..7)
0 120 120 120 120 120 120 120 
##$DP= (0..7)
$$ [...]
##$SW= 21.9926040160658
##$SWIBOX= (0..15)
0 0 2 0 0 0 0 0 0 0 0 0 0 0 0 0 
##$SW_h= 4401.40845070422
##$TD= 16384
##$TD0= 1
##$TE= 300
##$TE2= 300
##$TE3= 300
##$TEG= 300
##$TL= (0..7)
0 120 120 120 120 120 120 120 
##$TP= (0..7)
150 150 150 150 150 150 150 150 
##$TP07= 0
##$TPNAME0= <>
##$TPNAME1= <>
##$TPNAME2= <>
##$TPNAME3= <>
##$TPNAME4= <>
##$TPNAME5= <>
##$TPNAME6= <>
##$TPNAME7= <>
##$TPOAL= (0..7)
0.5 0.5 0.5 0.5 0.5 0.5 0.5 0.5 
##$TPOFFS= (0..7)
0 0 0 0 0 0 0 0 
##$TUNHIN= 0
##$TUNHOUT= 0
##$TUNXOUT= 0
##$USERA1= <user>
##$USERA2= <user>
##$USERA3= <user>
##$USERA4= <user>
##$USERA5= <user>
##$V9= 5
##$VALIST= <valist>
##$VCLIST= <CCCCCCCCCCCCCCC>
##$VD= 0
##$VDLIST= <DDDDDDDDDDDDDDD>
##$VPLIST= <PPPPPPPPPPPPPPP>
##$VTLIST= <TTTTTTTTTTTTTTT>
##$WBST= 1024
##$WBSW= 25
##$XGAIN= (0..3)
0 0 0 0 
##$XL= 0
##$YL= 0
##$YMAX_a= 517824
##$YMIN_a= -510268
##$ZGOPTNS= <>
##$ZL1= 120
##$ZL2= 120
##$ZL3= 120
##$ZL4= 120
##$ABSF1= 10
##$ABSF2= 0
##$ABSG= 5
##$ABSL= 3
##$ALPHA= 0
##$AQORDER= 0
##$ASSFAC= 0
##$ASSFACI= 0
##$ASSFACX= 0
##$ASSWID= 0
##$AUNMP= <proc_1d>
##$AXLEFT= 0
##$AXRIGHT= 0
##$AXTYPE= 0
##$AXUNIT= <>
##$AZFE= 0.1
##$AZFW= 0.1
##$BCFW= 1
##$BC_mod= 2
##$BYTORDP= 1
##$COROFFS= 0
##$CY= 7568.61572265625
##$DATMOD= 1
##$DC= 2
##$DFILT= <>
##$DTYPP= 0
##$F1P= 17.9538593292236
##$F2P= -4.03888763876832
##$FCOR= 0.5
##$FTSIZE= 32768
##$FT_mod= 4
##$GAMMA= 1
##$GB= 1
##$INTBC= 1
##$INTSCL= 1
##$ISEN= 128
##$LB= 0.03
##$LEV0= 0
##$LPBIN= 0
##$MAXI= 945.577
##$MC2= 0
##$MEAN= 0
##$ME_mod= 0
##$MI= -402.1523
##$NCOEF= 0
##$NC_proc= 0
##$NLEV= 6
##$NOISF1= 8.587773
##$NOISF2= 6.764455
##$NSP= 1
##$NTH_PI= 0
##$NZP= 0
##$OFFSET= 17.49637
##$PC= 1
##$PHC0= 214.2505
##$PHC1= -3.930134
##$PH_mod= 0
##$PKNL= yes
##$PPARMOD= 0
##$PPDIAG= 0
##$PPIPTYP= 0
##$PPMPNUM= 100
##$PPRESOL= 1
##$PSCAL= 0
##$PSIGN= 0
##$REVERSE= no
##$SF= 200.13
##$SI= 32768
##$SIGF1= 18.5376
##$SIGF2= -6.396296
##$SINO= 400
##$SIOLD= 32768
##$SREGLST= <1H.CDCl3>
##$SSB= 3
##$STSI= 0
##$STSR= 0
##$SW_p= 4401.40845070422
##$SYMM= 0
##$S_DEV= 0
##$TDeff= 0
##$TDoff= 0
##$TI= <>
##$TILT= no
##$TM1= 0
##$TM2= 0
##$TOPLEV= 0
##$USERP1= <user>
##$USERP2= <user>
##$USERP3= <user>
##$USERP4= <user>
##$USERP5= <user>
##$WDW= 1
##$XDIM= 8192
##$YMAX_p= 0
##$YMIN_p= 0
$$ End of Bruker specific parameters
$$ ---------------------------------
##NTUPLES= NMR FID
##VAR_NAME=  TIME,          FID/REAL,        FID/IMAG
##SYMBOL=    X,             R,               I
##VAR_TYPE=  INDEPENDENT,   DEPENDENT,       DEPENDENT
##VAR_FORM=  AFFN,          ASDF,            ASDF
##VAR_DIM=   8192,          8192,            8192
##UNITS=     SECONDS,       ARBITRARY UNITS, ARBITRARY UNITS
##FACTOR=    0.0002272,     1,               1
##FIRST=     0,             0,               0
##LAST=      1.8609952,     80,              -114
##MIN=       0,             -510268,         -510268
##MAX=       1.8609952,     517824,          517824
$$ Real data points
##PAGE= N=1
##DATA TABLE= (X++(R..R)), XYDATA
0@%%%%%%%%%qJ6j6J6j7K5l2M0m8N6p2Q8j04J21j40J64j94K26k59L00l48L96m45
32b35N05n78O55p36Q26r25J033j154J288j431J585j756J943k148K373k617K884
49A512l177L499l855M251m692N182n734O363p080P912q894J0066j1496J3292j5618
64h469J8769k3306L0434m3345P4076k79532k78895N63247L50534j47882m57871
75b02240p2550L30273K74986k16269l81467l4626L94208K61565k28479m46570
85c21169m9511M26306L87841j36062m53077k11727K41057K95367m5109k74518
95a40602n8207K69912K33203j50409l54233r9033K89052K92758q1710l44567j60746
106c04582K06246K85419J3005k10128j04232J30328J24683j16177k30461j7644
$$ plain form
0 0 0 0 0 0 0 0 0 0 0 -8 8 -8 8 -9 16 -16 24 -24 32 -40 48 -56 65 -75 89 -105 121 -138 162 -186 210 -235
32 -235 270 -308 347 -389 437 -488 545 -609 679 -752 833 -923 1020 -1128 1245 -1372 1512
49 1512 -1665 1834 -2021 2230 -2462 2720 -3014 3349 -3731 4181 -4713 5353 -6143 7149 -8469
64 -8469 10300 -13006 17428 -25917 48159 -231373 -510268 52979 403513 255631 -202240
75 -202240 -274790 55483 330469 114200 -267267 -301893 92315 353880 125401 -321169
85 -321169 -370680 55626 443467 307405 -145672 -357399 -116342 179025 133916 -140602
95 -140602 -198809 71103 304306 153897 -200336 -299369 -10317 282441 200731 -143836 -304582
106 -304582 -98336 187083 200088 -10040 -114272 16056 140739 24562 -205899 -223543
116b23543K58561K26503q3980k72725j10525J66030J91148l7713j86326o1472
126a34042J32010J04931r3873j50658M8248K31745J17282j78945k76753m2805
136b42860K23210J88635o8987j84277j5957J69294Q9286j45871j88038M7657K41864
147A13956J06002j99882k62640K2630K95182K02198j31030k70909n6561J95455
157A4401J36311j32271k08164L9347K73210J50512j91409l00459j8526K91495
167E4447K21064j37711l13348q3441K37182K28505p3678k42233m9994K19895J71101
178B31789j49111l01862n6719K81822K71229p8072l12938j37068K01628K53319
188B04017l2650k57079j23261J68475K09801n1092k42205q4986K15328K44694
$$ plain form
116 -223543 35018 261521 177541 -95184 -205709 -39679 151469 113756 -72570 -134042
126 -134042 -2032 102899 9026 -141632 -93384 138361 255643 76698 -200055 -242860
136 -242860 -19650 168985 99998 -84279 -100236 69058 158344 12473 -175565 -127908 113956
147 113956 219958 20076 -242564 -219934 75248 277446 146416 -124493 -181054 14401
157 14401 150712 18441 -189723 -150376 122834 273346 81937 -218522 -237048 54447
167 54447 275511 137800 -175548 -258989 -21807 206698 133020 -109213 -159207 60688 231789
178 231789 82678 -219184 -275903 5919 277148 199076 -113862 -250930 -49302 204017
188 204017 171367 -85712 -208973 -40498 169303 118211 -123994 -208980 6348 251042
198B51042n3662k95942j68870J56189K59689K9708k06449j38436J15696J92805
208A41770q225j97920j08265J36199J93640k1477k18632j27060J35879K25721
218A51630L3203j80284j44859O4015J50102R640j38657p4074J13239J53349k0042
229A17262j73588r6167J09571J66659N98j62551j07681Q0410J44631J2307j16424
240b4973n8844R3376J08956m9558j63614o2464J30418J58757j6166j60236q4648
251a28996R9791J38296j6669j43965o5871J03400J20334m2641j53939m5465J45378
262I653J55183m2678j91624r5411J15021J60120j0318j54207p3244J15323J43622
273A31440l2788j70098p3542J28762J57859l2824j88318r5662J26382J84590N591
$$ plain form
198 251042 197380 -98562 -267432 -111243 148446 178154 -28295 -166731 -51035 141770
208 141770 133545 -64375 -172640 -36441 157199 135722 -82910 -209970 -74091 151630
218 151630 184833 4549 -140310 -76295 73807 83447 -55210 -129284 -16045 137304 117262
229 117262 -56326 -152493 -42922 123737 124335 -38216 -145897 -65487 79144 91451 -24973
240 -24973 -83817 9559 118515 68957 -94657 -157121 -26703 132054 115888 -44348 -128996
251 -128996 -29205 109091 92422 -51543 -117414 -14014 106320 63679 -90260 -135725 9653
262 9653 164836 122158 -69466 -164877 -49856 110264 99946 -54261 -127505 -12182 131440
273 131440 98652 -71446 -144988 -16226 141633 108809 -79509 -175171 -48789 135801 141392
284A41392j68073j08814R0049J50262q000j59593q7955J14201J69433k873j72601
295d2572j10785R8912J73810J4670j63083j22463P6512J63784K8278j35414j00705
306a19056P9813J50246O958j57031j15356Q0894J69697L4531j39385j18989O1577
317f6101J53263L3917j28823j12443N5880J40337K5288j26021j00032P1042J52637
328I8944L0256j33331j19703M8231J40859L7543j12003r9657N4188J33446K7595
339A06368j16298r8527N5503J31170K2396j21072j00944N6966J39091L6384j08459
350B578r9240M5006J19981K1667j10833r0471N7396J29861K6392j11611r4751
361a04025N2927J27362K5610j12820r8827M7164J25346L1040j02282q8618N2522
$$ plain form
284 141392 -26681 -135495 -45446 104816 96816 -62777 -150732 -36531 132902 130029 -42572
295 -42572 -153357 -54445 119365 134035 -29048 -151511 -74999 88785 117063 -18351 -119056
306 -119056 -39243 111003 117961 -39070 -154426 -73532 96165 130696 -8689 -127678 -66101
317 -66101 87162 121079 -7744 -120187 -64307 76030 101318 -24703 -124735 -53693 98944
328 98944 129200 -4131 -123834 -75603 65256 102799 -9204 -108861 -54673 78773 106368
339 106368 -9930 -108457 -52954 78216 100612 -20460 -121404 -64438 74653 111037 2578
350 2578 -96662 -51656 68325 89992 -20841 -111312 -53916 75945 102337 -9274 -104025
361 -104025 -51098 76264 101874 -10946 -109773 -62609 62737 93777 -8505 -97123 -44601
372d4601J23293K2169j14315r8805M9326J29220L3138j05882r6487M7849J27584
383G2489L2471j07205j00697M1749J23451L2305j04629r6205M8091J30412L6816
394A09048j06061j04655L6978J23671L7533j00847r9184M0755J26479M0575r8716
405E576j01002L4772J20272L7364r9165j00559L5919J23867M4364r2179r9334
416i0105L0213J16125L9645r3623r9609K9895J17627M5020q6402r5792K8299J13517
428E4810M1254q9531r9224K5253J13310M5863q2590r4675K5719J11854M4028q5137
440A0934r8459K1532J09405M5203q1045r4091K5079J12247M6347q3191r9302J8820
452f6521J08352M7067p9300r5562K1333J10611M9039p8810r7608J7223J06742
$$ plain form
372 -44601 78692 100861 -13454 -112259 -62933 66287 99425 -6457 -102944 -55095 72489
383 72489 104960 -2245 -102942 -61193 62258 94563 -10066 -106271 -58180 72232 109048
394 109048 2987 -101668 -64690 58981 96514 -4333 -103517 -62762 63717 104292 5576
405 5576 -95426 -60654 59618 96982 -2183 -102742 -66823 57044 101408 9229 -90105
416 -90105 -59892 56233 95878 2255 -97354 -67459 50168 95188 8786 -87006 -58707 54810
428 54810 96064 6533 -92691 -67438 45872 91735 9145 -85530 -59811 52043 96071 10934
440 10934 -87525 -65993 43412 88615 7570 -86521 -61442 50805 97152 13961 -85341 -66521
452 -66521 41831 88898 9598 -85964 -64631 45980 95019 16209 -81399 -64176 42566
463D2566M7522p8839r7796J7779J10123N3191p4126r7753J2544J03509M9800p3884
475A4636r6721J3212J05243N3617o9830r5374J0818J01698N2219o9845r7152P221
487g0258J00066N5240o3404r1994P716R7144N2414o5437r4616M790R6181N4842
499H2684o0940r1284N104R5171N4879o0695r3046J391R1892N4258n8316q9547
511f8449L954R3555N5520n8315r1993K32R0535N4689n7284r0383J464R2210N7349
524H3084n5344r0958j441Q8899N5193n5703r0474p30R0526N8245n3103r0350k923
537f5079Q8116N7330n2820r1245n497Q6919O0093m7592q7726n827Q3899N7239
549G7810m9099q8995p658Q3748O0445m4886q7536r757Q0973O0615m1999q6211
$$ plain form
463 42566 90088 11249 -86547 -68768 41355 94546 20420 -77333 -64789 38720 88520 14636
475 14636 -82085 -68873 36370 89987 20157 -75217 -64399 37299 89518 19673 -77479 -70258
487 -70258 29808 85048 21644 -70350 -62634 34510 86924 21487 -73129 -68339 27842 82684
499 82684 21744 -69540 -64436 30735 85614 24919 -68127 -66736 25156 79414 21098 -68449
511 -68449 -64495 29060 84580 26265 -65728 -65496 25039 79728 22444 -67939 -66475 25735 83084
524 83084 27740 -63218 -64659 24240 79433 23730 -66744 -67474 23052 81297 28194 -62156 -65079
537 -65079 23037 80367 27547 -63698 -69195 17724 77817 30225 -57501 -63328 20571 77810
549 77810 28711 -60284 -67942 15806 76251 31365 -56171 -65928 15045 75660 33661 -52550
561e2550j2697P6252N8443m0258q2474r392P8231N9370m0882q5882j4803P4890
573H248O1095l5525q1472j4669P1325N8034l5004p8454j2397P1086N5468l8538
585B9197q1273j2781P3806O0796l3309p9883j6947O6971N5843l3200p5178j1433
597e7391O9211N4006l6948p8032j1466P2427N8218l5320q1012j7574O7235N8293
609F1647k9406p3412j3154O6078N2442l6798p7793j1739P2503N9643l4192q2196
621d6377j9479O8512O2691k6948p6883k0119O2776N6240l0636p6394j4916P1256
633I723O2782l1739q5828k6260O7150O9467k0303p9306k9038N8962O2977k1031
645C7556p5047k3114O3468O4024k5258q4003l0985O4220P4620j2219p9074l8619
$$ plain form
561 -52550 -65247 11005 69448 29190 -53284 -62676 15555 74925 34043 -51839 -66642 8248
573 8248 69343 33818 -47654 -62323 9002 67036 32032 -46422 -58819 12267 67735 29197
585 29197 -52076 -64857 8949 69745 36436 -43447 -60394 6577 62420 29220 -45958 -57391
597 -57391 11820 65826 28878 -49154 -60620 11807 70025 34705 -46307 -63881 3354 61647
609 61647 32241 -41171 -54325 11753 64195 27397 -50396 -62135 10368 70011 35819 -46377
621 -46377 -65856 2656 65347 38399 -38484 -58603 4173 60413 29777 -46617 -61533 9723
633 9723 72505 40766 -45062 -71322 -4172 65295 44992 -34314 -63352 -4390 58587 37556
645 37556 -37491 -60605 2863 66887 41629 -42374 -73359 -9139 65481 53262 -25812 -64431
657f4431N0215O5883r999o9561k9784N3042O2495j6274p5428l2817N5581P1106
669F0028o946p4090m2687M1348O4635O79n8332l1858L9432N3426j0625o3011k8815
682e6816M7271O1818n673o5186l8432L6179N8728L155n0704l0345L0668M3744
694C4407r196n1092j9544M4320N1218j1871o1528l0986L8503N4498j123m9801
706a2195k6684L1595M0811j1385m8237j3805M5942M4991k0481o3623k3918M7999
718h990N7137p342n7781k8114L6763M5434j2435n2487j5065M9076M7713k3169
730C0740o8525k3535N5332O3659j0061o8543l6146M0397N7166m967n6580k4755
742d5818M5191N2762j7045o9928k9964N3798P0334m277p2944m6816L7103O7517
$$ plain form
657 -64431 -14216 51667 41668 -27893 -57677 -4635 57860 41586 -33842 -66659 -11078 60028
669 60028 53082 -21008 -63695 -22347 42288 42967 -15365 -47223 -7791 45635 35010 -28001 -56816
682 -56816 -9545 52273 46600 -18586 -57018 -20839 37889 41044 -9660 -40005 -9337 34407
694 34407 25211 -25881 -45425 -1105 50113 38242 -23286 -54272 -15769 38729 37606 -12195
706 -12195 -38879 -7284 33527 22142 -26095 -39900 6042 51033 30552 -33071 -56989 -8990
718 -8990 48147 40805 -16976 -45090 -8327 37107 24672 -27815 -42880 6196 53909 30740
730 30740 -37785 -61320 -5988 57671 47610 -20933 -57079 -16682 40484 35517 -21063 -45818
742 -45818 -627 52135 35090 -34838 -64802 -11004 59330 55053 -17891 -64707 -27604 39913
754C9913Q282n6412l9129L2301N5734k782o1433l5809M3317O9551M453o8490n4085
767f4589K7887P0097K0905m9811m8304J7309N3247J1152m7283l7642K8717N9587
779D1272R209n7335n1237K0578O4868K6443m1013m9508N653M5265J7801l2713
791g17l2421J7902M5302P950m4953m0138J8562N4243K0919l6049m3228L318L7724
804H414J6846k3505k3683J4468L2148p0l8310k6448K3785M6086R641l8193l5559
817c4380J0701L7078J1492k5215k0142J6520K8035o250l8205j8190L2002M4860
829C8306m99m6701l3709K0509M4352R028l3917k5168J9894L4220m835m1830k0269
842d0619L5212M8835k953n4845l8001K6968N5771J2854m2339l6952J7527M3314
$$ plain form
754 39913 48195 -8217 -47346 -15045 40689 37907 -23526 -59335 -16018 53533 57986 -10504 -64589
767 -64589 -36702 33395 54300 4489 -43815 -26506 26741 37893 -9390 -47032 -18315 41272
779 41272 50481 -6854 -58091 -37513 27355 53798 12785 -36723 -31070 14195 31996 -717
791 -717 -33138 -15236 30066 38016 -6937 -47075 -28513 25730 46649 10600 -32628 -29310 8414
804 8414 25260 1755 -21928 -7460 24688 24618 -13692 -40140 -16355 29731 39372 1179 -34380
817 -34380 -23679 13399 24891 -324 -20466 -3946 24089 17839 -20366 -38556 -6554 38306
829 38306 37807 -8894 -42603 -22094 22258 31286 -2631 -27799 -7905 26315 21480 -20350 -40619
842 -40619 -5407 43428 40475 -14370 -52371 -25403 30368 43222 883 -36069 -18542 24772
854B4772M666m2478k8715L0089N2372L000n5299m3999K4843O2372K0593m4583
866G633m8571R431M8804J8565l5486l6260J7268M9092J1624m6659m5747J6579
878c3727N9768K7215l8618n3061n74M7095K9303k4425l9041K729L9225J7780l2158
891A511l9874Q523M9331K7052l0351m8694o013M0298L1722j5190l5467n280K8810
904F378J8017k0734l0241N342L7315K0035k5663l9491l173L5224K7020j3183l0568
917a3722n542K2633J4032j6214k1792P606L0102J1145k6082l1002M545L4157J9687
930B9553j8079k8710j127K3626J1496j7244j8672J0721K8152N274k9288k7541
942c1839J1340L7093J5520k4834l1059K879K9495J3429k0341k2741R843L0166
$$ plain form
854 24772 29438 -13040 -41755 -11666 40706 43706 -11593 -55592 -30749 31623 52216 7633
866 7633 -40938 -31507 17297 35862 376 -35884 -18616 30476 42100 -4559 -50306 -33727
878 -33727 26041 53256 14638 -38423 -38997 8098 37401 12976 -26065 -23336 15889 33669 1511
891 1511 -38363 -29840 19491 46543 16192 -32502 -38515 1783 33505 18315 -17152 -22432 6378
904 6378 24395 3661 -26580 -21238 16077 36112 10449 -29042 -32215 3009 30029 16846 -13722
917 -13722 -19264 3369 17401 1187 -20605 -12999 17103 28248 2166 -28836 -24291 9866 29553
930 29553 11474 -17236 -18363 5263 16759 -485 -19157 -8436 19716 24990 -4298 -31839
942 -31839 -20499 16594 32114 7280 -23779 -20900 8595 22024 1683 -21058 -11215 18951
954A8951O519l0392k8521J3200M0552J6178k9141l6423K667L5411J9321k1197
966G125k9521M700L2223J3005k7329l1629Q834M0677J9536k8261m0095n79L8103
979F789K5945j8488l4761k898L0960J9524k0595l2439K143L6440K2380k2981l9386
992b7367m528L5662K8878j4158l5840r261K6948K3513j2587k9553l458K8913K1635
1005B8797j6737l4278o453L0158K7342j0232l2449j1310K2356K3222p332k5367
1017a2283o264K1933J8598j2336k7664n103K5465K2822r565k8599r815K0111K1006
1030A8306o245k2602n905J9026J6093j0847k3669l118K3281J8883j1328k6638
1042a4763o765K1151J9722p660k2664n253J8958J5307j1177k2723j883K3162J7282
$$ plain form
954 18951 25470 -4922 -33443 -20243 20309 36487 7346 -29077 -26410 9001 28322 7125
966 7125 -22396 -17696 14527 27532 203 -31426 -22592 18085 37621 9360 -30735 -31314 6789
979 6789 32734 14246 -20515 -23413 7547 27071 6476 -25963 -23820 12620 35000 12019 -27367
992 -27367 -31895 3767 32645 18487 -17353 -26614 334 23847 11260 -18293 -21751 7162 28797
1005 28797 12060 -22218 -28671 1487 28829 18597 -13852 -25162 -2806 20416 13084 -12283
1017 -12283 -18547 3386 21984 9648 -18016 -23119 2346 25168 15603 -12996 -22811 -2700 18306
1030 18306 12061 -10541 -16446 2580 18673 7826 -15843 -18961 4320 23203 11875 -14763
1042 -14763 -21528 -377 19345 11685 -10979 -16232 2726 18033 6856 -15867 -17750 5412 22694
1055B2694j2638k6367m947K2887J9786r439k4649n713K0127J7059j0345k3280
1067a4825k950K2730J7610j2322k6605n376K3122K0663r030k5773p417K0279J9251
1080A9357q339k3890n842K0743J8762r662k5701o831K1701K1295p411k5712r252
1093b0782J8899K0568n817k3616q301J8523J9617o658k4117q445J8985K0771n633
1106A3994k4394j0176J7433K0777l929k2473r686J6314J9319m578k2362r176J6733
1119b204J9884m175k2431j0034J5852J9850l202k1489j0095J4882J8927l223k0722
1132h180r450J4959J8811l228k0880r904J4432J8744k535k0151r913J3921J8528
1145A5154k319j9807r987J3445J8248k132j9467j0032J3227J8237j810j9268j0186
$$ plain form
1055 22694 10056 -16311 -21258 1629 21415 11976 -12673 -18386 1741 18800 8455 -14825
1067 -14825 -17775 4955 22565 10243 -16362 -21738 1384 22047 13017 -12756 -20173 106 19357
1080 19357 11018 -12872 -18714 2029 20791 11129 -14572 -21403 298 21593 14182 -11530 -20782
1093 -20782 -1883 18685 12868 -10748 -19049 -526 19091 12433 -11684 -20129 -1144 19627 13994
1106 13994 -10400 -20576 -3143 17634 13705 -8768 -18454 -2140 17179 12601 -9761 -18937 -2204
1119 -2204 17680 13505 -8926 -18960 -3108 16742 13540 -7949 -18044 -3162 15765 12542 -8180
1132 -8180 -17630 -2671 16140 12912 -7968 -17872 -3440 15304 12769 -7382 -17295 -3374 15154
1145 15154 12835 -6972 -16959 -3514 14734 12602 -6865 -16897 -3670 14567 12757 -6511 -16697
1158a6697J2871J8132j558j9152j0551J2458J8392p65j8577j0728J1693J7800
1170A3318p54j8221j0549J1733J7973m62j8315j1032J1277J8127K97j7670j1473
1183a5751J0171J7420O04j6706j0697J0249J6966K21j7041j1100J0050J7436J173
1196A2995j6326j1389Q847J6493J526j5115j0571Q553J5645P51j5278j0311Q985
1209e195J6256J456j5178j1175P699J5539K056j3826j0215P540J4591J187j4030
1222c295r805Q272J5231J284j4570j0724P519J5379K386j3358j0387O864J4200
1235H996J464j3472r675P837J4923J468j4314j0790P447J5538K617j3545j1008
1248a2514O287J4497K478j2819j0086O984J4677K006j3751j1054O662J5485L458
$$ plain form
1158 -16697 -3826 14306 12748 -6404 -16955 -4497 13895 13130 -5447 -16175 -4482 13318
1170 13318 12564 -5657 -16206 -4473 13500 13038 -5277 -16309 -5032 13095 13392 -4278 -15751
1183 -15751 -5580 11840 12444 -4262 -14959 -4710 12256 12477 -4564 -15664 -5614 11822 12995
1196 12995 -3331 -14720 -5873 10620 12146 -2969 -13540 -4987 10658 11409 -3869 -14180 -5195
1209 -5195 11061 12517 -2661 -13836 -6137 9402 11458 -2368 -12583 -5043 9548 10735 -3295
1222 -3295 -13100 -4828 10403 11687 -2883 -13607 -6088 9291 11677 -1681 -12068 -5204 8996
1235 8996 10460 -3012 -12687 -4850 10073 11541 -2773 -13563 -6116 9422 12039 -1506 -12514
1248 -12514 -6227 8270 10748 -2071 -12157 -5173 9504 11510 -2241 -13295 -6633 8852 12310
1261A2310j2952j1613N323J4430L705j1825j0695N273J3903L101j2282j0966N437
1274f851J4674M253j1736j1803L836J3717M825j0303j0804L664J2767M115j0321
1287C3j0556L865J3152M557j0301j1216K880J2718N235q892j0455K420J1502M390
1301I332q909r762L052J1803M352r098j0233K583J1765M963q339r946J975J0759
1315D297M448p934r075K561J0786M031q462r504K430J0983M601p866r441J860
1329f285J0336M455p426q790K069J0004M019p677q902K193J0432M483p454r181
1343g724J538R925M568o890q754J489R602M404o891q692J501R656M577o786q926
1358g403J072R560M914o206q722Q23R072M772o062q560P66Q983M796n913q485
$$ plain form
1261 12310 -642 -12255 -6932 7498 11203 -622 -11317 -6044 7859 10960 -1322 -12288 -6851
1274 -6851 7823 12076 340 -11463 -7627 6090 10915 612 -10192 -6528 6239 10354 33
1287 33 -10523 -6658 6494 11051 750 -10466 -7586 5132 10367 1475 -8980 -6560 4942 9332
1301 9332 423 -9339 -6287 5516 9868 770 -9463 -6880 4885 9848 1509 -8437 -6462 4297
1315 4297 8745 811 -8264 -5703 5083 9114 652 -8852 -6422 4561 9162 1296 -8145 -6285
1329 -6285 4051 8506 1080 -7710 -5641 4363 8382 705 -8197 -6004 4428 8911 1457 -7724
1343 -7724 -6186 3739 8307 1417 -7337 -5848 3754 8158 1267 -7425 -5924 3732 8309 1523 -7403
1358 -7403 -6331 3229 8143 1937 -6785 -5962 3110 7882 1820 -6740 -5974 3009 7805 1892 -6593
1373f593O43Q805M943n687q515L09Q557N016n339q160J69Q172M877n091p929J41
1389e682P961M740n015p773J34P871M840m669p776k41P408M729m344p225j47P087
1405A898M421m391p171L6P204M508m378p290l63O978M798l826o914m70O492M287
1421E819l910o704q3O780M392m079p149n06O756M947l491p003r86O139M589l289
1437B222o518m78O320M429l705p052q39O581N257l028p017j638N756N018k464
1452B844o285j249N518M526k883o581j275N965N268k347o784k275M973N255j420
1467C250n695j962M355M409j832n621j528M874M774j672o033k434M157N049n73
1482C518m984k374L225L916j077m514j444L904M008j493n156k066L705M537n00
$$ plain form
1373 -6593 -5950 2855 7798 2111 -6404 -6095 2462 7478 2139 -6021 -5852 2320 7197 2106 -5823 -5682
1389 -5682 2279 7019 2004 -5769 -5635 2236 7076 2407 -5369 -5610 1798 6527 2183 -5042 -5189 1898
1405 1898 6319 1928 -5243 -5207 1997 6505 2127 -5163 -5526 1452 6250 2424 -4490 -4960 1532 5819
1421 5819 1909 -4795 -4878 1902 6294 2215 -4934 -5440 1316 6263 2772 -4231 -5217 922 5511 2222
1437 2222 -4296 -4774 1546 5975 2270 -4782 -5621 960 6217 3189 -3828 -5466 290 5308 2844
1452 2844 -3441 -4690 828 5354 2471 -4110 -5385 580 5848 3501 -3283 -5558 -585 4670 3250
1467 3250 -2445 -4407 -52 4357 2525 -3096 -4624 250 5024 3352 -2681 -5115 -958 4091 3518
1482 3518 -1466 -3840 -615 3301 2224 -2290 -3734 170 4178 2685 -2471 -4537 -832 3705 3205
1497C205m475k284K702L495o80l724j129L363L184j620m589j494L721M096p68
1512C003m415k109K684L419o70l451j094L045K843j654m332j114L856L982j062
1527B931m587k202K826L748l56l561j498K747K972j246m118j295L589L969q53
1542C066m709k532K697M172L26l633k261K014L211l66l583j783K896L938l03m367
1558a217k900K197M389J074l308l057J107L240P11k753k115J776L386K99l545
1573g16k917J485M093J493k683l239K73K905J451j741k174P25K534O80k449k415
1589b695R37L283J496k059k985k42K388J711j016j868P7J694O56j567j749O82
1605a257K438J139j665k416k22K026J573o51j570k42J212N89j140j208O76J934
$$ plain form
1497 3205 -1270 -3554 -852 2643 1963 -1761 -2890 473 3657 2037 -2552 -4046 -325 3771 3003
1512 3003 -1412 -3521 -837 2582 1912 -1539 -2633 412 3255 1601 -2731 -3845 11 3993 2931
1527 2931 -1656 -3858 -1032 2716 2360 -1201 -2699 48 3020 1774 -2344 -3639 -50 3919 3066
1542 3066 -1643 -4175 -1478 2694 3020 -613 -2874 -860 2351 1985 -1598 -3381 -485 3453 3150 -1217
1558 -1217 -4117 -1920 2469 3543 235 -2822 -1715 1525 2236 -517 -2632 -856 2530 2829 -716
1573 -716 -3633 -2148 1945 3438 755 -2484 -2211 694 2145 404 -1770 -1045 1489 2169 -280 -2695
1589 -2695 -1758 1525 3021 962 -2023 -2265 123 1834 818 -1050 -973 721 1377 -190 -1939 -1257
1605 -1257 1181 2320 655 -1761 -1983 43 1616 965 -605 -847 365 954 -186 -1394 -718 1216
1621A216P25j633k065K1J991J435p93j632l44J213P24r17j120N31J734O45j551
1638A80k010J18K118J558q48j952n59J321J178o06j403j3J569R60j210k018k09
1655a826K004J840o01k229j063J286J709l0j532o96J130J341m86j844p62J518
1671b41K006o8k083j552Q01K077O39j344j381L78J476L39j346j173P80J876N03
1688A687j657j750K94J948J185r95j672j99J347R33p75j272J19J449Q05j090j696
1705a339p4J611J356o17j681n59J080J147l56j232k45J148R13p46j448k37J448
1722A69J267m61j617o57J040J241k27j223m27J034R52n95j430l39J361J328m32
1739I84j765o99J176J431j99j450o10J087J239m90j622m74J432J586m38j955r74
$$ plain form
1621 1216 1941 308 -1757 -1736 255 1690 897 -735 -1079 134 858 -59 -1179 -648 1086 1731 180
1638 180 -1830 -1712 406 1964 1116 -836 -1395 -74 1104 498 -905 -918 651 1611 401 -1617 -1826
1655 -1826 178 2018 1417 -812 -1875 -589 1120 1090 -442 -1138 -8 1333 847 -997 -1759 -241
1671 -241 1765 1697 -386 -1938 -1137 940 1579 235 -1146 -768 708 1047 -299 -1472 -692 1184 1687
1688 1687 30 -1720 -1426 522 1707 712 -960 -1159 188 1121 346 -926 -807 642 1447 357 -1339
1705 -1339 -1413 198 1554 937 -744 -1303 -223 924 568 -664 -909 239 1152 406 -1042 -1279 169
1722 169 1436 975 -642 -1299 -259 982 755 -468 -895 139 1091 496 -934 -1273 88 1416 984
1739 984 -781 -1480 -304 1127 928 -522 -1132 -45 1194 704 -918 -1392 40 1626 1188 -767 -1741
1756a741J352J770j01j817r91J176J671k09j922r03J454J948k03k247j330J315
1772g78K321J95k085j507J078K148K10k028j479J193K360K70k310j821J104K611
1788A482O42k134k042P64K419P58j986j852Q25K451O93k086k160P74K675J074
1804B297j925k353M08K494J187j720k187M18K432J030j868k251M31K643J233j770
1820D99k402J32K470J375j543k236J85K349J210j691k274L38K582J297j743k469
1836a921J70K527J420j575k363J40K434J289j743k361L10K676J389j892k587K18
1852a869K713J550j720k626J22K638J492j726k600K15K816J555j886k862J05K902
1868H19J797j760k912n1K815J841j738k891q5K945J891j820l038j69L063K094
$$ plain form
1756 -1741 -389 1381 1280 -537 -1528 -352 1319 1110 -812 -1715 -261 1687 1484 -763 -2093 -778
1772 -778 1543 1738 -347 -1854 -776 1372 1582 -446 -1925 -732 1628 1898 -412 -2233 -1129 1482
1788 1482 2124 -10 -2052 -1288 1131 1889 -97 -1949 -1124 1327 2020 -66 -2226 -1452 1223 2297
1804 2297 372 -1981 -1573 921 2108 388 -1799 -1381 1051 2081 213 -2038 -1607 1036 2269 499
1820 499 -1903 -1771 699 2074 531 -1705 -1520 829 2039 348 -1926 -1588 994 2291 548 -1921
1836 -1921 -1751 776 2196 621 -1742 -1602 832 2121 378 -1983 -1673 1003 2392 500 -2087 -1869
1852 -1869 844 2394 674 -1952 -1830 808 2300 574 -2026 -1811 1005 2560 674 -2188 -2083 819
1868 819 2616 856 -2056 -2107 708 2549 811 -2080 -2165 780 2671 851 -2187 -2356 707 2801
1884B801j692l179l16K922K190j604l147l49K976K232j648l284l91L000K350j576
1900A285l366n29L005K413j487l350n48L024K407j516l408n92L057K531j465l461
1916b000o90L053K584j482l469p43L080K635j434l536p89L046K694j363l591q43
1932b848L062K747j332l661r09L139K900j314l758j038L080K995j209l736j117
1947b999L007L100j221l841j162L101L183j156l937j361L047L377r99l891j474
1962c226K985L305r64l926j440L079L417r35m074j639L003L598p27m002j810K803
1978e53L522o65l888j723K882L526p10m052j880K884L738m60l992k072K659L640
1994B856l69l795j922K642L545n07l929j948K717L776l39l972k202K495L723k19
$$ plain form
1884 2801 1109 -2070 -2386 536 2726 1122 -2025 -2374 602 2834 1186 -2098 -2489 511 2861 1285
1900 1285 -2081 -2610 395 2808 1321 -2029 -2577 447 2854 1338 -2070 -2662 395 2926 1461 -2000
1916 -2000 -2690 363 2947 1465 -2004 -2747 333 2968 1534 -2002 -2791 255 2949 1586 -2005 -2848
1932 -2848 214 2961 1629 -2032 -2941 198 3098 1784 -1974 -3012 68 3063 1854 -1882 -2999
1947 -2999 8 3108 1887 -1954 -3116 -15 3168 2012 -1925 -3286 -239 3138 2139 -1752 -3226
1962 -3226 -241 3064 2100 -1826 -3266 -187 3230 2295 -1779 -3418 -415 3183 2456 -1546 -3356 -553
1978 -553 2969 2304 -1584 -3307 -425 3101 2391 -1661 -3541 -657 3081 2621 -1371 -3443 -784 2856
1994 2856 2487 -1308 -3230 -588 2957 2450 -1479 -3427 -710 3066 2727 -1245 -3447 -952 2771 2552
2010B552l747k001K491L506m10l840j991K724L754l20m022k257K582L850j52l838
2026a119k161K477L651l44l942k047K792L885l74m262k354K747M118j15m111k453
2042c612K561L990k07m111k281K819M138k78m436k616K804M463J17m356k855K468
2058a392M340K38m224k752K573M354J25m432k999K568M744N04m353l326K178M581
2074B727P51m058l203K111M506O19m164l297K161M781Q65m219l571J792M678J192
2090C671l841l479J647M439J019l877l427J839M607J114l949l622J589M602J356
2105C688l666l547J373M357J197l582l350J586M424J118l792l591J532M558J345
2120C650l608l595J346M344J294l530l416J473M335J202l654l567J496M538J446
$$ plain form
2010 2552 -1195 -3196 -705 2801 2391 -1449 -3440 -716 3038 2718 -1304 -3561 -979 2871 2719 -1119
2026 -1119 -3280 -803 2848 2504 -1438 -3485 -693 3192 2818 -1444 -3798 -1051 3067 2952 -1159 -3612
2042 -3612 -1051 2939 2732 -1379 -3660 -841 3297 3019 -1417 -4033 -1229 3234 3351 -1005 -3860 -1392
2058 -1392 2948 3186 -1038 -3790 -1217 3137 3262 -1170 -4169 -1601 3143 3647 -706 -4032 -1854 2727
2074 2727 3478 -580 -3783 -1672 2834 3453 -711 -4008 -1847 2934 3799 -420 -3991 -2199 2479 3671
2090 3671 -170 -3649 -2002 2437 3456 -421 -3848 -2009 2598 3712 -237 -3859 -2270 2332 3688
2105 3688 22 -3525 -2152 2205 3402 -180 -3530 -1944 2480 3598 -194 -3785 -2253 2305 3650
2120 3650 42 -3553 -2207 2137 3431 -99 -3515 -2042 2293 3495 -159 -3726 -2230 2308 3754
2135C754l625l739J242M465J512l485l614J237M422J479l588l733J283M602J598
2150C810l600l923J097M628J834l468l936R98M518J855l444l941R72M600J902
2165C902l432m073Q45M633K103l357m142O80M560K143l215m084O59M466K142l194
2181F36m101N96M547K236l121m190M54M495K371k981m189L00M388K333k909m081
2197c216L84M370K280k982m162L57M415K467k866m270J77M288K523k713m111K21
2213b838M246K327k866m168L39M435K525k858m439R9M395K701k647m282pM226
2229A188K543k752m239K18M493K635k939m573n1M578L015k560m561l20M232K904
2245C811k507m375o1M358K874k762m696k99M600L348k370m818q10M168L290k002
$$ plain form
2135 3754 129 -3610 -2368 2097 3609 124 -3490 -2253 2169 3648 60 -3673 -2390 2212 3810
2150 3810 210 -3713 -2616 2012 3846 378 -3558 -2560 1958 3813 369 -3572 -2600 2000 3902
2165 3902 470 -3603 -2758 1875 3978 621 -3521 -2841 1719 3862 647 -3437 -2778 1688 3830 636
2181 636 -3465 -2869 1678 3914 793 -3397 -2943 1552 3923 942 -3247 -2947 1441 3774 865 -3216
2197 -3216 -2832 1538 3818 836 -3326 -2969 1446 3913 1047 -3223 -3046 1242 3765 1052 -3059 -2838
2213 -2838 1408 3735 869 -3299 -2960 1475 4000 1142 -3297 -3198 1197 3898 1251 -3031 -3038 1188
2229 1188 3731 979 -3260 -3042 1451 4086 1147 -3426 -3477 1101 4116 1556 -3005 -3325 907 3811
2245 3811 1304 -3071 -3132 1226 4100 1338 -3358 -3657 943 4291 1921 -2897 -3707 461 3751 1749
2261A749m424o06M091L021k295m612o03M351L557k035m830j202L867L600j473
2276B156m282j077L518L103j810m266p91L970L387j761m600j352L609L614j158
2291B260m049j278L120K899j461l777o89L618L024j839m360j093L655L415j245
2306B200l996j244L038K822j428l591n00L547K662k085m266p09L916L395j543
2321B218m293j267L266L065j392l742n99L576K756k201m435o24M263L614j755
2336B450m829j565L617L698j209m197j111L539L219j920m641r52M312M065j662
2351B814n244k038L736M401o96m563k008L254L701j177m580j484L919M269j252
2366C052n292k518L545M869j27m558k758K574M022k65m078j992L134M061p09m821
$$ plain form
2261 1749 -2675 -3281 810 3831 1536 -3076 -3679 672 4229 2194 -2636 -3838 29 3629 2156
2276 2156 -2126 -3203 315 3418 1608 -2658 -3449 521 3908 2147 -2453 -3805 -196 3418 2260
2291 2260 -1789 -3067 53 2952 1491 -2286 -2975 643 3667 1828 -2532 -3625 30 3445 2200
2306 2200 -1796 -3040 -2 2820 1392 -2199 -2699 848 3510 1425 -2841 -3550 366 3761 2218
2321 2218 -2075 -3342 -76 2989 1597 -2145 -2744 832 3588 1387 -3048 -3672 591 4205 2450
2336 2450 -2379 -3944 -327 3371 2162 -2035 -3146 393 3612 1692 -2949 -3901 411 4476 2814
2351 2814 -2430 -4468 -732 3669 2973 -1590 -3598 -344 3357 2180 -2400 -3884 35 4304 3052
2366 3052 -2240 -4758 -1213 3656 3529 -1029 -3787 -1213 2809 2544 -1534 -3526 -392 3669 2960 -1861
2382a861k574L042M786L21m278l124J939L946M32l436k108K295L477l62m094k273
2398c872K698M287K77l925k980J680L693O69k922j984J772K913l74l471j735K639
2414f35L725j00l893k558J904L582M75k934j893J789K667n76l241j324K898L432
2430C318o73m144k270K501L872J98l402k150K006L017n07l379j417L010L523q68
2446B635m471k311K907M359K23l974k747K028L659M1l598j942K736L811n34m510
2462a688k630K854M802N13m244l406J764M214Q41l482k661J997L936J33m115k947
2478d119K350M805J011m112l866J303M400J633l027l178J053L694Q74l345k968
2493c492J731M326J191l607l797Q97M187J984k585l311M78L227J226k564k636
$$ plain form
2382 -1861 -4435 -1393 3393 3714 -564 -3688 -1749 2197 2629 -807 -2915 -620 2857 2495 -1599 -3872
2398 -3872 -1174 3113 3390 -535 -3515 -1835 1858 2527 -395 -2379 -607 2306 1932 -1539 -3274 -635
2414 -635 3090 2990 -903 -3461 -1557 2025 2500 -434 -2327 -538 2129 1553 -1688 -3012 -114 3318
2430 3318 2645 -1499 -3769 -1268 2604 2802 -600 -2750 -744 2273 1766 -1613 -3030 -20 3503 2635
2446 2635 -1836 -4147 -1240 3119 3342 -632 -3379 -1351 2308 2349 -1249 -3191 -455 3356 2822 -1688
2462 -1688 -4318 -1464 3338 3851 -393 -3799 -2035 2179 3020 -462 -3123 -1126 2810 2943 -1172 -4119
2478 -4119 -1769 3036 4047 -65 -3931 -2628 1772 3405 378 -2800 -1747 1947 2821 -524 -3492
2493 -3492 -1761 2565 3756 149 -3648 -2751 1436 3420 835 -2476 -1998 1229 2455 -109 -2745
2508b745J199L631J070l145l287Q54L799J827k332l126K85K882J262k125k293
2523b244J042L064P73k878k775J023L604J450k469k962L93K929J220k085k175
2538b090R75K880N74k819k497J326L554J176k741l009O39L205J305k262k441R31
2554a294K968P01k814k578J399L702J091k993l208P64L571J571k376k908O95L141
2570A432J128k652k769J120L662J349k961l374N84L763J898k352l229K67L161
2585A027J595k272k932O29L450J599k596l375L07L634K132k067l379j63L074J963
2601B626j854k915J39L073J757k122l226Q4L299K152j841l275l59K886K062j478
2617A008k846j71K736J776j765k916m3L008K029j676l109l89K742K076j345k781
$$ plain form
2508 -2745 -1546 2085 3155 10 -3277 -2423 1376 3203 871 -2255 -1970 912 2174 49 -2244
2523 -2244 -1202 1862 2635 -243 -3018 -1995 1609 3059 590 -2372 -1979 950 2170 85 -2090
2538 -2090 -1115 1765 2339 -480 -2977 -1651 1903 3079 338 -2671 -2032 1173 2478 216 -2225 -1294
2554 -1294 1674 2375 -439 -3017 -1618 2084 3175 182 -3026 -2262 1309 2880 504 -2404 -1709 1432
2570 1432 2560 -92 -2861 -1741 1921 3270 309 -3065 -2481 1282 3180 828 -2401 -2134 1027
2585 1027 2622 350 -2582 -1953 1497 3096 500 -2875 -2568 1066 3198 1131 -2248 -2411 663 2626
2601 2626 772 -2143 -2004 1069 2826 704 -2522 -2438 861 3013 1172 -2103 -2462 424 2486 1008
2617 1008 -1838 -2009 727 2503 738 -2178 -2221 787 2816 1140 -1969 -2358 384 2460 1115 -1666
2633a666l04K539J758j556k740j06K804J881j600k959l30K660K060j337k789l37
2649b022K485J804j417k673k04K653J854j493k841l43K643J996j317k758m59K438
2665C46J940j278k704l90K534J952j344k823m51K527K057j191k788n48K399K041
2681B279j148k689n37K410K028j147k790o01K426K065j046k737o67K305K070j028
2697A193k684o44K276K060r50k684o96K179K128r02k655p19K172K043q93k607
2713a383p19K185K084q29k661q08K058K127p43k526q20J995K073q00k530p89K064
2730b2K174p57k636r73K023K220n60k555r59J854K153o18k513r27J976K226o29
2747A477k612j144J920K352l95k507j222J713K220l64k391j112J786K237l95k559
$$ plain form
2633 -1666 -1970 569 2327 771 -1969 -2075 729 2610 1010 -1949 -2279 381 2441 1104 -1685 -2022
2649 -2022 463 2267 850 -1823 -2027 626 2480 987 -1854 -2197 446 2442 1125 -1633 -2092 346
2665 346 2286 1008 -1696 -2086 448 2400 1056 -1767 -2218 309 2366 1175 -1613 -2161 238 2279
2681 2279 1131 -1558 -2095 315 2343 1196 -1594 -2195 231 2296 1250 -1487 -2154 151 2221 1193
2697 1193 -1491 -2135 141 2201 1251 -1433 -2129 50 2178 1276 -1379 -2098 74 2117 1224 -1383
2713 -1383 -2102 83 2167 1338 -1323 -2131 -73 2054 1311 -1215 -2035 -40 2033 1233 -1297 -2086 -22
2730 -22 2152 1395 -1241 -2214 -191 2029 1469 -1086 -2045 -191 1962 1344 -1169 -2096 -120 2106 1477
2747 1477 -1135 -2279 -359 1993 1598 -909 -2131 -418 1802 1438 -953 -2065 -279 1958 1563 -996
2763i96j261J740K424j56k435j426J486K268r4k224j273J474K213j96k332j386
2779b174J540K365K5k242j564J220K244K00k052j325J200K006K2k060j326J300
2795f21K205J39k120j545J068K123L33j839j365R80J867J00j866j190J165K035
2811A469J00k005j422R90K093L47j749j364Q35J794K15j727j190J122J900P0j934
2828d56j401J038K069L60j798j441Q04J894K66j647j255J001J882J66j950j372
2844a840J000K131M35j802j610P29J974M67j580j422P90J871L45j756j511Q22
2860i57K119O33j769j730N05K026P61j434j597M66J842O19j469j630N80K024P78
2877A767j572j779K83J991R34j207j714J92J687Q20j217j530L17J769Q39j300
$$ plain form
2763 -996 -2257 -517 1907 1751 -684 -2110 -624 1644 1550 -674 -1947 -473 1740 1544 -788 -2174
2779 -2174 -634 1731 1756 -486 -2050 -830 1414 1614 -438 -1763 -563 1443 1465 -595 -1921 -621
2795 -621 1584 1723 -397 -1942 -874 1249 1582 -257 -1622 -642 1225 1325 -541 -1731 -566 1469
2811 1469 1569 -436 -1858 -868 1225 1572 -177 -1541 -706 1088 1303 -424 -1614 -492 1408 1478 -456
2828 -456 -1857 -819 1250 1610 -188 -1629 -825 1069 1335 -312 -1567 -566 1316 1482 -468 -1840
2844 -1840 -840 1291 1726 -76 -1686 -957 1017 1484 -96 -1518 -728 1143 1488 -268 -1779 -957
2860 -957 1162 1795 26 -1704 -1199 827 1588 154 -1443 -977 865 1484 15 -1615 -1035 989 1767
2877 1767 195 -1584 -1301 690 1624 417 -1297 -1105 582 1402 185 -1345 -1028 741 1580 280
2893B80j712J64J806J033j057j641l6J557R37r70j454J10J551Q34j057j574O9
2910a160J606J015r19j570j35J423R61q04j384K1J327Q59r33j408L3J462R65q55
2928E04j500j42J371R75o95j398j06J275R00q01j367n1J398R28p97j475j60J330
2946A89J056o76j430k10J239R65o61j353j78J315J007o83j446k91J310J078n55
2963F76j454l58J165J103m86j392l41J179J070n10j427l99J184J180m20j458m77
2980a165J092J155l28j324n13J010J119l22j302n08J011J171l37j317n59R33J171
2997I87j69j278o37Q71J127j34j194n95Q31J094j56j180o31Q45J154j12j209o76
3015a062P79J118m1j114o66P04J070m6j105o19P36J097n8j166o62O99J134N9j137
$$ plain form
2893 280 -1432 -1268 538 1571 514 -1127 -1163 394 1331 361 -1093 -983 568 1402 345 -1229 -1160
2910 -1160 446 1461 542 -1028 -1163 260 1221 417 -967 -946 381 1240 307 -1101 -1068 394 1359 504
2928 504 -996 -1138 233 1208 513 -885 -991 284 1184 383 -984 -1035 363 1291 494 -981 -1141 189
2946 189 1245 569 -861 -1071 168 1133 472 -881 -1059 256 1263 580 -866 -1157 153 1231 676
2963 676 -778 -1136 29 1132 646 -746 -1087 92 1162 652 -775 -1174 10 1190 770 -688 -1165
2980 -1165 -73 1082 754 -570 -1083 -73 1046 724 -578 -1086 -75 1096 759 -558 -1117 -184 987
2997 987 818 -460 -1097 -226 901 767 -427 -1022 -191 903 747 -433 -1064 -219 935 823 -386 -1062
3015 -1062 -283 835 794 -320 -986 -282 788 742 -363 -982 -246 851 793 -373 -1035 -336 798 857 -280
3034b80o90O07J085M9j022p13O77J083Oj100p44O72J170J65j131q60N37J123K39
3053H73r82p81M99J058J60j056p73N51J201K18j046r36M00J168L89q79q98L44
3071d90J031K92q91q39L64J172L43r84r89L18J188M30p85r51J86R60M32p40q49
3090h02K93J062L64q82r48K35J114N59p39j005O7R47N13o17q38J63R35L91p65
3109D7q96J78J089N85p58r92k3R50O34n62q57L2R06M42o88r02J70J064O06p40
3129B85j100k5J020P15n52r64o4R27N16o19r04R0J054O63p08j178j08J104Q38
3148I90m76j094j96Q65P32m86j039k3J036P24o11j237j98J078R76l61j217m43
3166i80Q87R36l39j030k85Q93Q92m65j226l27J019J085k53j240n95P64J048j03
$$ plain form
3034 -280 -970 -363 722 771 -251 -964 -287 796 802 -298 -1042 -370 800 965 -166 -1026 -489 634 873
3053 873 -109 -890 -391 667 827 -229 -1002 -451 750 968 -78 -1014 -614 554 943 64 -834 -490
3071 -490 541 833 -58 -897 -533 639 982 -2 -991 -673 515 945 160 -791 -605 355 787 47 -802
3090 -802 -509 553 917 35 -913 -678 436 995 256 -749 -682 265 778 161 -677 -514 421 812 47
3109 47 -849 -671 418 1003 245 -747 -770 180 814 252 -605 -573 333 775 87 -815 -645 419 1025 285
3129 285 -815 -840 180 895 343 -621 -685 242 758 139 -765 -675 379 1042 334 -844 -952 152 990
3148 990 514 -580 -776 89 821 335 -704 -727 309 1033 422 -815 -1013 65 1041 680 -537 -980
3166 -980 -93 843 504 -526 -811 82 974 509 -717 -1044 -25 1060 807 -433 -1028 -264 784 681
3184F81j026m69P27Q85k31j098m68Q82J085j60j170p03O75J093Q0r69n95N60Q72
3203F51o6r86m82P56J039j26j152o61O28J119J04r47o63M95Q85l9r20m41O93R57
3223H44j11j121o55O77J113J27r82p22M70R33N6r04n18O54R65q7j139p07P36J208
3243H37J31j099q36M81J113J59r69p15O28J073Mj165p66O99J268K42j166j019
3261a100M61J279L08r66r26M80J160K30j131r12N44J393L34j153j155L75J322
3278E43N58r61j060K75J184M25r79j020L67J360M76j067j230K15J366P39q59j227
3296h95J12J136O26q15j095J91J277O09r70j218J15J307P67p57j238l0J128P23
3314I73o66j090M0J186O06q15j212P3J243P95p19j243j19J139P67o35j083k1J122
$$ plain form
3184 681 -345 -814 -87 798 567 -531 -999 -117 968 808 -362 -1065 -390 703 783 -186 -781 -221 651
3203 651 585 -401 -883 -127 912 786 -366 -1027 -399 720 824 -123 -786 -291 594 555 -365 -806 -113 844
3223 844 733 -388 -1043 -366 747 874 -108 -830 -360 573 629 -275 -793 -139 826 739 -400 -1107 -371 837
3243 837 968 -131 -967 -486 627 786 -183 -898 -270 803 807 -358 -1124 -425 843 1085 -81 -1100
3261 -1100 -639 640 948 -18 -944 -464 696 926 -205 -1117 -573 820 1154 1 -1154 -779 543
3278 543 1101 140 -920 -645 539 964 -15 -1035 -668 692 1168 101 -1129 -914 452 1191 332 -895
3296 -895 -783 353 979 164 -931 -740 537 1146 176 -1042 -927 380 1147 390 -848 -878 250 973
3314 973 307 -783 -743 443 1049 234 -978 -905 338 1133 414 -829 -948 191 958 323 -760 -781 341
3333C41O55p48j148k5J280Q04p46j247j54J168Q57o16j180q4J111P51p27j197
3351i05J0J220Q31p09j336j63J223R23n84j276j89J166Q48o20j314q8J228R45
3369A210o80j407k30J259J043n54j387k96J149R71n18j349k82J234J053n98j463
3386h45l48J227J178m89j431m40J113J168m60j414l77J149J161m61j474m84J175
3403e2J242l80j451n65J109J238l71j399n25J068J223l28j491n48J137J247k73
3420H81j451o62J066J275k50j424o17J027J260k40j454o68J056J323j86j490p20
3437a274J022J332j56j464p02J005J331j77j450p45R97J380j08j484p82R49J389
3454A063o1j454q08R17J429o7j460q65R21J436J4j450r01Q50J417M4j377r13Q68
$$ plain form
3333 341 996 248 -900 -925 355 1159 413 -834 -988 180 1037 421 -759 -843 268 1019 292 -905
3351 -905 -895 325 1156 447 -889 -1052 171 1094 510 -766 -955 211 1059 439 -875 -963 265 1210
3369 1210 530 -877 -1107 152 1195 641 -746 -1042 107 1078 560 -789 -1071 163 1216 618 -845
3386 -845 -1193 34 1212 723 -708 -1148 -35 1133 673 -741 -1118 31 1192 731 -743 -1227 -52
3403 -52 1190 810 -641 -1206 -97 1141 770 -629 -1154 -86 1137 809 -682 -1230 -93 1154 881
3420 881 -570 -1232 -166 1109 859 -565 -1182 -155 1105 865 -589 -1257 -201 1122 936 -554 -1274
3437 -1274 -252 1080 924 -540 -1242 -237 1094 917 -533 -1278 -281 1099 991 -493 -1275 -326 1063
3454 1063 1002 -452 -1260 -343 1086 1019 -441 -1306 -385 1051 1065 -385 -1286 -436 981 1025 -352 -1265 -397
3473c97J440K3j438r42Q42J501R2j404r76P47J417J28j340q99P79J399M9j361
3491c40r68Q41J470J45j422j043P69J428K05j320r80P56J431P4j373r60P93J536
3509A042J29j433j066P46J499K49j368j030P26J448J75j436j010Q01J559K44j525
3526b50j178P31J648L37j422j207P20J576K43j437j154P87J664L06j554j328P05
3543h13J749M73j430j370N66J675M39j406j295O49J733M40j509j462N99J874O56
3560A568j415j538L86J699P19j295j448M35J719O12j393j539M36J845Q13j296
3576C08j683K33J716Q51j122j485K32J602P13j222j494K94J768Q40j199j644R5
3593a197J637R56r64j524J00J513P26j043j438K67J625Q11j148j605J17J613R44
$$ plain form
3473 -397 1043 1066 -372 -1314 -472 1029 1121 -283 -1259 -512 905 1033 -307 -1206 -427 972 1021 -340
3491 -340 -1308 -467 1003 1148 -274 -1317 -548 880 1085 -235 -1215 -459 972 1046 -327 -1287 -494 1042
3509 1042 1171 -262 -1328 -582 917 1166 -202 -1232 -506 942 1117 -319 -1329 -528 1031 1275 -250
3526 -250 -1428 -697 951 1288 -134 -1341 -621 955 1198 -239 -1393 -606 1058 1364 -190 -1518 -813
3543 -813 936 1409 -21 -1391 -825 850 1289 -117 -1412 -763 970 1410 -99 -1561 -962 912 1568
3560 1568 153 -1385 -999 700 1419 124 -1324 -889 830 1442 49 -1490 -1054 791 1604 308
3576 308 -1375 -1142 574 1425 303 -1182 -950 652 1365 143 -1351 -1057 711 1551 352 -1292 -1197
3593 -1197 440 1396 432 -1092 -992 521 1247 204 -1234 -967 658 1469 321 -1284 -1167 446 1390
3610A390r70j434J2J468P37j002j372K71J605P26j213j552J76J697R05j033j544
3627a133P6J506Q12j050j404K58J662P18j243j624K64J791R84j158j732M6J681
3644D54R52j026j593J72J709Q74j269j723J40J910J175j184j926j26J791J224
3660A554r59j770q9J720J106j102j825m1J916J289j069k015l40J777J524q10j912
3677a046l50J601J315q44j852k58J762J390q91k029m42J688J578o12j913n79J454
3694b8J460o28j764l87J516J377p43j887m83J585J538n22j847o60J349J425m87
3711H14j617m78J392J285o55j732m71J530J469n88j791n92J335J428m80j627m81
3728a259J327J259o12j700l85J494J399o10j831n97J434J502m70j759n46J363
$$ plain form
3610 1390 420 -1014 -1002 466 1203 201 -1171 -900 705 1431 218 -1334 -1158 539 1444 411 -1133
3627 -1133 -1057 449 1261 211 -1193 -935 727 1445 202 -1422 -1158 633 1617 459 -1273 -1227 454
3644 454 1406 380 -1213 -1041 668 1542 273 -1450 -1310 600 1775 591 -1335 -1461 330 1554
3660 1554 595 -1175 -1264 456 1562 460 -1365 -1406 510 1799 730 -1285 -1625 152 1676 866 -1046
3677 -1046 -1396 205 1520 676 -1176 -1434 328 1718 827 -1202 -1644 44 1622 1010 -903 -1482 -28
3694 -28 1432 804 -960 -1347 169 1546 803 -1084 -1567 18 1556 1034 -813 -1473 -124 1301 814
3711 814 -803 -1281 111 1396 741 -991 -1462 68 1537 949 -842 -1434 -99 1329 849 -778 -1259
3728 -1259 68 1327 715 -985 -1370 124 1523 913 -918 -1515 -81 1421 951 -808 -1354 9
3744IJ357n81j739m66J532J474o56j921o22J541J601m57j885o72J390J530n03
3761I32j828o13J501J573n42j987p17J544J697l85j959q59J359J703l15j853p87
3778a536J369J661l93j934q80J462J804k78j988r79J297J811j75j860r55J259
3794c15J670k14j828r40J286J808j95j915j047J205J845n1j802j092J141J710
3810A266p5j743r81J159J697r6j826j031J165J784j7j804j064J062J715jj679
3827d69j005J054J685q6j745j043J167J784m5j787j134J113J734Q0j741j073J035
3844d76J692Mj765j035J146J793m4j847j149J086J858J39j789j231J016J799J14
3861A311j735j150J081J824K3j821j260J098J960J68j814j358R51J881K51j674
$$ plain form
3744 9 1366 785 -954 -1420 112 1586 930 -991 -1613 -72 1529 1072 -813 -1485 -95 1435 932
3761 932 -896 -1509 -8 1565 1023 -964 -1681 -137 1560 1175 -784 -1643 -284 1419 1104 -749 -1536
3778 -1536 -167 1494 1101 -833 -1713 -251 1553 1275 -713 -1692 -395 1416 1241 -619 -1574 -315
3794 -315 1355 1141 -687 -1627 -341 1467 1272 -643 -1690 -485 1360 1309 -493 -1585 -444 1266
3810 1266 1191 -552 -1533 -374 1323 1227 -599 -1630 -465 1319 1302 -502 -1566 -504 1211 1210 -469
3827 -469 -1474 -420 1265 1179 -566 -1609 -442 1342 1297 -490 -1624 -511 1223 1303 -438 -1511 -476
3844 -476 1216 1220 -545 -1580 -434 1359 1315 -532 -1681 -595 1263 1402 -387 -1618 -602 1197 1311
3861 1311 -424 -1574 -493 1331 1354 -467 -1727 -629 1331 1499 -315 -1673 -722 1159 1410 -264
3877b64j290R16J834J99j755j306R45J977L02j764j489P96J974M33j628j384P63
3894g41J767L42j613j326Q50J906L20j712j464P85J881N32j536j471O38J736M26
3911A320j498j265P22J813L42j647j427P32J979M93j570j488N69J803M95j448
3927g5j300O75J735L40j599j436Q17J968N04j661j569O01J921N57j450j437O02
3944h07J840L85j627j430P87K038N01j726j650N51K044O97j472j588M94J816N86
3961A439j512j519O84K020O55j738j784N15K119Q77j445j760K83J883P87j377
3977A27j604M87J945P23j597j771M27K076R95j372j883J19J852R99j208j643K69
3994a059J833P75j383j753L54K005J022j309j917M3J851J069j109j591R9J689
$$ plain form
3877 -264 -1554 -638 1196 1395 -360 -1666 -721 1256 1558 -206 -1695 -899 1075 1508 -120 -1504 -741
3894 -741 1026 1368 -245 -1571 -721 1185 1505 -207 -1671 -886 995 1527 -9 -1480 -842 894 1320
3911 1320 -178 -1443 -721 1092 1434 -213 -1640 -908 1071 1564 -6 -1494 -925 878 1373 -75
3927 -75 -1375 -700 1035 1375 -224 -1660 -843 1125 1629 -32 -1601 -1000 921 1478 28 -1409 -807
3944 -807 1033 1418 -209 -1639 -852 1186 1687 -39 -1689 -1138 906 1603 131 -1457 -963 853 1439
3961 1439 -73 -1592 -908 1112 1767 29 -1755 -1240 879 1756 311 -1449 -1166 717 1504 127
3977 127 -1477 -990 955 1678 81 -1690 -1263 813 1808 436 -1447 -1328 524 1523 315 -1328 -1059
3994 -1059 774 1549 166 -1587 -1233 772 1794 485 -1432 -1389 462 1531 422 -1169 -1070 619
4010F19Q22j241j652K81J923R71j312j837L5J831J115j013j653J0J625Q38j147
4027B15j568K77J838Q91j285j832R7J854J140j045j724j7J606R33j110j568K49
4044a049J807Q78j308j851J43J972J141j117j839p3J694J067j089j632J44J769
4060F57R76j284j846R4J993J231j164j981j64J787J273r80j747n7J728J072j126
4077D62j906jJ960J337j112k089k53J798J407q27j845k62J659J206r72j868j10
4094a416J817J378r96k056l57J739J512p06j886m39J539J335p96j778k85J694
4110B99J384q94j960m29J676J535o51j870n64J475J399o51j743l24J537J322p66
4127G75j889l90J569J537o30j876n55J428J402n63j697m49J512J322p06j889l80
$$ plain form
4010 619 1441 200 -1452 -1171 752 1723 411 -1426 -1391 440 1555 542 -1111 -1101 524 1362 215
4027 215 -1353 -1076 762 1653 368 -1464 -1367 487 1627 582 -1142 -1159 447 1380 270 -1298 -1049
4044 -1049 758 1636 328 -1523 -1380 592 1733 616 -1223 -1296 398 1465 376 -1256 -1112 657
4060 657 1633 349 -1497 -1403 590 1821 657 -1324 -1488 299 1572 592 -1155 -1212 516 1588 462
4077 462 -1444 -1445 515 1852 740 -1349 -1602 196 1603 776 -1069 -1331 328 1534 562 -1306 -1416
4094 -1416 401 1779 783 -1273 -1630 109 1621 915 -971 -1410 129 1464 668 -1110 -1395 299
4110 299 1683 789 -1171 -1600 76 1611 960 -910 -1474 1 1400 749 -994 -1318 219 1541 775
4127 775 -1114 -1504 65 1602 972 -904 -1459 -31 1371 808 -889 -1338 174 1496 790 -1099 -1479
4144a479J583J470o36j866n45J422J449n25j698n09J459J306o70j781m48J548
4160H0J483o05j876n88J429J490m53j775n57J385J385n65j759n27J496J472n54
4177I61j800p20J444J507m11j745o70J373J426m62j760n88J421J510m98j839o92
4194a543J387J586l83j766p17J297J495m06j764o45J394J535m51j820p59J364
4210a96J600l36j759p65J288J521l50j772p18J356J593l66j863q30J337J632k24
4227A148j799q62J247J598k64j762q17J277J645l08j793r27J253J704j30j760
4243e50r72J145J625j54j714q67J201J666k12j767j013J182J714j2j729j017J008
4260d66J615l7j606r25J059J627j13j721j003J075J722M1j636j084R05J596O9
$$ plain form
4144 -1479 104 1574 938 -928 -1473 -51 1398 873 -825 -1334 125 1431 761 -1020 -1468 80
4160 80 1563 958 -918 -1506 -77 1413 960 -815 -1372 13 1398 833 -926 -1453 43 1515 961
4177 961 -839 -1559 -115 1392 981 -764 -1434 -61 1365 903 -857 -1445 -24 1486 988 -851 -1543
4194 -1543 -156 1430 1047 -719 -1436 -139 1356 950 -814 -1459 -65 1470 1019 -801 -1560 -196
4210 -196 1404 1068 -691 -1456 -168 1353 1003 -769 -1487 -131 1462 1096 -767 -1597 -260 1372 1148
4227 1148 -651 -1513 -266 1332 1068 -694 -1511 -234 1411 1103 -690 -1617 -364 1340 1210 -550
4243 -550 -1522 -377 1248 1094 -620 -1487 -286 1380 1168 -599 -1612 -430 1284 1272 -457 -1474 -466
4260 -466 1149 1112 -494 -1419 -360 1267 1154 -567 -1570 -495 1227 1268 -368 -1452 -547 1049 1118
4277A118j522r45R88J549r1j627r83J054J679M8j625j088Q70J572J09j410r58
4294a262Q81J494r2j557r02J088J578mj620j048Q61J580J69j443r52Q53J412p5
4312I61j489q52J031J614n1j675j060R11J671J70j468j069Q63J450J7j499r00
4329a375J037J631m8j724j124R72J766K51j583j182P33J606J58j488j028R64J656
4346A222M1j709j196R37J859L51j626j354O73J673L73j425j148P59J664J77j624
4363c53j238Q19J904M03j563j487N42J748N36j257j241N16J566L17j426j258P03
4380g69J817M57j459j500M25J715O53j156j294L56J444M30j247j142N73J645M41
4397A389j390j400M09J675O64j096j297K47J362M79j101j055N39J481L40j345
$$ plain form
4277 1118 -404 -1349 -361 1188 1097 -530 -1513 -459 1220 1268 -357 -1445 -575 997 1106 -304 -1262
4294 -1262 -381 1113 1021 -536 -1438 -350 1228 1224 -396 -1444 -583 997 1166 -277 -1229 -376 1036 961
4312 961 -528 -1380 -349 1265 1214 -461 -1521 -610 1061 1231 -237 -1306 -443 1007 1024 -475 -1375
4329 -1375 -338 1293 1245 -479 -1603 -631 1135 1386 -197 -1379 -646 960 1118 -370 -1398 -434 1222
4346 1222 1263 -446 -1642 -705 1154 1505 -121 -1475 -802 871 1244 -181 -1329 -570 1094 1271 -353
4363 -353 -1591 -772 1132 1535 -28 -1515 -973 775 1311 54 -1187 -671 895 1212 -214 -1472 -769
4380 -769 1048 1505 46 -1454 -1029 686 1339 183 -1111 -755 689 1119 -128 -1270 -697 948 1389
4397 1389 -1 -1401 -992 683 1347 251 -1046 -799 563 1042 -59 -1114 -575 906 1246 -99
4413i9j278M95J664N89j193j300K80J397M70j040j053N34J370L07j314j211N73
4430h09J684N16j253j394L53J497N38j057j148M83J396L27j322j199O27J683N51
4447A473j334j480L42J579P05j061j308L12J463M87j252j235N02J671O22j354
4463A32j526L04J696Q01j041j466J67J452O61j065j295L56J562O68j241j534K30
4480a139J664R33j009j482J6J400P81q70j286J41J436P07j093j426J40J604Q95
4497A412r16j483r5J339Q68p60j205j4J284P05r51j289J23J495P78q79j414o5
4515a067J326Q81p04j236k6J197O76q47j201J51J350P44q87j388mJ361Q64p35
4533D55j278n9J168P48p89j210J42J292P21r18j326O1J391Q44p77j381l1J220
$$ plain form
4413 -99 -1377 -882 782 1371 178 -1122 -842 555 1025 -15 -1068 -534 836 1143 -171 -1382 -809
4430 -809 875 1391 138 -1256 -903 594 1132 75 -1073 -590 806 1133 -189 -1388 -761 922 1473
4447 1473 139 -1341 -999 580 1285 224 -1084 -772 691 1178 -74 -1309 -807 864 1486 132
4463 132 -1394 -1090 606 1407 366 -1100 -933 519 1180 115 -1180 -824 738 1406 165 -1369 -1139
4480 -1139 525 1458 449 -1033 -1017 383 1164 294 -992 -851 585 1292 199 -1227 -1087 517 1412
4497 1412 496 -987 -1082 257 1125 365 -840 -854 430 1135 184 -1105 -982 513 1291 412 -1002 -1067
4515 -1067 259 1140 436 -800 -826 371 1047 200 -1001 -850 500 1244 357 -1031 -1035 326 1190 455
4533 455 -823 -882 286 1034 245 -965 -823 469 1190 272 -1054 -993 398 1242 465 -916 -947 273
4551B73Q18p44j269N2J273P49q58j352O1J393Q88p99j423j03J281R05o83j283
4569h21j14J261Q24p86j325l9J334R04p55j385j94J286R75o02j351k04J158Q90
4587A056n90j298j35J219R04o55j383k07J240J016n75j326k63J092R26n24j211
4604g14j92J114Q38n63j283j99J174R19n37j293k71J087R64n06j231k15J022Q51
4622I65n16j191j66J096Q82n59j271k19J053R70m43j247l01J001Q97m81j133k10
4640h73J058Q56n66j232k86J133R82m66j257l68J049R42m31j152k70J018Q55n18
4658D74j196k90J145R82m80j319l73J007J009k96j207l62R29Q91m11j175k76J038
4676I0R88m41j289m30R66J105k63j207m43Q17R50l12j080l15R12R28l83j227m44
$$ plain form
4551 273 1091 347 -922 -870 403 1152 294 -1058 -997 396 1284 485 -938 -1041 240 1145 462 -821
4569 -821 -935 326 1150 364 -961 -1000 334 1238 483 -902 -1096 190 1165 563 -788 -992 166 1056
4587 1056 466 -832 -967 252 1156 501 -882 -1089 151 1167 592 -734 -997 95 1021 497 -714
4604 -714 -906 208 1046 483 -800 -999 175 1094 557 -736 -1007 80 1044 538 -693 -908 114 965
4622 965 449 -742 -908 188 1070 511 -760 -979 74 1044 601 -646 -947 54 951 470 -663 -873
4640 -873 185 1041 475 -757 -1043 90 1072 606 -651 -1019 30 972 541 -611 -881 137 992 474
4658 474 -722 -1012 133 1115 635 -684 -1057 -50 959 663 -544 -906 23 914 503 -672 -948 90
4676 90 1078 637 -652 -1082 -116 989 726 -481 -924 -107 843 531 -549 -864 48 976 593 -634 -1078
4695a078R96J053k57j144n13P64R53k13j015l43Q14Q58l53j155l41R15J029k31
4713G39j170n43P55R59j55r49l81P41P75k93j074l33R41R64k83j192n30P90J029
4732G90j38r87m32O74Q13k84r81l16R20R26l33j235m80Q49J056r3j066n16O39
4751a94Q77j86r75l31Q23R06l08j177n20Q94J098p8j128o56O71R42k4r84m05P09
4771d6Q80k67j093m96Q30J122q7j127p20O18J006N3q92n39O11Q23j19j001m88
4790i32P58J056p3j069p19N27J054J39q39o22M80P82k3q88m41O71R46o2j062o52
4810i69N61J024J65q33o59M17P73Rp66l97N82Q45j07j009n82O19R78J25q52o48
4830g24L77P97Q1p32m31N59P62j43r43m97O30R75N0q86o49L71Q58J16o95m60M39
$$ plain form
4695 -1078 -82 971 714 -430 -943 -179 774 561 -454 -797 17 875 522 -633 -974 -59 970 739
4713 739 -431 -974 -219 740 585 -364 -745 -4 771 478 -596 -929 12 976 693 -499 -1029 -239 790
4732 790 652 -335 -767 -93 720 436 -545 -861 59 985 652 -583 -1063 -214 842 749 -317 -833 -194
4751 -194 683 497 -478 -809 14 920 612 -565 -1085 -191 907 829 -299 -955 -284 658 634 -350 -755 -46
4771 -46 834 567 -526 -1022 -192 930 843 -284 -1004 -386 620 673 -219 -758 -147 676 557 -444 -932
4790 -932 -174 882 809 -260 -979 -452 602 741 -98 -720 -240 542 519 -369 -810 -139 807 745 -317 -969
4810 -969 -408 616 781 -52 -711 -294 479 488 -278 -675 -93 752 645 -364 -946 -327 651 776 -76 -724
4830 -724 -347 450 531 -201 -632 -73 689 546 -397 -894 -264 711 761 -125 -774 -403 455 571 -124 -584 -145
4851a45P45o7r21m53O41R39K1r45o69M49Q76J75p29n54M12P39j2q09m79N79Q99
4872F92J9r15o89M57R32K14p29o37L82P28O5p17m93M60Q95J4q70o65M56R30K23
4893G52p29o68K58P50J95o99m61L89P77N2q10n61L65R04K20p30o70K28P75J87
4913E24n58n05K90P29P0p29n59L80Q64J91p18o58K57P42K41n54n33K57O71Q7o30
4934a41n12L70P82J49o63o40K59P42K14n32n31K12O21J47o03m88L40P35J77o83
4954d5n76K21P64K22n49n56K04O52J28n29n05L04O95J35o51n59K46P54K19n42
4974C2n87K10O51J96n39m96K46O61J88o10n62K54P14K21n36n60J81O42K02n16
4994hn17K24O67J56n66n22K07O85K59n14o01J78O00K63m97m95J75O35J82n40m95
$$ plain form
4851 -145 600 533 -388 -841 -200 739 760 -185 -854 -405 471 646 -83 -637 -225 514 502 -307 -786 -207 692
4872 692 711 -204 -893 -436 496 710 -19 -656 -274 454 519 -198 -691 -231 664 678 -192 -857 -401 529 752
4893 752 23 -645 -387 363 558 -141 -602 -213 564 616 -194 -755 -390 514 734 4 -666 -438 337 524
4913 524 -34 -539 -249 480 550 -179 -738 -358 506 697 -21 -679 -422 320 561 7 -526 -269 402 489 -141
4934 -141 -653 -283 499 648 -15 -655 -396 346 560 28 -503 -291 330 477 -126 -614 -274 461 638 -45
4954 -45 -621 -400 364 586 37 -519 -315 337 465 -64 -569 -265 430 565 -86 -645 -399 355 574 32
4974 32 -555 -345 306 502 -37 -533 -287 374 562 -48 -610 -356 358 579 43 -517 -336 306 508 -8
4994 -8 -525 -301 366 522 -44 -566 -359 326 585 71 -530 -352 248 511 14 -481 -306 329 511 -29 -524
5015e24J96O44K17n00n14J45O00K13m60m75J59O12J66n04m87J83O59K29n38n22
5035e01J56O04K21m56m64J43N73K32n16m96J71O15K29m86m98J13N84K26l92m83
5055d25J13N69K18m55n09J59N73K74m52n05R1N33K76m10m57J22N33K01m22m81
5075d54J49N49K31m02m86O4N29K51l67m20R2M60J95m03l98J49N55J78m26m57P6
5096c35N20K16k96m58Q3M65J50l30l99J35N12J66l66m74P2N26K42l44m34O2M22
5117A35K04l24l78J42M68J43m28m22J46N22K07l15m54N3M58J74l09l66J22M70
5137B48J30m02m04J39N18K16l75m18L6M29K24k91l58J09M01J51l61m03J28N13
5157B30J93l27m73M0M44K64k83l59N6L47J84l32l35J14M47K00l55m53O3M54K63
$$ plain form
5015 -524 -328 316 533 33 -481 -336 264 477 17 -458 -299 313 479 -25 -512 -329 330 559 21 -501
5035 -501 -345 259 480 24 -440 -297 276 508 -8 -504 -333 282 511 25 -473 -360 224 450 58 -425
5055 -425 -312 257 475 20 -489 -330 243 517 65 -440 -349 184 460 50 -407 -285 248 449 27 -454
5075 -454 -305 244 475 73 -413 -349 180 431 64 -356 -264 196 391 -12 -410 -261 294 472 46 -411 -335
5096 -335 185 401 105 -353 -270 195 345 15 -384 -249 263 429 63 -411 -339 187 429 85 -349 -287 135
5117 135 339 15 -363 -221 247 390 -38 -460 -314 208 415 100 -354 -301 157 331 22 -344 -222 248
5137 248 378 -24 -428 -289 229 445 70 -348 -312 117 341 50 -308 -199 202 353 -8 -411 -283 230
5157 230 423 96 -377 -337 107 371 88 -271 -215 132 316 -16 -351 -237 210 410 55 -398 -335 119 382
5178C82k48l81K1L46J74k67l29J10L94J82l39l84K9M44K53k41l82j8L40J94k30
5199E0l05P5L68J55l23l60O4M13K11k26l85l1L71J62j94k84P3L17J22k93l02R7
5221b25M11J73k76l66K3L29J98k13k74O4L03R6k57k84J30L54J60k90l59M1L49
5242H7K00k28k66K9K78J35k56k65J22L63J31l07l36M9L81J87k24l25M6L17J12
5263B30k32k31P7L41J26l22l18J05L47J88k35l34L5L18J64k25k49M4L26R9k55
5284al11J02L80J28k43l04L7L15J65k09k52M9K88P5k45k66J17L02J34k26k70N0
5306a85K88J51k20k13J8K83P4j96k46R6L14P2j99k85O5L07J14j86k69N9K89O0
5328A91k04k22J00K68J01k48k59J28K99P3k01k66R4K78N8j60k47R8K74M3k32j97
$$ plain form
5178 382 134 -247 -226 120 294 27 -302 -192 202 384 45 -339 -310 134 387 146 -236 -254 86 280 50
5199 50 -255 -180 188 343 20 -340 -276 137 348 122 -263 -294 77 239 45 -239 -166 151 273 -20 -322 -225
5221 -225 186 359 83 -283 -260 69 267 54 -220 -156 147 243 -14 -298 -168 186 346 56 -303 -262 87
5242 87 287 59 -207 -178 100 235 -21 -286 -164 199 330 23 -313 -264 117 304 80 -245 -199 118 230
5263 230 -2 -233 -156 185 311 -11 -329 -224 123 311 76 -258 -223 95 259 34 -215 -171 155 254 -1
5284 -1 -312 -210 170 298 55 -249 -212 103 268 59 -193 -144 144 219 -26 -292 -175 127 261 35 -235 -185
5306 -185 103 254 34 -179 -161 122 196 0 -246 -150 164 236 37 -248 -183 124 238 52 -217 -158 131 191
5328 191 -13 -235 -135 133 234 -14 -273 -145 154 227 26 -240 -146 132 190 30 -217 -119 155 198 -34 -231
5350b31P2L23O3k22k53J00K89Q9k25k29R4K71N3k31j94R9L19J7k44k08R1L07P3
5373B23j94k37O6K90L5k02k22J31K74M3k31k25J27K86O2k45k24Q9K78P6k15j93
5395b08R8K66O4k73j81J21K95M4k45k24J07L01M8k43k02R0K82O6k45j61R6K65
5417A61O2k57k14J23K78P7k32k42J21K40R0k34j97J33K66L8k85j96J61L05L6k48
5439a4k27J12K72O2k19k20J20K80L8k74j86J46L15M0l02k17J16L03O1k19j91Q3
5461a21K86K2k37j98J51K85N7l07k10J41L13N9k63j89P5K83M3k37k04J41L07J3
5483B10k61k19J26L07Q4k70k08O5L03P3k43j79J42K43L0k38k53J62L28N0k62k49
5505b59J14K76Q0k45j86J47K51qk49j69J79K94K4k84k46J37L20M1k54j84J44K37
$$ plain form
5350 -231 -159 164 227 5 -248 -148 141 230 5 -224 -130 141 194 -37 -231 -132 187 204 -40 -248 -157 150 223
5373 223 29 -208 -142 148 183 -19 -241 -110 164 207 -24 -249 -122 164 226 -19 -243 -154 124 200 -15 -208
5395 -208 -110 156 220 -53 -234 -113 182 226 -19 -243 -136 165 213 -30 -232 -142 140 206 -39 -200 -104 161
5417 161 223 -34 -248 -125 153 230 -2 -244 -123 117 207 -27 -224 -91 175 213 -72 -268 -107 198 234 -14
5439 -14 -241 -129 143 205 -14 -234 -114 166 204 -70 -256 -110 205 245 -57 -274 -158 145 206 -13 -204 -121
5461 -121 165 187 -50 -248 -97 188 245 -62 -272 -131 182 241 -22 -211 -136 147 190 -47 -251 -110 197 210
5483 210 -51 -270 -144 163 247 -23 -231 -166 137 210 -33 -212 -70 173 203 -35 -288 -126 202 252 -10 -259
5505 -259 -145 131 211 -34 -220 -73 178 170 -79 -248 -69 225 249 -35 -281 -144 176 217 -37 -221 -77 160
5527A60K7k57j74J89K80K5l25k13J62L52L8k79k34J44K69J3k49j78J85L22k5l22
5549i0k12J72L74J4k61k46J08L20M0k81k03J95K75O6l67k16K04L49O2l27k72J66
5571a30K93Q5l06j99J46L07M1l24k23J85L75M5l23k66J45L21Q9k90k29J45K83
5592A70O2l10k10K02L34K4l08k90J87L45P9l06k40J26L24N7l02k08J40L31O8l31
5614e6k50J42L88P3k99k74J15L48O0k92k27J68L14N4l43k35J91L46Q2l32l01J55
5636a73L33R5k93k23J45L54Ll05k51J96L93Kl39l13K24L87M6l05k78J88L46K8
5658B60l16k62J85L62N7l66k84J83M15R3l68k90J77L74L9k96l00J88L87N9l43
5679d6l18J92M13R2l62l09J56L81J07l36l03J24M44P3l57l00J53M29R5l35l36
$$ plain form
5527 160 187 -70 -244 -55 225 250 -75 -288 -126 226 264 -15 -249 -105 164 177 -72 -250 -65 257 232 -90
5549 -90 -302 -130 244 258 -3 -249 -141 179 219 -62 -265 -70 205 271 -96 -312 -108 241 303 -24 -296 -130
5571 -130 163 248 -58 -257 -111 196 237 -87 -310 -125 250 295 -28 -294 -149 172 261 -29 -258 -113 170
5592 170 232 -78 -288 -86 248 272 -36 -326 -139 206 285 -21 -261 -135 189 246 -56 -264 -124 207 275 -56
5614 -56 -306 -164 224 297 -2 -276 -161 187 247 -45 -272 -104 210 264 -79 -314 -123 223 305 -27 -328 -173
5636 -173 160 255 -38 -261 -116 238 241 -64 -315 -119 274 276 -63 -376 -152 235 281 -24 -302 -114 232 260
5658 260 -56 -318 -133 229 286 -80 -364 -181 234 327 -41 -331 -154 220 259 -37 -337 -149 238 297 -46
5679 -46 -364 -172 241 333 -29 -338 -182 199 306 -30 -333 -209 235 308 -49 -349 -196 233 328 -7 -343
5700c43J49L81J34l55k83J20L92R6l33k76J44L90J19l56l37J32M19J22l19l20
5720c24J27M13Q0l11l33J76M04Q7l35l30J27M21J36l55l09J47L75J10l17l15J58
5741a68M18R0l53l31J46M18J23l29l63J49L91J30l19l38J51L80J50l49l43J18
5761b29M69J38l68l58J28M29J27l44l43J44M41J10l30l84J48M48J35l44l98J60
5781b21M28J56l44l50R2M44J44l43l85J41M63J62l75l82Q7M72J90l41l85P5M74
5802B02J49l17l90J25M41J71l62l69P8M35K09l39l84P7M62J78l22l95Q9M54J70
5823C62l05m26P8M72K21l19m48Q4M53K29l38l88N3M31K45l45m08M6M60K38l03
5844I2l82lM18K25k86m18O4M48K37l05m21M2M48K38l01m48L9M37K74k97m32K1
$$ plain form
5700 -343 -194 187 321 -34 -317 -197 195 291 -42 -318 -174 216 335 -21 -358 -226 193 315 -4 -324
5720 -324 -197 216 296 -15 -348 -172 232 319 -16 -346 -219 202 338 -17 -326 -179 196 306 -11 -326 -168
5741 -168 250 340 -13 -344 -198 220 343 14 -349 -200 191 321 2 -336 -185 195 345 -4 -347 -229
5761 -229 240 378 10 -348 -220 209 336 -8 -351 -207 234 344 14 -370 -222 226 361 17 -381 -221
5781 -221 207 363 19 -331 -239 205 349 6 -379 -238 225 387 12 -370 -283 189 379 38 -347 -272 202
5802 202 351 34 -356 -231 210 381 19 -350 -272 163 372 33 -351 -274 188 366 44 -351 -262 192 362
5823 362 57 -369 -291 181 402 83 -365 -281 172 401 63 -325 -272 159 404 59 -349 -303 157 395 92
5844 92 -290 -293 125 350 64 -354 -290 158 395 90 -331 -289 159 397 96 -352 -313 124 398 101 -331 -310
5866c10M46K54k83m50LM79K87l19m21rM69K69l18m21J3M59K36k79m53K9M73K81
5888D35l28m17j8M40K73k49m21j5M25K40k55m54J2M66K77k77m60k7M41L20k66
5909A42m43J3L65L02k50m63j4M94K83k95m63JM44K96k36m55m3M15K83k67m15k3
5931c29M37L18k89n01K1M60K98k18m83p3M24L28k49m64lM57K88k79n06rM62L50
5953D40k35m96p0M17L37k05m63p0M53K98k44n05l9M52L69j93n29j43M35L79j61
5974B27m72r2M05L14k15m56j10M62L79k22n16j21M34L90j54m75j28L91K99j57
5994A83m25j09M11L77k26m95j24L96M02j20n25j17L77L39j36m63r2L88L73k17
6014A97m66j27M21L87j58m87j41L51L98j70m50j09L85L62j71n08j29M42M19j60
$$ plain form
5866 -310 136 390 107 -343 -340 139 426 107 -314 -323 146 415 97 -324 -311 148 384 105 -348 -319 154 435
5888 435 107 -310 -328 112 385 136 -285 -300 125 365 110 -344 -332 134 411 134 -326 -353 88 408 142
5909 142 -301 -288 77 379 129 -334 -348 146 429 134 -329 -328 116 412 176 -279 -322 93 376 109 -306 -329
5931 -329 108 426 137 -364 -343 117 415 197 -286 -359 65 393 144 -320 -323 134 422 143 -363 -372 90 440
5953 440 205 -291 -361 56 393 188 -275 -345 108 406 162 -343 -382 70 439 246 -283 -426 9 388 227
5974 227 -245 -337 68 382 167 -289 -399 63 442 220 -296 -417 17 407 253 -222 -350 41 340 183
5994 183 -242 -351 60 437 211 -284 -408 -12 390 270 -255 -372 5 344 208 -255 -347 41 414 197
6014 197 -269 -396 25 412 254 -233 -374 -23 375 205 -245 -354 31 393 222 -286 -415 27 446 286
6034B86n41j60L89M04j34m60j36L65L64j54n05j03M17M38k01n23k03M01M37j25
6054B56m73j74L68M07j52m78j60M23M18j48n47j97M06M62j00n00k46L57M36j03
6074B55m79j86M17M18j28n23k10L69M79o8n38k31L63M17l0n16j96L30M25j08m81
6095b21k34M14M26k6n40k47L14M89j9m89k63K95M54o0m79k54L53M57k8n43k39
6116d40L03M79Lm77l11L38M31l0m61k54L27M63n1m83k71L38M73nm87k93K82M76
6138C50k8m64k55L33M32n2m84k54K84N13l2m79l10K98M89Mm71l08L06M65J7m93
6160a39l09L11N08Nm84l37K82N16J7m64l31K70M71L4m49l32K98M72K3m89l46L11
6182a62N27Qm69l38K33N16N4m43l51K62M70L2m32l46K77M73P2m50l64K18M97Q8
$$ plain form
6034 286 -255 -415 -26 378 244 -216 -352 13 377 223 -282 -385 32 470 269 -254 -457 -56 381 256
6054 256 -217 -391 -23 384 232 -246 -406 17 435 287 -260 -457 -51 411 311 -189 -435 -78 358 255
6074 255 -224 -410 7 425 297 -226 -436 -67 412 344 -194 -425 -62 355 325 -191 -387 -57 368 260 -221
6095 -221 -455 -41 385 359 -181 -428 -114 375 356 -133 -396 -101 353 293 -186 -440 -87 370 342 -201 -440
6116 -440 -137 342 345 -132 -443 -105 326 296 -165 -419 -92 371 320 -163 -434 -96 377 372 -115 -408 -126 350
6138 350 322 -142 -397 -64 368 316 -168 -422 -138 375 343 -136 -446 -148 341 345 -126 -434 -128 337 354 -139
6160 -139 -448 -137 371 376 -108 -445 -163 353 370 -94 -425 -155 316 350 -99 -431 -133 339 362 -127 -473 -162
6182 -162 365 373 -96 -434 -201 315 369 -74 -425 -163 307 339 -93 -439 -162 311 383 -67 -431 -213 284 372
6204C72m30l09J87M62O3m30l42K67M70P7m58l74K01N23J03m05l97K15M31J30l84
6225b8l91K63M42Q2m46l55K10N31Q6m15l67J53M89J27m11l11J58M59J11m33l83
6246d29K26N21J18m18m29R6N54J76l91l77J27M50J48m32l67K09N25J44m62l96
6266d07J08N30J80l76l93R9M67J53l67l69J30N27J37m40m24J51N43J81l56m50
6286c76Q6M79J88l26m12J48M69J30m01l87J18N20J85l25m82Q5M43K44l14l77P9
6307b26M34J49l75l74J16N27J92l63m76O5M89K27k84l84K5M45J52l55l55J28M81
6328B38J88l56m76M6N46K51l14m27N4L86J99l02l78J33M76J53l68m88Q7N31K86
6349D65l27m63k0M63K17k61l96P3M48K05l53m55N6N32K93l34m70m0M45K70k05
$$ plain form
6204 372 -58 -367 -180 282 345 -85 -427 -160 310 387 -71 -445 -244 279 382 -23 -420 -205 226 356 -28
6225 -28 -419 -156 286 368 -78 -433 -223 308 394 -21 -388 -235 254 381 -30 -341 -183 276 387 -46 -429
6246 -429 -203 318 436 18 -411 -315 239 415 24 -353 -226 224 372 -60 -427 -218 307 451 -11 -407
6266 -407 -299 231 411 35 -358 -259 208 361 -6 -375 -245 282 419 -21 -445 -294 249 430 74 -376
6286 -376 -290 189 377 51 -361 -213 256 386 -15 -402 -284 236 421 96 -386 -301 142 386 72 -305 -226
6307 -226 208 357 -18 -392 -276 251 443 80 -396 -331 158 385 101 -283 -258 187 339 -16 -371 -243 238
6328 238 426 70 -406 -360 186 437 123 -304 -250 136 335 33 -345 -212 264 417 49 -439 -352 179 465
6349 465 138 -325 -345 118 335 74 -322 -249 199 404 51 -404 -348 184 477 143 -327 -367 78 348 143
6370A43m25K2M16K30l15m61N5N19K88l16n24k3M48L46k45m19k6L77K30k45m28
6391c53J9M87L00l12n17l4M50L79j87m75o0L48K82k26m20N4M14K67k88m77p1M73
6413E3L78k18m42j09L74K64j78l76qM09K50k93m58j4M25L57j93m74j11L62L01
6434B99j59l76k8L78K23k42m49jM38L94k60m90j12L97L49j76l87q6L54K56k19
6455A03m10k1M14L55k39m82j48M21L71j59l79j34L22K83j80l93n8L94L60k22n22
6476c24j15M21M11j24m73j82L75L01j22l90q5L57L34j91m67j29M13L81j14m58
6496a81j89L40L35p9l86j36L31L07j57m22j37L68L99r1m72k06L00L69n1l95j36
6517b89K89L18j58l92j02L33L67r2m76j67K95L80m9l85k07K96L55j02m30j41L45
$$ plain form
6370 143 -282 -260 156 386 71 -390 -335 184 472 156 -368 -391 57 403 158 -261 -287 90 320 75 -353
6391 -353 -334 153 453 141 -376 -410 40 419 232 -243 -303 45 327 101 -319 -265 149 416 128 -349 -420 53
6413 53 431 213 -229 -338 36 300 122 -254 -262 147 397 104 -354 -368 57 414 221 -253 -364 -2 299
6434 299 140 -236 -264 114 337 95 -354 -355 83 477 217 -273 -385 12 361 185 -202 -288 66 322 103
6455 103 -307 -328 86 441 202 -280 -428 -7 364 205 -174 -308 14 297 117 -276 -334 60 420 198 -324
6476 -324 -439 -18 393 269 -204 -386 -11 290 168 -222 -307 50 384 193 -274 -403 10 391 277 -181
6496 -181 -370 -30 305 226 -160 -296 35 342 185 -237 -374 -6 393 302 -170 -376 -76 293 242 -153 -289
6517 -289 0 318 160 -232 -334 -1 366 274 -202 -369 -74 306 257 -128 -335 -39 316 214 -216 -357 -12
6538a2L72j16m05j86K65L89m2m14j51K66K85o4l67j45L15L30q9m01j71K51L96
6559C06k3m12j92K53L39l0l59j95K84L36l3m38k13K77M24m1l77k37K46L44ol75
6581a22k00K55L59k6m26j95K52M12l4l71k31J98M13l2l53k14K17L72j3l68k51
6602c58K57L76Ll51k61K11L63K9l45k19K12L29J2l54k31J94L89K7l85k29J95L71
6624B35L0l44k07J84L46Pl53j94J54M12K0l80k26J64L62M1l22k33J81L61L6l58
6646h4k38J84M21kl34k87J92L61N4l18k27J44L81J0l32k39J76L58O4l09k74J20
6668a79L77Q3l24k22J15L30R2l21k40J38L59P9l47k53J39L76R9l38k39J22L28
6689A74Q3k88k76J86L22Q8l20k78J28L60J14k82k75J14K89R1k39k45J06L36Q5
$$ plain form
6538 -12 360 244 -161 -347 -82 307 265 -149 -300 -34 251 187 -180 -325 -10 320 231 -170 -341 -90 306
6559 306 283 -129 -321 -68 271 241 -118 -313 -29 307 274 -164 -377 -100 324 283 -94 -331 -85 259 253 -122
6581 -122 -322 -67 292 266 -160 -355 -103 309 275 -96 -327 -129 284 252 -101 -315 -98 274 261 -107 -358
6602 -358 -101 275 278 -73 -334 -123 240 269 -76 -295 -83 246 258 -96 -327 -133 256 283 -102 -331 -136 235
6624 235 265 -79 -286 -102 244 251 -102 -296 -142 270 290 -90 -316 -152 210 251 -71 -304 -123 238 274 -84
6646 -84 -322 -138 283 281 -53 -340 -148 213 267 -51 -278 -134 247 257 -75 -314 -138 220 284 -25 -299 -179
6668 -179 198 281 -43 -265 -150 180 272 -49 -289 -151 208 287 -60 -313 -174 202 301 -37 -276 -154 174
6689 174 257 -31 -307 -121 201 289 -31 -309 -181 179 293 11 -264 -150 139 230 -9 -254 -148 188 273
6710B73l03k67J06L87R3k72k93R9L17R3k43k43J06L29O7k77k64R5L73J37k53l09
6732b49M5L39J31k49k35O7L16Q2k74k33R6L01J60k59l22P6L24J49k05k64L7K96
6754A29J09k46k56J01L21J57k84l07P0L22J69k09k72L5K69J11k03k33O3L12J14
6775B72k24l22L1L28K05j91l19M8K35J63j96k54N6K95J10k19k86N5L26J52j89
6796G6k82k1K83J76j59k60M4K22J30j70k94N5L04J78j81k87l1K72J90j53k34j0
6818a52K25J45j76k53M6K61K02k01l06j8K74J69j26k50k2K52J55k01k13OK77J49
6840B43j62k73m1K92J92j59k50k5J94J74j16k39qK27J74j59k66%K46K15j59k48
6862a48q2K54J69j11k22l4K39J62j69k02p3K64J95j46k20q0K19J89r7k35o5K30
$$ plain form
6710 273 -30 -297 -191 196 289 17 -276 -177 140 233 -10 -253 -147 182 249 -28 -292 -197 176 313 60 -249
6732 -249 -204 135 266 17 -218 -151 165 247 -27 -260 -164 137 297 38 -284 -208 116 265 60 -204 -167 129
6754 129 238 -8 -264 -163 158 315 31 -276 -206 116 285 76 -196 -161 108 219 16 -217 -154 158 272
6775 272 48 -274 -243 85 290 99 -220 -172 63 226 30 -224 -168 127 237 18 -268 -213 113 265 76
6796 76 -206 -227 56 232 73 -187 -143 79 209 39 -255 -200 104 282 101 -186 -217 55 245 92 -142 -152
6818 -152 73 218 42 -211 -165 96 298 97 -209 -227 47 216 90 -160 -182 70 225 24 -189 -183 94 243
6840 243 81 -192 -233 59 251 92 -158 -183 11 185 69 -170 -178 49 223 64 -202 -202 44 259 100 -148
6862 -148 -230 24 193 82 -140 -174 65 227 58 -144 -217 47 242 96 -124 -204 15 204 107 -128 -193 37
6884C7J48j10k52j0K39J55q6k99k7K19J77p5k27o7J93J68q9k21n0J80J98p6k92
6907a67k4J97J88o5k29r7K10J58o2k49m2K05J60q3k20q6K06K12r5k15p8J62J91
6930A77n6k36m7J56J59l7k25q2J75J91n5k78l2J59K05m4k23j14J62J84k4k12p4
6953a71J62J77o5k02r7J98J75l6k27j00J48K14n1j67j14J35J70n2j85r3J53K13
6975A85n1k12r8J20K26k6j76j25Q4K00lj88r5J42J76m7k48o3J43J87j3j77j25
6998a84J20J91j0j49j23J20J58nj99q2J30J87mk08j19J22J63J9j45j07J07J14
7020I6kj78n8J18J70lj83j44J16J79L7j21j45N5J47j0j44p5J31J89o7j75j18J10
7044g5J82N7j73j47P2J35M2j15q1R1J27j6j63j23J09J84O3j78j34L8J59O4j10
$$ plain form
6884 37 185 75 -177 -187 52 207 121 -178 -205 14 191 116 -111 -178 15 183 94 -127 -177 3 201 125 -167
6907 -167 -191 6 194 129 -100 -197 13 171 109 -140 -182 23 183 100 -120 -206 0 212 117 -98 -176 -14 177
6930 177 121 -115 -162 -6 153 116 -109 -191 -16 175 120 -158 -190 -31 174 130 -93 -207 -45 139 115 -97 -171
6953 -171 -9 168 103 -99 -196 2 177 141 -86 -186 -38 176 125 -42 -156 -21 149 97 -88 -181 -28 185
6975 185 134 -78 -176 -56 170 144 -32 -157 -73 127 124 -64 -159 -17 159 112 -136 -199 -56 131 118 -59 -184
6998 -184 -64 127 117 -32 -155 -35 123 118 -81 -163 -33 154 150 -58 -177 -55 108 127 -18 -125 -18 96
7020 96 94 -84 -142 -24 146 143 -40 -184 -68 111 148 27 -118 -63 84 74 -70 -145 -14 175 108 -67 -185 -75
7044 -75 107 164 -9 -156 -84 51 93 -22 -103 -12 115 99 -64 -187 -78 106 169 -9 -143 -105 54 118 8
7067Hj02O2J27rj67p1J05J71J8j43j48J7J59Q3r9o8QJ11Kj13q4Q0J74L3j71j78
7093a95P4J69P2p9j20j0J15L5r5n5O2J51j7j22j27L7J67P8r8j25k0J21M0p6o9
7118h7N7J33J0j66q7M3J72N4r2j42K6R8N5o3p3L4R2L9j32q8M9J91M2j21j53nJ04
7145a0Q7n4q1J3R0J7r2q3N0J71L1j15j51j3J62Q4l6r9l2N0O2p3n6RJ60M7j11j57
7173a30K0J13J33o1j22l3R7L6l8o7LJ14J3p4j18J6J07J37o4j16m4L1J00j7q3L2
7199a5N1M9r5j06K3J52N7l8j32l1P2O3Qj02j9R3J5k4j08mJ38O3n8j20p9R7J47
7226I7l8m9n8M9L5k8p9L1R5O2p0j39l8J01J14mq7p4P0L6jp2PP8L0o8p5m1J18J15
7256A17l5j00q0O7L7L5n6k7O0K2m3q4j4R0R8k1r9p0O0J11k0l1n1K2P5m2o6j3P4
$$ plain form
7067 8 -94 -32 95 86 -81 -152 -47 124 142 -1 -149 -132 27 110 11 -57 -49 62 64 -49 -133 -53 121 154 -17 -195
7093 -195 -121 48 120 41 -79 -89 26 61 -34 -89 -27 124 107 -15 -142 -105 62 140 42 -83 -103 18 58 -18 -87
7118 -87 -30 103 113 -53 -140 -97 75 129 37 -105 -79 19 74 11 -62 -28 64 103 -29 -117 -68 123 165 44 -109 -114 -10
7145 -10 77 23 -58 -45 45 62 -30 -113 -63 108 139 24 -127 -140 22 106 70 -29 -61 -11 51 -22 -78 -69 91 138 27 -130
7173 -130 -110 3 136 75 -47 -80 17 53 15 -52 -49 65 78 4 -114 -98 9 146 82 -34 -78 -47 53 36 -47 -15
7199 -15 36 85 -10 -116 -93 59 116 78 -54 -85 -13 50 58 -44 -63 30 45 21 -87 -91 47 110 52 -68 -147 -50 97
7226 97 59 10 -48 1 36 8 -71 -40 55 117 47 -92 -130 -29 85 81 -6 -80 -10 26 25 -47 -40 38 68 0 -75 -116 2 117
7256 117 82 -18 -98 -31 6 41 -15 -42 18 40 -3 -87 -101 -11 87 66 -33 -103 -43 68 48 17 -34 -12 63 21 -45 -58 16
7285A6O0J5j10q2N2Q6K9o1m8M9K7j1o2LK6P8k8n5p8M3J00J9m8p6L4L7K7o2KJO4
7316D7lq1o5N2Q1L1o0l9NK6Q7p6qj9Q8l1r2j0N6O8Lk8q2j3P3M8n9k3lL8Jk9l7
7349e4L0O5Ql4r4L2N9L1kp0lM6K8n6k0QN6L9o9l9rN5O2m2n3nK4M0j9p7K0Q5j6
7382B6J9q3m5J04L9rp4k9O1J5j0o0K0O3Mk6n6j2P4K3j2k3q9N9P2l1n4J7nN0l6
7413hk7k1P5L2k6n3k3N2K1J7m9l5N0L0l7j8k6K6P2j8o2j4K3Q5k7m6m1O5K5j8k2
7444Bo0O9N9l0p2j1K9L1L7o4m7N5K8J0o5l3L0Q3l0m5j3J0N9K2o6n6N7L2K4k7n3
7475c5J2L9L4o6n6L4P3J4l8n5KO5K4l4o3OQ6%k7n5J3N4Rl1l6%L4N1m5n9L5L8J8
7508D1k0q8K9M9K3j9r1lP3L7l0m5j3P1K8n5k3m4Q3N8m7m2k4P7K9l5o3k5Q7M1k6
$$ plain form
7285 16 76 91 -19 -101 -49 37 66 5 -43 6 33 22 -40 -37 -11 67 39 -16 -94 -51 49 68 20 -56 -22 15 42 -20 -18 -17 47
7316 47 44 -37 -102 -50 31 62 2 -37 -32 -6 81 5 -3 -22 66 35 -57 -67 -11 57 60 32 -50 -63 10 58 -1 -24 -27 11 12 -17 -54
7349 -54 -24 41 49 15 -79 -47 12 43 41 -29 -32 14 42 -14 -34 -26 30 69 0 -39 -48 7 69 27 -26 -31 -7 33 14 -63 -43 42 26
7382 26 45 -38 -83 21 60 51 -23 -52 9 24 14 -46 -26 37 41 15 -41 -53 21 44 32 9 -80 -21 51 20 -34 -17 -22 28 -8
7413 -8 -35 -56 19 51 25 -28 -51 1 22 39 -10 -45 5 35 -2 -20 -46 -20 52 34 -28 -42 -19 66 39 -7 -48 17 42 24 2
7444 2 -58 11 70 40 -32 -43 -14 17 54 -10 -57 -2 26 36 -29 -62 -32 51 21 -24 -37 -27 32 54 -12 -68 -11 21 45 18 -35
7475 -35 -23 16 50 -16 -72 -38 35 49 11 -44 -42 23 47 13 -50 -44 42 42 15 -40 -27 27 36 5 -31 -31 3 54 9 -50 -15 23 41
7508 41 21 -67 -38 11 34 15 -76 -79 -6 31 1 -44 -57 14 42 -13 -36 -80 3 61 14 -28 -52 25 54 19 -44 -69 18 59 33
7539C3p4NM7N1n2n2pN5N9l4o5j4N5N9n9o2J2M2O0k2p6j2L7O6lr2k3O9L1qp6nO3
7572HO1n1o8j7O5M0rq4LN5O0k5o6l5M7P3j6r4k3P2N3j1p8qL7N9k5o8k6P3N2%j06
7605e2l3R5P4k4p6o4P8O1oo4o7M9P0L0j10l6O8L4J3p1m3M3P6Qp2l7K1O6J3p0l4
7636f0N3L4K7q7m5M5Q4Nq1m9N9Q5j0p8o8P4N5K1p1m2J9O1M1r5m7M9P7K7p8o9L6
7667b8Q6J2r7k5J1Q0Oo3n5K8Q0J8o0m8K8R5Jq2n8J5R5L3q3m6J4P4M2o4p1J9J01
7698E8K5q1q8N4J00K2r6q0K9R2N8r7m6J9P5L7o9j09O0O8N9q8q6L7R2M8r0n8qQ8
7728B5L2m8q1K4P2N5n2j21M1J16Jl6j16M3P2N1p8p5K8R4M1p3p8JQ1O8n8r5j3J08
7758B9L9l8j00j2J18N1n8j02J0J03L9n1p8k5J18K5n0r1J0O7P7o9q9mR4N9o1o9
$$ plain form
7539 33 -41 -36 11 62 10 -42 -49 6 65 31 -34 -48 7 66 7 -55 -43 -1 59 37 -39 -51 -14 52 49 -43 -66 3 34 26 -50 -55 8
7572 8 69 18 -50 -67 -2 38 29 -55 -52 3 63 38 -28 -63 -16 57 41 -53 -76 -4 49 38 -40 -48 -11 48 23 -45 -71 2 54 54 -52
7605 -52 -85 10 84 60 -16 -80 -2 59 53 -11 -78 -29 41 71 -39 -75 -7 27 40 -31 -74 -31 45 53 -19 -56 -35 31 44 -26 -60
7636 -60 -7 27 54 -33 -78 -33 51 56 -25 -74 -15 70 60 -18 -86 -12 43 64 -7 -49 -30 31 72 -23 -70 -21 56 83 5 -64 -28
7667 -28 58 70 -27 -52 -41 39 45 -18 -73 -45 35 53 -7 -55 -27 68 69 -13 -71 -56 39 72 -11 -57 -43 31 73 9 -62 -43 58
7698 58 83 2 -86 -32 68 90 -6 -86 -57 35 93 -4 -50 -31 44 81 12 -97 -37 31 90 2 -84 -47 45 93 3 -55 -63 25
7728 25 57 9 -72 -48 24 79 27 -94 -53 63 64 28 -88 -45 27 78 0 -75 -47 47 88 15 -63 -62 19 87 29 -66 -79 29
7758 29 68 30 -70 -82 36 87 29 -73 -63 40 79 28 -50 -75 43 68 18 -73 -63 4 81 12 -77 -81 13 72 11 -58
7786e8lP2Q2o1r4j2O7Q8l7j08j2P6Q4n0r3qP0Q7l9r6k2P0P1n1r3j1J06P7p0q2
7816e0k5J05P0o2r0l4J09O0qj44oP7R0o6q4j9Q2P2l9q5l0R2P1n1q6m4R0R5j8j26
7846e4j9O3Q1k1j13k8R7P8k7j13k1P5J03j7j39k1J05P7m4j16l9Q9J13n7j20k5
7872i3O8J09k8p2q5J10P5m3p4l9P3Q3m1r5n8J11O8j0j22k1O8Q9l4o2o9P1J11k5
7900F5j11m2O3J23m6o3n9O9R3k8o5q7R5R4k1j01o9Q4J10k3j20o6P4J09Nr6n8O4
7928gR1j1j29l5P8J15Pj37m8M0J19J4j34o9R5O0L0j11p8J14J12l7j16m7L5J32
7954H3j2r4p3P2J16j4j10k3K1J37nj23o7M6J53Kj21p9N5Q5L2r9p6M6J18J3j08
7981b5p6N1J14L6j01j04O8Q1M2r5p9L8J12Lp5q7L6J27M8j11j01M4R9M4r6q2P0
$$ plain form
7786 -58 -61 11 93 32 -62 -74 -7 81 44 -64 -76 0 84 34 -59 -67 3 90 51 -45 -67 3 74 23 -70 -81 25 102 32 -50
7816 -50 -75 30 100 38 -52 -86 23 83 75 -69 -75 2 92 26 -58 -77 5 77 38 -47 -77 15 86 35 -51 -95 -5 90 72 -54
7846 -54 -73 -10 71 50 -63 -91 6 84 57 -56 -77 -2 101 84 -55 -76 29 106 62 -54 -93 -4 109 52 -68 -93
7872 -93 -25 84 56 -16 -101 9 84 41 -33 -72 1 84 43 -52 -110 1 69 59 -63 -84 -16 73 39 -23 -92 -21 90 65
7900 65 -46 -88 -25 98 52 -11 -70 -1 92 64 -1 -88 7 101 80 -21 -90 -6 104 81 -39 -105 -31 78 83 -13 -71 -7
7928 -7 84 73 -56 -91 -13 102 109 -28 -76 -36 83 97 -37 -106 -11 49 79 -32 -110 4 116 79 -37 -84 -49 83
7954 83 71 -23 -96 -24 92 78 -32 -55 -34 103 98 -25 -92 -46 107 109 -12 -91 -36 49 81 -18 -94 -48 70 83 -25
7981 -25 -101 -50 64 100 -1 -105 -37 44 86 -9 -88 -50 62 65 -10 -97 -61 66 114 3 -98 -54 45 89 -7 -89 -19
8008a9R0Nn9j23M9J18L2n7j19L0R8N2o8q1J1J08K1r2q1M3J27K6j15r6K2J45jl0
8036C6j06K7J04K7p9r6MJ58K6j03j05K5J46N0j11r2K0J20K9p9o8K4J01L6r9r1
8062i6L7J21P2r8j27NJ37K7o1q0J1J03O8q3j31K0J45N1j11q5LQ0R8j04p3nJ31
8089E5K1r5q1K7J23O4q3j16LJ06P6p9p9j2J00O2m7j31j3J43P9r3j22NQ7Q9j4j54
8117g9J0Q4O5n3o6j9R6O4o9j06pR2R0q9p6mQ4P0p2j24K1J14N0l7j24rJ17P4o1
8146C6j38RJ12J03p1j23L0O2O7r0q5k6J52Q1p7j18k1J00J07p4j00j3J01P5o0j07
8172f8l1J49Q7j03j00l8J23R2m6j20k6J04Q3o2j32RR1J07l9
$$ plain form
8008 -19 71 76 17 -106 -57 61 93 36 -83 -53 45 97 29 -52 -41 67 88 -4 -85 -42 85 111 -4 -100 -78 67 66 36
8036 36 -70 -43 61 88 9 -87 -83 75 101 -2 -107 -82 64 114 3 -89 -69 51 80 1 -67 -43 58 94 -5 -96
8062 -96 -59 62 134 36 -91 -86 51 78 17 -63 -52 51 119 36 -95 -75 70 121 10 -75 -72 8 106 2 -71 -76 55
8089 55 76 -19 -100 -73 50 114 31 -85 -82 24 100 21 -58 -70 30 92 45 -86 -99 44 123 30 -92 -87 0 89 75 -79
8117 -79 -69 15 80 27 -39 -58 38 102 33 -73 -80 12 102 13 -63 -67 17 87 15 -109 -88 26 76 39 -85 -94 23 97 36
8146 36 -102 -93 19 122 51 -72 -42 20 87 -3 -88 -114 38 119 42 -76 -97 3 110 36 -64 -77 24 99 39 -68
8172 -68 -99 50 137 34 -66 -104 19 111 65 -55 -81 23 106 44 -88 -79 12 119 80
8191H0
$$ Imaginary data points
##PAGE= N=2
##DATA TABLE= (X++(I..I)), XYDATA
0@%%%%%%%%%%JkRj6J6j6K4l2L3m1N6o5P3q9J06j22J42j66J92k20K55k92L28l72
34a98M23m77N36o04O75p53Q42r36J039j153J276j410J558j721J896k089K304k536
52a328K793l084L404l758M163m627N156n772O508p393Q480r865J1691j4220J7986
67A0134k4252L7086j05977L04273K96560l82072m23973P407M08604J69176k76047
78B0919l45133J05858M02998J58180l32294l62895J02854M73959K27829l08885
88A43390m69889n6899L62870K87296j26558k80901o194K76766J36715k32420l14636
99b80460L0781L44446K11144j97167l39809m2956K98612K49103r1125k64871p9534
110a61836J57196J08509j25862j70090P1271K70276J29582j89546k76845k4826
$$ plain form
0 0 0 0 0 0 0 0 0 0 0 0 1 -1 8 -8 8 -8 16 -16 17 -24 32 -33 40 -49 57 -65 77 -89 103 -117 138 -154 174 -198
34 -198 225 -252 284 -320 355 -398 444 -492 547 -606 670 -740 818 -903 993 -1096 1208 -1328
52 -1328 1465 -1619 1785 -1973 2190 -2437 2719 -3053 3455 -3938 4542 -5323 6368 -7852 10134
67 10134 -14118 22968 -83009 221264 517824 135752 -288221 -280814 127790 296966 20919
78 20919 -324214 -218356 184642 342822 10528 -352367 -249513 224446 452275 143390
88 143390 -326499 -383398 -20528 266768 140210 -140691 -146885 129881 266596 34176 -280460
99 -280460 -249679 94767 305911 108744 -231065 -274021 24591 273694 182569 -82302 -161836
110 -161836 -4640 103869 -21993 -192083 -120812 149464 279046 89500 -187345 -212171
120b12171K28583J64504j00279j97240j7846J61864Q9365j07798j20855Q0810
130c1063J94267J9561k33160k15566P6155K77565J38698j42837j96447J7758J73073
141G8004M7816j64540j39457J06325K24314K4607k35909j89829J27791L04051
151A83173R7425k31633k63238K5502K39454J06357j59280j66845R8405K51128
161A80448M8570k54893k41611R3886L16985J27966k29433k86394K7496K95400
171G8420J73836j55916k46917N356K31169J05083j98657k43662O1019L19602J77732
182C07065j93859l17063l8585K69755K09266j19818k69104n1458K20850J76076
192A93125j10218k30368j1966K41279J67106j52651k94467o3343K44651K37491
$$ plain form
120 -212171 16412 180916 80637 -116603 -134449 27415 116780 8982 -111873 -31063
130 -31063 163204 182765 -50395 -265961 -189806 87759 226457 83620 -112827 -95069 78004
141 78004 125820 -38720 -178177 -71852 152462 177069 -58840 -248669 -120878 183173
151 183173 280598 48965 -214273 -188771 50683 157040 -2240 -169085 -70680 180448
161 180448 229018 -25875 -267486 -173600 143385 271351 41918 -244476 -216980 78420
171 78420 252256 96340 -150577 -145221 85948 191031 -7626 -251288 -190269 129333 307065
182 307065 113206 -203857 -242442 27313 236579 116761 -152343 -203801 17049 193125
192 193125 82907 -147461 -159427 81852 248958 96307 -198160 -261503 -16852 220639
202B20639n7063k43659r4022J62203J70252o4938k03439n1541J74891J56621q4653
213H5291k16243n1402J93126J90983n4184k20830j04302J21223J55825k1000j42566
224f4079l8400J32492J15663p4761j74976m0655J49984J39319n7776j75328n8823
235a47340J28813J37624k9336j33698l9814J02717P9932p9427j41359l82J61612
246C9342J20381p7211j71016l9935J34290J17126n9990j47701k6913J27888R6819
257A13080p4755j39264L626J59157J02135j05717j88790l0288J63517J39728o0564
268H1865j62333l3322J39151J11003p9663j65049k0544J57361J20485q6719j82295
279a20060l0400J70210J51189o3371j89298o5806J31296J35037m9494j58920l7944
$$ plain form
202 220639 163576 -80083 -174105 -11902 158350 93412 -110027 -161568 13323 169944 85291
213 85291 -130952 -182354 10772 201755 147571 -73259 -177561 -56338 99487 78487 -64079
224 -64079 -102479 30013 145676 70915 -104061 -144716 5268 144587 86811 -88517 -147340
235 -147340 -18527 119097 89761 -43937 -83751 18966 98898 19471 -121888 -122270 39342
246 39342 159723 82512 -88504 -128439 5851 122977 62987 -84714 -111627 16261 113080
257 113080 38325 -100939 -97313 61844 163979 58262 -130528 -160816 2701 142429 81865
268 81865 -80468 -113790 25361 136364 56701 -108348 -128892 28469 148954 62235 -120060
279 -120060 -150460 19750 170939 107568 -81730 -147536 -16240 118797 69303 -89617 -127561
290a27561J46401J35210o3795j82601n8113J43027J50241m4845j78844p3307J27059
301b7128J53900k1564j55206o8605J09989J27841m1628j62651o2563J28798J53494
312A34677k2703j63386q2804J04048J42637j4496j48851p8218R6038J32968j4432
323H5478j37357o3352J04955J32163k4059j53973q1605R4937J39018k452j30385
334c6632p1265Q6804J21555j4849j31920o7073Q9343J19850j7853j32174o3459
345a17673R5790J28278r948j31244p3983P7849J13556j2101j19730n6770R0259
356a5717J16746j6300j27544o4526Q5676J15898j5260j27023o5696Q4838J19452
367I0544o583j18286o2708Q0245J09343j8100j26211o3485Q7242J21647p126j22897
$$ plain form
290 -127561 18840 154050 90255 -92346 -150459 -7432 142809 97964 -80880 -154187 -27128
301 -27128 126772 105208 -49998 -118603 -8614 119227 77599 -85052 -147615 -18817 134677
312 134677 111974 -51412 -134216 -30168 112469 97973 -50878 -129096 -33058 99910 85478
323 85478 -51879 -115231 -10276 121887 97828 -56145 -137750 -42813 96205 93753 -36632
334 -36632 -107897 -21093 100462 85613 -46307 -113380 -24037 95813 77960 -54214 -117673
345 -117673 -21883 106395 96447 -34797 -108780 -30931 82625 70524 -49206 -105976 -15717
356 -15717 101029 84729 -42815 -107341 -21665 94233 78973 -48050 -113746 -28908 90544
367 90544 83961 -34325 -97033 -16788 92555 74455 -51756 -115241 -27999 93648 86522 -36375
379c6375o8035Q0574J17203q983j24549p1019P7976J18146m001j18561o6128Q1259
391b2493J19191p019j26106p6043P4320J20223J174j16934p0837P5289J19090
402H9855k61j19192p5610O9120J15681J283j14945p1676P2313J19223N077j13900
414b3032p6623O3099J12334M447j10371p2791O5838J15385Q938j06946p4408N9395
426c4735J09058N819j07386p4035O0875J12849J1928j02276p3651N6681J07962
437G3089Q751j04455p5425N6014J09795J3351r9173p2487N6171J08266J0306j03886
449a9683p7578N3164J09441J5495r7848p4277N3426J08571J4293j00230p7876
460i3102M9801J07145J5848r7275p5668N1755J10203J8950r7243q0279M4654J05201
$$ plain form
379 -36375 -104410 -23836 93367 84384 -40165 -111184 -33208 84938 80937 -37624 -103752 -22493
391 -22493 96698 89679 -36427 -112470 -38150 82073 83247 -33687 -104524 -29235 89855
402 89855 89594 -29598 -105208 -36088 79593 80876 -34069 -105745 -33432 85791 90868 -23032
414 -23032 -99655 -36556 75778 80225 -30146 -102937 -37099 78286 87224 -19722 -94130 -34735
426 -34735 74323 80142 -27244 -101279 -40404 72445 84373 -17903 -91554 -34873 73089
437 73089 81840 -22615 -98040 -42026 67769 81120 -18053 -90540 -34369 73897 84203 -19683
449 -19683 -97261 -44097 65344 80839 -17009 -91286 -37860 70711 85004 -15226 -93102
460 -93102 -43301 63844 79692 -17583 -93251 -41496 68707 87657 -9586 -89865 -45211 59990
472E9990J9386r3063p6626M6476J06932K1670r2091p8737M1832J03097K1285r0679
484a0528p8727M0844J04552K6210q5369p7371L6955R8840K2838q6008p7572L7075
496d8261J00916K7073q2100p6612L4709R7862K5756q2596p8398L2274R7331K8285
508G6239p8324p5056L3132R6262K6776q0455p8168L0370R5889K8816p7324p5695
520g7538L1391R6427K9475p7918p8550K7792R4193K9685p5948p6163K9409R5639
532D7894L1241p5663p8485K6002R3471L1374p4409p8155K5197R4281L5237p0400
544G585p7848K1540Q9674L2729p0138p6958K2108R1357L6288o7512p7903J8363
556e0715Q8580L6996o4979p7728J4925Q5359L7818o0610p3519J6489Q4428L5651
$$ plain form
472 59990 79376 -13687 -90313 -43837 63095 84765 -7326 -86063 -44231 58866 80151 -10528
484 -10528 -89255 -48411 56141 82351 -3018 -80389 -43434 55406 78244 -7764 -85336 -48261
496 -48261 52655 79728 -2372 -78984 -44275 53587 79343 -3253 -81651 -49377 47954 76239
508 76239 -2085 -77141 -44009 52253 79029 -1426 -79594 -49224 46665 75481 -1843 -77538
520 -77538 -46147 50280 79755 1837 -76713 -48921 45272 74957 -991 -77154 -47745 47894
532 47894 79135 3472 -75013 -49011 44460 75834 1425 -76730 -51533 42748 77985 7585
544 7585 -70263 -48723 40951 73680 3542 -73416 -51308 40049 76337 8825 -69078 -50715
556 -50715 37865 74861 9882 -67846 -52921 32438 70256 9646 -63873 -47384 37044 72695
568G2695o3310p7028J3597Q4978M0563n7648p4957J0764Q0244L8382n5659p1695
580e9074J1571P8078L5240n7829p1563J4252Q2306L9081n6588p4796P688P6761
592B5127L8495n2046o8259J1624P5598L4073n5908o9193J3821P9381L6395n7305
604A1803p3896R097P8469M0900m9915o8975Q027P2304L3595n4412o7931J3985
616d6949P9648L7446n6764p5162P649P9842M3859m9932p3824K761P2665L9997
628F1236m8514o8594R320P7867M0093n5540p9147L034Q1453N1429m5576p8778
640e1717n507P2190M8533m1438p1833q43P2448M4793m7731p8110k113P9501N6641
653G4814m0312q2173j5344O7402N5604l0499p0268j0284O3886M7667l7056p2442
$$ plain form
568 72695 9385 -67643 -54046 30932 71495 13847 -61110 -50346 29898 68280 12621 -59074
580 -59074 -47503 30575 65815 7986 -63577 -49325 32981 72062 15474 -59322 -51634 25127
592 25127 63622 11576 -56683 -45059 30539 64612 8704 -60489 -46668 32713 69108 11803
604 11803 -62093 -52996 25473 66373 16458 -52517 -44490 27814 61409 6997 -60934 -46949
616 -46949 32699 70145 13381 -61781 -54132 25710 69569 19637 -54187 -51426 21239 61236
628 61236 12722 -55872 -46552 31315 71408 15868 -63279 -60245 21208 72637 27061 -51717
640 -51717 -57224 14966 63499 22061 -49772 -50615 21833 66626 18895 -59215 -61328 18173 74814
653 74814 34502 -47671 -63015 4387 59991 29492 -40776 -51060 12826 60493 23437 -49005
665d9005p902O9933N5102l3573p7896k0012O0842N7900j9686o3974j7858M9887
677C758M3618k6617o0540q301N8978M7807k8686o8009j7972N3750N2511j6056
689C4241n7430j8912M1054L8123k0337m8194l940N0502L6302l1120o0583j0255
701e0549N3555M6457j9800n5046j4745M1363L4981k1639m5105j04M9160K9306
713D7834l6505n7620q82O0420M3977k8915o1511j2590M8496L8688k4601m9804
725c3013n36N2835L1333l9539o1184J175O6859M6638l5130p1264j5167N7100N0250
738E0357k2119n8586j0354N2284L8946l3909o4111n126O6933N3322l1771p7404
750d1538k3589N8390O1840j3598o4854k5960M4977M8611j8477o0443j5570N6418
$$ plain form
665 -49005 -56907 13026 68128 34555 -43341 -63353 -2511 55389 35703 -28271 -46129 3758
677 3758 47376 20759 -39781 -48082 10896 58703 30017 -37992 -55964 -2214 50297 34241
689 34241 -23189 -42101 -1047 37076 16739 -31455 -35395 15107 51409 20289 -40294 -50549
701 -50549 3006 49463 29663 -25383 -40128 1235 36216 14577 -30528 -30632 18528 47834
713 47834 11329 -46291 -47173 13247 57224 28309 -33202 -45792 2704 41392 16791 -33013
725 -33013 -33549 19286 50619 11080 -50104 -48929 17930 64568 29438 -41826 -56993 107 50357
738 50357 28238 -30348 -40702 11582 50528 16619 -47492 -52618 14315 67637 35866 -41538
750 -41538 -65127 -6737 55103 41505 -23349 -49309 -4332 44279 25802 -34641 -50211 6207
762F207N5214k2133p4651l1638N1677O7444k105o3142l7979L3505N2781k444n1316
775a8580k4338M0179N0141j1956o2882l1788M2520O3178M106n6528m2106K2718
787b5336M9718P874l9082k5399K6139L9400o661m7911k4556L4965N1017J475m8814
800g171l5738J9492M3146R136l0232k0899J8568K7249q942l6702j2399L4330L8807
813C8645p994m5859k5236K5292L9253K285l1434j6905K0216K3380j2641l3634
825b4632m234L8474L3039j8602n0005j8431L5828M2593m536m0608j8765K6648
837c231K9808j3153l8588o248M1442L5644k1983n6137j8552M4406N1190o364n2012
850a3778k7716K9989M1570o133m3592j6125L8564M1606j6058n7849k4353M3783
$$ plain form
762 6207 61421 39288 -35363 -67001 -15324 52120 50015 -13127 -51106 -17601 35180 32736 -18580
775 -18580 -42918 -2739 47402 35446 -27436 -59224 -16704 46474 50580 -5948 -48054 -25336
787 -25336 24382 32256 -6826 -32225 -6086 33314 26653 -21258 -45814 -10849 40168 41643 -7171
800 -7171 -42909 -23417 19729 28865 -1367 -22266 -3698 23551 14609 -22093 -34492 -162 38645
813 38645 30651 -15208 -40444 -15152 24101 26386 -5048 -21953 -1737 21643 9002 -24632
825 -24632 -28866 9608 42647 24045 -25960 -44391 -8563 34030 29494 -11114 -29879 -3231
837 -3231 26577 13424 -25164 -31412 10030 45674 23691 -32446 -50998 -6592 44598 38234 -13778
850 -13778 -41494 -11505 30065 23932 -19660 -35785 2779 44385 28327 -29522 -53875 -10092
862a0092N7639j822n7492l8209K7334N1531O180m2796k8151K7235M3516m398n0930
875b0455k9360L5022N6934N544n3236m3966J9304N3578J7482l6442l6128J3056
887a8667L9721P212l7149k9101K2724M7533R113m3493m1245J2588M8017K1589
899C8842k8221l5906L653L2518J2159k5095k4025J4520L5317O720l4388l1902
911c5808J2253M0581J7223k5118l1261K380K6888J0578j9045j7492J2922K6528
923B0629O05l0455k2080J6920L5436Q645k7768k6556P759K7139P369k0086j4807
936a7250J4642K3420m223l0776j6726K2641L5013K278l3351k5620J3907L1972
948A5927O388k5183j8543J5415K6675k758l1904j7439K4177L7004J208l7783k8731
$$ plain form
862 -10092 47547 45725 -11767 -49976 -22642 28889 35069 -7727 -35878 -8643 34873 30475 -20455
875 -20455 -49815 -14793 42141 47685 -5551 -49517 -30213 23365 40847 4405 -31723 -18667
887 -18667 21054 28266 -8883 -37984 -15260 32273 41386 -2107 -43352 -30764 17253 38842
899 38842 10621 -25285 -21632 10886 23045 -2050 -26075 -11555 23762 30482 -3906 -35808
911 -35808 -23555 17026 34249 9131 -22130 -19750 7138 17716 -1329 -18821 -5899 20629
923 20629 21234 -9221 -31301 -14381 21055 29700 1932 -24624 -16865 10274 17643 -2443 -17250
936 -17250 -2608 20812 16589 -14187 -30913 -8272 26741 29019 -4332 -29952 -16045 15927
948 15927 22315 -2868 -21411 -5996 20679 17921 -13983 -31422 -7245 29759 30967 -6816 -35547
961c5547J6518L8489R713k9063k5687J2917L1576L813l1086k2634J9920L8302
973B7231M956l7351l2112J4806M2105J4960k9504l2503P295L3880J1780k6578
985a035k6502J2560L6164J0003l2080l2882J0059M0416J8310k6276l4845J695
997b4413L2682J7682k0002k7326M853L0308J2494k4561k9474N932L4671J8317
1009C1163k1485l2181j274K8741J8746j4842k5221K92K4250J2544j8116k3980
1021b1363M366K8395J4796j8838k7761o11K5688J6835j3223k2764j28K1242J1173
1034A7807j5626k0480M562K4874J1349j8617k4330K297K5529J4449j4806k2329
1046a5321Q20K1390J0530j5642j9550N302K4152R808j9270k3180M147K6238J3336
$$ plain form
961 -35547 -19029 19460 29173 110 -25577 -12660 18916 22729 -8357 -30991 -11071 27231
973 27231 32187 -5164 -37276 -22470 19635 34595 5091 -27412 -20117 13763 25543 -1035
985 -1035 -27537 -14977 21187 31190 -890 -33772 -23713 16703 35013 8737 -26108 -24413
997 -24413 8269 25951 5949 -21377 -16524 13784 26278 1717 -27757 -21825 12846 31163
1009 31163 9678 -22503 -23777 4964 23710 8868 -16353 -16061 8189 20733 2617 -21363
1021 -21363 -16997 11398 26194 7356 -20405 -21016 4672 21507 8284 -14480 -14608 6634 17807
1034 17807 2181 -18299 -13737 11137 22486 3869 -20461 -18164 7365 21814 7008 -15321
1046 -15321 -14501 6889 17419 1777 -17773 -12471 11681 21489 2219 -20961 -16814 9424 22760
1059B2760j6943k3578J569K3294J2014j5724k0804M105K4088J0456j8809k3361
1071b0933L883K6530J3973j6940k4685N80K4118J4131j4811k2557J330K3289J2683
1084B0591j6162k3327J719K5241J4904j5465k5060j209K3516J5891j2768k3120
1096a5249j339K1997J4601j3305k2923q23K2712J5436j3093k3953k465K2128J6475
1109B0199j1087k2773l185K0188J5167j0972k1808k350K0651J5287j1030k2323
1121a4036l126K0182J5838r960k1817l713J9076J5304r441k0774l253J8745J4837
1134A7862r650k0974l565J8592J5198q906k0473l894J7872J4972q530k0190m072
1147a5758J7507J4846q155j9776m132J7203J4866p875j9760m407J6908J4841p608
$$ plain form
1059 22760 5817 -17761 -16192 7102 19116 3392 -17412 -13307 10781 21237 2428 -20933
1071 -20933 -17050 9480 23453 6513 -18172 -17592 6526 20657 5846 -16711 -15381 7908 20591
1084 20591 4429 -18898 -17179 8062 22966 7501 -17559 -18768 4748 20639 7871 -15249
1096 -15249 -16588 5409 20010 6705 -16218 -17041 5671 21107 8014 -15939 -18404 3724 20199
1109 20199 9112 -13661 -16846 3342 18509 7537 -14271 -16621 4030 19317 8287 -14036
1121 -14036 -17162 3020 18858 8898 -12919 -16632 2444 17748 8307 -12467 -15720 3025 17862
1134 17862 8212 -12762 -16327 2265 17463 8557 -11916 -15810 2062 17034 8504 -11686 -15758
1147 -15758 1749 16595 8440 -11336 -15468 1735 16601 8726 -11034 -15441 1467 16308 8700
1160H700j9607m732J6677J5294o936j9507n379J5888J4973o509j8903n119J5786
1173F26J5036o450j9109n552J5591J5415n771j8916o253J4629J5257m944j7853
1186h294n952J4109J4475n387j7948n893J4332J5088m661j7829o744J3212J4738
1199A3246l738j6579o440J2381J3682m061j6178n704J2871J4013m044j6660o766
1212a3977J2015J4161k822j5429o488J1130J2951l352j4963n706J1732J3116l750
1225H618j5758o377J1707J3914k590j5126o841J0524J2845k782j4443n755J1241
1238h23J2911l436j5464o434J1521J3952k523j5363p309J0318J3414j888j4243
1251e367o563J0413J2890k753j5016o820J0897J4097j659j5039q030R506J3812
$$ plain form
1160 8700 -10907 -15639 1038 16332 9396 -10111 -15490 398 15371 8862 -10041 -15160 626
1173 626 15662 9212 -9897 -15449 142 15557 9786 -9130 -15383 -754 14503 9559 -8294
1186 -8294 -14246 -137 14338 8951 -8997 -14890 -558 14530 9869 -7960 -14704 -1492 13246
1199 13246 9508 -7071 -13511 -1130 12552 8491 -7687 -13391 -520 13493 9449 -7211 -13977
1212 -13977 -1962 12199 9377 -6052 -12540 -1410 11541 8189 -6774 -12480 -748 12368 8618
1225 8618 -7140 -13517 -1810 12104 9514 -5612 -12453 -1929 10916 8134 -6309 -12064 -823
1238 -823 12088 8652 -6812 -13246 -1725 12227 9704 -5659 -12968 -2650 10764 8876 -5367
1251 -5367 -11930 -1517 11373 8620 -6396 -13216 -2319 11778 10119 -4920 -12950 -3444 10368
1264A0368p10j3789p580Q901J2834j185j3761p302R420J3564o72j4054q565Q116
1278d415J3524O67j2564q236P224J2334K46j2118p622P522J2477L26j2447q326
1292a1408O953J2739J354j1352q361N818J1413J094j0640p388O320J1322O10j1065
1306b591p672O180J1631J305j0567p955N329J0911J372r701p043N507J0385O68
1320G759j0133p109N771J0806J233r949p460N063J0370J408r263o967M942R827
1334F298R92r337o727N264J0192J198r430p246M758J0039J660q822p012M351R682
1349E860J537q651o896M431R611J596q688p118M137R731K065q281p175L630R357
1364E146K098p964o993L612R210K158p811p008L411R155K278p672p091L164Q982
$$ plain form
1264 10368 9658 -4131 -11711 -2810 10024 8839 -4922 -12224 -2804 10760 10088 -3966 -12531 -4415
1278 -4415 9109 9776 -2788 -11024 -3800 8534 8780 -3338 -10960 -3438 9039 9365 -3082 -11408
1292 -11408 -4455 8284 9638 -1714 -10075 -4257 7156 8250 -2390 -9778 -3458 7864 8474 -2591
1306 -2591 -10263 -4083 7548 8853 -1714 -9669 -4340 6571 7943 -1758 -8801 -3294 7091 7759
1320 7759 -2374 -9483 -3712 7094 8327 -1622 -9082 -4019 6351 7759 -1504 -8471 -3529 6298
1334 6298 7290 -2047 -8774 -3510 6682 7880 -1550 -8796 -4038 6001 7661 -1161 -8173 -3822 5860
1349 5860 7397 -1254 -8150 -3719 5892 7488 -1200 -8318 -4181 5550 7615 -666 -7841 -4211 5146
1364 5146 7244 -720 -7713 -4101 5109 7267 -544 -7552 -4141 5014 7292 -380 -7471 -4307 4675
1379D675K476p265o927K808Q629K436o950o766K724Q348K397o755o548K694Q249
1394D225K499o640o662K340P959K663o140o270K174P529K373o030o023K330P537
1409C864K307o112o255K088P591K745n658o215J698O997K508n422n705K034P099
1424C564K352n775o124J935P404K915n424o339J254O881K963m874n776J447O698
1439C101K532n363o063J564P279L252n093o565O86O727L576m204n948N89O127
$$ plain form
1379 4675 7151 -114 -7041 -4233 4396 6832 -118 -6884 -4160 4188 6585 -170 -6718 -4024 4225
1394 4225 6724 84 -6578 -4238 3721 6384 244 -6026 -3852 3677 6050 20 -6003 -3673 3864
1409 3864 6171 59 -6196 -4108 3483 6228 570 -5645 -3947 3050 5558 136 -5569 -3535 3564
1424 3564 5916 141 -5983 -4048 3356 6271 847 -5492 -4238 2643 5606 732 -5044 -3597 3101
1439 3101 5633 270 -5793 -4229 3050 6302 1209 -5356 -4670 2057 5633 1429 -4519 -3930 2197
$$ [...]
8191a14
##END NTUPLES=NMR FID
##END=
