##TITLE=1H ikalashn
B1p2210
22.10.2024
##JCAMPDX= 6.0         $$ Bruker NMR JCAMP-DX V2.0
##DATA TYPE= NMR FID
##DATA CLASS= NTUPLES
##ORIGIN= UXNMR, Bruker Analytische Messtechnik GmbH
##OWNER= root
$$ TOPSPIN		Version 1.3
$$ 2024-10-22 15:53:34.093 +0400  Irina@DPX200
$$ Compression mode = diff/dup
##.OBSERVE FREQUENCY= 200.131300845
##.OBSERVE NUCLEUS= ^1H
##.DELAY= (6, 6)
##.ACQUISITION MODE= SIMULTANEOUS
##.ACQUISITION SCHEME= undefined
##.AVERAGES= 32
##.DIGITISER RES= 18
##SPECTROMETER/DATA SYSTEM= spect
##.PULSE SEQUENCE= zg
##.SOLVENT NAME= D2O
##.SHIFT REFERENCE= INTERNAL, D2O, 1, 17.49637
##AUDIT TRAIL= $$ (NUMBER, WHEN, WHO, WHERE, WHAT)
$$ ##TITLE= Audit trail, TOPSPIN		Version 1.3
$$ ##JCAMPDX= 5.01
$$ ##ORIGIN= Bruker BioSpin GmbH
$$ ##OWNER= Irina
$$ $$ F:/spectra/data/iren/nmr/1H/4/audita.txt
$$ ##AUDIT TRAIL=  $$ (NUMBER, WHEN, WHO, WHERE, VERSION, WHAT)
(   1,<2024-10-22 15:53:10.671 +0400>,<Irina>,<DPX200>,<TOPSPIN 1.3>,
      <created by zg
	started at 2024-10-22 15:50:58.125 +0400,
	POWCHK disabled, PULCHK disabled
       configuration hash MD5:
       BE 6D 3F 07 2A EA 11 49 91 17 2B D3 AF B3 58 0D
       data hash MD5: 16K
       FD 06 E3 4E 41 C1 BD F9 D4 25 AF 67 FA 02 70 D3>)
$$ ##END=
$$ 
$$ $$ hash MD5
$$ $$ E8 B8 9D 09 CA 06 AA 63 6D 0E 60 D7 5F 36 F5 C7
##$RELAX= 
##$RELAX= 
##$RELAX= 
##$RELAX= 
##$RELAX= 
##$RELAX= 
##$RELAX= 
##$RELAX= 
##$RELAX= 
$$ Bruker specific parameters
$$ --------------------------
##$DU= <F:/spectra>
##$EXPNO= 4
##$NAME= <1H>
##$PROCNO= 1
##$TYPE= <nmr>
##$USER= <iren>
##$AMP= (0..31)
100 100 100 100 100 100 100 100 100 100 100 100 100 100 100 100 100 100 
100 100 100 100 100 100 100 100 100 100 100 100 100 100 
##$ANAVPT= -1
##$AQSEQ= 0
##$AQ_mod= 1
##$AUNM= <au_zg>
##$AUTOPOS= <>
##$BF1= 200.13
##$BF2= 200.13
##$BF3= 200.13
##$BF4= 200.13
##$BF5= 200.13
##$BF6= 200.13
##$BF7= 200.13
##$BF8= 200.13
##$BYTORDA= 1
##$CFDGTYP= 0
##$CFRGTYP= 5
##$CHEMSTR= <none>
##$CNST= (0..63)
1 1 145 1 1 1 1 1 1 1 1 1 1 1 1 1 1 1 1 1 1 1 1 1 1 1 1 1 1 1 1 1 1 1 
1 1 1 1 1 1 1 1 1 1 1 1 1 1 1 1 1 1 1 1 1 1 1 1 1 1 1 1 1 1 
##$CPDPRG= <>
##$CPDPRG1= <>
##$CPDPRG2= <>
##$CPDPRG3= <>
##$CPDPRG4= <mlev>
##$CPDPRG5= <mlev>
##$CPDPRG6= <mlev>
##$CPDPRG7= <mlev>
##$CPDPRG8= <mlev>
##$CPDPRGB= <>
##$CPDPRGT= <>
##$D= (0..63)
0 2 0 0 0 0 0 0 0 0.06 0 0.03 0 0 0 0 0.0002 0 0 0 0 0 0 0 0 0 0 0 0 0 
0 0 0 0 0 0 0 0 0 0 0 0 0 0 0 0 0 0 0 0 0 0 0 0 0 0 0 0 0 0 0 0 0 0 
##$DATE= 1729597985
##$DBL= (0..7)
120 120 120 120 120 120 120 120 
##$DBP= (0..7)
150 150 150 150 150 150 150 150 
##$DBP07= 0
##$DBPNAM0= <>
##$DBPNAM1= <>
##$DBPNAM2= <>
##$DBPNAM3= <>
##$DBPNAM4= <>
##$DBPNAM5= <>
##$DBPNAM6= <>
##$DBPNAM7= <>
##$DBPOAL= (0..7)
0.5 0.5 0.5 0.5 0.5 0.5 0.5 0.5 
##$DBPOFFS= (0..7)
0 0 0 0 0 0 0 0 
##$DE= 6
##$DECBNUC= <off>
##$DECIM= 32
##$DECNUC= <off>
##$DECSTAT= 4
##$DIGMOD= 1
##$DIGTYP= 9
##$DL= (0..7)
0 120 120 120 120 120 120 120 
##$DP= (0..7)
150 150 150 150 150 150 150 150 
##$DP07= 0
##$DPNAME0= <>
$$ [...]
##$SW= 21.9926040160658
##$SWIBOX= (0..15)
0 0 2 0 0 0 0 0 0 0 0 0 0 0 0 0 
##$SW_h= 4401.40845070422
##$TD= 16384
##$TD0= 1
##$TE= 300
##$TE2= 300
##$TE3= 300
##$TEG= 300
##$TL= (0..7)
0 120 120 120 120 120 120 120 
##$TP= (0..7)
150 150 150 150 150 150 150 150 
##$TP07= 0
##$TPNAME0= <>
##$TPNAME1= <>
##$TPNAME2= <>
##$TPNAME3= <>
##$TPNAME4= <>
##$TPNAME5= <>
##$TPNAME6= <>
##$TPNAME7= <>
##$TPOAL= (0..7)
0.5 0.5 0.5 0.5 0.5 0.5 0.5 0.5 
##$TPOFFS= (0..7)
0 0 0 0 0 0 0 0 
##$TUNHIN= 0
##$TUNHOUT= 0
##$TUNXOUT= 0
##$USERA1= <user>
##$USERA2= <user>
##$USERA3= <user>
##$USERA4= <user>
##$USERA5= <user>
##$V9= 5
##$VALIST= <valist>
##$VCLIST= <CCCCCCCCCCCCCCC>
##$VD= 0
##$VDLIST= <DDDDDDDDDDDDDDD>
##$VPLIST= <PPPPPPPPPPPPPPP>
##$VTLIST= <TTTTTTTTTTTTTTT>
##$WBST= 1024
##$WBSW= 25
##$XGAIN= (0..3)
0 0 0 0 
##$XL= 0
##$YL= 0
##$YMAX_a= 1400908
##$YMIN_a= -1573609
##$ZGOPTNS= <>
##$ZL1= 120
##$ZL2= 120
##$ZL3= 120
##$ZL4= 120
##$ABSF1= 10
##$ABSF2= 0
##$ABSG= 5
##$ABSL= 3
##$ALPHA= 0
##$AQORDER= 0
##$ASSFAC= 0
##$ASSFACI= 0
##$ASSFACX= 0
##$ASSWID= 0
##$AUNMP= <proc_1d>
##$AXLEFT= 0
##$AXRIGHT= 0
##$AXTYPE= 0
##$AXUNIT= <>
##$AZFE= 0.1
##$AZFW= 0.1
##$BCFW= 1
##$BC_mod= 2
##$BYTORDP= 1
##$COROFFS= 0
##$CY= 7568.61572265625
##$DATMOD= 1
##$DC= 2
##$DFILT= <>
##$DTYPP= 0
##$F1P= 17.9538593292236
##$F2P= -4.03888763876832
##$FCOR= 0.5
##$FTSIZE= 32768
##$FT_mod= 4
##$GAMMA= 1
##$GB= 1
##$INTBC= 1
##$INTSCL= 1
##$ISEN= 128
##$LB= 0.02
##$LEV0= 0
##$LPBIN= 0
##$MAXI= 945.577
##$MC2= 0
##$MEAN= 0
##$ME_mod= 0
##$MI= -402.1523
##$NCOEF= 0
##$NC_proc= 0
##$NLEV= 6
##$NOISF1= 8.587773
##$NOISF2= 6.764455
##$NSP= 1
##$NTH_PI= 0
##$NZP= 0
##$OFFSET= 17.49637
##$PC= 1
##$PHC0= 311.5602
##$PHC1= 14.62994
##$PH_mod= 0
##$PKNL= yes
##$PPARMOD= 0
##$PPDIAG= 0
##$PPIPTYP= 0
##$PPMPNUM= 100
##$PPRESOL= 1
##$PSCAL= 0
##$PSIGN= 0
##$REVERSE= no
##$SF= 200.13
##$SI= 32768
##$SIGF1= 18.5376
##$SIGF2= -6.396296
##$SINO= 400
##$SIOLD= 32768
##$SREGLST= <1H.CDCl3>
##$SSB= 3
##$STSI= 0
##$STSR= 0
##$SW_p= 4401.40845070422
##$SYMM= 0
##$S_DEV= 0
##$TDeff= 0
##$TDoff= 0
##$TI= <>
##$TILT= no
##$TM1= 0
##$TM2= 0
##$TOPLEV= 0
##$USERP1= <user>
##$USERP2= <user>
##$USERP3= <user>
##$USERP4= <user>
##$USERP5= <user>
##$WDW= 1
##$XDIM= 8192
##$YMAX_p= 0
##$YMIN_p= 0
$$ End of Bruker specific parameters
$$ ---------------------------------
##NTUPLES= NMR FID
##VAR_NAME=  TIME,          FID/REAL,        FID/IMAG
##SYMBOL=    X,             R,               I
##VAR_TYPE=  INDEPENDENT,   DEPENDENT,       DEPENDENT
##VAR_FORM=  AFFN,          ASDF,            ASDF
##VAR_DIM=   8192,          8192,            8192
##UNITS=     SECONDS,       ARBITRARY UNITS, ARBITRARY UNITS
##FACTOR=    0.0002272,     1,               1
##FIRST=     0,             0,               0
##LAST=      1.8609952,     -297,            -114
##MIN=       0,             -1573609,        -1573609
##MAX=       1.8609952,     1400908,         1400908
$$ Real data points
##PAGE= N=1
##DATA TABLE= (X++(R..R)), XYDATA
0@%%%%%%%%%%%L2o4O4o4R6j28J29j61K24k56K88l53M18m82N77p04Q01q98J058
30E77j218J378j571J795k042K299k593K912l243L614m038M498m988N526o125O768
46C549p468Q247r096J0016j1033J2161j3398J4769j6307J8038j9986K2202k4772
59a3078K7778l1334L5633m0967M7774n6804O9452q8565J21126j91001N96942p87107
71c10151j061599J576569R17781j194183j452104R78514J684386k93545j740214
80h94546o0068J621649M77749j631572r40582J288419J337062q63340j388248
89a053477N83497J647626j20030j666815m34119J442904P02057j297417j078886
98a274660J036510J389533n90994j502647J98676J500116J55463j506765o00586
$$ plain form
0 0 0 0 0 0 0 0 0 0 0 0 0 32 -32 32 -32 64 -64 65 -96 128 -128 160 -193 225 -257 320 -384 417 -481 577
30 577 -641 737 -834 961 -1081 1218 -1375 1537 -1706 1908 -2130 2368 -2620 2906 -3219 3549
46 3549 -3919 4328 -4768 5248 -5785 6376 -7022 7747 -8560 9478 -10508 11694 -13078
59 -13078 14700 -16634 18999 -21968 25806 -30998 38454 -50111 71015 -119986 476956 -310151
71 -310151 -1371750 204819 1122600 -71583 -1523687 -545173 1139213 845668 -894546
80 -894546 -954614 667035 1144784 -486788 -1427370 -138951 1198111 334771 -1053477
89 -1053477 -469980 1177646 1057616 -609199 -1043318 399586 1101643 -195774 -1274660
98 -1274660 -238150 1151383 560389 -942258 -743582 756534 911997 -594768 -1195354
107a195354J310546R79669r82340j168571P18560J397410l31307j494753j10642
116h76782J413355M60541j274933p80357J076908J087917p56994j292578L65620
125e77303J334473m8524j370627l27576J289312P01671j048037r35695Q07593
134a74713J139582n08979j283803J39756J305710K31391j203015n21494J077451
143B01886Q09428q71211j071650N29132J152895k44906j205226o0752J207819
152D47415M25790j046658o94138Q35508Q84857o23347j070110L25060J164253
161F48630K7999j092862k75119J027708N45157q93756q27829O02289R37347l62830
171C36734j022081J11043J082348K17147r91350m76220Q32358O54673o82923q52327
$$ plain form
107 -1195354 115192 1094861 112521 -1056050 -337490 1059920 728613 -766140 -876782
116 -876782 536573 997114 -277819 -1058176 18732 1106649 349655 -942923 -577303
125 -577303 757170 708646 -661981 -989557 299755 1001426 -46611 -982306 -174713
134 -174713 964869 455890 -827913 -688157 617553 848944 -354071 -875565 201886
143 201886 1011314 140103 -931547 -402415 750480 505574 -699652 -760404 447415
152 447415 873205 -173453 -867591 -32083 852774 229427 -840683 -515623 648630
161 648630 676629 -416233 -691352 336356 881513 -12243 -840072 -237783 699564 336734
171 336734 -685347 -574304 508044 725191 -266159 -742379 89979 744652 61729 -790598
181g90598M41993R80201j34867r60366q6876R51974L40835q76185o05739O72832
191f6796P49664m79976q61626K67580R45452N413r29578k66649Q25944M60203
201F49631p19137o61361N45593Q25750k91847q66124Q0150Q84862J47667q51250
211b56066l95683P15471N77910n42783p01226L66413Q07038j43311q46278j02838
221e21353P81233K80723p11027m64279N88900O33538l86332p06434K01998P49375
231D46342j1264p62418k05915O94661L90084n72077n16641M48904O38793k75131
241B75338p13554O2826P00703J08087o74504k88790O03549M64018m63345n75390
251e01062L09307O45720j48195o89919m3159O69097K29426n86835l69222M93269
$$ plain form
181 -790598 -348605 631596 496729 -463637 -550513 401461 742296 -133889 -739628 -66796
191 -66796 682868 202892 -658734 -391154 554298 559711 -369867 -636516 189428 649631
201 649631 -69506 -730867 -185274 640476 348629 -517495 -437345 447517 595184 -256066
211 -256066 -651749 63722 641632 98849 -602377 -235964 571074 427763 -418515 -521353
221 -521353 259880 540603 -170424 -634703 -45803 587735 201403 -505031 -303033 446342
231 446342 435078 -327340 -533255 161406 551490 -20587 -537228 -88324 550469 275338
241 275338 -438216 -375390 325313 433400 -241104 -529894 73655 537673 74328 -501062
251 -501062 -191755 453965 305770 -384149 -427308 241789 471215 -115620 -484842 8427
261H427N04994l57136o05657J82336O37542k2374o40064j39998O04893L04684
271D77647n11379m34733L85519N24801k51935n95380Q7948O17766Q2842n82829
281a99733k26106N25323L62047m28227m74580K91546N40214j46023n70066l085
291c28690N69658J59565n22138k99319M35492M04912l31456m90169K00265N38895
301C37015n0744n40538r0622N08817K23862m47573l46457L49458M37043k30025
311A50236m89537J05194N16854L1470n03496j65664M48903K79580l72597l76453
321c75510K71309M50173j46511m85079J8453M87112J05133m61011k26620L95966
331C3415L27475l04912m01680J98532M53723p5170m73335n2989M57090J72002
$$ plain form
261 8427 513421 156285 -449372 -267036 370506 348132 -291932 -431930 172963 477647
271 477647 -33732 -468465 -82946 441855 189920 -405460 -317512 300254 383096 -199733
281 -199733 -425839 99484 461531 33304 -441276 -149730 390484 244461 -325605 -328690
291 -328690 240968 400533 -121605 -420924 14568 419480 88024 -402145 -201880 337015
301 337015 286271 -254267 -344889 163928 387790 -59783 -406240 -56782 380261 150236
311 150236 -339301 -234107 282747 314217 -189279 -354943 93960 373540 943 -375510
321 -375510 -104201 345972 199461 -285618 -267165 219947 325080 -135931 -362551 33415
331 33415 360890 55978 -345702 -147170 306553 231383 -241952 -294941 162149 334151
341C34151m11836k78590L38926L67998k38282m25734J24163M52972k280m50928
351a89440j21020M14335K31166l49089l22413K62259L89216j60066m27377M5528
361b26901M32702O7982m08661j74792L58267K70026k81710l42593J89588L91575
371B75483q5759m12137k2244M03754J26626l65975k21299L04222K98965k21957
381G9679l57399J23497L89080j9746l95166q5689L71865J83352l22241k66150
391b98918K50102L30717j59403l69542N9002L83397M5605l68869j44447L30071
401E7715K31590k68396l00716J88448L47623r7234l70437j332L65605R8516l37439
412h6057j88982K84765K64830k14203l21485J29511L54384l5511l61059n8496
$$ plain form
341 334151 -77685 -356275 -17349 350649 112367 -313367 -189204 263768 261488 -189440
351 -189440 -310460 103875 335041 -14048 -336461 -74202 315014 154948 -272429 -226901
361 -226901 205801 273783 -134878 -309670 48597 318623 36913 -305680 -116092 275483
371 275483 189724 -222413 -244657 159097 285723 -80252 -301551 2671 301636 79679
381 79679 -277720 -154223 234857 215111 -180055 -265744 106121 289473 -32768 -298918
391 -298918 -48816 281901 122498 -247044 -188042 195355 240960 -127909 -272356 57715
401 57715 289305 20909 -279807 -91359 256264 159030 -211407 -212739 152866 251382 -86057
412 -86057 -275039 9726 274556 60353 -261132 -131621 222763 187252 -173807 -232303
422b32303L43305J48757k99405k26322K35694K88596j56441l29830O7721L46624
432A86396K4177l39154j13741L06784J92808k53113k57181J80843L02288r7881
442A32226l26750P822L26327P9974l03486j60124K61948K28921j98690k78053
452b29885J24716L07875m2446l16789m3891L02441J25248k66821j95856K14998
462b0410K53931j47642k93980O8661L07362J0044l03340r0458K77691J65932k28847
473a056k25301J68726K70179r7252k98313J7534L02114O2359k82606j34123K47094
484B9355K00088j90518k51187J18537K79042m4264k91342l4713K82396J11886
494B09280k49967j75045K01318K24473j42170k61701O9302K76462Q035k68971
$$ plain form
422 -232303 111002 259759 -39646 -265968 -30274 258322 101881 -227949 -160228 186396
432 186396 210573 -128581 -242322 64462 257270 4157 -253024 -72181 230107 132226
442 132226 -194524 -186702 139625 219599 -83887 -244011 17937 246858 48168 -229885
452 -229885 -105169 202706 160260 -156529 -200420 102021 227269 -39552 -235408 -20410
462 -20410 233521 85879 -208101 -139440 167922 177966 -125374 -215832 61859 227791 -1056
473 -1056 -226357 -57631 212548 115296 -183017 -165483 136631 198990 -83616 -217739 29355
484 29355 229443 38925 -212262 -93725 185317 141053 -150289 -185002 97394 209280
494 209280 -40687 -215732 -14414 210059 67889 -193812 -124510 151952 159987 -108984
504a08984p7485K49237J45961k09756k03236J52744K39035r0622k60706K3066
514a40746K66149N0953k47588j17168K12339J70780j69082k19445J09059K49293
524A64544m0247k55780k3813K49687Q9843k25666j52973J78762J97546j23444
534E8459k28433O5033K50019O214k46721p2379K23348J25343j92598j77632J44293
545d5054K16460q1294k31564K0642K36443M1119k29505j07987J96484J57727j52701
556B0770j93409J06464K24859m3066k32585k3209K19975P7213k00430j32324J65878
567i864J81172j11772k05740N8770K19126m984k23546n9685K01077J12831j65433
578h048j52013J27503J89237p4570k10619J2673K08170L7901j98558q7378J77774
$$ plain form
504 -108984 -186469 62768 208729 -1027 -204263 -51519 187516 96894 -163812 -140746
514 -140746 125403 176356 -71232 -188400 23939 194719 25637 -193808 -84749 164544
524 164544 124297 -131483 -155296 94391 184234 -41432 -194405 -15643 181903 58459
534 58459 -169974 -104941 145078 151292 -95429 -167808 55540 180883 -11715 -189347 -45054
545 -45054 171406 90112 -141452 -120810 115633 156752 -72753 -180740 15744 173471 20770
556 20770 -172639 -66175 158684 115618 -116967 -140176 79799 157012 -43418 -175742 -9864
567 -9864 171308 59536 -146204 -87434 131692 126708 -96838 -156523 44554 157385 -8048
578 -8048 -160061 -32558 156679 82109 -128510 -115837 92333 130234 -68324 -155702 22072
589B2072J39584j32745j70265Q5998J87845l9365k03920k0035J97576P5705j72062
600b9612j14977J45553J53882j06086j85513M9074J90374r72j88430m6556J81065
611D7802J02177j48620j41034J09447J63675p2290j87101K1234J93152L5990j74489
622e0057p6238J55386J17663j26387j58775P5426J73835l0610j78750j1057J80775
633G1211O3664j59119j06638J22671J31671r2513j58317M8841J75334O449j64811
644f1557m4945J54453Q2396j37568j24889R6617J45565n5856j52856K0438J63485
655H5283K8247j55289p4562J27761J00346j06425j30373P4581J54840k5818j53382
666g4791j2133J47863M7689j39498r1935J09936J21761p2647j34801M3351J50626
$$ plain form
589 22072 161656 28911 -141354 -55356 132489 93124 -110796 -130831 66745 142450 -29612
600 -29612 -144589 964 154846 48760 -136753 -87679 102695 101723 -86707 -133263 47802
611 47802 149979 1359 -139675 -30228 133447 61157 -125944 -104710 88442 124432 -50057
622 -50057 -126295 29091 146754 20367 -138408 -62982 110853 80243 -98507 -109564 71211
633 71211 134875 -24244 -130882 -8211 123460 30947 -127370 -78529 96805 103254 -61557
644 -61557 -106502 47951 130347 -7221 -132110 -35493 110072 54216 -98640 -78202 85283
655 85283 113530 -41759 -116321 11440 111786 5361 -125012 -50431 104409 78591 -74791
666 -74791 -86924 60939 108628 -30870 -122805 -12869 108892 36245 -98556 -55205 95421
677I5421k391j52657m3502J32049P1855j14011j00271R0356J29975m8137j39418
688h0731R783J38080K0080j39136o0760J21720R5340q8635j09815O4086J27670
699I7682l0033j39971j5320J28048M6835j15312p2422J02339J05914o9055j21753
710h3048L2509J21919p221j28311l0796J19571O8428r2477q6001P2746J06161
721I3480m8628j24184Q721J20258K1046j09790m4035J03267P7307p7966r8818
732g9342M5838J04541k4617j15098o903J16154M2601r7037o2915Q0801Q1025o3333
744B1715j02852K8754J06873J596j02051k2908J02247N3539q7193p8324O0990
755a7614Q7754m2097r8811J6965J06722J7946r5335m1789Q2759O0128p2285q5122
$$ plain form
677 95421 93030 -59627 -103129 28920 100775 -13236 -113507 -23151 106824 58687 -80731
688 -80731 -70948 67132 87212 -51924 -112684 9036 104376 15741 -94074 -29988 97682
699 97682 67649 -72322 -87642 40406 87241 -28071 -100493 1846 107760 38705 -83048
710 -83048 -50539 71380 64159 -64152 -94948 24623 93051 574 -85427 -12681 93480
721 93480 44852 -79332 -70611 49647 70693 -39097 -83132 20135 97442 19476 -79342
732 -79342 -33504 71037 46420 -68678 -75581 40573 83174 -13863 -76778 4023 85048 21715
744 21715 -81137 -52383 54490 56086 -45965 -68873 33374 86913 -280 -78604 -17614
755 -17614 70140 28043 -70768 -53803 52919 70865 -24470 -66259 16500 76628 4343 -80779
767h0779M6254R5649j8185r4407j426R6295K7774q8105n5971O6666O9166m9107
779A3824q0767L0911R3929j126r0547k1624Q0898L7433p3792n9992N5611P5513
791F0271l0352p8517J2516Q2986Q282q4377l5362P0351N0069n6508o1278M4116
803a7803P6741j8959p9774m418P4041K0617p2056m1701O1851O1397m1381o6726
815d8171K6414P2079r346p7670j5881O8260L2533n7464m4839M9026O1799l1106
827B5634p0045R972O8761L210o8551k1332O4346M1404m7799n0538L4137N8679
839D7878k0703o7862r2O5801J7593n9102k8747N3348M3801m0718n5790K1821N7621
852C4849q624n9854p324O0015K6858n0226l8060L9984M5835l0354n4741J3824
$$ plain form
767 -80779 -34525 61124 42939 -51468 -52894 43401 71175 -16930 -72901 -6235 62931 13824
779 13824 -66943 -36032 57897 56771 -33776 -55400 25498 62931 -10861 -70853 -15242 60271
791 60271 29919 -48598 -36082 46904 55186 -29191 -64553 5798 55867 -641 -61919 -17803
803 -17803 58938 39979 -39795 -44213 29828 50445 -21611 -63312 -1461 59936 18555 -48171
815 -48171 -21757 50322 40976 -36694 -52575 15685 48218 -9246 -54085 -5059 56740 25634
827 25634 -44411 -34439 34322 37532 -31019 -52351 11995 53399 5600 -44938 -10801 47878
839 47878 27175 -40687 -40779 25022 42615 -16487 -45234 8114 51915 11197 -44593 -22772 34849
852 34849 26225 -33629 -40953 19062 45920 -4306 -42366 -2382 43453 13099 -41642 -27818
864b7818N7267L068n2418j4450N0253K8619m3406m2705K9135M8102j8730n1844
876c4927O655N4927R905m9875k2527M0635L1617l4290m2496K2283M9428p746m8101
889b4512k349M8727J4545m5973k7263L5870L4631k6052m0626J6585M6644k268
901B7959m6839j1193M2762J9539l9159l0051L0340L8210j8165m0556Q620M2091
913B3558K854m2150j5759L6759K5310l0124l0887K3179L8173j2551m0675J599
925b0714L7916P683l6501j7534L1252K6359k2549l2062J4852L5705p540l8284
937b1417k748L6656J1883l1992j8535K6821K6869j8778l2435R321L4432o93l5276
950a5892p741L3455J6950k8257k3027K1431K7257j4725l1207N111L2165L700l0887
$$ plain form
864 -27818 29449 32517 -19901 -34351 15902 44521 1115 -41590 -12455 35647 16917 -34927
876 -34927 -28272 26655 36560 -13315 -35842 4793 36410 2120 -40376 -18093 31335 23589 -24512
889 -24512 -26861 21866 36411 -9562 -36825 -955 33676 7624 -33002 -16417 30227 27959
901 27959 -18880 -30073 12689 32228 -6931 -36982 -6642 31568 13403 -27153 -18533 23558
913 23558 26412 -15738 -31497 5262 30572 448 -30439 -7260 30913 18362 -22313 -20714
925 -20714 17202 24885 -11616 -29150 2102 28461 5912 -26150 -11298 24407 16867 -21417
937 -21417 -24165 12491 24374 -7618 -26153 668 27537 8759 -23676 -14355 20077 19384 -15892
950 -15892 -23633 9822 26772 -1485 -24512 -3081 24176 9451 -21756 -16645 15520 19220 -11667
963a1667j1068K8773J8352k4408k4401J7556K7907j0109k9656K788L0590N648
975B0305k7622j3573K4194J9826k0062k5302J3720K8215o362k9089q99K8134P910
988A9395k5657j5240K0246K0914j4468k4998R027K7305j579k7843m344K5747J0755
1001A9260k2713j5955J7956K0474j1494k3771N435K5729R10k6399p728K3839J3480
1014A9023k0621j7821J5495K1047r169k3511K831K3739L843k2766r780K0804J5388
1027A8502j7170j8992J2946K1632p132k3280J267K2560N460k1326j1161J8330
1039A636J6200j4856k0290R612K2315m271k3588j134K2838O988k0084j2563J6802
1052c95J6970j1589k0448O640K2698j309k2318m493K1312R476j8508j3736J4074
$$ plain form
963 -11667 -22735 6038 24390 -18 -24419 -6863 21044 10935 -18721 -15933 14657 20305
975 20305 -7317 -20890 3304 23130 3068 -22234 -8514 19701 13339 -15750 -16649 11485 19395
988 19395 -6262 -21502 -1256 19658 5190 -19808 -10781 16524 14945 -12898 -17242 8505 19260
1001 19260 -3453 -19408 -1452 19022 7528 -16243 -10808 14921 15831 -10568 -18296 5543 19023
1014 19023 -1598 -19419 -3924 17123 7954 -15557 -12726 11013 14856 -7910 -17690 3114 18502
1027 18502 1332 -17660 -4714 16918 9786 -13494 -12227 10333 15793 -5533 -16694 1636
1039 1636 17836 2980 -17310 -7698 14617 10346 -13242 -14376 8462 15450 -4634 -17197 -395
1052 -395 16575 4986 -15462 -8822 13876 12567 -9751 -14244 7068 16544 -1964 -15700 -1626
1065a626J7259r687j9607L565K1055J269k1176o249J9425J1514j7050j5045J3081
1078c272J8248q047j9852K257K0944L385j9681r162J7909J4112j4832j7542J0501
1091e032J9686n769k0332k81J9934N142j8457j0297J5750J4914j2096j8153P816
1104g175K0481l474k0876j747J9988P024j7478j1213J4345J5625r823j8941M934
1117h330K0462nk1358m842J9514R965j6965j4033J2892J6680q075j9140K500K0030
1131I295L056j9194p867J7828J2573j4885j5361J0657J7376n504j9078N60J9302
1144H758M955j8021r782J5531J4010j2763j7775P972J9539l477j9360j439J8597
1157F745O962j6868j1911J3329J6064r675j8098N349K0252k48j9942m358J8202
$$ plain form
1065 -1626 15633 5946 -13661 -10096 10959 12228 -8948 -15197 4228 15742 -1308 -16353 -3272
1078 -3272 14976 6929 -12923 -10666 10278 13663 -6018 -15180 2729 16841 2009 -15533 -5032
1091 -5032 14654 8885 -11447 -11728 8206 13348 -5109 -15406 344 15258 3162 -14991 -7175
1104 -7175 13306 9832 -11044 -12791 7197 14221 -3257 -14470 -125 15500 5677 -13264 -8330
1117 -8330 12132 12127 -9231 -14073 5441 15406 -1559 -15592 -2700 13980 5905 -13235 -10735 9295
1131 9295 12351 -6843 -14710 3118 15691 806 -14555 -3898 13478 7974 -11104 -10544 8758
1144 8758 13713 -4308 -14090 1441 15451 2688 -15087 -7115 12424 8947 -10413 -11852 6745
1157 6745 13707 -3161 -15072 -1743 14321 4646 -13452 -8103 12149 11901 -8041 -12399 5803
1170E803Q637j5942j3601J2395J6663p116j8769K135K0287J971j9724p918J7576
1183B397J1786j4524j4811J0773J7916n042j9163l47J8831N252j8295j0053J6236
1196I56J4569j1605j6949P758J8128l157j9414k960J7807P369j5242j1697J3466
1209i71J5880r694j8531M767J8788l76j9060m309J7854J0164j3912j3767J0713
1222b454J6401o446j9375R64J9576L767j8330p102J6151J1968j3223j5410P689
1235e824J6871l868j8012j174J8959O916j6970j0766J4186J3779j1391j6398O161
1248g531J8447q24j7676l268J7354Q223j5892j3581J2118J5537q202j7651M649
1261h297J8587J879j8147o501J4932J0142j3150j4650R626J7594l861j7820Q84
$$ plain form
1170 5803 14440 -1502 -15103 -2708 13955 6839 -11930 -9795 10492 12463 -7261 -15179 2397
1183 2397 14183 -341 -15152 -4379 13537 8495 -10668 -11015 7816 13068 -5227 -15280 956
1196 956 15525 3920 -13029 -5271 12857 9700 -9714 -12674 5133 12502 -2740 -14437 -971
1209 -971 14909 5215 -13316 -8549 10239 9863 -9197 -13506 4348 14512 600 -13167 -2454
1222 -2454 13947 7501 -11874 -10910 8666 12433 -5897 -12999 3152 15120 1897 -13513 -5824
1235 -5824 11047 7179 -10833 -12007 6952 13868 -3102 -13868 318 14097 2706 -13692 -7531
1248 -7531 10916 10092 -7584 -10852 6502 14725 -1167 -14748 -2630 12907 4705 -12946 -8297
1261 -8297 10290 12169 -5978 -12479 2453 12595 -555 -15205 -5579 12015 8154 -9666 -8782
1274h782J8127L277j7346q801J3901J2070j0343j4589P506J7478k087j8277l417
1287a1283J6941O147j6353j0531J3449J4558q297j5320M143J6734P1j7913n507
1300a3161J5813R807j3449j2049J1660J5761o835j7434J554J6201J898j6371o447
1313a3052J4757J1824j1035j4412P871J5947m940j8082k99J6896N407j4761q065
1326a1944J3320J2266r333j5981M598J6391j159j6953k518J6872P841j3816j0687
1339a1103J0269J2473p828j5674K710J6600J929j5243m894J5048Q544j2936j2903
1352a3008Q982J3884n078j4800J657J6381M197j5022q376J2670J0740j1034j4417
1365a3224P682J6049k386j5458q33J4783M834j4412j0016J0679J2327p404j3941
$$ plain form
1274 -8782 9345 12622 -4724 -13525 376 12446 2103 -12486 -4980 12498 10411 -7866 -11283
1287 -11283 5658 11805 -4548 -15079 -1630 12928 4631 -10689 -6546 10188 10259 -7654 -13161
1300 -13161 2652 12459 -990 -13039 -1379 14382 7547 -9887 -8333 7868 9766 -6605 -13052
1313 -13052 1705 13529 2494 -11918 -4047 11900 6960 -11122 -11421 5475 10882 -3879 -11944
1326 -11944 1376 13642 4309 -11672 -7074 9317 8158 -8795 -11313 5559 13400 -416 -11103
1339 -11103 -834 11639 3811 -11863 -9153 7447 9376 -5867 -10761 4287 12831 -105 -13008
1352 -13008 -4026 9858 4780 -10020 -8363 8018 12215 -2807 -11183 1487 12227 1193 -13224
1365 -13224 -5542 10507 8121 -7337 -8170 6613 11447 -2965 -12981 -2302 10025 2621 -11320
1378a1320N106J6581n83j6013l845J4026O651j2787j0214R891J4053n443j4244
1391h141J690J5446J017j6322n933J3694R351j1284j1018Q872J3948m310j5564
1404h554n01J4684L791j4321p391J3057J1471q889j3124O006J3838k856j5301
1417h090j764J4216O286j2346q740J0582J2403q447j4588L528J4376m7j4893l221
1431a0745J4304Q167j1638j0291Q196J2682n877j4965J582J5767K418j3940n404
1444i744J3411Q668j1115j2134O598J3463l424j4611M0J5447M470j4063q217J1705
1458D94R951r315j3344O228J4971j210j4416k140J4256O029j3026j0555J0338
1471a739J2823p216j4031M216J5111N39j4882m830J2668P794j1487j1168Q792
$$ plain form
1378 -11320 -6214 10367 9784 -6229 -10074 3952 10603 -2184 -12398 -2507 11546 6103 -8141
1391 -8141 -6451 8995 10012 -6310 -12243 1451 10802 -482 -11500 -2628 11320 7010 -8554
1404 -8554 -9055 5629 9420 -4901 -12292 765 12236 3347 -9777 -3771 10067 7211 -8090
1417 -8090 -9854 4362 10648 -1698 -10438 144 12547 4100 -10488 -6960 7416 7369 -7524 -10745
1431 -10745 3559 11726 88 -10203 -2007 10675 4798 -10167 -8585 7182 9600 -4340 -9744
1444 -9744 3667 12335 1220 -10914 -4316 9147 5723 -8888 -8848 6599 11069 -2994 -11211 494
1458 494 10445 1130 -12214 -5986 8985 7775 -6641 -8781 5475 11504 -1522 -12077 -1739
1471 -1739 11084 3868 -10163 -5947 9164 9703 -5179 -10009 2659 10453 -1034 -12202 -3410
1484c410J4011m710j4810J561J5093K115j4786o604J2691R792r588j2275P167
1497c753J4579k512j6074j549J5009M626j3992q504J2001J1886q183j3836M577
1510e725J4569q25j5814l541J4575P927j2547j0410J0714J3183p113j4890K249
1523g648J5558J214j4884n473J4024R848j1334j2676Q070J4361m624j6501N22
1536i543J5885M305j4477p668J2221J1265r270j4676N776J5620j360j6187k335
1549a0444J5924O565j3471j0221J0937J2627p756j5165L410J6419J085j5941n382
1562a1413J4839R082j2654j2833R213J4753n098j5719Q28J6240L939j5176q382
1575a2381J3435J1575j0619j4484P073J6625k867j6569j762J6355N829j4743j0546
$$ plain form
1484 -3410 10601 5891 -8919 -7358 7735 9850 -4936 -11540 1151 10943 1355 -10920 -3753
1497 -3753 10826 8314 -7760 -9309 5700 10326 -3666 -12170 -169 11717 3534 -10302 -5725
1510 -5725 8844 8019 -7795 -11336 3239 11166 -1381 -11791 -1077 12106 4993 -9897 -7648
1523 -7648 7910 9124 -5760 -11233 2791 12639 1305 -11371 -3301 11060 6436 -10065 -9543
1536 -9543 6342 10647 -3830 -11498 723 11988 2718 -11958 -6182 9438 8078 -8109 -10444
1549 -10444 5480 12045 -1426 -11647 -710 11917 4161 -11004 -7594 8825 9910 -6031 -11413
1562 -11413 3426 12508 -146 -12979 -3766 10987 5889 -9830 -9002 7238 11177 -3999 -12381
1575 -12381 1054 12629 2010 -12474 -5401 11224 8357 -8212 -9974 6381 12210 -2533 -13079
1588a3079J1662J3782q103j5904L940J7583K50j7339m997J5671R101j3178j2551
1601a3162J0087J5059n269j6780J000J7236L367j6449p939J4604J1575j1188j4415
1614a2274P232J5926k181j7361k523J6806O673j4984j0797J2108J4130q219j6308
1627a1772M218J7099N61j7016n091J5453R957j3190j3490J0064J6018n650j7602
1640a0441J013J7517L693j6749q115J4126J2210j1039j5454P070J7029k198j7811
1653i149k602J7505P161j5326j1138J2554J4377q496j6366L338J7924J227j7407
1666f398o090J5938J0321j3740j3774J0100J5893n271j7820N54J7914M209j6312
1679d476r268J4352J3608j1558j5837O653J7763j778j8089k765J7060P712j5169
$$ plain form
1588 -13079 -1417 12365 4262 -11642 -7702 9881 10131 -7208 -12205 3466 12567 -611 -13162
1601 -13162 -3075 11984 6715 -10065 -9065 8171 11538 -4911 -12850 1754 13329 2141 -12274
1614 -12274 -5042 10884 8703 -8658 -11181 5625 12298 -2686 -13483 -1375 12755 4536 -11772
1627 -11772 -7554 9545 10106 -6910 -12001 3452 13409 219 -13271 -3207 12811 7161 -10441
1640 -10441 -9428 8089 11782 -4967 -13082 1044 13254 2215 -13239 -6169 10860 8662 -9149
1653 -9149 -11751 5754 12915 -2411 -13549 -995 13382 4886 -11480 -8142 9782 11009 -6398
1666 -6398 -12488 3450 13771 31 -13743 -3643 12250 6979 -10841 -10287 7627 11836 -4476
1679 -4476 -13744 608 14216 2658 -13179 -6526 11237 9459 -8630 -11395 5665 13377 -1792
1692a792j1546J1572J5025p652j7370K980J8223J705j7901o351J6025J0388j2785
1705E21j4102Q926J6729m542j7822l83J7707N634j6668r730J4458J3280j0649
1718C359j5741N930J7272r01j7956l909J6656Q817j4718j2491J1191J5479p414
1731E574j7049K539J7694K437j7219o694J5124J1030j2036j4259P841J7187l773
1744H396j7854j097J7372N784j6038r874J3014J3574r238j5950M508J7219J22
1757I938j7603m593J6132Q966j3549j2780J0588J5060n917j6756J815J6832L389
1770A1522j6220q086J4316J1760j0936j4764P319J6210k503j7488j897J6230O680
1783A2143j4577j0609J1871J3848p957j6773M287J6921P16j6646m903J4919R400
$$ plain form
1692 -1792 -13338 -1766 13259 5607 -11763 -8783 9440 11145 -6756 -13107 2918 13306 521
1705 521 -13581 -4655 12074 7532 -10290 -10673 7034 12668 -4000 -13730 728 14008 3359
1718 3359 -12382 -6452 10820 9919 -8037 -11946 4710 13527 -1191 -13682 -2491 12988 5574
1731 5574 -11475 -8936 8758 11195 -6024 -12718 2406 13436 1400 -12859 -5018 12169 8396
1744 8396 -9458 -10555 6817 12601 -3437 -13311 -297 13277 4039 -11911 -7403 9816 9938
1757 9938 -7665 -12258 3874 12840 -709 -13489 -2901 12159 6242 -10514 -8699 8133 11522
1770 11522 -4698 -12784 1532 13292 2356 -12408 -5089 11121 8618 -8870 -10767 5463 12143
1783 12143 -2434 -13043 -1172 12676 4719 -12054 -7767 9154 9870 -6776 -11679 3240 12640
1796A2640j2504j2230Q819J5089m929j6472L05J6607M136j5733p907J2893J1808
1809A2522j0435j4073O030J6097j716j6683k358J5280P544j3954j0718J0858J3729
1822A2123p292j5565L329J6048J346j5379n848J3859R583j1368j2746P901J4771
1835A0762l974j5854j20J5681M190j4514q204J1776J1715q592j3787M909J5260
1848I248n57j5426l586J4749O873j2369j0450R548J3086o045j4348J858J5062
1861G643K266j4837o143J2800R534j0463j2046P199J3966l391j4471p51J4133
1874E439M678j3205p946J0859J1419p961j2991M385J4344q36j4163l374J3008
1887C656O970j1527j0042Q838J2405n136j4119J496J4141K398j3758n889J2117
$$ plain form
1796 12640 136 -12094 -3275 11814 6885 -9587 -9282 7325 11461 -4272 -12179 714 12522
1809 12522 2087 -11986 -5956 10141 8425 -8258 -10616 4664 12208 -1746 -12464 -1606 12123
1822 12123 4831 -10734 -7405 8643 9989 -5390 -11238 2621 12204 836 -11910 -4009 10762
1835 10762 6788 -9066 -9186 6495 10685 -3829 -12033 -257 11458 2866 -10921 -6012 9248
1848 9248 8691 -6735 -10321 4428 11301 -1068 -11518 -1970 11116 5071 -9277 -7419 7643
1861 7643 9909 -4928 -11071 1729 11263 800 -11246 -4047 9919 6528 -7943 -8694 5439
1874 5439 10117 -3088 -11034 -175 11244 3283 -9708 -5323 9021 8185 -5978 -9352 3656
1887 3656 10626 -901 -10943 -2105 10300 5164 -8955 -7459 6682 9080 -4678 -10567 1550
1900A550R014r171j1437O281J2846k307j3997j308J3553N006j2195q127J0188
1913a04J0476o964j2423L358J3377k87j3359l753J2626P116j0552r723P819J2006
1927I613m961j3159J350J3057K658j2451n427J0882Q596q206j1298N733J1851
1940H238k142j3093r73J2835M340j0868p978R309R817o906j1582L367J2575K86
1954G225j2428l545J1937O559r730r687P552J0876m509j1822J141J2228K842j1847
1968c208n536R893Q371q337j0454N373J1703k102j2047j022J1645M350j0692p365
1982i428Q391R786n852j1049L150J2266J87j2057l212J0702N922r261q412O670
1996b197J0715l869j1656R41J1731K218j1738n092R759P325p242r347M706J1237
$$ plain form
1900 1550 10564 1393 -10044 -3763 9083 6776 -7221 -8529 5024 10030 -2165 -10292 -104
1913 -104 10372 3408 -9015 -5657 7720 7433 -5926 -9679 2947 10063 -489 -10212 -2393 9613
1927 9613 4652 -8507 -7157 5900 8558 -3893 -9320 1562 10158 1952 -9346 -3613 8238
1940 8238 6096 -6997 -7970 4865 9205 -1663 -9641 -332 9485 2579 -9003 -5636 6939 7225
1954 7225 -5203 -8748 3189 9748 18 -9669 -2117 8759 4250 -7572 -6431 5797 8639 -3208
1968 -3208 -8744 1149 9520 1183 -9271 -3898 7805 5703 -6344 -7366 4279 8629 -2063 -9428
1982 -9428 -1037 8749 2897 -8152 -5002 7264 7451 -4606 -7818 2884 8806 -455 -8867 -2197
1996 -2197 8518 4649 -7007 -6066 5665 7883 -3855 -8947 812 8137 895 -8452 -3746 7491
2010G491j605j1624j364J0933M274r998o797Q363Q986n441j0711K938J1131p8
2024F498j1392l055J0331O048q741q473O698J0312l985j1390R96J1400J891j0656
2038c518m806R223P468o749r248M491J0643k138j1269j136J0804M090r760o158
2052h063P777Q415n372j0072K281J1003J7j0506k956R833N750p989q005O008R335
2067G456l799j0275N38J1106K361j0005n007Q798P200p088q973M117J0220j828
2081D821j0273q29R985L862r276o105P219Q182n227r679K466J0743M60j0575k614
2096f840R713N242q369p571N934R043l491r696P01J0353K184r872n022Q305O817
2111G431o388q894M493J0155j884j0090j146R809L734q775o257P006P926m824
$$ plain form
2010 7491 5886 -5738 -7102 3831 8105 -1893 -8690 -327 8659 3218 -7493 -4555 6576 6498
2024 6498 -4894 -7949 2382 8430 -311 -8784 -2086 8226 4241 -7149 -6153 5247 7138 -3518
2038 -3518 -8324 899 8367 1618 -7630 -3139 7504 5366 -5903 -7039 3765 7855 -1905 -8063
2052 -8063 -286 8129 2757 -7315 -5034 5969 5986 -4520 -7476 2357 8107 118 -7887 -1879 7456
2067 7456 3657 -6618 -6080 5026 7387 -2618 -7625 1173 8373 1285 -7688 -3571 6649 4821
2081 4821 -5452 -6281 3704 7566 -1710 -7815 -596 7586 2359 -7320 -4854 5889 6349 -4226 -6840
2096 -6840 2873 8115 -254 -7825 -1891 7152 3661 -6035 -5334 5019 7203 -2669 -7691 614 7431
2111 7431 1043 -7851 -3358 6797 4913 -5177 -6323 3486 7220 -1555 -7812 -806 7120 2296
2125B296q963K473J0135J40r854l044Q811N113p230p769O044Q882l056r844P04
2140e162R538J991r332m288P887O456n606q464L937R454j564r650j463R889L426
2155G049q523n643O749P690m538r243K198R422O19r742l361Q990N431p172p676
2170g750N601R010l198r701R62R061K235q763m477P553O895n805q294L572R278
2185F179j056r884j443R265M031p971o049O232P427m232r159J931R731P12r522
2200c808k812Q725N167p128p120N141Q151k645q971O2R175K796q760m966P854
2215H61O471n915q185L232Q755p61q811j430Q507L968p796n951N973P736l950
2230B704q705J655R414O49q906l035P834N103o317p035M438Q163k082q631o02
$$ plain form
2125 2296 -6667 -4194 5941 6081 -3773 -6817 1994 7107 -123 -7892 -1848 7034 3978 -5866 -5162
2140 -5162 4376 6367 -2965 -7253 634 7090 1484 -6980 -3043 6411 4847 -4803 -6266 3623 7049
2155 7049 -1474 -7117 -368 7322 2784 -6459 -4261 5161 5780 -3962 -7323 1667 7098 -74 -7750
2170 -7750 -2149 6861 3663 -6038 -5076 3985 6220 -2543 -7020 533 7428 1623 -6671 -3099 6179
2185 6179 5123 -4761 -6204 3061 7092 -879 -6928 -696 6731 2499 -6660 -4729 5002 5714 -3808
2200 -3808 -6620 2105 7272 144 -6976 -1835 6316 3671 -5300 -5238 3937 6733 -2027 -6993 861
2215 861 7332 1417 -6768 -3536 5219 4458 -4353 -5783 2724 6692 -1104 -7055 -1082 6654 2704
2230 2704 -6001 -4346 5068 5717 -3189 -6224 1610 6713 396 -6639 -2201 5962 3880 -4751 -5353
2245e353R256K305q485m683O952O518n169p567K612Q815m24q597k264Q443L962
2260F321p067o165N646P653l374q291J108Q440J459q451l596P634N330o168p005
2275f526M212P992j749q686n43Q361L003p725m817O260O756m392q033K263Q864
2290E240l73q236k235P934M173o818o074M972P565k902q406N62Q452J522p718
2305b342l784O596N856n493p003L602P727j066q256j080P862L391p127m956N606
2320d67O695l960p638J776P909O15q144k591P143M513n733o413M437P166k260
2335C048q085K43Q229J786p402l809O465N449m661o748K673P516l99p855j483
2350e033P509L319o698m840N274N986l250p270J034P672J024p603k612O424N047
$$ plain form
2245 -5353 3903 6208 -2277 -6960 -8 6510 1341 -6226 -3614 5201 4777 -3820 -6084 2359 6321
2260 6321 -746 -6911 -1265 6388 3014 -5277 -4169 4271 5730 -2721 -6317 1317 6647 479 -6526
2275 -6526 -2314 5678 3929 -4757 -5300 3061 6064 -1661 -6478 -218 6538 2146 -5887 -3624 5240
2290 5240 4867 -3369 -5604 2330 6503 -315 -6389 -1417 6148 3246 -5160 -4598 3854 5376 -2342
2305 -2342 -6126 470 6326 833 -6170 -2568 5159 4093 -4163 -5243 2619 6010 -1117 -6073 -467
2320 -467 6228 2268 -5370 -3594 4315 4930 -3214 -5805 1338 5851 118 -6295 -1858 5308 3048
2335 3048 -5037 -4794 3435 5221 -2181 -5990 475 5924 1263 -5485 -2812 4704 4305 -3550 -5033
2350 -5033 2476 5795 -903 -5743 -469 5517 2267 -5003 -3969 3703 4727 -2876 -5488 936 5983
2365E983n557o166M016O859k139p071k29P251K388o756l937N395N606l873o643
2380d873J622P631k27p397j838O601L760n825n092M344O205k392o995M60P229
2395C213J676o669l216N866M365m393n685K719O609j171o836o76O392K705n959
2410a060m008M855N163l176o802K222O310L44o542k030N958L528m467n284L472
2425a517O198j886o743R5O693J606n848l392M890M871l764n601K015O374n58o484
2441c051j358O152K745n484m024L976N501k554o032J072O047J156n899k661N416
2456A002L622m173m879K990N338j214n870k69N504J961m883l633M301M813l416
2471A194n355J705N694n9n499j570N223K646m148m065L203M980j837n640N12N680
$$ plain form
2365 5983 426 -5740 -1724 5135 2996 -4075 -4304 2947 5335 -1421 -5358 37 5643 1770 -4873
2380 -4873 -3251 4380 4153 -3244 -5082 1519 5279 -546 -5638 -1294 4911 2519 -4476 -4016 3213
2395 3213 4889 -1780 -4996 870 5235 842 -4843 -2124 4485 3314 -3522 -4198 2194 4899 -1060
2410 -1060 -5068 -213 4950 1774 -5028 -2806 3504 3848 -2694 -4724 1234 4762 295 -4989 -1517
2425 -1517 4681 2795 -3948 -3853 2840 4446 -1402 -4794 96 4967 1203 -4398 -2383 3991 3433 -3051
2441 -3051 -4409 1743 4488 -996 -5020 -1044 4457 1903 -4129 -3057 2990 4146 -1753 -4414 1002
2456 1002 4624 451 -4428 -1438 3900 2686 -3184 -3453 2051 4012 -871 -4504 -203 4610 1194
2471 1194 -4161 -2456 3238 3179 -2320 -3890 1333 3979 -169 -4234 -1031 3949 2112 -3528 -3016 2664
2487B664J083n634k103M542L710l738m634K080N280n58n765o48N348K317m417
2502d73l668L786M277k325m990J015N308L85n147j589M346L265m093l754K623
2517a034M767j479n192N0M874J528m398k966L763L753k707m563J587M918l86m601
2533b086j191M549K143l850l042K793L984j617m550M44M832Q79m956j709L778
2548D01L214l028m216K232M235r61m081n84M323J771m054k571L019L784k278m159
2564b953J220M388K12m594j371L796K430l122l239K192L835j143m215K07M050
2579A693R72l859j982L624K514k338l387J554L632j60m280p28M001J623l235k744
2595c100K882L159j575l704N51L561M47l504j621L335K716k753l488K162L404
$$ plain form
2487 2664 3747 -1887 -3990 552 4262 524 -4110 -2030 3250 2692 -3073 -3721 1627 3944 -473
2502 -473 -4141 -355 3922 1597 -3393 -2378 2930 3315 -1832 -3421 925 4190 97 -3657 -1034
2517 -1034 3733 2254 -2938 -2888 1986 3514 -884 -3850 -87 3666 959 -3604 -2017 2901 2515 -2086
2533 -2086 -3277 1272 3415 -435 -3477 -684 3300 1683 -2867 -2423 2409 3288 -1668 -3377 401
2548 401 3615 587 -3629 -1397 2838 1877 -2204 -2788 1535 3306 -748 -3319 -300 3484 1206 -2953
2564 -2953 -1733 2655 2867 -1727 -3098 698 3128 6 -3233 -1041 2794 1651 -2564 -2357 1693
2579 1693 2665 -1194 -3176 448 2962 624 -2763 -1209 2423 2263 -2017 -2745 1256 2879 -356 -3100
2595 -3100 -218 2941 1366 -2338 -1787 1774 2221 -1283 -2904 431 3147 394 -3094 -932 2472
2610B472o05m105k70L737J354l534j747K530L114k081l243Q15L698j33l482r98
2626b478L416J823k770k751K197K935j155l478L9L698P61l283j459K817K549k478
2642C83k767J539K666j5l351o90L327J709l155j983K004K600j315l039N01L200
2658A614K60k841j328L011J656k144k485J349K930o47l347LL409J045k988j675
2674b178K084K792k128k710Q55K891J55k941o84K731J442k350k090J564K719j330
2690H22k779M77L029K18k568j645K578K139k299k161J544K492m52k530l23K542
2706A084Q72k271j823J966K263j441k547Q70K243K68k620n79K045J563j945k019
2722b071J300K435l82k631j62K777O32k718j053J942J507j163j949J051J931k51
$$ plain form
2610 2472 1867 -2238 -2508 1229 2583 -951 -2698 -168 2946 865 -2378 -1563 2135 2002 -1480 -2478
2626 -2478 938 2761 -9 -2760 -563 2372 1217 -2261 -2222 1476 2237 -1046 -2505 312 2861 383
2642 383 -2384 -845 1821 1806 -1545 -2235 1092 2801 -354 -2337 -333 2267 952 -2087 -1586 1614
2658 1614 1874 -967 -2295 716 2372 228 -2257 -908 2022 1375 -1972 -1969 1440 2485 -503 -2178
2674 -2178 -94 2698 570 -2140 -1285 1606 1761 -1180 -1864 867 2309 -41 -2131 -567 2152 822
2690 822 -1957 -1480 1549 1767 -801 -2446 132 2271 -28 -2189 -645 1847 1395 -1135 -1458 1084
2706 1084 1956 -315 -2138 -172 2091 650 -1897 -1027 1216 1484 -1136 -1715 330 1893 -52 -2071
2722 -2071 -771 1664 1282 -1349 -1511 1266 1898 -820 -1873 69 1576 413 -1536 -485 1446 1195
2738A195k400m42K129R81j676j862J831K091r54k250Q8K543J72k439p29J961J429
2755A668j325k007J114K131k84k553K35J853O82j855j592K094J630j211k268N55
2771a133K463j56k190n61J989J050j616j377J140J997o92k172K16J758M07j502
2787c79j077J516J469j147j801P89J913k60k245k44K043R00j661j265J335J455
2803A341q42j945M09J969K37j667p88J599J052j160j634R60J805n15k024k7K029
2820G99N13j714j067J696J376j353j518M35J663J88j745n40J851P73j701j057
2836a401J143J682p80j767L91J478M24j624q21J405Q89r47j603Q23J880n85j688
2853a101L4J574O99j704q11J031J619p29j941N31J996j28j645o39J830N76j273
$$ plain form
2738 1195 -1205 -1647 482 1463 -213 -2075 -244 1847 893 -1357 -1269 1274 1446 -993 -1722 239 1668
2755 1668 343 -1664 -550 1581 1297 -1256 -1021 832 1514 -341 -1933 161 1791 580 -1688 -1133
2771 -1133 1330 1174 -1016 -1577 412 1462 -154 -1531 -391 1606 914 -1258 -1042 716 1123 -379
2787 -379 -1456 60 1529 382 -1419 -630 1283 1023 -1222 -1466 577 1477 -184 -1449 -114 1341
2803 1341 499 -1446 -1037 932 1169 -498 -1286 313 1365 205 -1429 -469 1336 821 -1203 -1230 799
2820 799 1312 -402 -1469 227 1603 250 -1268 -833 830 1018 -727 -1267 584 1357 -344 -1401
2836 -1401 -258 1424 644 -1123 -732 746 1170 -454 -1275 130 1019 72 -1531 -708 1172 587 -1101
2853 -1101 -1067 507 1206 -498 -1309 -278 1341 612 -1329 -798 1198 1070 -575 -1214 616 1192 -81
2870h1j052O21J742m75j692J03J571L77j485q67J166J113r98j241N25J721j11
2887I37j508o65J480J247j735j058J357J051l67j739N6J709K67j602n32J181R54
2904A033j018j093P65J347k97j712k28J475P91j284q66J036J300o36j629L59J603
2921I46K27j671o85J288J344j420r01M78J389l95j570k59J667N95j618o04R43
2938b46J473r12j339J48J730k73j275k41J474M33j104j170J192J172q31j278L18
2955g29J566Q1j517n75J563O68q66j399M94J573j20j591j36J613O67j510r80J323
2973A25Q73o83j435M99J271J81j282n65J241O93p98j301P63J647q63j119L7J372
2991F56J03j047p91R43J203j067j200N69J552k96j522k3J299O21j113j052R84
$$ plain form
2870 -81 -1133 -512 1230 755 -937 -834 737 1114 -371 -1238 -72 1041 43 -1198 -673 1048 937
2887 937 -571 -1236 244 1491 -244 -1302 55 1106 739 -1000 -944 765 1032 -570 -1102 79 1033
2904 1033 15 -1078 -313 1034 737 -975 -1203 272 1063 -221 -1087 -51 1249 613 -1016 -657 946
2921 946 1173 -498 -1183 105 1449 29 -872 -394 995 600 -970 -1229 438 1033 -585 -1189 -246
2938 -246 1227 315 -1024 -876 854 581 -694 -935 539 972 -132 -1302 -110 1062 231 -1047 -729
2955 -729 837 918 -599 -1174 389 1057 191 -1208 -714 859 739 -852 -988 625 1292 -218 -1198 125
2973 125 998 315 -1120 -621 650 831 -451 -1016 225 918 120 -1181 -418 1229 366 -753 -716 656
2991 656 759 -288 -1079 -136 1067 0 -1200 -631 921 625 -897 -920 379 1000 -113 -1165 -181
3008a81J237n53j197j53J436K77j367n15J259R74r15j271L56J528o42q78l14J292
3026C73Q55j230j152R50J302q26j235N54J005K02j291p62J378Q38j115r72O99
3043d27J552m41j660p8J552M05j396o58J148J416j131j394N64J516O6j742l61
3060a069J814M43j341r43Q40J287m73j408k6J689J22j404p68J198J177p76j229
3077h67L07J328K5j454j04J255O93j303q44Q59J516j088j344M42J466M2j283r45
3095a299J432J122j210j282N97J502k90j312k53J520N52j208j182J238J119p41
3111C05j284L79J327K90j423r53J763R12j238j603J014J781n15j614n1J416P71
3128A277j578q81J017J096n82j183K15J479J65j704n91J745Q06j169j356R12J592
$$ plain form
3008 -181 1056 503 -694 -847 589 866 -501 -1016 243 1217 302 -969 -613 915 273 -605 -919 373
3026 373 1228 -2 -1154 -204 1098 272 -963 -409 596 798 -493 -1255 123 961 -154 -1126 -427
3043 -427 1125 684 -976 -1054 498 903 -493 -1151 -3 1413 282 -1112 -548 968 1034 -708 -1069
3060 -1069 745 1188 -153 -1096 -256 1031 558 -850 -876 813 935 -469 -1237 -39 1138 362 -867
3077 -867 -560 768 793 -661 -765 490 1183 -120 -964 -105 1411 323 -1021 -579 887 929 -354 -1299
3095 -1299 133 1255 45 -1237 -640 862 572 -740 -993 527 1079 -129 -1311 -73 1046 305
3111 305 -979 -600 727 1017 -406 -1359 404 1316 78 -1525 -511 1270 755 -859 -910 506 1277
3128 1277 -301 -1182 -165 931 349 -834 -619 860 1025 -679 -1270 475 1281 112 -1244 -332 1260
3145A260q24j103k64J727L23j626p77J160J330r54j576O44J690k21j785j25J564
3162D43R73j448j307J096J530o07j724J60J795J27j412q56J302J038j121j152
3178a163O76J310K31j961n2J404P69j125j398J323R71n25j390K75J578J49j635
3195e63m11J420Q33j318j299R02J611m45j776J02J443P61j463j259J255J531r09
3212D15j745O34J665L62k089n06J494J218j407j262J031J515q19j420J25J867
3228A078J03j613p82J199J024o13j637K98J829J9j618p19J756R17j270j183J144
3245f8J334n79j523j09J721M10j549q86J373J324j272j321K85J868k52j581l64
3262a189J610Q93j558j246R29J778n55j825j12K399J13j742j090J930R09r62j312
$$ plain form
3145 1260 436 -667 -931 796 1119 -507 -1284 -124 1206 252 -1324 -680 1010 789 -996 -1121 443
3162 443 1416 -32 -1339 -243 1287 680 -1044 -884 911 1038 -374 -1230 72 1110 -11 -1163
3178 -1163 -487 823 1054 -907 -959 445 1214 89 -1309 14 985 460 -930 -655 923 1072 -563
3195 -563 -974 446 1279 -39 -1338 -436 1175 730 -1046 -944 499 1260 -203 -1462 -207 1324 415
3212 415 -1330 -696 969 1331 -758 -1264 230 1448 41 -1221 -190 1325 506 -914 -789 1078
3228 1078 1181 -432 -1214 -15 1009 396 -1241 -943 886 905 -713 -1432 324 1241 -29 -1212 -68
3245 -68 1266 687 -836 -945 776 1186 -363 -1249 124 1448 176 -1145 -860 1008 756 -825 -1189
3262 -1189 421 1314 -244 -1490 -561 1217 662 -1163 -1275 1124 1237 -505 -1595 335 1244 282 -1030
3279a030O78J337j47j716l38J622R19j606q76J046J405q06j570L80J497L42j831
3296f94m61J305J218j136j644Q10J787o25j191m10J657O62j442j041J152J381
3312A328j109j665P49J796k42j959j93J739Q15j321j307J175J469l91j993K82
3328h27J869M8j646n19J145J407r58j493K29J913l65j542p39J869Q28j573j219
3345a573J414J419r50j844O04J847K48j689o11J432J124j093j732R50J508J67
3361A221k267R5J519Q79j949r41J390J313r56j446M32J657K43k107m70J663J231
3378A507j535j407J000J495m71j860K75J732M32j598j055J555J362j223j477O46
3394f22J670j83j655l28J474Q60j428j352R64J710n52j836M03J742K78j818o66
$$ plain form
3279 -1030 -352 985 838 -878 -1216 406 1325 -281 -1157 -111 1294 488 -1082 -702 795 1137 -694
3296 -694 -1155 150 1368 232 -1412 -602 1185 560 -631 -1041 616 1278 -164 -1205 -53 1328
3312 1328 219 -1446 -697 1099 857 -1102 -1295 444 1259 -62 -1369 -194 1275 884 -1109 -827
3328 -827 1042 1090 -556 -1075 70 1477 519 -974 -745 1168 803 -739 -1478 391 1219 -354 -1573
3345 -1573 -159 1260 310 -1534 -930 917 1165 -524 -1135 297 1421 328 -1404 -454 1054 1221
3361 1221 -1046 -951 568 1447 -502 -1443 -53 1260 304 -1142 -710 947 1190 -917 -1387 276 1507
3378 1507 -28 -1435 -435 1060 589 -1271 -996 736 1168 -430 -1485 70 1432 209 -1268 -622
3394 -622 1048 865 -790 -1118 356 1216 -212 -1564 -600 1110 558 -1278 -875 867 1145 -673 -1339
3411a339J421J385j335j397P32J704j42k062o9J820P30j885p54J107J524j018
3427D22j972O73J831P3j415q60J674P81j330j258J104J775q60j674J57J962J49
3444A232j445j020J148J325r86j618P69J811l22j738l40J647P36j568p22R61J367
3461A237o55j732J95K004J15j691r07J914J001j174j578R24J433m01j620k01J954
3478H18L85j385j309J277J635q86j915P18J749m4j804k80J415J198j462j431R41
3495c80J675m62j834o2J948L60j592q97J287J192j199j298N62J983p47j321j67
3512i52J459R34j644j065J197J387p47j538K43J684J53j684o84J497J239j558
3528g9j114J041J143k96j623j51J629N47j651p97J414J191j186j411N68J973k68
$$ plain form
3411 -1339 82 1467 132 -1265 -533 1171 1029 -1033 -1102 718 1448 -437 -1191 -84 1440 422
3427 422 -1550 -877 954 1027 -388 -1248 426 1207 -123 -1381 -277 1498 638 -1036 -879 1083 1232
3444 1232 -213 -1233 -85 1240 254 -1364 -595 1216 894 -844 -1184 463 1199 -369 -1091 -130 1237
3461 1237 582 -1150 -955 1049 1164 -527 -1434 480 1481 307 -1271 -347 1086 685 -935 -1136 818
3478 818 1203 -182 -1491 -214 1421 535 -1380 -662 1087 1043 -761 -1041 374 1572 110 -1321 -380
3495 -380 1295 833 -1001 -1063 885 1245 -347 -1244 43 1235 36 -1262 -700 1283 536 -785 -952
3512 -952 507 1441 -203 -1268 -71 1316 569 -969 -726 958 1111 -573 -1257 240 1479 -79
3528 -79 -1193 -152 991 695 -928 -1079 550 1097 -554 -1351 63 1254 68 -1343 -775 1198 930
3545I30j651n31J761Q09j390j186J233J190m48j851M36J603M3j667m36J196R56
3562I97p59j608Q80J377j49j729j37J679P54j700j023J452J293q99k096J065J317
3579G14J08j526k28J392O60j516q60R68J488o86j799L20K066j26j366p17J432
3596C24R49j112j424N76J893m31j676j16J827O32j719r05J240J298p98j700M93
3613f49J661j2j997k77J682J113j637j261R14J770o07j577KJ590L79j399r68J531
3631B58J217j121j555N81J647k36j460m59J840O58j761q52J235J411j017j603
3647a217N11J604N56k210n86J946P20j283j202O87J868r61j318J41J589P33k162
3664e84p35J101J430q64j634P76J604j96j764j56J257J056j629j001J139J592
$$ plain form
3545 930 -721 -1252 509 1318 -72 -1258 -25 1165 717 -1134 -698 905 948 -719 -1155 41 997
3562 997 238 -1370 -490 887 738 -991 -1128 551 1305 -395 -1418 34 1327 428 -1668 -603 714
3579 714 822 -704 -932 460 1120 -396 -1256 -288 1200 514 -1285 -965 1101 975 -391 -1108 324
3596 324 1273 161 -1263 -687 1206 775 -901 -1017 810 1442 -277 -1182 58 1356 558 -1142 -649
3613 -649 1012 1000 -997 -1274 408 1521 -116 -1377 -463 1307 700 -877 -875 715 1094 -305 -1273 258
3631 258 1475 354 -1201 -620 1027 791 -669 -1128 712 1370 -391 -1243 -8 1403 386 -1217
3647 -1217 -706 898 1454 -756 -1342 604 1324 41 -1161 -474 1394 433 -885 -744 845 1578 -584
3664 -584 -1319 -218 1212 348 -1286 -510 1094 898 -866 -1022 235 1291 -338 -1339 -200 1392
3680A392j027j346M07J470J89j726n35J131J374j003j561N99J961n58j878J53
3696i58J876L52j659j032J358J405j143j179L38J660o7j832m27J750Q87j364j444
3713a479J135J758r01j747M53J908N4j885p22J758R58r33j801Q80J684k72j714
3730h66k80J736N07j423j008J418J393j146j898O98J976k42j613m39J643R53j498
3747h9j354J356J624o90j921p0K147K75j809r17J551J223j152j424M99J940k64
3764I25k176j66K324N33j881j096J325J691r79j792N47J644R1j715p33J734J291
3781A567j888j329J393J609p54k009O7K208N04k042q45J515J444j030j672O54
3797f08K027l58k111k86K156N71j587j248J452J617j020k093N47J891J52k165
$$ plain form
3680 1392 365 -981 -574 896 1085 -641 -1176 -45 1329 326 -1235 -636 1325 767 -1111 -958
3696 -958 918 1270 -389 -1421 -63 1342 199 -980 -642 1018 951 -881 -1308 442 1329 -35 -1479
3713 -1479 -344 1414 513 -1234 -781 1127 1181 -704 -1426 332 1290 357 -1444 -564 1120 848 -866
3730 -866 -1146 590 1097 -326 -1334 84 1477 331 -1567 -869 1107 865 -748 -1187 456 1409 -89
3747 -89 -1443 -87 1537 847 -1074 -1144 1003 1278 -531 -1448 103 1326 174 -1250 -751 1189 925
3764 925 -1251 -1417 907 1440 -441 -1537 -212 1479 500 -1292 -745 899 990 -725 -1458 276 1567
3781 1567 -321 -1650 -257 1352 598 -1411 -1344 864 1368 -674 -1519 -4 1440 410 -1262 -608
3797 -608 1419 1061 -1050 -1336 820 1391 -196 -1444 8 1625 605 -1488 -941 950 1102 -1063
3813a063n22J766J216j283j564J239J585n43k010o6K116N26j513j167J335J546
3829A598j446j844Q37K090l34j909k34J808O13j447j205J301J586q63k113L51
3845a211K558r2j836p74J988R76j511j514Q73J841l67j876j99J939P37j845j453
3862a766J795J175q59j983P97J842R2k051m50J911Q60j392j435J271J737o26k134
3879a216R3K237J92j883q72J653J317j325j906P77K628r67j732l58K213O44j751
3896b56j199J246J684r15j841J40K429J2j981o59J894J152j622j735J212J612
3912A173k06k062j30J869P16j586j388J422J865j208k106P98K166l92j940l35
3928a344J917P55j731j215J612J603q32k029j04K660Q8j922r75J757J162j261
$$ plain form
3813 -1063 -1585 181 1397 114 -1450 -211 1374 831 -1179 -1245 871 1397 -116 -1283 52 1598
3829 1598 152 -1692 -855 1235 901 -1008 -1242 566 1179 -268 -1473 -172 1414 551 -1562 -1211
3845 -1211 1347 1255 -581 -1355 633 1609 98 -1416 -543 1298 931 -945 -1144 795 1532 -313 -1766
3862 -1766 29 1204 345 -1638 -841 1001 1093 -958 -1408 503 1363 -29 -1464 -193 1544 918 -1216
3879 -1216 -1123 1114 1306 -577 -1449 204 1521 196 -1710 -933 1695 728 -1004 -1362 851 1495 -256
3896 -256 -1455 -209 1475 560 -1281 -1141 1288 1300 -681 -1340 554 1706 84 -1651 -439 1173
3912 1173 967 -1095 -1225 644 1360 -226 -1614 -192 1673 465 -1641 -843 1323 931 -1009 -1344
3928 -1344 573 1328 -403 -1618 -6 1597 765 -1264 -1368 1292 1380 -542 -1517 240 1402 141
3944A41j762J097J926o26j866j36K076O50j941j145J701J235p04k155O84J977
3960A152o1j906o04K120J159j938j588J593J720q15k156P5K165M01k040j140J954
3977I1J452j262j731P16J945j81k275oK102R56k076j305J443J812q34k297O07
3994h43J966L30k197p25J991R40j562j578J277J817o66j882q5J936Q28k379r10
4011a742K102J067r59j887Q40J959k40k039m05K138O40j512j557J394J962j162
4027E99k040N08K146L6k016r50K062J299j573j600Q79K015k82k132l04J939J068
4044A654j790j113J481J219j226j720P67J951k6k135n11K045R87j485j706J258
4060c50J911q24k007J50K349K85k093q79J756J359j423j741R47J834j73k209k50
$$ plain form
3944 141 -1621 -524 1402 776 -1090 -1226 850 1500 -441 -1586 115 1350 646 -1509 -825 1152
3960 1152 1091 -815 -1419 701 1860 -78 -1666 -73 1647 832 -1324 -1249 916 1317 -723 -1863 91
3977 91 1543 281 -1450 -734 1211 1030 -1245 -1251 851 1807 -269 -1574 -131 1681 847 -1450 -843
3994 -843 1123 1453 -744 -1469 522 1462 -100 -1678 -401 1416 750 -1132 -1217 719 1547 -832 -1742
4011 -1742 360 1427 468 -1419 -579 1380 1140 -899 -1304 834 1474 -38 -1595 -201 1761 599
4027 599 -1441 -933 1213 1249 -767 -1717 345 1644 71 -1529 -650 1365 1083 -1049 -1353 586 1654
4044 1654 -136 -1249 232 1451 225 -1495 -728 1223 1197 -938 -1449 596 1583 98 -1608 -350
4060 -350 1561 737 -1270 -1120 1229 1514 -579 -1458 298 1657 234 -1507 -560 1274 1101 -1108 -1358
4077a358K055Q49j756j462J467J883j296j763K12K245Q8k340k71J753J237j548
4093ej579R98J894k91k180l8K239L06j690j505J930J693j479j907P63K060j62
4110A047k023l48J795J079j627j131P96J838p16j921L31J763L16j842m69J418
4126C06J345j194j683O10J917m15k042k9J914O54j550j503J233J626q04j501K13
4143i03J867L71k091n05J364J601j886j323J367J520q05j544k42J951O18j815
4159d55q16J416J459j379j849P37K234n48k019J43J552P02j492j080J129J870
4175A604j021j847N33J863J6j918m39J664J036j261j763J080J539n48j742j46
4191a350K110N58j708j227J818J295j383j578P33J746J50k021m02J850P09j385
$$ plain form
4077 -1358 697 1546 -210 -1672 -205 1678 382 -1381 -1169 1076 1164 -1176 -1447 306 1543 -5
4093 -5 -1584 -586 1308 1017 -1163 -1201 1038 1344 -346 -1851 79 1772 293 -1614 -851 1209 1047
4110 1047 -976 -1324 471 1550 -77 -1208 -412 1426 710 -1211 -880 883 1199 -643 -1112 306
4126 306 1651 457 -1226 -616 1301 886 -1156 -1185 729 1383 -167 -1670 -437 1189 385 -1116 -903
4143 -903 964 1335 -756 -1261 103 1704 -182 -1505 -138 1382 577 -967 -1209 742 1360 -455
4159 -455 -1271 145 1604 225 -1624 -887 1347 799 -1220 -1077 475 1177 -315 -1395 -266 1604
4175 1604 583 -1264 -731 1132 1148 -770 -1209 455 1491 230 -1533 -453 1086 538 -1204 -1350
4191 -1350 760 1318 -390 -1617 201 1496 113 -1465 -732 1014 1164 -857 -1259 591 1300 -85
4207h5j628J600J594p76j998N79J815j43j751n10J539J008j177j454R72J788m37
4224I36j978j35J855O80j936r14J551J159r20j438N23J541N21k246l88J752P21
4241A284j234j265Q88J477l23k133J51K062K35j651p91J201J406j237j173M67
4257f36J627j92j536k69J647N96j447j187J509J363p82j783L14J549K26j703n28
4274a232J578O40j072j089Q87J339m45j898M02J642K92j533q35J138J430j024
4290B20j121L70J491j46j676j60J607O05j243j325J234J142n10j610J93J676J23
4307H70j468p01J235J180j117j012O26J359l72j197l60J532P00j602q39J355J029
4324A218j026j127K45J742j85j580j64J294Q38j516q91R49J207m65j676K73J444
$$ plain form
4207 -85 -1713 -113 1481 705 -1293 -714 1101 958 -793 -1303 236 1244 67 -1387 -415 1373 936
4224 936 -1042 -1177 678 1358 -578 -1492 59 1218 298 -1140 -617 924 1445 -801 -1189 563 1284
4241 1284 50 -1215 -327 1150 827 -1306 -1155 907 1142 -509 -1300 -99 1307 70 -1103 -636
4257 -636 991 799 -737 -1006 641 1237 -210 -1397 112 1475 693 -1090 -776 773 999 -704 -1232
4274 -1232 346 986 -86 -1175 -288 1051 606 -1292 -890 752 1044 -489 -1324 -186 1244 220
4290 220 -901 -531 960 814 -862 -1022 585 1190 -53 -1378 -144 998 488 -1122 -929 747 870
4307 870 -598 -1299 -64 1116 -1 -1013 -387 972 600 -597 -957 575 1275 -327 -1166 189 1218
4324 1218 192 -935 -690 1052 867 -713 -877 417 1255 -261 -1152 -203 1004 539 -1137 -864 580
4341E80L41j564l56J225Q97r51j210N83J399k32j435N1Q97R49j246j321J260J226
4359A093o66j427J66J530M6j384l20J220Q81j052j153Q00J615n39j653R2J492
4376G41J82j372m94J110J178q85j467L26J601p9j627l58J534M95j111j156J301
4393h1J038n81r47pJ329P2j178o18J256N19p88j159R09J260k64j408k72J498L99
4412I77j538l97R93R68o33j266L00J599l25j567K19J159P57j438q53Q93J065l15
4430E98j285L0J294L45j376r31J666N38p19j275O83J307l59j287K2R61P21j142
4448b09q41J180J073r33j253M31J307J91j311p21J380Q85j215r12M32J341l27
4465D98j514L84J269J80j095q50J271Q16p33j129N09J094m8j443J22J174N19j113
$$ plain form
4341 580 921 -643 -999 226 1123 172 -1038 -455 944 712 -723 -672 225 1174 -72 -1393 -133 1093
4359 1093 427 -1000 -834 696 742 -642 -962 258 1139 87 -1066 -266 1349 810 -843 -751 741
4376 741 923 -449 -943 167 1345 460 -1007 -681 920 841 -786 -1144 390 885 -226 -1382 -81
4393 -81 957 376 -571 -578 751 823 -355 -973 283 802 14 -1145 -236 1024 760 -648 -920 578 977
4412 977 -561 -958 35 1003 370 -896 -596 1003 678 -889 -670 489 1246 -192 -1045 -152 913 598
4430 598 -687 -657 637 982 -394 -1325 341 879 160 -1115 -432 875 516 -771 -749 212 933 -209
4448 -209 -1050 130 1203 270 -983 -552 755 946 -365 -1086 294 1179 -36 -948 -516 825 498
4465 498 -1016 -632 637 817 -278 -1128 143 959 226 -903 -394 700 652 -791 -669 505 1024 -89
4483h9q55Q27J034o25j029L01R65L37j180p04J373Q23j204j035O89J240o18p15
4501d65j65J187K57o93j116J050O35n42r59N54J326m11j319n3J104P03j282o55
4519h44O11J333n01j578K44J414J56j373m42J321O55j067o27M79J008l17j100
4536f28o9J277L76j297l52O78R87n65j317M60J025M9j088k78R04P16j010p93P88
4555a37R13l21j380M48Q14N48j131l72J056P41q03j275O84P15P5j062k20J263
4573E56J63j084o04J019J106r27r31O7J181M04j466m49J264P85j130j020R33J027
4591H94m67j152L1J323Q9r48p80R80R42n29j355N16J390l38j208n6R68O41j022
4610h1p99O66J084m93j070L51J166J93j421l67Q49Q13j008q96O25J213j51j518
$$ plain form
4483 -89 -944 -117 917 292 -737 -436 529 866 -314 -1018 355 1178 -26 -1061 -372 868 250 -465
4501 -465 -630 557 814 121 -995 55 690 148 -811 -257 1069 658 -661 -714 390 1093 -189 -844
4519 -844 -233 1100 599 -979 -735 679 835 -538 -980 341 996 -71 -698 -219 789 472 -628
4536 -628 -697 580 956 -341 -693 -15 972 407 -910 -450 575 624 -464 -742 162 878 -132 -925 -137
4555 -137 776 455 -925 -477 337 885 -246 -618 438 1179 376 -899 -215 500 575 -487 -707 556
4573 556 719 -365 -969 50 1156 229 -702 -635 546 950 -516 -965 299 1084 -46 -1066 -133 894
4591 894 427 -725 -694 629 718 -230 -1010 -30 912 383 -972 -456 934 596 -612 -668 300 941 -81
4610 -81 -880 -214 870 377 -693 -342 824 1017 -404 -771 78 891 -117 -1013 -388 825 674 -844
4628h44N8J102N60j195o69R53R11o39j235K66J333j1r11n58J335K36k88j275M95
4647c76J324m90j040q4J231L88r63j071J161O76p11p17L53R35Kj210j19J100M44
4666H33j068o36Q31R11l81j184J50J348j13j120l60J105P04r55j086N45J241j61
4684F04j201k28J515K38j105p21P21R30m86q85J37J360j6j178o13J336L41o23
4702A26j088Q47J104m57j296j66J547L42j250m31R24P12r67p61N45J143j75j276
4720e77R5P74M47q05q41Q78R23m95j120J82J288k24q81m01R94N70q78j012P30
4739c53Q62k8r41j60J164J83q88q94J063Q64o78j107L44J476k09j351j14J193
4757D26N53r24p08N73R77m75j133L18J058M9r26q67J464M28p55p79M52R82r8j019
$$ plain form
4628 -844 -786 316 876 -319 -988 -35 876 237 -998 -732 601 590 -321 -879 456 692 404 -871 -376
4647 -376 948 458 -582 -666 565 953 -10 -1081 80 756 45 -672 -319 616 618 -592 -711 389 833
4666 833 -235 -871 -40 871 490 -694 -544 804 691 -429 -789 316 1020 65 -1021 -476 765 604
4684 604 -597 -825 690 928 -177 -898 -177 753 267 -618 -481 879 863 -315 -928 408 749 126
4702 126 -962 -115 989 532 -764 -930 617 959 -291 -722 202 914 -53 -814 -269 874 699 -577
4720 -577 -482 292 739 -66 -907 -29 894 399 -721 -539 749 525 -356 -757 237 807 -71 -1083 -353
4739 -353 509 481 -460 -620 544 727 -161 -1055 8 872 194 -913 -569 907 698 -653 -767 426
4757 426 979 55 -653 -80 897 422 -711 -393 665 714 -212 -1079 385 813 58 -721 -269 713 615 -404
4777d04j82Q67N83j039q75J249O74l82j020J69J068l97q68k57R59P62q24j168
4795a085P69R90j22j415R8J194L44j255k28R08O86m14j438M53J138j14r34m99
4813i24J309N55j046p77P48R14k10j079l14J559J07j348m09J004O39p49j058M80
4831e99J573m76j159m7J061M24r19p86P85J016o83q01r7J428r1r23m64J004M68
4850G14r30o20N53J100k55j528N85O65M26r91o70J008Q29n70j066N62R56M0j347
4869e39l30J239L95j157m90R60N42q8j445K33J231P8q90o48R10Q10p48j079N22
4888d94J368o62r62r5J371K90r52o28P52Q61p54j027L89J249p0j052m84J089O50
4907H39r27p49P20P04J42j419k2J125L06j233j12N96R37n58j264N64Q51J51j195
$$ plain form
4777 -404 -586 281 864 -175 -1050 199 873 491 -529 -360 708 311 -557 -814 145 907 83 -1085
4795 -1085 -316 674 552 -863 -765 429 773 -482 -710 198 884 470 -968 -515 623 509 -425 -924
4813 -924 385 940 -106 -883 -135 779 569 -510 -824 735 842 -506 -915 89 728 -21 -1079 -599
4831 -599 974 498 -661 -708 353 777 -142 -928 -143 873 190 -611 -708 720 629 -294 -758 246 714
4850 714 -216 -836 -283 817 562 -966 -381 284 710 -281 -951 57 886 316 -750 -188 768 808 -539
4869 -539 -869 370 765 -392 -882 78 620 532 -913 -680 551 629 -261 -909 1 811 63 -1016 -494
4888 -494 874 212 -750 -845 526 816 -136 -764 -12 849 95 -932 -543 706 636 -416 -900 189 839
4907 839 -88 -837 -117 587 729 -690 -712 413 719 -514 -626 -30 907 349 -915 -351 500 651 -544
4926e44l21R49O12q46q01R08J054q84o68M0R56L6o81l54Q10O31p77j057O01J087
4946G51l9j305o2J086N98j154p89Q34P81l66j039K10Q97P0q47l85P93O54n54j276
4966a142O39J162k42j020K73O98K37q58o44P62P12m02j036Q90Q42j47j132l03
4984g11P73O05q28p05O70N95j16j052K33J058o3q18p04J160O95q69p40K62R32
5003C77J50j111k15J068J64o66o03Q01O67m26r26M21R26j85j026l95J272M76q53
5022h4o01M06Q65j25j224L00R31M06r81p31J114L07n05p13K89Q20K38j530L88
5041d30P76J53n77m77M63Q34m56o38k62J121R5j010k19O79Q41q05q62L54Q81p8
5061C83r11j26J242r0o36o85R51N13n49p48K56R63j57r75K28N21M47p42o37M75
$$ plain form
4926 -544 -865 84 696 -150 -951 -43 1011 127 -541 -501 455 491 -190 -544 266 897 120 -937 -336 751
4946 751 712 -593 -655 431 1029 -125 -914 -80 701 335 -704 -494 403 473 -374 -759 34 688 134 -1142
4966 -1142 -503 659 417 -603 -330 368 605 -253 -897 -135 577 175 -861 29 871 724 -408 -711
4984 -711 62 667 -161 -866 -196 399 283 -769 -536 522 459 -359 -1063 97 792 -77 -817 -555 377
5003 377 527 -584 -799 269 433 -233 -836 -35 632 206 -720 -299 627 442 -584 -979 293 769 -84
5022 -84 -685 -279 586 461 -763 -463 468 874 -107 -838 276 583 78 -635 -346 474 712 -818 -430
5041 -430 346 499 -78 -555 -92 742 286 -352 -614 507 602 -408 -627 52 893 88 -774 -420 461 383
5061 383 -528 -654 588 498 -138 -823 128 641 92 -656 -400 563 406 -569 -341 180 627 -115 -752 -277
5081b77R28k03r54J45R22L79q73p03P19N32m41o86RJ202k72p78n01J144K98o28
5101c8m78N77O49l17p93j20J011J44r03n25P96P85o33p75N65N32l16n13n3Q25
5121D20J79q07o66O03Q58m42p72R3J131l68m49k78N26O56p90m33M79O14j99p37
5141c82j39R55L07j075k56N98N09n41m63J55J021l52q41j86R55L96q88m31Q71
5160B13N86q30n74L03M62M65q30k12N97L76k75q70M41O00j75p86j14R27Q1n60
5180a75o97J142L31n94q72M78Q93j02r64P3P86M99q94n06O87M21m10q24M19M60
5200A51K08p06l88Q75L76q62l06N49M96j49o17l4P58M69r39n14P71N99n57r70
5220g90L37R45q3p53j41O91K79m79r48P71P08m16q71K29Q55J91q37l27Q59M93
$$ plain form
5081 -277 651 448 -506 -361 561 940 67 -636 83 615 174 -512 -503 699 427 -351 -852 292 590 -38
5101 -38 -516 61 710 393 -400 -520 491 635 -268 -793 3 788 155 -620 -55 477 161 -352 -405 420
5121 420 599 -208 -874 -271 587 145 -627 -534 597 229 -220 -498 28 684 -106 -539 -60 554 355 -382
5141 -382 -521 434 741 -334 -590 8 517 -24 -487 -332 689 337 -504 -690 265 661 -227 -658 213
5160 213 799 -31 -605 -302 160 625 -205 -417 180 556 281 -589 -148 452 277 -509 -623 304 385 -175
5180 -175 -872 270 601 7 -865 -387 506 404 -560 -487 299 798 -96 -602 85 506 96 -728 -309 151
5200 151 359 -347 -735 140 516 -346 -652 -103 393 244 -373 -407 351 820 -119 -633 138 737 180 -790
5220 -790 -453 492 409 -344 -485 206 485 6 -942 -171 537 121 -750 -521 334 525 -312 -639 220 713
5240G13o69n08Q6J077k62r93J18O68M57p39n95L87R65n06p65K68M87K54r25l57
5260h39Q01N75l51r92P02P74m82o88J08N72L57r24q9N33N24l44p26J75Q40o2q64
5281d00k09Q07K20n24n55N56N46j90p41R1R27P1p53l86P73L24p87m94M71P96n1
5302D92r76k2J057J00q50m70N54J046q40o10L82P20l6p43j49L50M79p34l71L75
5322b46P62j07j047L53Q30j21m06q97J121J64j36o60K19R64n16q30n5J017J97
5341F06q48m92P42P13l90r50L11N68J94p87l39Q15L99n03q42M57P46Q8j116r2
5361g20J244K42j099k51P59L54l67o71L69P44j89q82J08O02L42q56k26L56P62
5380F21j97r38K53Q53k09q45k21N98P93p26o45M79P21r1p91q4P91L11n23o88L45
$$ plain form
5240 713 44 -464 -378 699 437 -556 -438 230 687 -52 -647 -260 705 199 -566 -298 189 443 -482 -839
5260 -839 -38 537 186 -806 -104 670 188 -500 -392 180 537 -387 -476 57 581 237 -489 -314 526 464 -400
5281 -400 -609 198 418 -106 -661 -105 441 251 -490 -399 528 599 -154 -540 233 557 -230 -724 -253 543 492
5302 492 -484 -506 551 651 -199 -669 -115 931 91 -519 -137 583 547 -196 -345 5 484 -250 -621 -246
5322 -246 516 409 -638 -285 545 424 18 -879 242 406 270 -390 -171 793 277 -553 -608 409 606
5341 606 -242 -734 8 721 331 -619 -308 260 454 -333 -672 143 542 39 -803 -346 400 488 -628 -720
5361 -720 524 766 -333 -584 175 529 162 -509 -140 604 415 -467 -359 243 585 -271 -497 -141 621
5380 621 424 -514 -261 592 383 -462 -683 -85 708 -18 -663 -184 537 446 -345 -429 362 673 150 -538 -193
5401a93R63q23l85l2O31K49j029l15J219M80q08o09L26R58l34p32J05O55J95q30
5421c09m14P35L07l47n50K06J088j69j044n5R68K34p72m77P47L19j12r97K19J163
5441G40r4q40l45Q02M55q19n50O13P40n89p20K9J030K8p45m57O55P16o84p28K62
5462e01J054J4r67N7O31M59o54q53M29J069k75j133K69Q06K96j071k50O86N69
5481F35p33n68L17Q08J37j289m7J140K38q83n72J097N49m89r19J08R77j79p52
5500d25m39Q59N50n03q56N95R27k77j003Q0P92L43j084k98P91Q87q71n63R4Q68
5520D67l3p34k07Q57K66p50n02L98J009n42r72N31N22J62n79o20R23O56q39q99
5540h86P69R25m19r24j80J290J50p44p52Q55N41m95p80L81Q14p0p82m08J106K25
$$ plain form
5401 -193 770 -53 -438 -470 161 410 -619 -934 285 765 -43 -652 -326 632 298 -434 -329 326 521 -309
5421 -309 -723 12 319 -28 -578 -372 716 547 -497 -552 416 650 -122 -599 148 467 355 -642 -423 740
5441 740 646 -194 -539 263 718 -101 -651 -38 702 113 -607 -578 452 480 -265 -722 -67 649 -35 -763 -501
5462 -501 553 567 -400 -343 288 747 93 -760 -331 738 463 -670 -401 405 701 -370 -620 66 635
5481 635 -98 -666 -349 459 596 -693 -740 400 638 -245 -817 280 829 340 -579 -471 506 327 -425
5500 -425 -864 -5 545 42 -814 -219 708 431 -572 -492 300 643 -441 -739 52 939 68 -495 -401 467
5520 467 434 -300 -507 350 616 -134 -636 -238 771 229 -743 -212 310 472 -107 -727 196 852 13 -886
5540 -886 -117 808 389 -535 -715 575 725 -19 -771 84 625 130 -650 -269 545 475 -307 -715 391 616
5560F16q27l94L90Q17k28j087J98J081J28j069k91P00Q79p95p93M43R43n91n62
5579d42j42R56N06j011l76L83P85o73p32M27P73p3o59l68Q45M94p80o07M96J176
5599I78o64q89jP78P17j089m32N88N70k19j202N65P50O2r43N7O71N37q73n69P33
5620A25O18k21j063J89P70J64q71p15J113O83n25j002M06J045j83r86j19Q08O80
5639I16j070n81P90O51m39p10l4Q07j77m42m42R13P38p84r66O72P08P4j345L10
5659d11Q29J91q61k89N14Q29o60q75L19P73j10q22j02R52M17j002n10N82J022
5678G86n09q51L29R04j59o69l71N76P65p02n59L98P65n26o49N5O21K95o51n51
5698g03P81O63o87o47J75J024l3j219o3Q69M68p78n89N47J057k85j153N0J160
$$ plain form
5560 616 -211 -605 -215 602 374 -713 -515 566 694 -375 -666 34 913 118 -675 -232 711 120 -442
5579 -442 -584 372 878 -133 -509 -126 659 -14 -746 -319 454 381 -278 -646 199 693 -87 -694 -198 978
5599 978 314 -575 -576 202 919 -170 -602 -14 556 337 -865 -300 450 512 -431 -374 297 834 -39 -608 125
5620 125 743 522 -541 -352 418 582 -289 -1004 109 792 267 -735 -329 716 533 -453 -572 236 916
5639 916 -154 -735 55 706 267 -443 -477 330 153 -289 -731 182 920 136 -830 -158 550 624 -721 -411
5659 -411 418 609 -252 -541 -27 802 142 -733 -414 359 249 -573 -675 277 694 -308 -818 -236 786
5678 786 277 -574 -245 659 500 -169 -540 36 801 99 -460 -62 703 177 -472 -417 204 499 -152 -703
5698 -703 78 741 54 -593 -418 606 573 -646 -709 160 628 -150 -739 -192 865 580 -573 -523 637
5717F37j05o70l33M12Q79r08n65M35P67r6r22j88P34O14p06o41O77O54n85p70
5737f80K93Q27K22r96k19Q57N76p72q37M76J007l91q85j00J249j65q02m49Q78
5756H9M69l75p06Q6R47jr44k39O77P38o83o79N20P61j76q63k39J182K97j163k83
5777e85O93M56n08p03N67P60n96n75p4O54M47o63m37N36N67m24n77J56J097l71
5797D20n42n45R42M00o13o77K71J122n14r47O4R55k24m13k48N00P35m60j027M07
5817c94Q92k05o44k14Q68K41q29k08L96O32l04n02K23L76J27q37n07J134K81n99
5837g3p72Q16N60j70o79l65J080K11q17l00M44P15m85q06L36P77j32p53j10Q53
5857C30L88p27n81M98P14m67n73k7P62J68q23m93J104K54m46p74N01Q17p0r79
$$ plain form
5717 637 532 -138 -471 -59 820 -88 -653 -218 549 453 -469 -657 77 691 -15 -656 21 675 90 -680
5737 -680 -387 440 662 -334 -553 304 880 108 -729 -253 754 363 -522 -622 627 462 -340 -789 89
5756 89 558 183 -523 -437 510 509 -435 -674 3 741 58 -621 -101 660 484 -379 -618 564 861 -302 -585
5777 -585 108 564 56 -647 -80 680 84 -491 -565 89 536 -127 -564 -28 539 115 -462 -306 791 420
5797 420 -122 -667 275 675 62 -615 -344 778 264 -683 -619 336 112 -301 -549 -49 686 226 -801 -394
5817 -394 498 293 -351 -565 303 544 -285 -493 -97 535 231 -271 -48 328 455 -382 -889 245 526 -73
5837 -73 -845 -29 531 361 -318 -683 397 608 -209 -509 -65 650 165 -641 -305 472 340 -413 -523 330
5857 330 718 -9 -590 -92 622 155 -418 -445 317 485 -338 -831 273 527 81 -693 -192 625 555 -424
5877d24l1P15M70q02m42M55P07n11p46J64P60r4n09m12O56Q16p04q49N92P70k44
5898C37j075L24O71N4o97q0M88N58l91q49L97R15k64r83K0O42M15p39k75L27P35
5919E30l67p13m7J076pq73k4Q88O5m62q93Q09M76k1o91k32J004Mo07l91N46L75
5941D45r9r55K45R84j97p91l76R95K30n18n34N16P09m65o35pP43Q9o03l13N02
5962c5M55m16m65L55N98l17n49J86K26O46p25o39P51M69l98o95M46L63Q2r42n1
5983f55J161P0m84o26J09P71J77j054L18P25j07n55o43P76N10m61o13L75P87l02
6003B79n94J08L53M76p08n22N24O62k77p07J91P63l07m10m20N98N47n60n97N32
6023f9M04l95m71K66O01j07m23m29L62N94p0p46L03O55q3o49O1L90K84o94l43
$$ plain form
5877 -424 -455 260 730 -72 -514 -59 648 137 -609 -445 315 221 -288 -700 -44 772 68 -781 -189 581 337
5898 337 -738 -414 257 311 -386 -466 22 580 189 -660 -263 652 388 -595 -575 67 482 -257 -532 -205 530
5919 530 163 -550 -597 479 472 -401 -425 463 528 66 -827 -18 458 437 -254 -486 518 522 -85 -476 70 445
5941 445 346 -609 -364 620 423 -368 -744 251 481 -37 -571 -55 654 189 -446 -453 290 379 -224 -537 -35
5962 -35 420 4 -461 -106 492 175 -374 -188 38 684 -41 -680 71 540 142 -553 -107 256 338 -604 -655
5983 -655 506 576 92 -534 -425 346 523 -531 -213 512 405 -150 -793 -17 493 32 -581 -206 581 279
6003 279 -315 -207 146 622 -86 -608 -84 578 301 -406 -215 548 241 -169 -589 9 556 -4 -601 -69
6023 -69 335 -60 -531 -265 336 229 -194 -623 -261 333 263 -483 -180 475 392 -257 -196 194 478 -216 -559
6044e59M44O53j42q85K09P26M2p24k32P39L00k43p43M72L24Q9p16j13O37p9l31
6065a32o67R37M22l22q56M32L88K08q19p9O27L55o47p30O28O87j92p54K81N50
6085C17L1p57J95K24N60l58q77O80N79l23m64k62O99J21m02m95N53O17k87r07
6105e56L01O70j22m32j62M42M53n04p35L85P62j99o35j86R32m6n74j61L80O86
6125F99n14n63J85O17Qm84j07K99M63p35k66N47J89l34m09M2P16K14q22k70Q38
6146C13M88o71n66K34Q96l80p87P1N57K64o33l51N42M75l19n76J66M61Nn10k59
6167e80N37O68o17o22M00P21j51q85J01P13K04p76k46N22L11j41o66K37P37k07
6187B60m35m28R18L1k63n38L67N90k40o96K43P06p3p44l4N14J65m41k53K11K93
$$ plain form
6044 -559 -115 538 396 -489 -280 446 488 -236 -468 271 571 328 -415 57 381 470 -246 -359 278 199 -132
6065 -132 -799 138 560 238 -618 -186 202 410 -409 -488 139 494 -153 -883 -255 432 240 -514 -233 317
6085 317 348 -409 -214 10 570 212 -665 15 594 271 -193 -455 244 365 -37 -532 21 638 351 -556
6105 -556 -255 415 293 -139 -301 141 594 90 -645 -260 502 303 -332 -518 414 368 -206 -367 13 699
6125 699 185 -378 -193 424 432 -52 -159 140 603 -132 -398 149 338 4 -405 -363 353 567 -255 -525 313
6146 313 801 130 -436 -202 694 314 -473 -402 155 419 -214 -565 -23 452 133 -443 -277 184 189 -321 -580
6167 -580 -43 625 8 -614 -214 507 356 -529 -428 285 489 -287 -533 -11 300 159 -507 -270 467 260
6187 260 -175 -603 315 346 83 -455 -88 502 262 -434 -191 515 442 -302 -336 178 343 -98 -351 -140 153
6208A53j58l23j17R24N3q56j90P22K28o15l75N0J016j57p10J4N53L01n66m64P42
6229B25J84j57n56J04Q18k51m11m01M65N08m25m62J20O28l19o33O4O14L47m56
6249Fn38M66M61l74k07j01O63J64q27j41P64j81k94l93L94Q46l58q99J44P76L7
6270D08m08m56N09K54m68m06M90N62j95o45j39P49J70o32j63K60M51K4j135L38
6290d32P53K76r20j60P02L58n71l33O1M35J57o12j16O58K00p64o7M47N34o39m86
6311e19L77M76Q9p29r4P11K38n85n03M05O59j10p29P9O22qp02k40O16M22m09p23
6333f57M05Q32n74j76m44J004p4p22J7K17N76j72o18Q6P79m6r70K27N85J10j94
6354A91p60M23N29l12o85L44P42j04n15m40P19L71l92o77J28R44m56l77l5P26
$$ plain form
6208 153 -5 -328 -445 479 532 -324 -514 208 436 -179 -554 -504 512 355 -355 -341 212 513 -53 -517 225
6229 225 409 252 -304 -200 618 367 -44 -445 20 528 103 -359 -239 389 70 -563 -499 115 462 6
6249 6 -532 -66 395 21 -186 -287 376 540 -287 -428 336 155 -139 -532 -138 708 350 -549 -405 371 408
6270 408 0 -456 53 307 -161 -567 -77 485 290 -355 -494 255 425 -207 -370 -110 341 365 -770 -432
6290 -432 321 597 -323 -483 219 577 6 -327 -266 169 326 -286 -402 256 456 -308 -375 72 606 -33 -519
6311 -519 -142 334 423 -306 -400 311 549 -36 -539 -134 525 415 -314 -235 387 379 -323 -563 53 475 66 -657
6333 -657 -252 580 6 -170 -614 390 316 -406 -389 -172 404 232 -386 -300 479 433 -537 -310 275 385 191
6354 191 -569 -146 383 71 -614 -270 472 368 -147 -587 132 503 111 -566 -438 506 50 -327 -362 364
6374C64J44m38o32O75M34m39m70K66K69K41p76j95N82L69n96l58R4N53J50n99
6394c62k73P03N08p56k46K68P69o53n62K63O54J43o44N1N28J16o52n27M14N90
6414C32j26l76j63O93J40n86k01M33L03m32m07R1O09j00n74K53L59M15o36n34
6434e07L87M48j09p25O9P21j40l93KL25L53m67l41J58O27j33n52j60O19K79m70
6455im53M12M25m50n74N12L65Pl33k88P10K13n35l44L9P79j07n96j34Q30J65o96
6477f2j26l3M85j11o88N62L38Qq45J60N51J20m64l74N70L08l23n97K65N78M9o17
6499b46k98R47K4l19n08M03J57J63o44J00L25L09m11n75P60K30k69n44K17N31
6519C52jp76J60M40L66n20l83j8O59j18m74J04N72n9o06j74P14K87p58k46L42
$$ plain form
6374 364 508 70 -562 113 547 108 -362 -96 173 414 -362 -557 25 394 -202 -560 -466 87 237 -362
6394 -362 -635 68 576 -180 -426 -158 611 -42 -604 -341 313 456 -188 -137 391 507 -145 -672 -258 332
6414 332 206 -170 -333 360 500 -86 -287 146 449 17 -390 -299 310 210 -364 -111 248 663 27 -507
6434 -507 -120 328 219 -506 -437 284 144 -249 -247 78 431 -36 -377 -219 408 275 -277 -437 182 461 -9
6455 -9 -462 -50 375 -75 -649 -137 228 235 -98 -386 324 537 2 -342 -303 476 369 -227 -361 469 634 -62
6477 -62 -188 -221 264 153 -535 27 365 373 -472 -312 239 359 -105 -479 91 399 76 -521 -256 322 371 -246
6499 -246 -544 403 427 108 -400 3 160 323 -321 -221 104 413 2 -573 187 417 148 -396 -179 352
6519 352 351 -425 -265 175 541 21 -362 -380 279 161 -313 -209 363 304 -302 -476 238 525 -233 -479 -137
6540a37M26P8o88J15M41L30o01m45N92K31l45l76J52N81j1n89K6M84j5J00r08
6561e59M40O42j12q47K44L29K42l65n80N46M27l16n42K59N12M9o44j98P32J79
6581D38p27k39M11L37j06o21K74L69K81p02J17J57N06p24k03J13P61j90r01L18
6601c31N45L2m75l04M32M78l88n11L60L07J83n94p7N25J62l21m67L56N09k97m04
6622b80o5P50j66l93l45N77K81l70n44M27O00j60m00j38L20L19n61k57J82N11
6642B88M4p25N9P95Ll80l45M26O3p4o11L33O93k76p21j30J054k13n35j03J66N10
6664C21m76J47l19O45p9n27k14O68L04o59j26J47O81j97n72m9M47K81p78l4L99
6685A0M88l18m98J99L15r5m63K57L23Q9j65l93L03L41j71l82K3K92J64k80m02
$$ plain form
6540 -137 289 367 -321 -206 235 565 -36 -481 111 342 -3 -379 -227 354 343 -246 -220 264 249 349 -559
6561 -559 -119 523 411 -436 -192 137 379 14 -566 -20 407 91 -451 -192 320 369 -275 -473 259 438
6581 438 -289 -528 -117 220 114 -507 -233 136 417 -285 -168 -11 495 -229 -432 -319 442 252 -649 -331
6601 -331 214 246 -229 -533 -101 377 -11 -522 -162 145 328 -266 -343 182 344 23 -444 -88 421 124 -280
6622 -280 -345 405 239 -154 -499 78 359 -11 -555 -128 472 312 -88 -226 94 413 -148 -405 -223 288
6642 288 332 -393 -334 461 464 84 -261 165 228 154 -457 -124 569 293 -428 -558 496 283 -252 -355 -189 321
6664 321 -155 -8 -327 318 239 -288 -502 166 470 -189 -315 -168 513 316 -256 -305 142 423 -355 -389 10
6685 10 498 180 -318 -119 196 101 -362 -105 218 307 142 -251 52 393 222 -160 -137 155 319 39 -363
6706c63K68M01l17k42P1M65q9n18M6M68L13q20l3K92O23n90l43K60L95pm98k91
6728e09N42L00l11m88L09L30j41k44j28N59J43o45j20L93K35l75J07o9N44l10
6748A22l19k5M82J60n20l24M46L50j09m70j86Q08j62n27%J98K31k20k43J93L87
6769B72j26l83Q3M41K48o26k95K85O09o24j47J58K87J20l14m00O20J57n81k37
6789d53M96L93l82m66N5O16j8o01j10M92L55m92l22K04O21k37l93r1O92k48j47
6810c6k25R6O39j78m11j20N08J9p19L6K76K03k00k68M25L25j44n67J70L15j54
6831a0k6j69J66M16l76k73L50J64j51n22M8N12J56l99l44N04K16j97l53J58M79
6852C49j5n13j84N18K3p5m88L14J32L6m12K38K04o2k72j30L58L74l36l86K59L18
$$ plain form
6706 -363 -95 306 -11 -253 -182 283 194 -324 -278 190 503 -317 -350 -58 565 -25 -368 -108 287 280 -218 -509
6728 -509 33 333 22 -466 -157 173 32 -212 -340 219 362 -283 -403 -10 225 -150 -43 -112 432 122
6748 122 -197 -222 260 420 -100 -424 22 372 263 -207 -393 415 253 -274 -274 -76 155 -65 -308 -115 272
6769 272 146 -237 -154 287 535 -91 -386 -101 508 -116 -263 -105 182 302 -12 -412 208 365 -216 -453
6789 -453 43 436 54 -412 -357 259 241 -360 -470 22 377 -115 -437 -233 388 151 -242 -333 359 111 -36
6810 -36 -261 -165 474 296 -115 -235 273 292 -427 -391 -115 88 -112 -380 45 370 226 -341 -171 144 -10
6831 -10 -36 -205 -39 377 1 -272 78 242 91 -431 -383 129 285 -114 -458 46 262 65 -288 -130 349
6852 349 334 -179 -363 155 178 103 -385 -71 61 97 -315 -77 127 65 -207 -337 21 395 59 -327 -68 250
6874B50j34n87J43M74k0k18j56J05N13k26n73L90K58J43n51j86P19Rl45m17L29
6895h0K80l33k97K83K52K01m91j5M80J37k58p01L94N61j70p40K01L65J9j46k85
6916c43K49O40l86k90l47Q11m4m35N6M25n1l10k77J39O18k00m82J58J79K25n91
6937b56j29J86M58l07k36L51j0O4l95J09L62P3m17j87K24L74k10k60J57M85l41
6958I5l46j72P50j6j96m92R8P71j47k05m29N58K63m96o49R17j68n1k62o2L05p4
6980ho6l82M42J66j37k51J91M47n26k33L69K85J69n16q5J65M85o16k08Q5O89j29
7002C36p65K34N35j55j44m30L17N62n32m2j0K54N3m62K55J54J88m63q5r8M63j48
7024A7l06l7L84J42j90l73L15N76m88p5m2N60l51k58p3L20K53m65K6kK70j54m18
$$ plain form
6874 250 116 -471 -328 146 126 -92 -248 -143 370 144 -429 -39 219 362 -189 -375 344 353 8 -409 -80
6895 -80 200 -133 -430 -147 105 306 -185 -200 280 417 159 -542 -148 413 243 -497 -296 69 88 -58 -343
6916 -343 -94 546 160 -130 -477 334 290 -145 -89 336 285 -25 -302 -163 455 255 -227 -69 110 335 -256
6937 -256 -385 -199 259 -48 -284 67 57 121 -274 -165 197 270 -147 -334 -110 264 54 -206 -49 436 95
6958 95 -251 -423 327 311 115 -377 -279 492 345 140 -289 269 532 36 -613 304 136 85 -177 -239 66 -8
6980 -8 -74 -456 -14 152 15 -236 -45 402 -124 -357 12 297 466 -50 -135 30 515 -101 -309 -224 465 336
7002 336 -429 -195 340 185 41 -389 -72 490 -42 -84 -94 160 213 -249 6 160 348 -115 -200 -298 165 17
7024 17 -289 -326 58 200 10 -363 -48 528 40 -35 -77 483 132 -126 -199 121 374 -91 -65 -67 203 49 -369
7047c69M3N47J34n83J32QM91n50l32M55J88j65J14l31L00L17n34l24M19L72l72
7068d0k93K14J40L26k79m63L63K11r9m50J70N92l78j81M6K76N2l64M8J83J58j53
7090G9l58K07N10k90m49k3M30K40l45m66N95L01l46l10L06J77R2l30k39N61j36
7111B06j40j94m7L84mm41j41N97K60n26j68K35K18k19k80Q0N94l89k76n7L46J81
7133B19l81K30o6L90j06n68J04L89k1j54l02J10M51k26m00J71M04J13o87k7L47
7154a0J97l13l18N11J31m0k65m3J71L20m97o7L67m4K26l93R1K09m6k20J22J80
7176B69j85k35k80M49N88o36l24M16L37k20n12M34r2J21k15l59M18L18O2n91l
7197b40M37K9l95j82M15M15n01j41K2K05K10o70m6N32J98o89j56N04M94l19m77
$$ plain form
7047 -369 -326 221 355 -228 -96 -88 403 -147 -479 -24 164 -1 113 -218 82 399 -135 -459 -40 332 -40
7068 -40 -333 -119 21 347 68 -395 -32 179 80 -370 -200 392 14 -167 -121 155 207 -157 -109 74 232 79
7090 79 -279 -72 438 148 -301 -324 106 346 1 -465 130 431 85 -225 81 258 350 20 -219 342 206
7111 206 66 -128 -175 209 205 -236 -377 220 480 -46 -214 21 239 20 -260 -180 414 25 -251 -308 38 219
7133 219 -162 68 2 392 286 -282 -178 211 190 36 -266 -156 295 69 -331 -160 244 357 -330 -357 -10
7154 -10 187 -126 -444 67 198 158 -107 -150 21 341 -156 -223 144 100 326 -67 24 233 187 -33 89 269
7176 269 84 -151 -431 18 606 -30 -354 62 399 179 -333 101 9 130 -85 -444 -26 292 354 -237 -240
7197 -240 197 226 -169 -351 64 479 -22 -163 -141 64 274 -396 -442 90 288 -401 -557 -53 441 122 -355
7218c55J63M57r3l96J40j2M52k16m68K16O23m69k34j93O63j20k80r3J33K90k48
7239d0j68J49K37q2q4j87M39K10p73J16O0J96k9q2j75L56K96o95J59J05L19l71
7261d4K5j7L21n3m11j85L16L96m83O3P2J00j70j08O6M93j8n49j49K44N77o44q4
7284b42J56L65j16m23L7N52k07j63l11N06R5k60k63J75J57J66l43LK37J39n41
7305b81Q5K27P0K62o09l4K81L60m98j93M49L15m61k94N49L7k39k93O2K96j4l20
7327b43JQ4L45n4m66N4P06k13l91j54O83p6k36m49K93L33P3p49K92K60j91k51
7349c49j2L65N00m69l39J82K31j20j53J86K43J53n43l59M54K98k12k70J66K77
7369B29j23j04m32N72P9k06m42L81M95j55m39j34N50k52j05j44R7M15k13n45M43
$$ plain form
7218 -355 -192 265 172 -224 -84 -96 356 140 -328 -112 511 42 -192 -385 278 158 -122 -215 -82 208 -40
7239 -40 -208 -59 178 96 12 -175 264 474 -299 -183 -123 73 44 -38 -213 143 439 -256 -97 8 327 -44
7261 -44 -19 -36 285 232 -179 -364 -48 348 -135 -72 0 100 -70 -178 -112 381 363 -186 -335 -91 486 -158 -242
7284 -242 -86 279 163 -260 -223 329 122 -41 -352 154 249 -11 -274 -99 58 224 -119 -116 121 260 -281
7305 -281 -196 31 101 363 -246 -280 1 361 -137 -330 119 434 -27 -321 228 265 26 -267 -205 91 77 -243
7327 -243 -242 -158 187 133 -333 -279 427 214 -177 -331 352 276 40 -409 -116 217 290 -459 -167 93 -98 -349
7349 -349 -361 4 504 35 -304 -122 109 -11 -164 22 265 418 -125 -484 -30 268 56 -214 -48 229
7369 229 106 2 -430 142 221 15 -427 -46 449 294 -145 -279 271 19 -86 -230 -133 282 69 -476 -33
7390c3L15r3m54J05K53L30o13j01L68M47n24j32j10L70L0l11N9K66M9q7j98k69
7412c33Q95k21o79J83K66P9k1m91K40J3J23n78M30K62j67j28j87P78n0l51j64
7433a01J9K62k00O4j70J45L91m80m4J90M49n24k61M01l8rk09j01K04K46k4n78
7455c68N23K26o0n84J39K54J79n94J45K28L18k25p15K07M82j68k60P1L42J43n40
7476b57Q5j07M89l22M2j22K79R7l12j09K55J79m9m50K73M77l66l96K44M73J0l50
7498F3k80N32J72m32k51J34J82p6l15J54K71J1k53r3JM29p6m46J71K20J75l39
7520d6o1K18J27j10m81M70R8k42l70K47R9J96l05P0Q0J05k67l1N4M79k05l68L00
7543E7r6O13m81m07J27O79m27k04J42J4l9k77M2L42Q8j35j70k19M63q6j08r6K09
$$ plain form
7390 -33 282 189 -265 -160 93 423 -190 -291 77 524 0 -132 -242 128 158 -153 -94 172 221 134 -64 -333
7412 -333 562 341 -338 -155 111 190 169 -322 -82 -69 54 -524 -94 168 1 -127 -314 464 414 63 -101
7433 -101 -82 180 -20 44 -126 19 410 -70 -114 76 525 1 -260 141 103 94 -115 -216 -12 234 210 -368
7455 -368 155 381 321 -263 -124 130 309 -285 -140 88 406 181 -534 -327 155 -13 -273 -202 140 283 -257
7476 -257 -172 -279 210 -112 -70 -192 87 184 -128 -237 18 197 148 -302 -29 448 82 -314 -70 403 413 63
7498 63 -217 315 487 55 -196 -62 120 44 -271 -117 154 165 -88 -181 -180 249 173 -273 -102 118 293 -46
7520 -46 -107 111 238 128 -353 117 215 -27 -397 -150 -51 145 -160 -90 -10 95 -172 -203 -149 330 125 -243 57
7543 57 -39 574 93 -314 -187 492 65 -139 3 17 -22 -299 -257 85 173 38 -132 -351 112 26 -82 -178 31
7566C1Q3l07k01J59N33l41j88J36K02J17k88j91L15K36l50M3j28K90M1k41k61
7587c10N59j14k42o1R9J46j34j99J06J22L67o21J62K32Q7L4n25K44L89k98k71
7608b28J71L34m7m76K6K69L28k24l93R4O25j35o51J64L30n1k97pK33J33k43m68
7630e13M47K85n6k23m0M4K95m13k58M42J16rj67k32N98l15K2j07J55l1k7l87R1
7653b83N41r2m76j3L50L61m32l77M88M5P5l20J10M5J18p2k98K92J41j84k91K84
7675A2p1K9l44n0N55Q9l83Q9J15K51j07m64K65L31l21k52J93J89J6j86l48N60
7697A68J02%m42q1M92n3K8o30J62N44k16l01K43L99o10O2n9M02Q8l53k88J63L22
7720A42n4k05j36J75Qj12k26N73L7l34k30M19Q7l43m0K31J36k03lL15j81q2Q6
$$ plain form
7566 31 114 -193 -394 -235 298 -43 -231 -95 107 224 -64 -255 60 296 -54 -11 -139 151 192 -49 -310
7587 -310 249 135 -107 -168 -69 77 -57 -256 -150 -28 339 -282 -120 112 199 233 -292 -48 341 43 -228
7608 -228 -57 277 230 -246 -220 49 377 153 -240 -146 479 344 -307 -143 187 136 -161 -168 65 198 -45 -513
7630 -513 -66 219 163 -60 -100 -56 239 -174 -432 10 126 117 -50 -282 316 1 23 -84 71 40 13 -374 -283
7653 -283 258 166 -310 -323 27 388 -44 -421 67 112 187 -133 -23 22 140 68 -230 62 203 19 -272 12
7675 12 -59 -30 -374 -424 131 220 -163 -74 41 292 185 -279 -14 317 -4 -256 -63 126 142 -44 -392 168
7697 168 270 270 -172 -253 239 186 214 -416 -254 290 74 -227 16 415 -195 -133 -192 210 298 -55 -343 -180 142
7720 142 88 -117 -253 -78 -70 -182 -408 165 202 -132 -362 57 144 -199 -239 -8 128 -75 -78 237 56 -26 60
7743F0k12K16J47k85j9j15L75J27l69k14M33N7l17j3n8K84N6l92J72K45Kk40l00
7766c60M19K25l31J12j42L03K28n01l86N51J50m03k71L00K46m4j88QK94j48j55
7787i3q9N1L65l22l0j37K67N18n16j77K31J68l41P2j13L69j83k82k9L56L1k33
7809a17j52N2O90k15n17PN65j63m86J53K39R3j03j94P2J51Q0l50n6M89n4n34K21
7832a29j68K88J39m88N82o9j17l07J43O7M79k74k36J59oQ4k78L0M79q7m50J59
7854@K15Jj71j44p6L31J15n51K44J2N6k7k50K70K60l08j21J66J46r8m7j19J34
7877C8K91m74J41k91N16j99j22j61M32J5k32l39M35P2N7m92K25M36j6o49J1L27
7899B1K83k39l49K96L97l21k69q0L94%j39lK11K72o79J29n5J83J09m08J22K88
$$ plain form
7743 60 -152 64 211 -74 -93 -208 167 294 -75 -289 144 201 -116 -129 -187 97 153 -239 -67 178 180 -60 -360
7766 -360 59 284 -47 65 -77 226 454 -47 -433 118 268 -135 -406 -106 140 96 -92 -84 210 62 -93
7787 -93 -182 -131 234 -88 -118 -255 12 530 14 -163 68 236 -105 -33 -146 223 40 -242 -271 85 116 -117
7809 -117 -269 -217 473 258 -259 -252 313 150 -336 -183 56 149 46 -148 -76 75 155 -195 -251 238 184 -350 -129
7832 -129 -297 -9 130 -358 224 155 38 -269 -126 -59 420 146 -90 69 63 147 -131 -101 378 291 -159 0
7854 0 215 216 45 -99 -175 156 271 -280 -36 -24 32 5 -245 25 285 -23 -144 22 168 70 23 -96 38
7877 38 329 -145 -4 -295 221 22 -100 -261 171 186 -46 -385 50 122 179 -313 -88 348 332 -317 -306 21
7899 21 304 65 -284 12 409 88 -181 -261 133 133 -6 -9 202 474 -205 -76 -131 52 161 -247 -125 163
7921A63O0j72l33K49K38l26R6o9J97J79l98n5K28N9j05n04M86K07j85j66j5M34
7943B68j91J9l9j02L59k03l31J49K58k97p6j14K43K67k24k30J74O52l66l88L29
7964A57Qk50ro6M56l18J31m42L38K30r4l30L3R6J91l24J19J52J5q5k92K5L73j76
7988f2J56j37ON43m11l42J62K18k63j43J80J83K82m01j52L05r4j50j91J75M37
8009C01k28k10n5L70J10l66j73L46J58K0k52l56M94l6k81m7L69N6k38k76K92K29
8031B27n0l93J65j3R3J3l10K38r3K74m89M13Q8q1l65P9L51J06k93j61K33J71j43
8054F0k26n2K97K37k70l90M91m8j77n0r8M77k05k4j79K16k2k03q3L20J88m48j81
8077c70L03K95j36k38P5K06J09l06Q9j35M60n13m9J93K55o2m43O2L19j4j60j3
$$ plain form
7921 163 223 51 -282 -33 205 -121 -25 -94 103 282 -116 -171 57 116 11 -493 -7 200 15 -151 -166 268
7943 268 77 96 57 -45 314 111 -220 -71 187 -110 -186 -300 -57 210 -14 -244 -70 582 216 -172 157
7964 157 165 -85 -94 -160 296 -22 109 -333 5 235 141 -189 -156 -60 131 -193 -74 78 93 8 -284 -259 114 -62
7988 -62 94 -43 -37 506 95 -247 -85 133 -130 -273 -93 90 372 -29 -181 124 30 -120 -311 -136 301
8009 301 73 -137 -192 178 288 -78 -251 95 253 273 21 -335 159 123 -158 -205 164 220 -18 -294 -2 227
8031 227 177 -216 -51 -64 29 42 -268 -30 -123 151 -338 75 163 82 -283 -204 147 253 -40 -201 32 203 60
8054 60 -166 -218 79 316 46 -344 147 99 -78 -128 -226 251 46 22 -157 59 37 -166 -249 71 259 -189 -370
8077 -370 -67 228 92 -146 -71 135 244 -62 27 -108 352 -161 -210 -17 238 176 -267 -205 114 100 -60 -73
8099g3n8K9L26m41K2N10k88k51pR8K78j93J28j99J79L8k10L1P8L30k10k34L0K97
8123B10j89m75L01L78J60n02j37L33M9J6n81K72L98l38j01J22L06p6j60j59Q4
8144h9J19R0l0k57K66O9l05k9K26q0O5j59mK55m5k43R8K50J88m66R5l2J23j35
8168c0k40K34K21J41l06j68k7L70l33Q1o4N98k43l55M8K1J95m74K58J29p1J26
8190A11m08
$$ plain form
8099 -73 -131 -102 224 -217 -195 315 27 -224 -231 -133 145 -48 80 -119 60 98 -112 -81 -3 327 117 -117 -87 210
8123 210 21 -454 -153 225 385 -117 -254 79 128 144 -437 -165 233 -105 -206 -84 222 146 -14 -173 -89
8144 -89 30 120 90 -167 99 168 -137 -166 60 -20 45 -114 -118 137 92 -151 -53 197 385 -81 14 -18 105 -30
8168 -30 -270 -36 185 326 20 -148 -175 195 -138 -57 -121 477 234 -121 -73 -52 143 -331 -73 56 -15 111
8190 111 -297
8191b97
$$ Imaginary data points
##PAGE= N=2
##DATA TABLE= (X++(I..I)), XYDATA
0@%%%%%%%%%%JjL2o4O4o4R6j28J29j61J93k25K88l51M15m80N44o09P06q25R27
31D87j058J212j369J538j734J955k185K440k724L036l369L736m143M579n053N580
47B928o159O787p471Q233r073R996j1032J2195j3500J4982j6691J8682k1020K3823
61A2680k7274L1626l7295M5043n6310P4251j07304J87765p27016r69775J766384
72A92775Q69740j263887j206177J199089J577226n95096j767895J17828J648701
81G72304K76740j657640o81295J491674J199125j070060j357804P04619J506776
90A184439m07049j709863j99826J558850N73049j357338q77665J204583J257588
99A226768q14827j470432L87463J501613k2293j511620l62835J442776Q21662
$$ plain form
0 0 0 0 0 0 0 0 0 0 0 0 1 0 32 -32 32 -32 64 -64 65 -96 97 -128 160 -191 224 -256 288 -321 385 -440 487
31 487 -571 641 -728 810 -924 1031 -1154 1286 -1438 1598 -1771 1965 -2178 2401 -2652 2928
47 2928 -3231 3556 -3915 4318 -4755 5241 -5791 6404 -7096 7886 -8805 9877 -11143 12680
61 12680 -14594 17032 -20263 24780 -31530 42721 -64583 123182 -603834 -1573609 192775
72 192775 1062515 -201372 -1407549 -208460 1368766 773670 -994225 -876397 772304
81 772304 1049044 -608596 -1289891 201783 1400908 330848 -1026956 -322337 1184439
90 1184439 777390 -932473 -1132299 426551 999600 -357738 -1235403 -30820 1226768
99 1226768 411941 -1058491 -671028 830585 808292 -703328 -1066163 376613 1198275
108A198275j142706j079705Q48857J279345n50027j477222R7950J464752K92250
117I31769j350909o23353J186324R37261r35322j213194N57570J325204k00248
126F15102j350021j23288J359567N33681j173763q29232R28962J038988o69654
135C30342j224811L28659J311226N0473j266792l87339J137150O56300r97787
144f2579r60106P03667J129296l76905j174058J06975J226559K48300j141844
153c00695n73805R41505P94132p31602r77606M90740J140613j42170j140147j63840
163f62875J053056L94964r86598p03714P52852Q98637m72732r74757K49173J066590
173F14596N1265j055126l61212R11396N68957p59086p49316N81878R37987k81639
$$ plain form
108 1198275 55569 -1024136 -175279 1104066 554039 -923183 -825233 639519 931769
117 931769 -419140 -1042493 143831 1081092 145770 -1067424 -509854 815350 615102
126 615102 -734919 -858207 501360 1035041 -138722 -967954 -38992 999996 330342
135 330342 -894469 -565810 745416 795889 -470903 -858242 278908 935208 -62579
144 -62579 -1022685 -319018 810278 433373 -740685 -633710 592849 841149 -300695
153 -300695 -874500 67005 861137 129535 -848071 -357331 783282 641112 -499035 -662875
163 -662875 390181 785145 -201453 -905167 -152315 746322 273590 -701167 -451994 614596
173 614596 665861 -389265 -750477 160919 729876 -29210 -778526 -196648 741339 459700
183D59700r77686J7244R52489K01850r33711m85290P80659O89638n73672q05826
193f74605L81000R11039j37315r53849j45420Q81896L67992p73440n56573O47877
203e1398P58886m18410q55570J81192Q76249K7808q80290k74929P94150M97475
213F55163o28693o43276M56649P56396k63889q42002J3951Q20128J97525p45907
223b23955l68435O63439N58263m91641o79702K90064P28203j11517p63520r6312
233d95113P40163L07149o34346m56387N12738N78180l71112o87907J66654P13719
243C73738K7148o88468j95011O49187L81648n39510n28278L84555O12665k32695
253B44979o73384N5308O89708J41290o31805l02720N41865M37274m32792n63255
$$ plain form
183 459700 -517986 -500742 451747 653597 -280114 -765404 15255 704893 131221 -674605
193 -674605 -293605 617434 480119 -473730 -619150 262746 630738 -142702 -699275 -51398
203 -51398 707488 289078 -566492 -385300 490949 518757 -361533 -636462 157688 655163
213 655163 26470 -616806 -160157 596239 332350 -509652 -495701 324427 521952 -223955
223 -223955 -592390 71049 629312 137671 -542031 -251967 476236 364719 -398801 -495113
233 -495113 245050 552199 -82147 -538534 -25796 552384 181272 -506635 -339981 373738
243 373738 400886 -287582 -482593 166594 548242 8732 -519546 -134991 477674 244979
253 244979 -428405 -373097 316611 457901 -173904 -476624 65241 502515 69723 -493532
263d93532K70970O28980r9711o40463n5801O30016K24690n64524l75867M49740
273b5502M82144l20598n63895J73030O14487m40o05839j58163N56262K94062m83691
284c8143m23960L63116N13339k18544n57801P3236N75357Q2176n51653k32558
294d15435M82178L55930l84919m49889K69611N20651j25853n45523k1993N27177
304B11935J57155m83483k88720M02311L96216k90991m67751J68362N07015l8038
314B74011n15903j00906M81198K26141m12579l29372L26480M18276k09590m72535
324c14779Q2070M89423M2984m78142j67527M32739K79958l52966l68413K53244
334a01409M30337j39338m69212J0763M68975J13406m37580k26428L79724L26907
$$ plain form
263 -493532 -222562 406418 306707 -333756 -389557 240459 465149 -99375 -475242 -25502
273 -25502 456642 136044 -427851 -254821 359666 359226 -246613 -404776 151486 445548 -38143
284 -38143 -462103 -98987 414352 195808 -361993 -288757 286600 368776 -182877 -415435
294 -415435 66743 422673 37754 -412135 -142524 378127 252274 -293249 -315242 211935
304 211935 369090 -114393 -403113 -802 395414 104423 -363328 -194966 312049 274011
314 274011 -241892 -342798 138400 364541 -48038 -377410 -50930 367346 157756 -314779
324 -314779 -232709 256714 299698 -178444 -345971 86768 366726 13760 -354653 -101409
334 -101409 328928 189590 -279622 -268859 200116 313522 -124058 -350486 29238 356145
344C56145k91007m00031J82654M43494o3111m55650n9146M36650J78328l84731
354e6405k79841L08463L57943k13331m12731J02684M33772J1141m24445j22982
364b95732L86784K24030l22550l09356K37264L70338j38508m04875L2819M12143
374A92357P5605l87637j74997L38421K62363k65261l31166J74002L76534p2557
384A87664l95578l3511L86186J35737l50705k27263K88299L00931k06723l53703
394b68666J10100L79574o381l79047r6021L53066J90352l01177k68629K30755
404e6074L27633j43599l62072M8715L71351N0109l54985j45085L13464K28569
414B78026k52000k96478J73089L40566q3074l61544j1867L55231J04334l23955
$$ plain form
344 356145 65138 -334893 -152239 291255 228144 -227506 -286652 149998 328326 -56405
354 -56405 -336246 -27783 330160 116829 -295902 -193218 240554 251695 -172750 -295732
364 -295732 91052 315082 -7468 -316824 -79560 290778 152270 -252605 -219786 192357
374 192357 267962 -119675 -294672 43749 306112 40851 -290315 -116313 260221 187664
384 187664 -207914 -241425 144761 280498 -70207 -297470 -9171 291760 85037 -268666
394 -268666 -158566 221008 214627 -164420 -260441 92625 282977 -18200 -286829 -56074
404 -56074 271559 127960 -234112 -185397 185954 236063 -118922 -264007 49457 278026
414 278026 26026 -270452 -97363 243203 160129 -201415 -213282 141949 246283 -77672
424g7672j88968K69810K59986j97180l11316J13197L41498k1098l45721o9142
434b26606L25919J54825k82392k27454K18319K82274j41086l17922N2671L29247
444A67795L6472l18043j21443K85289J96334k32389k56036J63055K95225q4210
454A32049l14572l93L13260Q6523k86076j62272K43135K26934j83618k76815J08772
465a13073L03117k9642l07637n0362K93238J29177k55970j97907J99427K49254
475B19622j34970k87197N8403L03458K3497k93871r9086K67591J68285k20939
485D793k28211J55990K67675q1022k87120N580K90329P3784k68872j45953K26567
496A3540K00684j73961k45216J06818K71954l0174k75133m3830K60939J12306
$$ plain form
424 -77672 -266640 3170 263156 65976 -245340 -132143 209355 188257 -157464 -226606
434 -226606 99313 254138 -28254 -255708 -37389 244885 103799 -214123 -161452 167795
444 167795 204267 -113776 -235219 50070 246404 14015 -242021 -78966 216259 132049
454 132049 -182523 -182916 130344 216867 -69209 -231481 11654 238588 54970 -221845 -113073
465 -113073 190044 160402 -147235 -197597 95641 224818 -31152 -229059 -29632 219622
475 219622 84652 -202545 -144142 159316 182813 -111058 -210144 57447 225732 4793
485 4793 -223418 -67428 200247 119225 -167895 -162315 128014 201798 -67074 -213027 13540
496 13540 214224 40263 -204953 -98135 173819 143645 -131488 -175318 85621 197927
506A97927k32359j76712J82756K23806j21439k50490N8301K66423J4008k59534
516i7313q5410K31231J44861j92236j96410J40748K37380p4630k55270P108K53865
527A13924N5842k41360j23135K04211J78194j51083k14376R5958K41843l0071
537A29947k51846m0653K36878R9902k08842j51503J72075J99676j13030k26550
547a53946M9801K34696Q723k36253p5941K15570J35594j75242j76064J30760K10275
558A67973p7120k32457Q887K27915N0753k10159j03832J86539J59927j39886j95882
569a57342Q4726K13062l3297k23694k7270K15682Q8600j83906j33076J46937J70484
580A60906j03991k03810M3080K11319J3245k03235o1431J91246J14799j57769
$$ plain form
506 197927 -34432 -211144 -28388 195418 73979 -176511 -118210 148213 162221 -97313
516 -97313 -182723 48508 193369 1133 -195277 -54529 182851 108221 -147049 -139941 113924
527 113924 169766 -71594 -194729 9482 187676 36593 -177783 -81825 160018 129947
537 129947 -121899 -162552 74326 174228 -34614 -186117 -14042 185634 72604 -153946
547 -153946 -104145 130551 139274 -96979 -172920 42650 178244 3002 -173062 -42302 167973
558 167973 90853 -141604 -132717 95198 145951 -64208 -168040 18499 178426 38540 -157342
569 -157342 -72616 140446 107149 -116545 -143815 71867 160467 -23439 -156515 -9578 160906
580 160906 56915 -146895 -103815 107504 120749 -82486 -143917 47329 162128 4359
590D359j57524J09270J79336o3549j96784J1666K04410N0329j85186r6534J58630
601A8423J34022j29259j72889P7828J90119k3308j89535k1647J87172P4061j68130
612b3143j24674J27946J52870r1123j75647M9058J94464Q919j84587n7458J64917
623D1542R5869j43999j40335J02693J69128n1347j75536J0782J80933L6422j73932
634d7780q8772J40556J19773j07859j44255P3634J69917k0328j71841k8086J58731
645E3690O2375j48149j04492J19462J38830p3884j48708L8876J58805K119j62798
656f3874n4186J41353Q8973j16738j14361R3018J45435n0640j57162M770J49430
667F6018K8328j45141p0125J27509J10396r0181j28613N8480J42758k4863j54725
$$ plain form
590 4359 -153165 -43895 135441 71892 -124892 -113226 91184 141513 -43673 -140207 18423
601 18423 152445 23186 -149703 -71875 118244 94936 -94599 -116246 70926 144987 -23143
612 -23143 -147817 -19871 132999 41876 -133771 -84713 109751 118670 -65917 -123375 41542
623 41542 137411 -6588 -146923 -44230 124898 73551 -101985 -91203 89730 126152 -47780
634 -47780 -136552 4004 123777 15918 -128337 -54703 115214 94886 -76955 -105041 53690
645 53690 116065 -32084 -136576 -17114 121716 47832 -100876 -62000 96805 98924 -63874
656 -63874 -118060 23293 112266 -4472 -118833 -25815 119620 68980 -88182 -83412 66018
667 66018 94346 -50795 -120920 6589 116985 26804 -101809 -43329 99429 74566 -80159
678h0159k1735J43852N9774j22519q4385J04570J16510p0888j38007K7148J37839
689G2000M340j39712l9502J33649Q0427j04971j03877P5493J17758m9354j36433
700i0182O995J36453L3751j20240n7886J10454R0076q8087j17133M9066J21617
711G4884j9795j24946j0118J27328N1581j06583p9206Q1082R4510o3458j17542
722i2263K9192J24616Q828j13710l1602J07894O0143r3086r0750O1032J02243
733G2537l4402j09056J1029J18663K6108j07895n4534Q7817O9993p4021r3006
744h6767M6875J07352j1783j04326j1841J02097L7069r7381o8286P3847Q3926
755G0782n0386r1747L1786J05251N47j02353l1619Q8125N0261p8518p3179O1236
$$ plain form
678 -80159 -101894 41958 101732 -20787 -105172 -602 115908 45020 -92987 -65839 72000
689 72000 76340 -63372 -102874 30775 111202 6231 -97646 -22153 95605 46251 -90182
700 -90182 -83187 53266 87017 -33223 -91109 19345 109421 21334 -95799 -46733 74884
711 74884 55089 -69857 -79975 47353 98934 -7649 -86855 -5773 88737 25279 -92263
722 -92263 -63071 61545 70373 -43337 -74939 32955 93098 12 -90738 -29706 72537
733 72537 38135 -70921 -59892 58771 84879 -23016 -77550 10267 80260 6239 -86767
744 -86767 -39892 67460 55677 -48649 -60490 41607 78676 -18705 -86991 -13144 70782
755 70782 20396 -71351 -39565 65686 66233 -36120 -67739 20386 70647 -7871 -81050 -19814
767a9814R2955l1145r5389P967R4740J2979r4686m3602P7798O3619n7009p3948
779f5535M1489Q8851j6605r4001j1987Q5384K9884p7811m8011O6962P0302m2623
791B6299p7639K0660P9778l432q5605k2774P8265M4773o2736n5382N1265O9449
803F2921l3537q0719O236P7346J2241p2969l0196O9749N3166n1467o5181L3089
815a9321O8879j9079p6189k786P4266K6146o2091l8772N3969N3003m1950o7995
827e1920J9502O9505l084o8484j1529O8222L2426n6673m7216M0481N4095k8324
839A7001o3800J0772O8956J0461o2024k3374N6435L6462m8769n1699L1722N6721
851C8864j4493n8393J336O0830J6922n6354l3600M4418M1457l5590n0568K3287
$$ plain form
767 -19814 73141 41996 -53393 -45426 49314 62293 -32393 -75995 1803 65422 8413 -65535
779 -65535 -24046 64805 48200 -45801 -57788 27596 57480 -20331 -68342 -1380 68922 26299
791 26299 -51340 -30680 49098 45666 -39939 -62713 15552 60325 -2411 -57793 -6528 62921
803 62921 29384 -51335 -45099 32247 44488 -28481 -58677 11072 64238 12771 -52410 -19321
815 -19321 49558 30479 -45710 -48496 25770 51916 -10175 -48947 5022 58025 16075 -51920
827 -51920 -32418 37087 34003 -34481 -46010 22212 54638 -2035 -49251 -8770 45325 17001
839 17001 -46799 -36027 32929 43390 -18634 -42008 14427 50889 2120 -49579 -17857 38864
851 38864 24371 -34022 -32686 28144 45066 -11288 -44888 -470 40987 5397 -45171 -21884
863b1884N7459m649n4704q981N1570K1068m7650l6759L6795M6396k3198m9811
875c4348J3377N4319J273n3875j7397M5105K6598l7894l6989K9099M6943j4288
887B1923m9403J879M8394P712m7777k1242M1319L2250l0470l6716K1485M4009
899C3363r731m7388n106M4288J5557m0944k4840L5851L4730k4852l9838J3077
911a5833M0893l478m2931r419M0106K1153l3019k8610K7139L5192j8310l9918
923b7035O797L9785L177l6859j2238L4525K2291k7450k9793J8975L3403j1759
935A3819l7135K272L7663P483l3892j5669K9385K2908k3535l0415J4373L4022
947B1279m877l4673l082L4952J2473l1115j9912K4882K4767j7961k9367J0082
$$ plain form
863 -21884 35575 30926 -23778 -32759 18811 39879 -7771 -44530 -7735 38661 15463 -34348
875 -34348 -20971 33348 34621 -19254 -36651 8454 35052 -2842 -39831 -10732 36211 21923
887 21923 -27480 -25601 22793 30505 -17272 -38514 2805 35055 4585 -32131 -10646 33363
899 33363 23632 -23756 -28862 15426 30983 -9961 -34801 1050 35780 10928 -28910 -15833
911 -15833 25060 21582 -21349 -30768 9338 30491 -2528 -31138 -3999 31193 12883 -27035
923 -27035 -20238 19547 22724 -14135 -26373 8152 30443 2993 -26800 -7825 25578 13819
935 13819 -23316 -21044 16619 24102 -9790 -25459 3926 26834 3299 -27116 -12743 21279
947 21279 16402 -18271 -21353 13599 26072 -5043 -24955 -73 24694 6733 -22634 -12552
959a2552L2043r17l1535p349K9609J4367k6814k2074K1160K6141j3824k8908O675
$$ plain form
959 -12552 19491 18574 -12961 -20310 9299 23666 -3148 -25222 -4062 22079 8255 -20653 -13978
$$ [...]
8191a14
##END NTUPLES=NMR FID
##END=
