##TITLE=1H ikalashn
B1p2110
21.10.2024
##JCAMPDX= 6.0         $$ Bruker NMR JCAMP-DX V2.0
##DATA TYPE= NMR FID
##DATA CLASS= NTUPLES
##ORIGIN= UXNMR, Bruker Analytische Messtechnik GmbH
##OWNER= root
$$ TOPSPIN		Version 1.3
$$ 2024-10-21 15:34:26.171 +0400  Irina@DPX200
$$ Compression mode = diff/dup
##.OBSERVE FREQUENCY= 200.13100065
##.OBSERVE NUCLEUS= ^1H
##.DELAY= (6, 6)
##.ACQUISITION MODE= SIMULTANEOUS
##.ACQUISITION SCHEME= undefined
##.AVERAGES= 32
##.DIGITISER RES= 18
##SPECTROMETER/DATA SYSTEM= spect
##.PULSE SEQUENCE= zg
##.SOLVENT NAME= CDCl3
##.SHIFT REFERENCE= INTERNAL, CDCl3, 1, 15.99637
##AUDIT TRAIL= $$ (NUMBER, WHEN, WHO, WHERE, WHAT)
$$ ##TITLE= Audit trail, TOPSPIN		Version 1.3
$$ ##JCAMPDX= 5.01
$$ ##ORIGIN= Bruker BioSpin GmbH
$$ ##OWNER= Irina
$$ $$ F:/spectra/data/iren/nmr/1H/4/audita.txt
$$ ##AUDIT TRAIL=  $$ (NUMBER, WHEN, WHO, WHERE, VERSION, WHAT)
(   1,<2024-10-21 15:33:09.734 +0400>,<Irina>,<DPX200>,<TOPSPIN 1.3>,
      <created by zg
	started at 2024-10-21 15:31:01.859 +0400,
	POWCHK disabled, PULCHK disabled
       configuration hash MD5:
       BE 6D 3F 07 2A EA 11 49 91 17 2B D3 AF B3 58 0D
       data hash MD5: 16K
       A4 AE 54 DD 98 D2 47 61 B5 D3 D1 25 9F DD 54 EC>)
$$ ##END=
$$ 
$$ $$ hash MD5
$$ $$ 84 CE E6 B4 7B DE CA 58 1F 01 E0 55 91 7A A9 73
##$RELAX= 
##$RELAX= 
##$RELAX= 
##$RELAX= 
##$RELAX= 
##$RELAX= 
##$RELAX= 
##$RELAX= 
##$RELAX= 
$$ Bruker specific parameters
$$ --------------------------
##$DU= <F:/spectra>
##$EXPNO= 4
##$NAME= <1H>
##$PROCNO= 1
##$TYPE= <nmr>
##$USER= <iren>
##$AMP= (0..31)
100 100 100 100 100 100 100 100 100 100 100 100 100 100 100 100 100 100 
100 100 100 100 100 100 100 100 100 100 100 100 100 100 
##$ANAVPT= -1
##$AQSEQ= 0
##$AQ_mod= 1
##$AUNM= <au_zg>
##$AUTOPOS= <>
##$BF1= 200.13
##$BF2= 200.13
##$BF3= 200.13
##$BF4= 200.13
##$BF5= 200.13
##$BF6= 200.13
##$BF7= 200.13
##$BF8= 200.13
##$BYTORDA= 1
##$CFDGTYP= 0
##$CFRGTYP= 5
##$CHEMSTR= <none>
##$CNST= (0..63)
1 1 145 1 1 1 1 1 1 1 1 1 1 1 1 1 1 1 1 1 1 1 1 1 1 1 1 1 1 1 1 1 1 1 
1 1 1 1 1 1 1 1 1 1 1 1 1 1 1 1 1 1 1 1 1 1 1 1 1 1 1 1 1 1 
##$CPDPRG= <>
##$CPDPRG1= <>
##$CPDPRG2= <>
##$CPDPRG3= <>
##$CPDPRG4= <mlev>
##$CPDPRG5= <mlev>
##$CPDPRG6= <mlev>
##$CPDPRG7= <mlev>
##$CPDPRG8= <mlev>
##$CPDPRGB= <>
##$CPDPRGT= <>
##$D= (0..63)
0 2 0 0 0 0 0 0 0 0.06 0 0.03 0 0 0 0 0.0002 0 0 0 0 0 0 0 0 0 0 0 0 0 
0 0 0 0 0 0 0 0 0 0 0 0 0 0 0 0 0 0 0 0 0 0 0 0 0 0 0 0 0 0 0 0 0 0 
##$DATE= 1729510389
##$DBL= (0..7)
120 120 120 120 120 120 120 120 
##$DBP= (0..7)
150 150 150 150 150 150 150 150 
##$DBP07= 0
##$DBPNAM0= <>
##$DBPNAM1= <>
##$DBPNAM2= <>
##$DBPNAM3= <>
##$DBPNAM4= <>
##$DBPNAM5= <>
##$DBPNAM6= <>
##$DBPNAM7= <>
##$DBPOAL= (0..7)
0.5 0.5 0.5 0.5 0.5 0.5 0.5 0.5 
##$DBPOFFS= (0..7)
0 0 0 0 0 0 0 0 
##$DE= 6
##$DECBNUC= <off>
##$DECIM= 32
##$DECNUC= <off>
##$DECSTAT= 4
##$DIGMOD= 1
##$DIGTYP= 9
##$DL= (0..7)
0 120 120 120 120 120 120 120 
##$DP= (0..7)
150 150 150 150 150 150 150 150 
##$DP07= 0
##$DPNAME0= <>
$$ [...]
##$SW= 21.9926370048069
##$SWIBOX= (0..15)
0 0 2 0 0 0 0 0 0 0 0 0 0 0 0 0 
##$SW_h= 4401.40845070422
##$TD= 16384
##$TD0= 1
##$TE= 300
##$TE2= 300
##$TE3= 300
##$TEG= 300
##$TL= (0..7)
0 120 120 120 120 120 120 120 
##$TP= (0..7)
150 150 150 150 150 150 150 150 
##$TP07= 0
##$TPNAME0= <>
##$TPNAME1= <>
##$TPNAME2= <>
##$TPNAME3= <>
##$TPNAME4= <>
##$TPNAME5= <>
##$TPNAME6= <>
##$TPNAME7= <>
##$TPOAL= (0..7)
0.5 0.5 0.5 0.5 0.5 0.5 0.5 0.5 
##$TPOFFS= (0..7)
0 0 0 0 0 0 0 0 
##$TUNHIN= 0
##$TUNHOUT= 0
##$TUNXOUT= 0
##$USERA1= <user>
##$USERA2= <user>
##$USERA3= <user>
##$USERA4= <user>
##$USERA5= <user>
##$V9= 5
##$VALIST= <valist>
##$VCLIST= <CCCCCCCCCCCCCCC>
##$VD= 0
##$VDLIST= <DDDDDDDDDDDDDDD>
##$VPLIST= <PPPPPPPPPPPPPPP>
##$VTLIST= <TTTTTTTTTTTTTTT>
##$WBST= 1024
##$WBSW= 25
##$XGAIN= (0..3)
0 0 0 0 
##$XL= 0
##$YL= 0
##$YMAX_a= 971976
##$YMIN_a= -1183950
##$ZGOPTNS= <>
##$ZL1= 120
##$ZL2= 120
##$ZL3= 120
##$ZL4= 120
##$ABSF1= 10
##$ABSF2= 0
##$ABSG= 5
##$ABSL= 3
##$ALPHA= 0
##$AQORDER= 0
##$ASSFAC= 0
##$ASSFACI= 0
##$ASSFACX= 0
##$ASSWID= 0
##$AUNMP= <proc_1d>
##$AXLEFT= 0
##$AXRIGHT= 0
##$AXTYPE= 0
##$AXUNIT= <>
##$AZFE= 0.1
##$AZFW= 0.1
##$BCFW= 1
##$BC_mod= 2
##$BYTORDP= 1
##$COROFFS= 0
##$CY= 7568.61572265625
##$DATMOD= 1
##$DC= 2
##$DFILT= <>
##$DTYPP= 0
##$F1P= 17.9538593292236
##$F2P= -4.03888763876832
##$FCOR= 0.5
##$FTSIZE= 32768
##$FT_mod= 4
##$GAMMA= 1
##$GB= 1
##$INTBC= 1
##$INTSCL= 1
##$ISEN= 128
##$LB= 0.02
##$LEV0= 0
##$LPBIN= 0
##$MAXI= 945.577
##$MC2= 0
##$MEAN= 0
##$ME_mod= 0
##$MI= -402.1523
##$NCOEF= 0
##$NC_proc= 0
##$NLEV= 6
##$NOISF1= 8.587773
##$NOISF2= 6.764455
##$NSP= 1
##$NTH_PI= 0
##$NZP= 0
##$OFFSET= 15.99637
##$PC= 1
##$PHC0= -46.86282
##$PHC1= 13.15948
##$PH_mod= 0
##$PKNL= yes
##$PPARMOD= 0
##$PPDIAG= 0
##$PPIPTYP= 0
##$PPMPNUM= 100
##$PPRESOL= 1
##$PSCAL= 0
##$PSIGN= 0
##$REVERSE= no
##$SF= 200.13
##$SI= 32768
##$SIGF1= 18.5376
##$SIGF2= -6.396296
##$SINO= 400
##$SIOLD= 32768
##$SREGLST= <1H.CDCl3>
##$SSB= 3
##$STSI= 0
##$STSR= 0
##$SW_p= 4401.40845070422
##$SYMM= 0
##$S_DEV= 0
##$TDeff= 0
##$TDoff= 0
##$TI= <>
##$TILT= no
##$TM1= 0
##$TM2= 0
##$TOPLEV= 0
##$USERP1= <user>
##$USERP2= <user>
##$USERP3= <user>
##$USERP4= <user>
##$USERP5= <user>
##$WDW= 1
##$XDIM= 8192
##$YMAX_p= 0
##$YMIN_p= 0
$$ End of Bruker specific parameters
$$ ---------------------------------
##NTUPLES= NMR FID
##VAR_NAME=  TIME,          FID/REAL,        FID/IMAG
##SYMBOL=    X,             R,               I
##VAR_TYPE=  INDEPENDENT,   DEPENDENT,       DEPENDENT
##VAR_FORM=  AFFN,          ASDF,            ASDF
##VAR_DIM=   8192,          8192,            8192
##UNITS=     SECONDS,       ARBITRARY UNITS, ARBITRARY UNITS
##FACTOR=    0.0002272,     1,               1
##FIRST=     0,             0,               0
##LAST=      1.8609952,     213,             -13
##MIN=       0,             -1183950,        -1183950
##MAX=       1.8609952,     971976,          971976
$$ Real data points
##PAGE= N=1
##DATA TABLE= (X++(R..R)), XYDATA
$$ [...]
2447B251k216k125j25J845K203N05j625k430p09J545K338J065j325k491j124J179
$$ 2251 35 -2090 -2215 -370 1833 2338 713 -1717 -2426 -881 1457 2522 1197 -1294 -2418 -1239
2463a239K192J385p28k244j546K79K353J620l21j978j973J06J934J983K58j673
$$ -1239 953 2338 1610 -634 -2180 -1901 452 2072 1751 -227 -2200 -2094 -160 1823 2081 408
2479D08k164m49J457K196P16j302k051r69J123K110J214j121j897j428P51J934
$$ 408 -1756 -2205 -748 1448 2164 862 -1189 -2158 -1035 1075 2289 1168 -729 -2157 -1406 528
2495E28J431k53j865j698K52J715J608R9j697j666l36J503J933M65j418j945o46
$$ 528 1959 1706 -159 -1857 -1605 110 1718 1817 120 -1546 -1882 -379 1554 2019 601 -1344 -1990
2512a990J205J841Q78q80j858j108P28J752J266m91j883j258K56J895J399j47
$$ -1990 -785 1056 1934 1054 -804 -1912 -1184 568 1834 1343 -540 -1798 -1542 353 1752 1605
2528A605j631j553o9J441J549L93j401j607n00J144J716M43q37j549q83Q88J559
$$ 1605 -26 -1579 -1648 -207 1342 1735 334 -1273 -1773 -629 1087 1530 693 -856 -1739 -851 708
2545G08J115o67j710j132M68J552J242k41j425j387J51J233J396L8j213j322k52
$$ 708 1823 1156 -554 -1686 -1218 334 1576 1335 -90 -1477 -1326 -93 1303 1341 128 -1194 -1446
2562a446J080J609L44r84j618n80J133J150P63n74j532p34N15J365R09l08j429
$$ -1446 -366 1243 1587 603 -1015 -1595 -462 688 1451 877 -655 -1389 -874 491 1400 1092 -337
2579c37j164L93J176J239k8j311j295P7J009J291L14j073j156m65R59J295M42
$$ -337 -1501 -1108 68 1307 1279 -32 -1327 -1250 -241 1050 1364 291 -865 -1330 -371 924 1366
2596A366p33j431n27O14J335P43m95j298p45L15J086R84l65j046q72R0R85R56
$$ 1366 633 -798 -1325 -711 624 1367 872 -426 -1171 -856 230 1214 849 -197 -1069 -979 6 962
2614I62J28r63j147j64R65J055L02o68j321m24O77J161M59m03j145n34M63J221
$$ 962 1090 127 -1020 -1184 -219 836 1138 470 -851 -1275 -598 563 1022 619 -526 -1060 -597 624
2632F24O97n91r11q74L28Q21R10r7q81q72r9R57Q79L9p10r67m7O19P89L75o05
$$ 624 1321 730 -181 -1055 -727 94 1004 907 26 -846 -945 12 891 930 220 -747 -794 -175 614 989 384
2653C84r59n09N33J055M09k84j063m16L27R08N69l22p74o84J08R13O12J3o37r20
$$ 384 -575 -1084 -551 504 913 629 -434 -850 -523 385 954 632 -142 -826 -718 195 807 820 183 -737
2673g37l7O85Q78km58r35n9M74P63K86m63r40m10L54R76M31j77r68m91J99Q10
$$ -737 -774 -89 789 787 329 -606 -665 -191 572 858 395 -545 -955 -601 375 806 629 -339 -830 -631 179
2694A79O14r5q54o09K30N23O86r7n20o56k0O32N74K04n35o94l38N17P10L24l71
$$ 179 793 698 -156 -765 -535 -12 674 577 57 -599 -619 13 587 791 256 -438 -776 -259 451 775 404
2715D04p46m17L91P16L71m17n64o27L77O81L74N1o63n95mO43O05P1p50m89QM48
$$ 404 -342 -759 -368 348 719 302 -262 -889 -512 169 543 594 -69 -664 -668 -25 580 651 -99 -588 -580 -132
2737a32O93J0n53o03j25M59O82J96k79n76l41K03O89L78m39m50n19L83P31L32
$$ -132 561 571 18 -585 -710 -251 431 627 348 -228 -569 -366 323 701 262 -188 -707 -324 407 739
2757G39j79n57n08j6N77M87n8l99o88l7N00N57m1k67n50j27L97O16J68l44o81
$$ 739 560 3 -505 -521 56 543 485 86 -602 -639 -139 418 377 110 -440 -567 -170 446 614 270 -411
2778d11j94J83P25K61k73m51l81K98M90L45k16n49l15PN43P09k62n11o13N1N69
$$ -411 -605 -422 303 564 291 -160 -541 -243 247 592 376 -173 -488 -481 62 771 509 -2 -615 -564 5
2799EM52Q6l72o28j6L93L85L50n04n82j51K15Q65P9l44m12l47J95N44K54O0n25
$$ 5 457 543 171 -457 -473 -80 305 655 151 -431 -582 -367 498 577 233 -179 -526 -331 213 467 527 2
2821Bn00k5O68M47k15k68n54NM93M13P8m24n37k27M36N16L61l07p62j24K80M80
$$ 2 -498 -523 145 592 377 109 -445 -440 53 466 544 120 -417 -644 -208 308 669 362 -400 -524 -244 236
2843B36K52k36l96m92K88N23L99j71l98m75k6N66M52O4m95l80j00K83N46O0l77
$$ 236 488 252 -144 -636 -348 175 574 403 5 -470 -496 70 522 586 91 -289 -389 -106 440 500 123
2864A23m27j70L36N36K23k88n80l15K04O35K66l23m58l60K57N56L60j86n64l23
$$ 123 -304 -474 -138 398 621 333 -247 -562 -358 277 543 220 -238 -598 -341 215 575 389 -175 -498
2884d98R1L83N15On51n07O2M99L17K15m86n08O1K00N76K71m14o00k53K78O74K49
$$ -498 -407 -24 491 497 -54 -561 -499 0 317 532 46 -462 -401 -201 375 646 232 -368 -621 -343 331 580
2906E80l28m55k69N1N52M08j67m87m88J84N38M73j20l67o50k7M90N83J5k70o24
$$ 580 252 -203 -472 -421 131 539 372 -115 -603 -419 119 592 472 105 -545 -572 -82 501 516 246 -378
2927c78k25K87O02K48k21o91j51K67N10L28j70p00l56J88N27O63j34n70n94m6
$$ -378 -603 -316 286 534 313 -378 -529 -262 248 576 406 -294 -650 -462 65 728 594 24 -570 -616
2947f16P41L35J00n03m58j42M61N55J94l05o10l59L72N98K45j53q30l01L92N13
$$ -616 125 460 560 57 -401 -543 -82 473 667 362 -248 -607 -235 363 608 455 -375 -676 -284 229
2967B29M18k87m68m48P1N84N38m4n69o56J09L69O78J05n25m96k73N02O45R5j88
$$ 229 647 360 -108 -556 -485 99 637 593 24 -632 -523 -154 524 629 104 -392 -665 -163 482 577 389
2988C89p33l49K64P89L73k70p29m60K77O21L98j53n01n51jP14N20l7n59n58j75
$$ 389 -344 -693 -429 360 733 463 -266 -726 -449 172 570 417 -84 -635 -636 78 598 561 2 -556 -731
3009g31O11O78J66m98o79k10L83O99L77l99o57n15M02O97M20j92p45m44O5P36
$$ -731 -120 558 724 226 -453 -663 -280 419 796 397 -260 -775 -373 324 744 552 -193 -637 -572 164
3029A64L89J42o91o82j0P55N01j0m21o81j26M91O96K14m42p03l56K98O95M26j18
$$ 164 553 695 4 -678 -688 67 568 558 137 -544 -670 -179 517 731 289 -414 -770 -472 223 649 531
3050E31q48m48L16P45M31j20p06p00L06O45M35J40o79o04j20N46O96J97n57q16
$$ 531 -317 -765 -449 296 727 607 -99 -799 -493 152 587 727 48 -556 -676 -130 566 763 206 -610
3070f10j99O07P12K82m08p60m54M18Q20M42l66q25n86M46P89M38j04o59q09pP71
$$ -610 -809 -202 510 792 384 -376 -830 -412 408 850 484 -341 -927 -481 308 746 642 -17 -826 -833 -62
3091f2P40P7p20o72k01N78Q06K45m43q45m35N40Q14N16m71p09n97K76P91O39j34
$$ -62 678 755 35 -637 -838 -260 546 791 348 -497 -932 -392 422 938 467 -242 -839 -563 228 867 733
3112G33q99n99O2P75P09M6p10r02MP33P39J51o09q40k34N24Q73L73o63p46n32
$$ 733 -166 -765 -703 72 781 827 117 -785 -781 -48 691 842 233 -607 -841 -317 556 929 266 -480 -1012
3133a012L59J080N01k21r01o45J03P48Q51j66o91p47r1P74Q13J19p12q53k86O71
$$ -1012 -653 427 928 707 -194 -839 -736 12 863 697 6 -741 -832 -58 755 874 162 -691 -977 -306
3153c06Q76M29n79r39m64L65R36O00k84j086m97L11R51N42q5p66q83q0J032Q99
$$ -306 570 999 420 -519 -983 -618 318 918 634 -452 -949 -638 313 855 770 4 -879 -959 73 972
3173I72j37n60r67l13P81R60K10n12r38m30M71R46M50l16j096n34L01R41Q15k71
$$ 972 835 275 -692 -1005 -224 736 946 434 -504 -934 -463 483 933 617 -479 -1013 -712 229 1044 773
3193G73j000p75K4J012R59J2r19j073k1P89J037J50n66j021l23N35J010M34l55
$$ 773 -227 -1002 -978 34 993 1005 86 -987 -1008 -219 818 968 402 -619 -942 -407 603 1037 682
3212F82j150n01L20J019O24j37j067q01J69J024Q50N2r88j160K8Q83R10K88p42
$$ 682 -468 -969 -649 370 994 857 -210 -1011 -842 182 1032 1084 96 -1064 -1036 -153 757 1045 303
3231C03r86m75O72J166M43o57r60p71N87J101O60l35j040p37J62J051Q07r2r11
$$ 303 -683 -1158 -486 680 1123 466 -494 -1265 -678 423 1083 748 -292 -1029 -867 184 991 899 -12
3250a2r34j69J027J005K56r00r87l96Q79R46M62o43r92q47O80J134O94n29r06
$$ -12 -946 -1115 -88 917 1173 273 -714 -1110 -231 715 1177 534 -458 -1305 -625 509 1203 674 -232
3269b32r88M86J040P22o0j053q19j81J026J089J64j030j012l69R24J096K93p89
$$ -232 -1220 -734 306 1028 968 -85 -904 -1085 -59 1030 1194 164 -848 -1217 -293 803 1096 307
3287C07r05n93N61J215N86m97j175q13O80R25P57j08j172q94K7J188J084j65r48
$$ 307 -598 -1191 -630 585 1171 674 -501 -1314 -634 291 1048 940 -232 -1126 -1099 89 1173 1008 60
3306F0j036o0P50J145M04r51j053l98N11J344N31n14j227p39N23J250O14k23j224
$$ 60 -976 -1036 -286 859 1263 312 -741 -1139 -628 716 1247 733 -494 -1233 -710 540 1154 931 -293
3325b93p59K10R25J068j58j001j021r9R11J226K57j053j034l24P32J163M33o94
$$ -293 -1052 -842 83 1151 993 -8 -1029 -1128 -217 1009 1266 213 -821 -1145 -413 750 1183 489
3343D89j106o84N34J155Q13l81j187q38K01J324P47n2r03j233NR92J158J16q07
$$ 489 -617 -1301 -767 388 1201 820 -367 -1205 -1004 320 1067 1015 112 -1121 -1116 -124 1034 1150 343
3362C43j286k49Q82J102N11p85j259m07L68J390P48m75j221q73K59J184J026j83
$$ 343 -943 -1192 -310 792 1303 518 -741 -1148 -780 610 1358 883 -338 -1211 -952 232 1258 1075
3380A075j226j089J06J168J012N8r28j155k29Q64J217L69q75j293l89P85J189
$$ 1075 -151 -1240 -1134 34 1046 1104 176 -979 -1208 -344 873 1242 367 -926 -1315 -530 659
3397F59P56q34j160p22M47J218Q71k69j116j125K17J144J059N3j096j150j91R69
$$ 659 1415 581 -579 -1301 -854 364 1235 966 -150 -1275 -1058 86 1145 1198 102 -1048 -1239 -270
3415b70J365J77r71j111l52O18J488M14o74j432o83O81J416N64m07j068r90L39
$$ -270 1095 1272 301 -810 -1162 -544 944 1358 684 -748 -1431 -750 666 1230 823 -245 -1235 -896
3433h96J217R74j95j196j063l2J154J058J92j067j177j91Q39J307L10p32j309
$$ -896 321 1295 1100 -96 -1159 -1191 -37 1021 1213 146 -1031 -1222 -383 924 1234 502 -807
3450h07n55N84J424P04m74j366q41M18J191J022k19j242j076l5J311J131J29j187
$$ -807 -1362 -778 646 1350 876 -490 -1331 -913 278 1300 1081 -161 -1237 -1272 39 1170 1299 112
3468A12j150l18J046J413K89q93j356n37Q92J217O64o46j287q51O00J273Q94k88
$$ 112 -1038 -1356 -310 1103 1392 499 -857 -1394 -502 715 1379 733 -554 -1405 -805 468 1362 1074
3486A074j244j088J67J179J115j19j178r46j34R15J414N3q83j217l81P82J301
$$ 1074 -170 -1258 -1091 88 1203 1084 -94 -1040 -1174 -259 1155 1208 325 -892 -1273 -491 810
3503H10N61q05j242q10Q40J124Q80m77j311r54K50J368R60p8j190j226J60R84
$$ 810 1371 566 -676 -1486 -646 478 1358 881 -430 -1384 -1134 234 1194 1116 -74 -1300 -1140 -156
3521a56J230K11r95j285l89R04J443N71r62j409m90O44J377P95n96j281r18K55
$$ -156 1074 1285 290 -995 -1384 -480 963 1534 572 -837 -1327 -683 694 1489 893 -388 -1306 -1051
3539a051J479R32l14j262j175O7J323J290P4j273j335k20R98J534L93r54j317
$$ -1051 428 1360 1046 -216 -1391 -1324 -1 1289 1363 90 -1245 -1465 -467 1067 1460 506 -811
3556h11o66Q11J394P57p06j398q02M86J465Q60m71j215r95K76J125J143Q8j410
$$ -811 -1477 -666 728 1485 779 -619 -1421 -935 530 1390 919 -296 -1291 -1015 110 1253 1341 -69
3574f9j100o4J023J347K67j196j342l25R54J400N49p92j226q73O13J331J007m92
$$ -69 -1169 -1233 -210 1137 1404 208 -1134 -1459 -505 895 1444 652 -574 -1447 -834 497 1504 1012
3592A012j482r73L86J355J135l60j135j179j44J264J281J99j074j349n72J250
$$ 1012 -470 -1443 -1057 298 1433 1073 -62 -1241 -1385 -121 1160 1359 285 -1064 -1636 -386
3608c86J373M42j011j227p11P81J469Q44p83j295j105L61J727R57j90j593j058
$$ -386 987 1429 418 -809 -1520 -739 730 1574 791 -504 -1609 -1248 479 1436 1246 -347 -1405
3625a405J64J282J405n4j246j357j37J110J251N32r65j561n37R13J430O48n72
$$ -1405 -1241 41 1446 1392 146 -1211 -1348 -238 1013 1545 580 -981 -1518 -605 825 1473 901
3642I01j556p94M33J423R94k64j484j134K84J256J329l5j353j450o7J308J442
$$ 901 -655 -1449 -1016 407 1401 1137 -347 -1481 -1197 59 1388 1353 0 -1450 -1517 -209 1233
3659A233K02r35j614l54P48J665P03r49j350r02P65J431R65n15j588j104L36J484
$$ 1233 1435 500 -1114 -1468 -720 945 1648 699 -651 -1553 -788 643 1608 1093 -495 -1599 -1263 221
3677B21J368k27j520j139l6J342J405J46j340j367l25J008J565N39r77j571q05
$$ 221 1589 1362 -158 -1297 -1333 9 1414 1560 220 -1147 -1472 -464 1101 1640 663 -908 -1713
3694a713R86J465R31p59j475j170P09J440J135l93j353j274J50J432J211J84j398
$$ -1713 -727 738 1669 910 -565 -1735 -1026 414 1549 1156 -197 -1471 -1321 111 1322 1506 108
3711A08j368k67J263J330N43j110j690m67R24J507R74r07j480r61O72J485J141
$$ 108 -1260 -1527 -264 1066 1609 499 -1191 -1658 -734 773 1747 840 -640 -1601 -929 556 1697
3728A697n73j419j165K75J296J388j04j292j510m8J138J478N05j278j534m68J036
$$ 1697 1124 -295 -1460 -1185 111 1499 1395 103 -1407 -1455 -317 1161 1666 388 -1146 -1614 -578
3745e78J547O05r04j493p40O07J608Q95m46j555j274N44J375J463k59j458j382
$$ -578 969 1574 670 -823 -1563 -956 652 1547 1101 -454 -1728 -1184 191 1654 1395 -63 -1445
3762a445l0J429J493K79j377j675k94J167J609N08j031j584p26Q78J541Q29m62
$$ -1445 -1475 -46 1447 1726 349 -1326 -1620 -453 1156 1664 633 -951 -1677 -799 742 1571 1109
3779A109j678j061N80J325J245o6j676j280Q7J409J430J15j413j464l21J320J510
$$ 1109 -569 -1630 -1050 275 1520 1454 -222 -1502 -1415 -6 1424 1539 126 -1338 -1659 -339 1171
3796A171N62j088j512q24R54J615P80p28j571j059O73J369J173l10j444j290J81
$$ 1171 1733 645 -867 -1691 -737 878 1658 930 -641 -1700 -1027 342 1515 1205 -239 -1529 -1348
3813a348J385J419Q3j429j519j18J333J491M36j344j554l80J009J487Q29r63j589
$$ -1348 37 1456 1539 110 -1409 -1527 -194 1297 1733 389 -1165 -1545 -536 951 1780 817 -772
3830g72r88P87J608J032m17j609j218L13J521J192K0j565j343l8J218J667K34
$$ -772 -1760 -973 635 1667 1250 -359 -1577 -1264 257 1449 1469 -96 -1439 -1477 -259 1408 1642
3847A642j203j716l57J086J529O03r10j617o61P26J473J076o53j633j063N47J633
$$ 1642 439 -1277 -1634 -548 981 1584 674 -943 -1604 -878 595 1671 1018 -615 -1678 -1131 502
3864E02J044r4j770j257N7J309J621N5j203j631l54J220J620M87r01j672o22Q07
$$ 502 1546 1452 -318 -1575 -1518 -209 1412 1467 264 -1367 -1721 -501 1119 1606 705 -967 -1589 -782
3882g82J565Q84o29j598j041M44J557J210j54j688j307K19J483J311N3j407j450
$$ -782 783 1667 1038 -560 -1601 -1157 400 1610 1456 -232 -1539 -1320 163 1474 1527 120 -1330
3899a330j68J243J474L95j039j645o01R61J649O86o74j806q79O14J660R93k64
$$ -1330 -1498 -255 1219 1614 575 -1070 -1671 -710 939 1625 951 -855 -1734 -1120 540 1533 1269
3916A269j726j086K68J393J214oj304j345j35J323J480L52j326j456m82J022J434
$$ 1269 -457 -1543 -1275 118 1332 1326 22 -1323 -1458 -135 1345 1697 371 -1085 -1567 -545 889
3933H89O42q62j503q61Q07J578Q93l45j695j076K33J557J379l50j333j346j70
$$ 889 1531 669 -834 -1695 -888 690 1583 1238 -457 -1533 -1300 257 1636 1286 -47 -1393 -1563
3950a563J506J166L51j188j432l59J004J624N75j066j607o27P35J706P69o24j495
$$ -1563 -57 1109 1460 272 -1160 -1519 -515 1109 1684 618 -989 -1616 -881 825 1594 970 -525
3967e25q91K10J631J052l87j360j206P2J490J260Q1j142j584j41J067J229P09
$$ -525 -1416 -1206 425 1477 1090 -270 -1476 -1404 86 1346 1427 285 -1299 -1440 -373 856 1565
3984A565r38j424q27Q90J516Q40p08j730o50M30J485J099l92j488r60J18J307
$$ 1565 627 -797 -1624 -734 782 1622 914 -816 -1466 -1036 449 1548 1156 -332 -1292 -1174 133
4001A33J270K3j350j306o4J031J337M23j097j486m97R37J406Q73r31j471q93O32
$$ 133 1403 1426 76 -1230 -1294 -263 1074 1497 400 -1086 -1583 -646 760 1633 702 -769 -1662 -1030
4019a030J539R15m58j214j225L18J271J331o2j479j263L8J108J448J26j091j323
$$ -1030 509 1424 966 -248 -1473 -1155 116 1447 1385 -94 -1357 -1319 -211 1237 1363 272 -1051
4036a051m18J055J343P55r43j642n90P06J403R31o36j469p69M44J246R53l3j462
$$ -1051 -1469 -414 929 1684 741 -901 -1491 -785 618 1549 913 -556 -1325 -881 365 1318 1285 -177
4054a77j118m5J226J358J17j058j391k67Q78J357O06r42j455m09N31J471P93o56
$$ -177 -1295 -1340 -114 1244 1361 303 -1088 -1355 -477 880 1486 544 -911 -1320 -789 682 1475 819
4072H19j326r17M39J228J193m88j136j060M4J283J235oj185j173j86J022J202
$$ 819 -507 -1424 -985 243 1436 948 -188 -1248 -1204 79 1314 1308 123 -1050 -1236 -214 988
4089I88M83r83j330m94O89J464O31o94j304q57L76J420J044m08j301j004R6J304
$$ 988 1471 488 -842 -1336 -647 817 1448 754 -550 -1407 -1031 389 1433 1025 -276 -1280 -1184 120
4107A20J115j4j231j066k26J102J218J93p34j426m95Q72J410N32p53j315o21N63
$$ 120 1235 1221 -10 -1076 -1302 -200 1018 1211 477 -949 -1444 -572 838 1370 617 -698 -1319 -756
4125g56J327P56m58j259q77J70J352R91p0j231j009p0J097J046L58j176j037m40
$$ -756 571 1327 869 -390 -1267 -1097 255 1246 1176 -55 -1064 -1134 -37 1009 1367 191 -846 -1286
4143a286R03J266L37o59j136q06O36J356Q85o86j263q35L48J239J047k52j141
$$ -1286 -383 883 1220 561 -575 -1381 -745 611 1496 810 -453 -1288 -940 299 1346 1094 -47
4160d7j198J06J119J083K24j118j161k93R56J170L21o92j199n36P20J089P85m93
$$ -47 -1245 -1139 -20 1063 1287 169 -992 -1285 -329 841 1162 470 -729 -1265 -545 544 1329 836
4178H36j414o90L29J220Q16k36j127r54L02R27J073M3j099j068k44J171J050L03
$$ 836 -578 -1268 -939 281 1097 861 -266 -1220 -918 9 1082 1125 26 -1042 -1286 -115 935 1238
4196A238p80j245l50O15J187N77o11j209n59N12J030P22l35j027j039K49J200
$$ 1238 458 -787 -1137 -522 665 1242 631 -578 -1137 -625 405 1127 792 -235 -1274 -1025 175
4213A75R36n1j104r62N3Q90R54J74p75j112m22Q55J117L94n90j111n74N80R29
$$ 175 1111 1060 -44 -1006 -953 -63 891 1065 290 -822 -1244 -389 728 1122 532 -579 -1153 -573 356
4232C56Q22m95j131n15J93Q52J021j42j006q73j51Q89J200m6q12r02k40P14J128
$$ 356 1178 683 -448 -963 -770 82 1103 961 -45 -918 -1069 -180 1020 974 162 -740 -980 -266 862
4251H62K74o62j115m69P68Q65N45l09j174o40L90R16Q04j56r71j029K75P80Q56
$$ 862 1136 474 -641 -1110 -342 523 1068 759 -415 -1055 -665 251 1055 899 -72 -1101 -826 -46 810
4270H10J34q54r15j91P68R77K91o85j028l12N75R51M83m02j089n12K42J160O07
$$ 810 944 90 -825 -1016 -248 729 1020 335 -693 -1005 -430 521 1004 602 -487 -999 -757 403 1010
4289A010k36j036p89L20Q41P90n6p92r85M2Q51P29K86q03r62k36O60J035L06m88
$$ 1010 774 -262 -1051 -731 110 900 844 52 -933 -891 -40 689 975 172 -790 -1026 -366 669 975 487
4309D87r66n16N63R85L99k84q94p77L88Q96N11o2q28p72O6P00O49K67o76q69k58
$$ 487 -479 -995 -432 553 952 668 -226 -1003 -615 281 792 730 -98 -870 -804 -104 545 812 136 -733 -991
4330i91P02J014J22l37j043l48L89R26M33l41p99o88K20R03P91l19q20o98J45
$$ -991 -289 725 847 510 -533 -881 -492 434 867 526 -273 -961 -741 162 953 634 -186 -884 -739
4349g39P55P18J46o53r00q3N64Q82K13n80r02l02O36P75M20n75q42m97M90O73
$$ -739 16 734 880 227 -673 -756 -192 690 903 323 -579 -881 -245 530 950 375 -467 -964 -474 199
4369A99O94k83p95o22J72O98O36N8o45r13J60M72R32o6m95p89l06O63P38K79m42
$$ 199 893 610 -185 -807 -635 63 699 757 112 -801 -641 -169 763 697 202 -587 -893 -230 508 787 345
4390C45p96l75L64Q09M99l71p61n43L45N68O97j06o21q33R3O44P90k4o39p24j74
$$ 345 -451 -826 -462 347 846 475 -286 -829 -484 84 781 675 54 -779 -686 -42 748 724 85 -639 -813
4411h13O10P17K94m50p37m00L52Q26L50l67o71m57K05P12M91j22o40n79M9O55
$$ -813 -203 514 808 358 -379 -779 -427 399 749 382 -289 -746 -541 171 662 540 -100 -679 -630 25
4431B5O61k5n22p73m3N04P13K07n20p47k23K63Q75M90n01p24m35L49O32M88j25
$$ 25 686 661 139 -634 -677 -173 540 747 227 -520 -743 -480 395 885 384 -340 -775 -426 206 694 569
4452E69p04n55J67O14O12Jo23p34L8M35P81J8l03q01j71M90M87L58m49n83l77
$$ 569 -135 -690 -523 91 703 704 81 -653 -615 -180 601 619 316 -485 -656 -166 321 679 230 -353 -730
4473g30K63P30M42j74p10o19K00P60O17k57n91n70j52P58N17J73m64p48J0L58
$$ -730 -467 263 705 531 -179 -798 -598 162 779 522 -69 -639 -791 -33 484 657 193 -555 -545 -187
4493a87N69J81l11o90k71L87P83K51k60p09m81K68O35N61j06q35k97Q2L97O46
$$ -187 382 563 252 -438 -709 -322 461 712 452 -257 -738 -470 165 726 620 -215 -512 -430 -33 613
4513F13j4m61o26j90P42L60K44n27o26o1K56N92L19l18n57l33J58O82L83l50l77
$$ 613 599 138 -488 -678 64 424 668 141 -485 -546 -290 302 621 303 -254 -587 -429 253 636 286 -91
4534i1n14P8O01N95m4n99o45J86L45N56Pl27m79k12L07O09K27k83n28l84M11L26
$$ -91 -605 -527 74 669 625 26 -619 -433 -88 468 475 148 -331 -543 -236 373 600 317 -211 -595 -184 142
4556A42M68j17n28o50J62M96M79R3n37m69j34N25M79J54m84m61l14M40N63L44
$$ 142 610 493 -35 -685 -523 -27 452 545 8 -461 -595 -70 409 563 79 -382 -696 -256 307 651
4576F51l65o04l93M40L99M14j29o25l50K43L53O13k82n08m10mO05M18L5l65n56
$$ 651 286 -318 -711 -271 128 542 413 -212 -562 -319 34 647 365 -143 -553 -557 48 466 501 136 -420
4597d20j05M49L81K66k87p36j48K64N68L95k99m36m57J47N46N28k15m94l35O8
$$ -420 -525 -76 305 571 284 -452 -600 -336 232 627 328 -108 -565 -418 128 656 441 -53 -388 -320
4617c20L58M72J9n02l90j26K99N50J59k86m96j85J53N86J13l5o63k14K40L21M10
$$ -320 38 510 529 27 -363 -489 -190 360 519 233 -263 -448 -295 291 404 369 -294 -508 -268 53 463
4638D63j51m00m22J05L47M36K6l14n42j55N37N27J6k33n65j72L16M08L03k20m72
$$ 463 312 -88 -510 -405 -58 378 404 90 -452 -607 -70 457 473 240 -325 -497 -181 227 530 310 -162
4659a62m01L31L68L69j07n28k42qL84M50j69k24l89j08L11L57L63n95l45j07L51
$$ -162 -563 -232 136 505 398 -130 -372 -380 4 454 285 61 -328 -436 -125 232 595 0 -345 -452 -101
4680a01K25M41k35n30k85K08L47K75o6m47k13P1K86K29Q9k77m35K4L54L64N8l00
$$ -101 124 565 330 -200 -485 -277 70 345 279 -168 -381 -310 -24 205 294 17 -418 -394 -40 324 382 82
4702H2k69k02K35L15K42k02l93m3N8L09K88j14l91l03J47L21J17P6j44m07j38
$$ 82 -187 -389 -154 161 403 201 -192 -235 -177 132 420 306 -85 -388 -241 80 197 273 129 -278 -416
4723d16L71L03J51l28l55m9L53J78R1q1l53k70L84P7K22l9l52j69Q7J70K63j3
$$ -416 -45 258 409 81 -274 -323 30 208 299 218 -135 -405 -21 56 278 239 -113 -282 -195 -25 238 225
4745B25k60k29o0K55J17J58K5l75j64O9M03K04j83l33n1n5K88L07k80p3l31K07
$$ 225 -35 -264 -324 -69 48 206 231 -144 -308 -239 164 368 185 -148 -199 -254 34 341 61 -12 -343 -136
4767a36J08K43M3j94l50P2J65J60R2j09k27q8L30k1J16j07j52j10k8J75L27k01
$$ -136 -28 215 258 64 -286 -214 -49 111 203 94 -133 -221 109 88 204 97 -55 -165 -193 -18 309 108
4789A08j89j53J6J75L27j3k21k82j49L61R8J25j71Nk60J59K12J75k08j45j25R7
$$ 108 -81 -234 -218 -43 284 271 50 -232 -381 -20 78 203 32 37 -223 -64 148 323 115 -30 -155 -58
4811e8J28K65j01l29k8KQ6K68n8j92m4p2J96PJ48j23k99O2L5J49R0k0p5k30J25
$$ -58 70 335 234 -95 -123 -121 -35 233 175 -17 -61 -133 63 70 218 95 -204 -142 -107 42 132 112 37 -193 -68
4836f8K39k5l4r0j12j53J55K53K9k8k51j44K73j75K98m7j63p7pK38J25o1j89o0
$$ -68 171 146 112 22 -90 -243 -88 165 194 166 -85 -229 44 -131 167 120 -43 -120 -127 111 236 175 -14 -74
4860g4p4J72J80kk5k07j58J00P1K01j1j50n8K3J52j1r0O7r2j6n3J41M7k09j2L3
$$ -74 -148 24 204 202 177 -30 -188 -88 -17 184 173 23 -35 -12 140 129 39 106 14 -2 -55 86 133 -76 -88 -55
4886e5n0J00J55k02l4N6q0R5J39j08m3q2l8J88M7K5j39j62K14q4J26J3j98J58
$$ -55 -105 -5 150 -52 -86 -30 -110 -15 124 16 -27 -109 -147 41 88 113 -26 -188 26 -58 68 81 -117 41
4910D1k28J70J32lJ1q5j05O1K3J22k4k5j05o1J16o6K32J7l41P7k2J58L4l1j36
$$ 41 -187 -17 115 112 123 38 -67 -6 17 139 115 90 -15 -76 40 -26 206 223 -118 -41 -63 95 129 98 -38
4935c8o0J53j4M9p0m7j17l5K71l2pq3Ll8OJ62J8j13l2j06L3K05N2j5r4j90M3O4
$$ -38 -98 55 41 90 20 -27 -144 -179 92 60 53 -30 -27 -65 -59 103 121 8 -24 -130 -97 108 160 145 51 -139 -96 -32
4963c2K25n7l09R0j15J50M8Q0o4o7k4K2J42O6o8M0j23n3M3O7M1q2j87J73j12J95
$$ -32 193 136 -173 -83 -198 -48 0 80 16 -51 -75 -53 89 155 87 127 4 -49 -6 61 102 20 -167 6 -106 89
4989H9r9o4M9k15L01P7l5o2j05j45J64J68L0j1k24j02J08J24J86j65j74o3K1N0
$$ 89 -10 -74 -25 -240 61 138 103 41 -64 -209 -45 123 153 142 -82 -184 -76 48 234 69 -105 -168 -147 -97
5013i7K91l7j02j61j06J47J58K8M6k02j42J68k8J62n1q7j03J0O8K23o0m3k94o
$$ -97 194 157 55 -106 -212 -65 93 121 167 -35 -177 -9 -37 125 74 -13 -116 -106 -38 185 125 82 -212 -218
5037b18P9K50J58j64j02m6NJ22Q9j18p0k44K72M8K52k93M7l17J58Q5J87k1j39
$$ -218 -139 111 269 105 3 -43 -38 84 173 55 -15 -259 13 61 313 20 67 -250 -92 -7 180 159 20
5060B0j14j33J80K27q8N8j84k49J60K88l9m6j49j82J65J60J79p7k52l08K17K44
$$ 20 -94 -227 -47 180 92 150 -34 -283 -123 165 126 80 -69 -251 -86 74 253 176 -76 -384 -167 77
5082G7M8M7j62j33j48L63J39n2j55k60M8J76P6J91k17m5l40J76K82L6N0k13k43
$$ 77 125 172 10 -123 -271 92 231 179 24 -236 -188 -12 64 255 38 -7 -347 -171 111 147 197 -16 -259
5105b59k2K64J18J01k21k21k1L04J95j4l03m4k35K20K93L1P9l82j14J07K64N1
$$ -259 -281 -17 101 202 -19 -240 -261 43 238 224 -79 -123 -358 -138 155 186 265 -117 -231 -124 140 191
5127A91j02j09p5o3K12J12J08k76k34o7J54K88K9j23k61L4M7L24j4j7l41j56K67
$$ 191 89 -20 -95 -158 54 166 274 -2 -236 -303 -149 139 168 45 -216 -182 -135 189 175 158 -183 -339 -72
5150g2J47K29j72j35j71K8L16K7o2m9m38J34K29L30j32k04j32j99L81J07J31l11
$$ -72 75 304 132 -3 -174 -146 170 197 135 86 -352 -218 11 341 209 5 -127 -326 55 162 293 -18
5172a8j81j85L07K95R8j17k79j08J1L46J64j25k20j80pJ33K84p5r3k92k7K73J31
$$ -18 -199 -384 -77 218 316 199 -80 -188 -177 169 333 208 -12 -192 -199 -66 218 143 50 -242 -269 4 135
5195A35J90k11l54j74J81L70k2Jk14k30J60L09K00nm53k14K36L5L36n9l59j44
$$ 135 325 114 -240 -414 -233 137 115 116 -98 -328 -168 141 341 336 -117 -331 -95 -60 276 217 -142 -286
5217b86n2K58L25J44j44m95M7J26K27L06l31k52l45K76M33J36j62l19j72N5K96
$$ -286 -338 -80 245 389 245 -250 -203 -77 150 456 125 -127 -472 -196 237 373 211 -108 -280 -225 71
5238G1K40o7k90j35j18K37K69Rj31l85q8K92K62J47j45m23j66P8M97L09j90l76
$$ 71 311 244 -46 -181 -299 -62 207 216 85 -300 -388 -96 166 313 168 -255 -421 -343 154 463 273 -103
5260a03j84J40J38L30l1l94l17J57J45L11J63l24k41k23L23K70L9m9l54k68L32
$$ -103 -287 -147 -9 321 290 -104 -421 -264 -119 192 355 31 -210 -433 -110 160 199 150 -204 -472 -140
5281a40K96L31k95m01k22K15L56L29j11n86j82R8K89L19L7l39k81p0J81M03J28
$$ -140 156 487 192 -209 -431 -216 140 469 358 -228 -410 -312 -23 296 333 -6 -287 -357 -176 227 355
5302C55l88l40k1K50N38l3j87l67j71R6K62M53k28k25l83M1N15K13o4k70l37p4
$$ 355 -33 -373 -394 -144 394 361 174 -193 -364 -268 -6 447 219 -6 -389 -348 167 380 316 46 -291 -365
5324c65L55M37n4k80l02j33Q3M43K47j89l16k46k2M45K98j88l28l03LM13L95M
$$ -365 -10 427 373 93 -209 -342 -259 184 431 242 -74 -320 -342 103 401 213 -115 -418 -415 -2 393 397
5346C97m16l92O1L06L12J24k03n95K2K41L78K38k43m08k42K53K87J96o3m22j56
$$ 397 -19 -411 -350 -44 268 392 189 -406 -384 -143 235 473 230 -178 -420 -167 120 316 253 -169 -325
5367c25n3L71L25nk89l45J7L53K81J23l66m04k7J69N52O7l00l88j61J77L81L67
$$ -325 -378 -7 318 313 24 -321 -304 49 330 453 87 -317 -344 -175 377 444 144 -244 -405 -228 153 520
5389E20l15l99k18J69L42K81j25l31l69J7M31K59J57j83p16J13K16N07K29m99
$$ 520 205 -194 -412 -243 99 380 255 -76 -445 -428 3 262 419 236 -480 -367 -151 356 585 86
5409H6l87q3K76L45R9n1m76l41K43M12L29j13l75l08K4K98M61p5m13l33K4K77
$$ 86 -301 -384 -108 237 336 285 -191 -532 -289 123 452 339 -36 -344 -320 -22 439 364 -49 -382 -358 -81
5431h1M01K8l16k46k20K02M39J88j22m92k41J15M89K98q8n40k90K27L07K56J1
$$ -81 320 348 32 -214 -434 -232 207 395 273 -219 -460 -345 144 442 354 -186 -476 -249 58 314 325
5452C25n49j21j25M32L86J24k66n05j72L06M51J37k22m15k68K67L75L52j86m25
$$ 325 -224 -345 -470 -38 348 472 206 -299 -471 -165 286 423 201 -214 -482 -215 160 512 326 -99
5472i9m92J25N72L65l1l95n11J7M67M35p6m17k25l35N27L71P2j53n39j25K55O58
$$ -99 -591 -466 106 471 440 45 -466 -449 18 453 377 -40 -265 -600 -73 298 370 217 -322 -447 -192 466
5494D66m4j31l78l78J98L59L50j62m05l34Q2L50M65j3m06l65j65K95M89K45l32
$$ 466 422 291 -87 -465 -267 92 442 280 -125 -459 -377 -27 438 425 19 -346 -511 -216 273 518 186
5515A86n04k18K76L95L86m08k72l12K03M32J68K6m68k97J33L12M01mm59m26O5
$$ 186 -318 -536 -260 135 521 113 -159 -471 -268 164 332 358 -110 -407 -274 38 439 435 -24 -450 -385
5536c85L46M72L4k80n21q2M12L96Q4l00k95l52J80N17L42k53m81m02K50L12M01
$$ -385 -39 433 467 187 -334 -416 -4 392 476 176 -119 -471 -291 226 568 315 -166 -568 -318 -6 395
5557C95Q1n79m06J12M19L12J27l28n38j29L97M40J27l28m53j70J83L83M28k35
$$ 395 476 -103 -509 -397 22 334 461 133 -405 -534 -137 303 430 102 -351 -521 -338 45 473 238
5577B38l83k46l0N72L67r4m02m87R8K72M07J95m69m43L1K32M62K84l07n99j33
$$ 238 -145 -391 -421 151 518 424 22 -465 -367 -95 312 507 38 -405 -374 -142 320 604 297 -302 -435
5598d35K59M33J88j79m84k65J22M29L90j52m09l82l4N29L99K7l75l72q1K79M88
$$ -435 -176 257 445 266 -218 -483 -361 68 458 306 -103 -485 -519 10 409 436 61 -311 -392 -113 375
5619C75Q0l30l92k61L05N76J91m20k93k69J95M01L41k04n78k39J94M14L51M3m43
$$ 375 455 125 -267 -528 -223 353 544 124 -169 -438 -243 158 499 295 -283 -522 -328 86 437 480 37
5640C7n43J30L74L75J63l67o16J8L01M90J59k52o41p0J80M85L17j82n11j57n8
$$ 37 -506 -376 -2 373 536 169 -447 -429 -128 362 521 269 -372 -442 -262 223 540 358 -153 -310 -368
5661c68M10M66j50k95o18J53M31M79p2m19l44k41N02L81J63k97l50k52L66K77
$$ -368 42 508 358 63 -555 -402 29 508 436 17 -327 -568 -66 315 478 181 -169 -421 -55 222
5681B22K79j21m89k56M6L70M17N9o68k06oK64M73P4m90k42k48L87N05Q2k71m58
$$ 222 501 380 -109 -365 -319 51 468 527 -141 -347 -353 -89 384 458 -32 -274 -522 -135 370 452 181 -277
5703b77j13K21L12M10k62n87j05K10L10K85p7m85k75M0L05L39Q5l28l21q6L79
$$ -277 -390 -169 143 553 291 -296 -401 -191 119 404 327 -158 -433 -393 -88 251 336 8 -313 -399 -20
5724b0L76R5l13m30j00J71L97K91k16m43k50K21L81L04j53l95m21J27M88K37L4
$$ -20 356 451 138 -292 -392 -221 176 467 251 -192 -442 -221 160 464 311 -84 -505 -378 110 347 381
5745C81l72m38J9L16M33R0m01k72k70K80M82K54k50m88l09K90M46K05p7m68l11
$$ 381 9 -429 -410 -94 339 429 28 -244 -514 -234 248 502 252 -236 -545 -255 191 396 319 -149 -460
5766d60P5M12N39k11m46l15j20M29M40J02l83m21p3L12L63K46l36l46l43L93M51
$$ -460 -385 27 566 355 -91 -406 -526 -97 343 445 62 -359 -432 -120 243 489 153 -193 -536 -143 308
5787C08K17k49m73k03J61K04L76R6m96l45J44J61M35J54m93k73o0P4N17K46k68
$$ 308 525 276 -197 -400 -239 -35 341 437 -59 -404 -260 -99 336 490 -3 -276 -336 -262 255 501 233
5808B33m59k60L68L14J33L6n11l35K33N28M5m3m58k26Q6L17J72Q4k80k90j52L91
$$ 233 -226 -486 -118 196 329 365 -146 -481 -248 280 325 282 -176 -402 -316 1 173 257 -23 -313 -465 -74
5830g4L98O8l06m12n1K97K54K54j60m01k42J88L47L12j33l86m06J92L79L64r1
$$ -74 324 392 86 -326 -377 -80 174 428 268 -133 -375 -187 160 472 339 -47 -453 -261 118 482 391
5851C91l42l44j55L69M21O3l57m50q1L90K75J04j54m24m9P4N08K02k08m03l41
$$ 391 49 -295 -450 -81 340 403 46 -404 -485 -95 180 284 130 -294 -343 -269 239 441 233 -170 -511
5872e11K23M09M05k18n03j53N4K37L29Q4l57j89j77L09M29J40l40l52j26J01N78
$$ -511 -288 121 526 308 -195 -348 -294 -57 272 356 -1 -190 -367 -58 371 511 171 -181 -307 -206 372
5893C72N7k13m10j85J99M15Q8l6m07k96J70L21K31N7l52l21M2K05M63j20j97m27
$$ 372 429 216 -194 -379 -180 235 323 287 -120 -416 -246 75 306 363 11 -310 -268 -63 400 280 83 -344
5915c44NK05L83O1k40j95p7j3K78K06k9l28l34N9L68L54o0k12n55L04J05L29J70
$$ -344 -339 -134 249 310 70 -125 -202 -215 63 269 240 -88 -422 -363 5 359 299 87 -468 -164 -59 270 440
5938D40l59m03L6O3M13J89j98m40o4J84L33J56q7l63j30j6L46K88j41l17k14R0
$$ 440 81 -322 -286 -223 190 379 181 -259 -323 -139 194 350 263 -100 -230 -246 100 388 247 -70 -284 -194
5960a94K95M03k32j89m71M5K49M02N1k09m05J6J70K86L0r6l55k91L45K32L70k13
$$ -194 101 504 272 83 -388 -343 -94 308 359 150 -255 -239 -69 217 247 151 -204 -495 -150 82 452 239
5982B39m47q3RK97J97J97l36m32O0K77K92R2j99l33j53K51K51J98j57m29j35J59
$$ 239 -208 -291 -282 15 212 409 73 -359 -299 -22 270 362 163 -170 -323 -72 179 377 220 -209 -344 -185
6004a85K55K11r0j83l15P1L23K62j11m09m5R1J7L82O8l18k97j61M35K02Q2j16
$$ -185 70 281 191 8 -307 -236 87 349 238 -171 -216 -125 -108 274 342 24 -273 -434 1 203 285 169
6026A69l02j69J8M65J87k20k03k72O0M25K73j55l32k08j3K01L46J46m62l59J21
$$ 169 -133 -302 -284 181 368 148 -55 -327 -267 158 431 276 -56 -264 -277 -76 270 416 -46 -405 -284
6047b84K08K64K34k20m27o5J20L20K00l4m31j27R8L88J18r9k56k69o5L66K61%
$$ -284 -76 188 422 202 -225 -290 -170 150 350 316 -115 -242 -144 244 362 263 7 -262 -327 39 300 300
6069C00l24l62P3L32K99o0j58l98M8J50L66m0p2l28o3o6N09J86k97j48j55j7J44
$$ 300 -24 -386 -313 19 318 258 100 -298 -250 -100 266 226 154 -174 -237 -303 206 392 95 -53 -208 -225 -81
6092h1L57K2m08j72k7K46K26R7j65m09K4K27K21K11l49r9l42K46L28K07m1m22
$$ -81 276 298 -110 -282 -309 -63 163 260 95 -314 -290 -63 158 369 20 -79 -421 -175 153 360 319 -103
6114a03k37J80L17P6J05l46j48j29K98L69j40k21k34j56K95J92J78j67k95j94
$$ -103 -340 -160 157 233 338 -8 -156 -285 13 382 242 21 -213 -369 -74 118 296 129 -166 -360
6134c60K11K41K37k94k00j63J77J87J77o4l13j57j7K64K81O4j51l16m2K14J24
$$ -360 -149 92 329 35 -165 -328 -151 36 213 149 -164 -321 -338 -74 207 271 120 -196 -238 -24 100
6155A00K22k34m04MJ61K03L40l29k00k64R0L41K10j5k59k70J77J71K28j5k49l87
$$ 100 322 88 -316 -312 -151 52 392 63 -137 -401 -311 30 240 225 -34 -304 -127 44 272 257 8 -379
6177c79R8K88K61J6j98l04K5Q1L03Rj20l71q9J63K52K59j11k67k46J74K87J83
$$ -379 -281 7 268 284 86 -218 -193 -112 191 200 80 -291 -380 -217 35 294 183 -84 -330 -156 131 314
6199C14k09n4k80J07P4L64j17j48m29K15K46N8J77l31j35k32K34K63J34j11l56
$$ 314 105 51 -229 -122 -48 316 199 51 -378 -163 83 141 318 -13 -148 -380 -146 117 251 140 -216
6220b16j14J09J98L54j30k57k45P4K58J46n8j02k25k1K00K97j78p2l08m7J61L99
$$ -216 -330 -221 -23 331 201 -56 -301 -227 31 177 119 17 -208 -229 -29 268 90 18 -290 -337 -176 223
6242B23l4j24k92p3M9L60J48r9j60j91r6K48L66M7l89k90J27J1L82M2j41j48j69
$$ 223 189 65 -227 -300 -251 109 257 158 -2 -193 -289 -41 325 372 -17 -307 -180 -169 213 255 114 -34 -203
6265b03M5L14J11j51k46j46K17J90L6k07nj74J08J34K06n6j95j84rK37P1J96l57
$$ -203 -158 156 267 116 -130 -276 -59 131 167 -40 -45 -219 -111 23 229 173 -22 -206 -215 22 93 289 -68
6288f8p2o9R9K67p7k2k71k6N8L51R7k32j35j1JJ69J32k3j45k94J96J63M4J39k45
$$ -68 -140 -209 -110 157 80 58 -213 -239 -181 170 267 35 -100 -111 -110 59 191 168 23 -271 -75 88 132 271 26
6313B6j84l0J99Q2L4k0j84q9J73N6K23k89n8n1j09L13J04j50l6o0k5R9N6op5m3
$$ 26 -158 -188 11 93 127 107 -77 -166 7 63 286 -3 -61 -112 -221 92 196 46 10 -50 -75 24 80 74 -1 -44
6339d4k68K72J76J61l28m9k3m8K09K7K3j06j70J21O9K1R7j32j69j6L02M4l7p9
$$ -44 -312 -40 136 297 -31 -80 -103 -151 58 85 108 2 -168 -47 22 43 140 8 -161 -177 125 169 132 53
6363E3q7j43J92Q7M8l3j12j22J76j0Q6j20k22P2Q9R9J04n7j16j88R1R3J61J6j60
$$ 53 -34 -177 15 102 150 117 5 -117 59 49 135 15 -207 -135 -46 53 157 100 -16 -204 -113 -20 141 157 -3
6388ck08J15J29K9P9j95j84J66M6L9J84j05j84j21J71J57q8P1j01j93K12K9j3
$$ -3 -211 -96 33 62 141 -54 -238 -72 -26 13 197 92 -92 -213 -42 115 27 98 -3 -196 16 45 32
6411C2J7o7j35R4L8L26j78j11o0j19J35J5J05j94j6k4J10K01j5p7j71l1NK55n0
$$ 32 49 -18 -153 -59 -21 305 127 16 -44 -163 -28 -13 92 -102 -118 -142 -32 169 154 77 -94 -125 -120 135 85
6436H5M6k33J0KL4K32J8k88J1L6J08J06o1j68j4L0K2J2J22p4J0j92J40R0P8j67
$$ 85 131 -102 -92 -90 -56 176 194 -94 -83 -47 61 167 106 -62 -76 -46 -24 -12 110 36 46 -146 -6 84 162 -5
6462ej81J48r0K22P8j0k79K0j1J32J08m4j18j10M7J89m2rj80J8R7N8Q1p4r7q3
$$ -5 -186 -38 -128 94 172 162 -117 -97 -108 24 132 88 -30 -140 -93 96 54 45 -135 -117 -20 38 119 45 -52 -135
6488a35K6NK15O1j60p8q2J32R7m1O5o7j60J1l1R0J04J09k73M3J13L9K2j22j35
$$ -135 -109 -104 111 172 12 -66 -148 -16 81 40 105 38 -122 -111 -142 -52 52 161 -112 -69 44 83 105 -17 -152
6513a52PR4J99p9K4k00J67j10J25J1N7k38L0O7K9P4j08J2K5q2R1m6Qjj12J25p1
$$ -152 -145 -51 148 69 93 -107 60 -50 75 86 143 -95 -65 2 31 105 -3 9 34 -48 43 -3 5 4 -108 17 -54
6540e4J29n4o4j39K24n2L9q5r2J64q2J11K2J28k03n8QJ88n3r5k2L1m9O7K6K9q4
$$ -54 75 21 -43 -182 42 -10 29 -56 -148 16 -66 45 67 195 -8 -66 -58 130 77 -18 -40 -9 -58 9 35 64 -20
6567b0l0p1O3J61mj27Q1n4Q3M2r6n5Q2j14Q2j1K8k4j9J9o7k9J07k3J10j40r8J19
$$ -20 -50 -121 -58 103 99 -28 53 -1 82 124 28 -27 55 -59 23 12 40 16 -3 16 -51 -80 27 4 114 -26 -124 -5
6595eQ7j15o4L8O5n7J5J23n9l4k0LJ65j0p3kj27Q4P9p1j15M9Q8kKo2J29j67J80
$$ -5 82 -33 -97 -59 6 -51 -36 87 28 -6 -26 -23 142 132 59 57 -70 14 93 22 -93 -44 44 42 44 -18 111 -56 124
6624A24k09J23K13j82o5m0Jk5Q2n5O7k1m2j8L6J02r6r9l9J04M8J35j68m7j17J55
$$ 124 -85 38 251 69 4 -36 -35 -60 22 -33 34 13 -29 -47 -11 91 -5 -104 -143 -39 9 144 -24 -71 -188 -33
6650c3J46j00pK3p9j05J31K56k51jq7lJ99j24O8j8P4j74J04N0k2l2k05P0J49l6
$$ -33 113 13 6 29 -50 -155 -24 232 -19 -20 -107 -110 89 -35 33 15 89 -85 19 69 47 15 -190 -120 29 -7
6676gJ8o9J41j05o6P5J82j31r0n6R1R9r1N9j39n6J93rR9K0j91j06n0K13M2q9R4
$$ -7 11 -58 83 -22 -88 -13 169 38 -52 -108 -17 82 -9 50 -89 -145 48 39 138 158 -33 -139 -189 24 66 -23 71
6703G1j30j4j8K34r6K2mk08L8K26O3r6j09j04k6J61O7K6j01M3l9m7J56q4J19j91
$$ 71 -59 -73 -91 143 47 69 65 -143 -105 121 184 88 -21 -125 -151 10 77 103 2 45 6 -41 115 31 150 -41
6729d1n3rR8K7J5J0j54RQ0O3J5k01p3J46J57J10j41j3j05Kj24K62K0k33m5N1K16
$$ -41 -94 -103 -5 22 37 47 -107 -98 -18 45 60 -141 -214 -68 89 199 58 45 -60 -58 -182 80 100 -133 -178 -127 89
6756H9J1L9j82j0j41K65j1R4L1j57k37J85Q3k4M3j95o8M4K98M3l4j20k18l3K38
$$ 89 100 139 -43 -53 -194 71 60 154 185 28 -209 -24 59 35 78 -117 -185 -141 157 200 166 46 -172 -205 33
6781C3J35j20J4l37J57P6J06K35k51p5j48J20Q1J10n4j12k43K25K15k5k5j37j69
$$ 33 168 48 62 -275 -118 -42 64 299 48 -27 -175 -55 26 136 82 -30 -273 -48 167 142 117 -20 -189
6804a89J18J17Prj16j50N0J59J29J12l12%L3O7R1j6J22m13Q8K8K20Q7M3j99k44
$$ -189 -71 46 53 44 -72 -222 -172 -13 116 228 -84 -84 -51 16 107 91 213 -200 -112 -84 136 223 266 67 -177
6829a77K8K51J47j21p2j66j1J82J08l7q6j07r3J74n0K23j78p0k04J57K60L7j03
$$ -177 -149 102 249 128 56 -110 -121 61 169 132 46 -61 -154 20 -30 193 15 -55 -259 -102 158 195 92
6852I2j72Lq7J10K56r0k28j6k0P4K51qj70k6j36J75J39O1k43Lk07K9M50J0j29
$$ 92 -80 -77 -164 -54 202 112 -116 -132 -152 -78 173 165 -5 -31 -167 8 147 208 -35 -32 -239 -210 240 250 121
6877A21j25j86N2J96K23j30k15j42J13N6J16Q3n4l31k4J58K71J49j98l39j57L32
$$ 121 -4 -190 -138 58 281 151 -64 -206 -93 -37 79 162 108 -223 -247 -89 182 331 133 -206 -363 -31
6899c1J58J04k26o1j91J44J74K07k3m42q4L4L42J75j63q4k47N7J07K50J01k23
$$ -31 127 231 5 -56 -247 -103 71 278 255 -187 -271 -237 105 280 117 33 -214 -157 -50 200 301 78
6921G8k95L0O7J86J80j05k09k38J94J52J50j70j00j18L2K84R5l6j67l88J24L62
$$ 78 -217 -187 -120 66 246 141 -68 -306 -112 40 190 20 -80 -198 -166 118 213 177 10 -378 -254 108
6943A08J15K7k67j53j04J52K51O5k01j92n4K4K40K64j17k00j69R0J92J70rl22
$$ 108 223 250 -17 -170 -274 -122 129 194 -7 -199 -253 -229 11 275 158 -42 -211 -121 71 241 232 -90
6965i0j17k8K02L28M4k90k29Q0J12K51Rl56J1j85J30K87J92k15j44k43J40K75
$$ -90 -207 -235 -33 295 339 49 -180 -100 12 263 272 -84 -73 -258 -128 159 351 136 -8 -251 -111 164
6987A64J41j10j75l14O7L56O3K5k42k29R9J36K63J49l20l19q4L07lK84l2l26j68
$$ 164 305 195 20 -294 -227 129 192 217 -25 -254 -155 -19 244 393 73 -246 -330 -23 -26 258 226 -100 -268
7010b68J19L14J45j33k64k12pL88J85q7k66n8j32K71J97l5l9l59L2J97K72l6j42
$$ -268 -149 165 310 177 -87 -299 -306 82 267 180 -86 -144 -276 -5 192 157 118 -241 -209 -12 260 224 82
7033H2k18k66K36L70L5L7k68l12J29K49J48k9k02j58J7L90nR4l76j79JL02J61
$$ 82 -136 -402 -166 204 239 276 8 -304 -175 74 222 193 -9 -167 -150 240 235 329 -47 -226 -225 77 238
7056B38J15j74m23n5J68L14J52k12l72r8Q3M39P1j45j44k91J54K17J75J07l16
$$ 238 353 179 -244 -299 -131 183 335 123 -249 -347 -264 175 246 101 -43 -334 -180 37 212 319 3
7077Ck25K0J17K39J48k63k05j81M08K47kj08l56j33J61K56K16Ml44k36JK99K88
$$ 3 -222 -202 -85 154 302 39 -166 -347 61 308 306 198 -158 -291 -130 126 342 346 2 -234 -233 66 354
7100C54j66k44k34O3K73K64o0j84l61P2P5L87L3k29k25j24J72L59Q4n2n36mJ43
$$ 354 188 -56 -290 -227 46 310 250 66 -295 -223 -148 239 272 43 -182 -306 -134 225 309 257 -279 -283 -140
7123a40J35L15r0m01m4k4L56K19r8k21k65J02J70K33R9j41m81l8L02K18J53k01
$$ -140 -5 310 220 -181 -225 -249 107 326 228 7 -258 -156 14 247 346 205 -276 -314 -12 206 359 158
7145A58k40k64M8K56L10l6l38k75J64L04J94n3j78k71j71L99K43J13k53m24j52
$$ 158 -82 -346 -298 -42 268 232 -106 -381 -217 87 281 228 50 -221 -392 7 250 363 110 -314 -466
7166d66L12L57J75k18n02R0q4M03J43r1k87l07J70N09J99j26k86l94O0L56K22
$$ -466 -154 203 378 160 -342 -252 -336 67 210 119 -168 -475 -305 204 403 277 -9 -403 -343 13 235
7187B35Q0l24j65j73K80L24J96l68m79r6L43L56Q3j43j70m49J34L04L55j0m49
$$ 235 315 -9 -174 -347 -67 257 453 85 -394 -490 -147 209 292 149 -21 -470 -336 -32 323 313 -136
7208a36j71n5K67L72l9k43l93M1K72L21K35l38l87j22J19N21Q2j78k95l21J53
$$ -136 -307 -362 -95 277 238 -5 -398 -357 -85 236 471 133 -254 -376 -257 264 346 168 -127 -448 -295
7229b95L13K67p4l39j91j29N17L08o3k66l46O4J14M64R0l15k36l34K12M18J68
$$ -295 18 285 211 -128 -319 -448 69 377 314 48 -298 -234 -120 344 434 119 -117 -451 -239 179 347
7250C47j87m24q4K23K45K30j38k96k09J48J78L27l4l60m03O5L63L47J8k55m74
$$ 347 160 -264 -348 -125 120 350 212 -84 -293 -145 33 360 326 -34 -437 -372 -9 338 356 101 -373
7271c73p7K89M11M4k95k46k02K14N53P3k19m08p5J02K87M35k50m94j14J33J15
$$ -373 -450 -161 250 294 -1 -247 -449 -235 318 391 172 -236 -311 -209 78 513 263 -231 -345 -212 -97
7292i7M57P1l50k97j02K75K42J99k48m21j55J98N55K15l56l33j91J04K38M22j39
$$ -97 360 431 81 -216 -318 -43 199 398 150 -271 -426 -228 327 542 186 -147 -338 -234 4 426 287
7313B87l21l19M8K86M04K5l78n00J51K94L61J07l60l73j46L75L31J70j93m21j87
$$ 287 -34 -353 -305 -19 385 410 32 -468 -317 -23 338 445 85 -288 -434 -59 272 442 249 -172 -359
7334c59J56L46L01k74k22l01PL87L03j6k72l04k03M51L39N8k47l86j31K91M29
$$ -359 -203 143 444 170 -52 -353 -346 41 344 328 56 -248 -451 0 339 397 150 -236 -367 -76 353
7355C53J09k81k94j72oM87K96j82n30j40l9N82J78l9m15l50J40K82K88O7k26m62
$$ 353 462 181 -113 -285 -291 196 492 310 -220 -360 -399 183 361 322 -93 -443 -303 -21 267 334 108 -354
7377c54j8L21L30L3j08m13k53J25M48L09l35k28k85J50M21L14j01m47m15J99L95
$$ -354 -372 -51 279 312 204 -209 -462 -337 111 420 85 -143 -428 -278 143 457 356 -91 -506 -307 88
7398H8K30L1l69l46j09N36L24l9k61l75j35K91M93Q0j45o21l1P3N30J86p8n65
$$ 88 318 349 -20 -366 -475 61 385 346 85 -290 -425 -134 359 439 294 -327 -358 -285 245 431 353 -212
7420b12k87K02M02J91O2l51n62K13K56M88n6j90m14l9J34M69M2j68l09k48L38
$$ -212 -499 -297 105 296 358 7 -555 -342 -86 402 346 156 -258 -297 -163 306 348 180 -129 -377 -39
7441c9L11J15p9m92j65J40L49K16K6l61m48N4L45M18o7k85l15k30M15L98J80l62
$$ -39 272 387 308 -184 -349 -209 140 356 382 21 -427 -373 -28 390 323 38 -277 -507 -92 306 486 124
7463A24l32k44K67L67J82k44l38k59L25K42K12l6m18k34O6L90K61l4l55k43J5
$$ 124 -208 -452 -185 182 364 120 -218 -477 -152 90 302 266 -152 -386 -320 70 331 297 -58 -301 -286
7484b86K10L10K04l59m28q2K98L62J38k21l42k56J91N07K89k20l76l99J44L40
$$ -286 -76 234 438 79 -349 -431 -133 229 367 146 -196 -452 -261 246 535 315 -61 -460 -316 24
7504B4L51m5k74l82P7K20L14J05l77m03NL81L16J29k49m92k19L76L69K14k34k89
$$ 24 375 330 56 -326 -249 -29 285 390 13 -390 -385 -4 312 441 192 -300 -519 -143 226 440 206 -83
7526h3l69J68L18M69k31m63l10J89M26K20J54l58n74L5K51M53P7j38m96j72J84
$$ -83 -452 -284 34 503 272 -191 -501 -312 114 334 488 130 -444 -409 -158 295 372 234 -262 -434 -250
7547b50M94J34j17m81l39K24M26L56j23m47k50p4M85J18J54k63m33n9K65N50J9
$$ -250 244 378 261 -220 -559 -335 91 447 324 -123 -373 -447 38 156 310 47 -386 -445 -180 370 389
7568C89l16l71r7K70L44Q2j24m12k31J64M65L20k83j82l58M9L50L31l4l18l58
$$ 389 73 -298 -395 -125 219 301 177 -235 -466 -302 163 483 200 18 -340 -291 59 390 356 38 -320
7589c20j42L80M10J09m43k63j68K93M87J59l64m60o5K19L42L31k45m71j95J06
$$ -320 -462 -82 328 437 -6 -269 -437 -144 343 502 138 -322 -387 -168 174 505 260 -211 -406 -300
7609c00L37K24J32m01l91L3L72L53Ml00l94j30K70N32M3j70n19j64L03L99K16
$$ -300 37 261 393 -8 -399 -366 6 359 363 63 -331 -461 -191 341 384 214 -305 -469 -166 233 449
7630D49k07n19q3J28J99M31Pm18l06j06M28L40J39m23l48r1L21M63L5j99m89j50
$$ 449 242 -277 -360 -232 -33 398 405 -13 -319 -425 3 343 482 59 -289 -380 -59 404 439 240 -249 -399
7652c99K53K94K78k97k81l55K42L97L14j43m11l82k5M14N88j8m02l76r7L21L32
$$ -399 -146 148 426 129 -152 -507 -265 132 446 303 -108 -490 -515 -101 487 469 67 -309 -406 -85 247
7673B47J70l67k43l19L86K91L23k91l35l40L30L99J35p8l53m31K32L05L98j47
$$ 247 417 50 -193 -512 -126 165 488 197 -138 -478 -148 251 386 308 -45 -476 -244 61 459 312
7693C12l23l39j42M28N41j59k56k91k14K99M15J48l21k28k91K89M39Q6j92l14
$$ 312 -11 -350 -492 -64 477 318 62 -229 -443 -144 271 419 98 -130 -421 -132 307 393 201 -113
7713a13l77K58L27K96K6l83n00J09K84M82K8m49m04p2M11L73Q2k91k57j59J52
$$ -113 -490 -232 95 391 417 34 -466 -357 -73 409 437 -12 -416 -488 -77 296 378 87 -170 -329 -177
7734a77M03J52j51m34k13J42M16K14O5m68l30qM03L06O1k97m55N4K56L55O3k89
$$ -177 226 378 227 -207 -420 -278 138 352 417 -51 -381 -389 14 320 381 84 -371 -317 -61 294 357 68
7756F8l09j65K81K89K70j27m15m43M74K73K65k34l59l09K45L07L43m2l19n40Q5
$$ 68 -241 -406 -125 164 434 307 -108 -551 -77 196 461 227 -132 -441 -196 111 454 412 93 -447 -362
7777c62K54L27J06j60n79j06L47M62J00k44m73j22K00M77K19k54l44k61K56J69
$$ -362 -108 219 325 165 -414 -520 -173 289 389 145 -328 -450 -250 227 446 192 -152 -413 -157 12
7797A2M13j09m28j98o4M11L54m4l08k85j82L95L51J1j42l51k56L76L06J47j42
$$ 12 425 316 -112 -310 -374 37 391 347 39 -246 -428 -33 318 329 187 -164 -420 -44 262 409 267
7818B67n46j6O6M08J68P7n04l15l4M51L08m2k76l53m4K46L88K54k91m59k25L65
$$ 267 -279 -295 -229 179 347 424 -80 -395 -429 22 330 288 12 -341 -385 -139 249 503 212 -247 -472 -107
7840a07L21J86j27n33j55K44K71K16M7l80l29N2M73K87j35l87l68L8M06L11J20
$$ -107 214 400 273 -260 -415 -171 100 316 363 -17 -346 -294 179 466 331 -56 -424 -386 20 331 451
7861D51l02l68k22K89M35J82k36l26k61J10M13J50j03l57k71P7M57K04j35j62
$$ 451 149 -219 -441 -152 283 465 229 -97 -358 -248 165 315 212 -145 -416 -339 118 322 187 25
7881B5m03J9L76K72%k94l49ML00L17P0j95l72k49K30N51n1k2l72k41K37L90J63
$$ 25 -378 -359 17 289 289 -5 -354 -350 -50 267 337 142 -230 -479 -249 302 251 229 -143 -384 -147 243 406
7904D06j60k53k69k9K91L17J67l82l31j81J76M63K91l96l71rJ34L10K96j98n21
$$ 406 246 -7 -276 -305 -14 303 470 88 -243 -424 -248 215 506 110 -261 -270 -136 174 470 272 -249
7925b49j26J41K82L80l4n14k17k9L58L53N5l69l43m4K48M99l6l94j73j14K20M53
$$ -249 -375 -234 48 428 394 -120 -337 -366 -8 345 400 31 -312 -356 -108 391 355 -39 -212 -326 -106 347
7947C47O0j09n51j85J72L63L40j21l06k83R6K62K10j96k01k40M3K47M12K4k82
$$ 347 407 298 -253 -438 -266 97 437 316 10 -273 -177 85 295 99 -102 -342 -299 -52 360 384 102
7968A02l78m4P0N45N2j57l47p3J53K46K84k04m91p5K62J2L54k01j91k11LK43L83
$$ 102 -276 -320 -250 295 347 190 -157 -230 -77 169 453 249 -242 -317 -55 -43 311 110 -81 -292 -289 -46 337
7991C37k7k23l22m8J38L38J59j51m01j51K72K72K07j31l74l10L12K46K02n5k80
$$ 337 310 87 -235 -283 -145 193 352 201 -200 -351 -79 193 400 269 -105 -415 -103 143 345 290 10
8012A0k34l9K21L53ol17k79k9K95K04Jq5k25k02J00M75O9k15k67j87J63L40L06
$$ 10 -224 -263 -42 311 305 -12 -291 -320 -25 179 180 95 -130 -332 -232 243 312 97 -170 -357 -194 146 452
8035D52k71k62k12R5J04L72o8j22l58m5L10J24K14l04l04q3L00K49P2p0l83j71
$$ 452 181 -81 -293 -198 -94 278 210 88 -270 -315 -5 119 333 29 -275 -358 -58 191 263 193 -190 -361
8057c61K12K94K17j79k30l51J61L74K09j07l35j56o5L53K15O7k12l15q3K25K90
$$ -361 -149 145 362 183 -47 -398 -237 137 346 239 -96 -252 -317 36 251 318 106 -209 -292 -67 223
8078B23J05j23l99j26J69L62J22j61l13k05J93K27J03j03k22k34J46K29J81J47
$$ 223 328 205 -194 -320 -151 211 333 172 -141 -346 -153 74 177 74 -148 -382 -236 -7 174 321
8098C21k48l61J0Q2M32J31l56k26k9J72J99P2r4k07k30J73L29J44n2j61l12L9
$$ 321 73 -288 -278 -196 236 367 11 -215 -244 -72 127 199 105 -102 -332 -159 170 314 262 101 -211 -172
8120a72K30K14j15r9l42O3J71L44k3k93k11o0K05L32p2j2l28L6L0K29J38j70j58
$$ -172 58 272 157 58 -284 -221 -50 294 271 -22 -233 -293 -88 244 172 160 -168 -132 -102 127 265 95 -63
8143f3k05Q0K96P7mk35k77O6J23L27J43k65l36N5Q9K56J92k50j55j91J09L42P6
$$ -63 -268 -188 108 185 181 -54 -331 -265 -142 185 328 63 -273 -218 -129 127 319 69 -86 -277 -168 174 250
8166B50m7k94k39J5L84K61j85j73j28p2M58l2j52r1j71pJ39K80Q9k28k96N0R7
$$ 250 203 -91 -330 -315 69 330 145 -28 -156 -228 230 198 46 -45 -216 -223 -84 196 285 57 -239 -189 -92
8189i2J83J22
$$ -92 91 213
8191B13
$$ Imaginary data points
##PAGE= N=2
##DATA TABLE= (X++(I..I)), XYDATA
0@%%%%%%%%%%%%JjL2o4O4o4R6j28J28j60J92k24K56k88L52m16M52n16O08o73P69
$$ 0 0 0 0 0 0 0 0 0 0 0 0 0 1 0 32 -32 32 -32 64 -64 64 -96 96 -128 128 -160 192 -224 228 -288 320 -353 416
33D16q73R70j093J240j397J569j754J945k156K386k641K930l241L571l942M346
$$ 416 -457 513 -580 660 -737 832 -922 1023 -1133 1253 -1388 1542 -1699 1872 -2070 2276
49B276m782N270n810O402p063P805q639R591j0679J1937j3425J5206j7382K0124
$$ 2276 -2506 2764 -3046 3356 -3707 4098 -4541 5050 -5629 6308 -7117 8089 -9293 10831
63A0831k3681K8523l5545M6669o7124J17122m63857p96888N90651R00782N61351
$$ 10831 -12850 15673 -19872 26797 -40327 76795 -387062 -1183950 -593299 307483 868834
74H68834m22705q98300o07468L21054Q94601O90608j87783q35314p23223J03222
$$ 868834 446129 -452171 -1059639 -738585 156016 846624 658841 -176473 -899696 -796474
84g96474Q04767P77587O431p36740p97713r2638O79546Q29036J97566n97687q39062
$$ -796474 8293 785880 792311 55571 -742142 -834780 -155234 673802 871368 273681 -565381
95e65381k87679N20535Q46973L75814m34803q37392m49891L48232Q16418N16353
$$ -565381 -853060 -332525 514448 890262 455459 -381933 -831824 -483592 332826 849179
105H49179k57333p87053n80725J58194P44059O31225o7055p00572o77426k6570
$$ 849179 591846 -195207 -775932 -617738 126321 757546 690491 -10081 -687507 -714077
115g14077O41354P01908J08054n79460p17438j86895N12323P28066K66226m38418
$$ -714077 -72723 629185 737239 157779 -559659 -746554 -234231 493835 760061 321643
125C21643p28077l36179L68673P26528M05702k90470p07563m60454K12667O79485
$$ 321643 -406434 -742613 -373940 352588 758290 467820 -239743 -700197 -487530 191955
135A91955N07933j34188o45809n54465M7915N97848N83898K3660n57947o18308
$$ 191955 699888 565700 -80109 -634574 -586659 11189 595087 618747 60800 -557508
145e57508j06244M95022O24513J69466m37444o30486k37796L67800O23334K97836
$$ -557508 -663752 -168730 455783 625249 187805 -442681 -680477 -312677 310657 608493
155F08493k97860o07992l46336K38596N98629M01240j63424n63674m29901J05655
$$ 608493 310633 -297359 -643695 -405099 193530 594770 431346 -132328 -562229 -456574
165d56574N39332M71110k7968m90266m89607l3129M50662N11238R5267m06544
$$ -456574 82758 553868 525900 35634 -453973 -487102 -36440 474798 570065 163521
175A63521n25551j55393L53529N24324K02026l07643n29285k62396K40214N11100
$$ 163521 -362030 -517423 -163894 360430 562456 254813 -274472 -536868 -296654 214446
185B14446L01996j88580n02704l48602J26627M77497L78308p3808m51382m02943
$$ 214446 516442 327862 -174842 -523444 -396817 80680 458988 385180 -66202 -469145
195d69145K0958M22030M28326L9707l79729m40193q8879L45409M57055J44654
$$ -469145 -448187 -26157 402169 441876 62147 -378046 -466925 -121516 335539 480193
205D80193k97183m54909j85024K55300M52646K27070k06050m41841k65616J53629
$$ 480193 183010 -271899 -456923 -201623 251023 478093 272043 -169798 -435414 -281785
215b81785M24037K96674j06625m08783l29651N3174L78437L44522j1934l53090
$$ -281785 142252 438926 332301 -76482 -406133 -352959 25478 370000 358066 4976
225D976l61722l6137L16220L68359P7665k82216l76190j19139K47482L81507J60175
$$ 4976 -356746 -392883 -76663 291696 369361 87145 -289045 -408184 -160702 220805 380980
236C80980k06502l74412j89896J70601L68711K23846j24473l49926k46095Q6702
$$ 380980 174478 -199934 -389830 -219229 149482 373328 248855 -101071 -347166 -260464
246b60464L37189K72886m4711l17899k92093O273K96048L05959L0016k71180l17085
$$ -260464 76725 349611 304900 -12999 -305092 -298819 -2771 303188 333204 62024 -255061
257b55061o9763K37681L18713J01357k09750l23862j36007J77340L21339J62027
$$ -255061 -324824 -87143 231570 332927 123177 -200685 -336692 -159352 161987 324014
267C24014j48763l18281j88804J15872L08774K12997p9542k93983k32588M4904
$$ 324014 175251 -143030 -331834 -215962 92812 305809 226267 -67716 -300304 -255400
277b55400K79275K52392r021k59084k63581k0677K39829K73562N2343k14074k77256
$$ -255400 23875 276267 267246 8162 -255419 -276096 -36267 237295 289638 75564 -201692
288b01692q2394J86199K78342J11276j57748k77144j37922J28479K70863J57537
$$ -201692 -284086 -97887 180455 291731 133983 -143161 -281083 -152604 118259 275796
298B75796j02709k63910j76703P3617K51584J92612m4762k38686k09047J4491
$$ 275796 173087 -90823 -267526 -193909 57675 250287 205525 -33161 -242208 -227717
308b27717K23028K22478J4080k05409k30469l9560J87035K36370O4759j64774
$$ -227717 -4689 217789 231869 26460 -204009 -243569 -56534 179836 244595 79821
318G9821k37568q8387J42564K39339J13509j17834k37594j35335R3449K33046
$$ 79821 -157747 -246134 -103570 135769 249278 131444 -106150 -241485 -148036 85010
328H5010J53489o9224k24172j67882M4417K12003J80115k0316k00475j92887m674
$$ 85010 238499 169275 -54897 -222779 -178362 33641 213756 193440 -7035 -199922 -204596
339b04596J87251K03189K8442j73125k10936n1480J54696K14214P3170j34031
$$ -204596 -17345 185844 214286 41161 -169775 -221255 -66559 147655 220825 86794
349H6794k13887r4033J12371K12183J13975r0390k09044j31402O9161K03549J46422
$$ 86794 -127093 -221126 -108755 103428 217403 127013 -82031 -213433 -144272 59277 205699
360B05699m6811j93813j58289K3893J80879J67987o77j67030j76224k0855J53329
$$ 205699 158888 -34925 -193214 -169321 11558 179545 178868 11838 -164386 -185241 -31912
371c1912J82636M0527j39239j86942n9315J22758J88094P7768j03742j86778r5803
$$ -31912 150724 191251 52012 -134930 -194245 -71487 116607 194375 90633 -96145 -191948
382a91948Q3319J84037J12528o4133j79757j26575M5601J73809J38403k6639j65298
$$ -191948 -108629 75408 187936 123803 -55954 -182529 -136928 36881 175284 148645 -16653
393a6653j48829O309J54260J57564J4941j41430j64737l4363J27728J69193N1528
$$ -16653 -165482 -159173 -4913 152651 167592 26162 -138575 -172938 -45210 123983 175511
404A75511j14076j71277o7011R9633J71090Q2612q2781j69848r8735O4487J67122
$$ 175511 61435 -109842 -176853 -77220 93870 176482 93701 -76147 -174882 -110395 56727
415E6727J13667m6083j61742j25692K7986J53995J34636j0462j43924j41243p527
$$ 56727 170394 124311 -37431 -163123 -135137 18858 153494 143032 -892 -142135 -149662
426a49662J32363J47680K5497j19948j52786m2890J06724J55414N8643r2269j54850
$$ -149662 -17299 130381 155878 35930 -116856 -159746 -53022 102392 161035 68766 -86084
437h6084p2132P6742J51796Q4901o0631j48157r7308M4159J44027J08904k8117
$$ -86084 -158216 -81474 70322 155223 94592 -53565 -150873 -106714 37313 146217 118100
448A18100j38614j19062J1956J30309J25843M118j20053j31085k0614J08085J35454
$$ 118100 -20514 -139576 -127620 2689 128532 132650 12597 -118488 -139102 -31017 104437
459A04437L6209r6745j38668n1200Q4940J40658O4971p1473j39441p6978N6866
$$ 104437 140646 43901 -94767 -145967 -61027 79631 144602 73129 -66312 -143290 -86424
470h6424J36188Q8529m0890j30665r8359K6413J26102J07822j2206j20221j14936
$$ -86424 49764 138293 97403 -33262 -131621 -105208 20894 128716 116510 -3711 -118647
481a18647j806J12596J20866J6580j02504j24951l2377Q9830J26994M6298p7696
$$ -118647 -120453 -7857 113009 129589 27085 -97866 -130243 -40413 86581 132879 55183
492E5183j28274n9260O4889J26793O9303n3128j24077p9228L8921J19304Q8532
$$ 55183 -73091 -132351 -67462 59331 128634 75506 -48571 -127799 -88878 30426 118958
503A18958k3934j13267r6715R836J06641J03503L660r8403j06785j4912R0062
$$ 118958 95024 -18243 -114958 -105122 1519 105022 108682 10279 -96506 -111418 -21356
514b1356J10230K7478p9613j11659l9838O8987J12996N2031n7482j13123o2930
$$ -21356 88874 116352 36739 -74920 -114758 -45771 67225 119256 61774 -51349 -114279
525a14279M5540J10057P1146l4616j06651p9077K1383J00622Q5399r530r5505
$$ -114279 -68739 41318 112464 77848 -28803 -107880 -86497 14125 99524 89994 -5511
536e511r2686l806Q8879R7416J5224q0772r9605k5613P2081J01252L6239o1449
$$ -5511 -98197 -102003 -13124 84292 99516 18744 -80861 -106474 -34393 66859 103098 41649
548D1649j00385m5396N2622J01491N6367m1657r9820o4351L1537R7109P2150j9780
$$ 41649 -58736 -104132 -51510 49981 106348 64691 -35129 -99480 -67943 29166 101316 81536
560H1536r1541p7625P428Q4303Q1750K905p8409q6598j4356P0594Q8292K2998
$$ 81536 -10005 -87630 -80202 4101 85851 88756 10347 -76251 -90607 -20013 68279 91277
572I1277o3933r0502l3045N3839Q8971M1681m3857q7280m9443L4156Q5562N7029
$$ 91277 27344 -63158 -96203 -42364 46607 88288 44431 -42849 -92292 -58136 27426 84455
584H4455k4496q1974o1821J6920P9626O7735o243p3245p1083k996O7587P5189
$$ 84455 59959 -22015 -83836 -66916 12710 80445 74202 957 -70126 -73122 -5535 69654
596F9654J3663o0765p7432k2497N3393P8206K9178m7166p9010l7428L8040P6480
$$ 69654 83317 22552 -54880 -77377 -23984 54222 83400 36234 -42776 -80204 -42164 34316
608C4316M3283l0178p5538n1407K0175P2016N6121j2664o8646n9849N216O4728
$$ 34316 77599 47421 -28117 -79524 -59349 12667 68788 56124 -12522 -72371 -67155 -2427
620b427O3398L104n8748o4887j0320N4343O8687K0108m6451o8781k6342M0845
$$ -2427 60971 64075 5327 -59560 -69880 -15537 53150 73258 26807 -41974 -68316 -27471
632b7471O9320L3327l3052o6834l8190K5589O4040M2724j8825o2730m8686R836
$$ -27471 41849 75176 42124 -24710 -62900 -37311 26729 69453 50628 -12102 -60788 -50952
644e0952N8372N1404m160n5718n5504m215M9203N5303R747m4439n6508j6565L8730
$$ -50952 7420 58824 54664 -1054 -56558 -60773 -11570 43733 53480 9041 -47467 -64032 -25302
657b5302N7540K2890l3041n7225k7545K8811N7926L3653k0957n4196l6537J5351
$$ -25302 32238 55128 22087 -35138 -62683 -33872 24054 57707 36750 -17446 -53983 -38632
669c8632N2689M1441p748m8725m4070K423M6201M6419L032m3267m8891r387L7828
$$ -38632 14057 55498 47750 -975 -45045 -42622 3579 49998 53030 9763 -39128 -48515 -10687
682a0687M8302J3866l3647m9977k0507K7285M8434K3884k3683m8708k8365J8741
$$ -10687 37615 51481 17834 -32143 -52650 -25365 23069 46953 23270 -25438 -53803 -35062
694c5062M7343L1779j3287m5020l4499Q356M3018L8455r32l8259l9135k877L6303
$$ -35062 12281 44060 30773 -14247 -48746 -40390 2628 41083 40151 1892 -37243 -40120 -3817
707c817M1369Q166l1713m0815j1395K8419M0959J5735k3798m1377k0839J8596
$$ -3817 37552 45718 14005 -26810 -38205 -9786 31173 46908 23110 -18267 -39106 -20510
719b0510L9619K3538j5301l9494k7363R752L6374K7766o906l5083l0616J878L2135
$$ -20510 19109 42647 27346 -12148 -39511 -29759 6615 34381 27475 -7608 -38224 -36346 -4211
732d211L2369K622k9620l4062o428K7310L5280J1003k2702l3917j2835K0109L4347
$$ -4211 28158 30780 1160 -32902 -39330 -12020 23260 34263 11561 -22356 -35191 -15082 19265
745A9265J7015j5533l2794j8988J2575L2970K2347r045l1696k4585N317K9267
$$ 19265 36280 20747 -12047 -31035 -18460 14510 36857 27812 -3884 -28469 -23152 6115
757F115K5095k326k7585k7290j990K4285K7301M251k3063k9290q262K0266K9330
$$ 6115 31210 28884 1299 -25991 -27981 -3696 23605 27856 4793 -24497 -32759 -12493 16837
770A6837J0762j7180k8985j3345J3833K8160J6280r754k6170j7466P735K6081
$$ 16837 27599 10419 -18566 -31911 -18078 10082 26362 16608 -9562 -27028 -19293 6788
782F788J9977m324k4216k0589K391K3148K1878R77k0351k2679m413J7787K2648
$$ 6788 26765 22441 -1775 -22364 -19973 3175 25053 26030 5679 -17000 -21413 -3626 19022
795A9022O205j6233k3674q849J3672K2919R566j2378k3415j2667R159K2138J4355
$$ 19022 25227 8994 -14680 -23529 -9857 13062 22628 10250 -13165 -25832 -16673 5465 19820
808A9820o320k1243j6214L661K0291J7528j325j8286j7362K68J7544J8638K552
$$ 19820 13500 -7743 -23957 -20296 -5 17523 16198 -2088 -19450 -19182 -1638 17000 19552
821A9552j4807j8642m399J3864J9566P202j1568j9454q502R904J8834R249q425
$$ 19552 4745 -13897 -18296 -4432 15134 22336 10768 -8686 -17188 -7284 11550 20799 12374
834A2374j8303j1102N819J7308J2086m384j7356j4376J453J5868J4787r7j4522
$$ 12374 -5929 -17031 -11212 6096 18182 13798 -3558 -17934 -16481 -613 14174 14077 -445
847d45j5245j617J2588J5035L448j0829j5112m533J0057J5739O806q149j5185
$$ -445 -15690 -17307 -4719 10316 13764 2935 -12177 -16710 -6653 9086 15892 7743 -7442
860g442p693P103J5193Q811m782j3885r407L418J2964J0161k108j2601j1610O44
$$ -7442 -15135 -8032 7161 15972 11190 -2695 -12102 -8684 4280 14441 12333 -268 -11878 -11234
874a1234J1825J2263K40j1373j2671k528R393J2228L543p806j2453n080O728J2023
$$ -11234 591 12854 13094 1721 -10950 -13478 -4085 8143 11686 3880 -8573 -13653 -6925 5098
888E098N897n693j1957o549N169J1740P706l441j0908p990K163J0264Q992l12
$$ 5098 10995 5302 -6655 -13204 -8035 3705 11411 7970 -2938 -10928 -8765 1499 10491 10179
902A0179r516r230j5R088R406P67q307r756k049P177R846L061n987r843m913M542
$$ 10179 663 -8567 -8582 506 9912 10679 2372 -7384 -9433 -2256 7590 10651 4664 -5179 -10092 -5550
918e550R491N289l858r367n671L227Q576N746k140p974o519R97P625P278K22o875
$$ -5550 3941 9230 5372 -3995 -9666 -6439 2137 7883 5743 -2231 -8750 -7753 -128 7150 7372 497
934D97p415q03O549P344J228n359p189j635M843P336K733m269p567l860L429P486
$$ 497 -6918 -7721 -1172 6172 7400 2041 -5148 -6783 -1940 5396 8129 3860 -3707 -7567 -4138 3348
950C348M418k402p248m772J540O244M725j103n561n112M89N400N327J44n222n837
$$ 3348 7766 5364 -1884 -6656 -5116 1128 5853 4750 -811 -5923 -5434 -34 5293 5437 215 -5622
966e622p85M826N922J570m107n466j923L172N563K292k702n337k902K553N671
$$ -5622 -6407 -1581 4341 5911 1804 -3662 -5585 -2413 3150 5442 2740 -2597 -5499 -2946 2725
981B725L399k138n413l771J288M766L852l08m282l932j98L738L947L05l605m172
$$ 2725 6124 3986 -1427 -5198 -3910 856 4708 4400 118 -3814 -4012 -274 3673 3978 373 -3799
997c799o26L403M297J065l118m122j482K333L874K047j702l727k211J518L770
$$ -3799 -4425 -1022 3275 4340 1222 -2900 -4382 -2049 1825 3872 2170 -1557 -3768 -2250 1520
1012A520K327j560l789k391J049L636K723k06l067l066m58K577L125P97k492k811
$$ 1520 3847 2287 -1502 -3893 -2844 792 3515 3309 242 -2824 -3282 -705 2420 3217 725 -2086
1028b086o17K194K716M31j941k777q80J670K825J478j177k880j812R10K787J651
$$ -2086 -2703 -509 2207 2638 697 -2080 -2960 -1290 1535 3013 1836 -1044 -2856 -1946 841 2492
1044B492p83k441j552O97K259J636n40k167k024M2K073K307M77j782k358n22J558
$$ 2492 1709 -732 -2284 -1587 672 2308 1768 -399 -2423 -2381 -308 1999 2476 694 -1664 -2186 -628
1061f28J826M86j075j724n73R81J661J091j024k006j071Q55J816J291m92j801
$$ -628 1198 1684 609 -1115 -1688 -707 954 2045 1021 -985 -2056 -1201 615 1906 1414 -387
1077c87j151L93J482Q75j47j212j186J50J442J270K07j514j643k03J133J375O24
$$ -387 -1538 -1145 337 1212 1065 -147 -1333 -1183 259 1529 1736 222 -1421 -1624 -491 884 1508
1094A508p63j206n62N98Q08O23m17j075o18N75J375N17o13j248p42L86Q33Q11
$$ 1508 745 -461 -1023 -425 383 1006 589 -486 -1104 -529 846 1363 750 -498 -1240 -854 -21 790
1112G90J9o07q57q4Q11N68j20r61o29K4R60J045o2o69q45l36M01P33M65k24p73
$$ 790 809 202 -655 -739 72 640 520 -441 -1070 -1046 -86 959 897 228 -617 -953 -552 181 646 422 -351
1133c51j59L26O60J78n76n14j76M52N33M28j72n58n57q1M08O62j65n46k00Q7N78
$$ -351 -510 -184 476 654 78 -436 -612 -160 373 801 629 71 -486 -567 -159 503 338 -208 -408 -321 257
1154B57K16k27n68m55J47L31O21K02j75m41m00J41L39K44l7j82J7K16K47q1l11
$$ 257 473 246 -322 -777 -630 -299 322 524 349 -92 -492 -351 -12 232 195 13 30 246 493 412 101
1175A01l06j08N3M37K38J53l60m33K32P4j9k08j06O1R3K62j10Pl44l00P0J11L04
$$ 101 -205 -313 -260 177 415 568 208 -225 7 81 62 -146 -252 -191 -98 164 54 61 -283 -583 -513 -402 -98
1198i8M5J47q8M6P9k40p4j37L39J30R6K49nk90k40M7K46j04k9n7J81J86j14q3
$$ -98 -53 94 6 52 131 -109 -183 -320 19 149 245 494 489 199 -41 6 252 148 119 62 243 429 315 232
1222B32j86k41J31j55R4J65P4j16j88J6n4p2k48lL17K84K34j58k21k06j06K03
$$ 232 46 -195 -64 -219 -125 40 114 -2 -190 -174 -228 -300 -548 -551 -234 50 284 126 -95 -301 -407 -204
1244b04J75M04l9j64nK06K01j32m26k47K05J56N13l2j44l19l87O6Q2K08j32l21
$$ -204 -29 375 336 172 167 373 574 442 16 -231 -26 130 643 611 467 148 -239 -173 -91 117 -15 -336
1266c36k20K16M92J9n02l49k99K10M46N44J76l28n76j84M48L55J40j55l26J39
$$ -336 -556 -340 152 171 -331 -680 -979 -769 -323 221 397 69 -507 -691 -243 112 252 97 -229 -90
1286i0M96L25O0m52m89k04L24O36L12j07o96l73J81M06K67m25n62j80K40O50L03
$$ -90 406 731 791 339 -150 -354 -30 606 918 811 115 -258 -77 329 596 171 -391 -571 -331 319 622
1307F22l06o26q58J35O27Q67k7m05o13p0M70M02K54n47l90k38O65Q37K90m22q36
$$ 622 316 -310 -1168 -1033 -406 461 434 29 -584 -654 -184 218 472 -75 -465 -703 -38 799 1089 667 -169
1328a69m84K30R77L92j32q07n03J84P65K05k02p39p06J98R43O60m8q49r65Q8M07
$$ -169 -653 -423 554 946 814 7 -496 -312 453 658 456 -283 -989 -791 152 812 764 -85 -1050 -962 -555
1349e55P16L96n15o18l52O24P31K47m31r36k35M84J142M71k15j097o52K91Q37
$$ -555 161 557 42 -576 -928 -304 427 674 243 -693 -928 -444 698 1169 954 -143 -795 -504 333
1368C33P83k39o66q29J91P77Q27l57r84q70j00J157J001J57r15j057m32N99R22
$$ 333 1116 877 211 -618 -427 350 1177 820 -164 -1034 -1134 23 1024 1181 266 -791 -1223 -624 298
1387B98M54o52r70m30Q08J073N41p13j046p21O36J267P05j77j054r23J92R93Q35
$$ 298 752 100 -870 -1300 -492 581 1122 409 -637 -1358 -722 545 1250 1073 19 -904 -712 281 1116
1406A116j51j000p09l7J057R65J0j018j315k59R07J114M96o32j431l90O80J094
$$ 1116 965 -35 -744 -781 276 1241 1251 233 -1082 -1341 -434 680 1176 544 -887 -1277 -597 497
1424D97M39o64j136o39O74J333P05l96j333j062M92J340J048j83j190j119L35
$$ 497 936 272 -864 -1503 -829 504 1209 813 -520 -1582 -1090 250 1298 1115 -75 -1194 -859
1441h59J060R83l9j153j103j09J048J671K55j253j307o19P77J197R50r00j334
$$ -859 201 1184 1145 -8 -1111 -1220 -172 1499 1754 501 -806 -1425 -648 549 1499 599 -735
1458g35o91P48J298P67o48j510q74M46J654J211l28j544j394L3J334J464J99j349
$$ -735 -1426 -678 620 1387 739 -771 -1645 -1199 455 1666 1338 -206 -1600 -1567 -233 1231 1430 81
1476H1j262j56J313J425L34j358j590m76J084J792Q91r95j889q70P05J627J123
$$ 81 -1181 -1337 -24 1401 1735 377 -1213 -1689 -605 1187 2078 1083 -806 -1676 -971 656 1779
1493A779p06j775r74N10J761J149l94j869j430K19J768J642J02j496j756l36J340
$$ 1779 1073 -702 -1676 -1166 595 1744 1350 -519 -1949 -1730 38 1680 1782 286 -1470 -1806 -466
1510d66J730M18j285j733m77J234J894Q01j183k087j097J061K094J302q77j837
$$ -466 1264 1682 397 -1336 -1813 -579 1315 2116 933 -1154 -2251 -1190 904 2206 1329 -508
1526e08j386K64K030J464k48k037j663L24J971J795k4j948j948l23J774K077P71
$$ -508 -1894 -1630 400 1864 1616 -421 -2084 -1760 211 2006 1982 34 -1914 -2237 -463 1614 2385
1543B385j691k046q73J256K327R19j261k294j069J073K328J526q71k409j787O26
$$ 2385 694 -1352 -2225 -969 1358 2277 1016 -1278 -2347 -1274 1054 2580 1709 -700 -2487 -1861
1559a861K217K001l35k161k147J15K108K176K75k233k248m31J945K561O80j613
$$ -1861 356 2357 2022 -139 -2286 -2171 -63 2113 2388 155 -2093 -2524 -579 1982 2662 1049
1575A049k650j359J724K595J206j015k665j592J107K598J689p11k737j930L64
$$ 1049 -1601 -2960 -1236 1359 2565 1550 -1115 -2707 -1600 998 2687 1976 -761 -2691 -2327
1590b327K748K438j98k566k701j93K443K702M57k177k656p88J977K803J024j830
$$ -2327 421 2859 2661 95 -2606 -2799 -356 2346 2803 626 -2030 -2818 -841 1962 2986 1156
1606A156l001j458J656L261J545j013l153j981P12K887K280m72k936k232J30K839
$$ 1156 -1845 -3303 -1647 1614 3159 2146 -1007 -2988 -2276 611 2891 2419 -517 -2749 -2619 220
1622B20K664R2k822k931l23K494L107Q54k256l334j216K000L257J606j612l441
$$ 220 2884 2976 154 -2777 -3100 -606 2501 3355 1099 -2235 -3451 -1451 1806 3412 1800 -1641
1638a641j773J313L447K187j267l225k632Q90L239K748j42l226l049j50L030L086
$$ -1641 -3414 -2101 1346 3533 2266 -959 -3591 -2701 538 3286 3144 -82 -3131 -3281 -251 2835
1654B835L90k679l244q06K691L363J164k172l804j697K046L712J956j465l670
$$ 2835 3225 546 -2698 -3504 -813 2550 3714 1542 -2262 -3959 -1913 1799 3755 2290 -1380
1669a380k295J075L597K589q21l512k874O17L301L187J24l342l562n53L011L691
$$ -1380 -3675 -2600 997 3586 2765 -747 -3621 -3004 297 3484 3608 266 -3296 -3849 -838 2853
1685B853J028k548l886j398K491L672J628j921l905k007J773L799K556j224l985
$$ 2853 3881 1333 -2553 -3951 -1460 2212 3840 1919 -1986 -3993 -2220 1579 4135 2911 -1074
1700a074l006Q53L930L025j98l626l430R3L143L681L58k937m039r91L079M064
$$ -1074 -4080 -3227 703 3728 3530 -96 -3526 -3433 -290 3391 3749 812 -3227 -4218 -1139 2925
1716B925J402k603m271j682K015M116K236j518m063k593J212M011K795r29l921
$$ 2925 4327 1724 -2547 -4229 -2214 1902 4138 2620 -1443 -4036 -2824 1187 3982 3053 -868
1731h68l219O83L672L577M4l596l892m79L203M049J072k945m125j545K719M210
$$ -868 -4087 -3404 268 3845 3889 293 -3599 -4078 -875 3174 4246 1301 -2824 -4369 -1650 2560
1747B560J790k160m476k212J974M108K811j281m032l251Q77L925L367j95m010
$$ 2560 4350 2190 -2286 -4498 -2524 1584 4395 3114 -918 -4169 -3292 633 4000 3805 -205
1762b05l549M1L595L839K96l319m132r16L140M277J541k697m425j949K119M397
$$ -205 -3754 -3713 -118 3721 4017 698 -3434 -4350 -1210 3067 4608 1911 -2514 -4463 -2344 2053
1778B053K363j725m365k764J494M299L032r73m148l528M24M087L700J27l676m013
$$ 2053 4416 2691 -1674 -4438 -2944 1355 4387 3414 -734 -4262 -3838 249 3949 4076 400 -3613
1794c613o10L432M165Q69l172m067j509K843M458K005k467m774k370K090M478
$$ -3613 -4223 -791 3374 4243 1071 -2996 -4505 -1662 2796 4801 2334 -2440 -4810 -2720 1758
1809A758K871j479m333l112R16M267L257m75m144l584p1L930M244K94l547m388
$$ 1758 4629 3150 -1183 -4295 -3379 888 4145 3670 -474 -4058 -4129 -199 4045 4339 792 -3596
1825c596q83L083M356J557k801m404j860K193M538K342j883m654k576J475M536
$$ -3596 -4479 -1396 2960 4517 1716 -2688 -4548 -2355 2183 4525 2642 -2012 -4588 -3113 1423
1840A423L132j051m278l623N81L955L951m3l698m092n49L623M266R19l286m521
$$ 1423 4555 3504 -774 -4397 -3816 139 4090 4047 349 -3743 -4292 -669 3597 4516 1230 -3291
1856c291j359L045M459J901k441m494k510J919M677K659j454m418l191J144M211
$$ -3291 -4650 -1605 2854 4755 2314 -2180 -4690 -2771 1906 4565 3111 -1307 -4498 -3354 857
1871H57L623q97m174l747J56M061M065M34l591m361j028L250M527J288k816m484
$$ 857 4480 3583 -591 -4338 -4182 -121 3944 4378 787 -3574 -4602 -1352 3175 4463 1647 -2837
1887b837j739K511M571K242k231m554k579J648M457L184j110m413l504N69M293
$$ -2837 -4576 -2065 2506 4748 2517 -2037 -4616 -2968 1489 4673 3563 -850 -4354 -3785 508
1902E08L436q7l916l887k25L714M171P16l489m444j310L124M736J652k541m480
$$ 508 3944 3857 -59 -3946 -4171 -457 3714 4430 941 -3503 -4813 -1689 3047 4699 2158 -2322
1918b322k217K143M259K737j642m443k954J266M288L437p95m316l612L20L915
$$ -2322 -4539 -2396 1863 4600 2958 -1485 -4439 -3173 1115 4552 3757 -559 -4171 -3851 64
1933F4L995J77l649m003q38L320M267J043k996m530j482K886M461J902k294m753
$$ 64 4059 4236 587 -3416 -4254 -934 3333 4376 1380 -3150 -4632 -1746 2715 4617 2323 -2430
1949b430k394J796M486L027j140m249l531Q55M295L612m44m186l754NL688M237
$$ -2430 -4824 -3028 1458 4485 3345 -904 -4435 -3580 715 4327 3883 -303 -4057 -4052 -364 3873
1965C873N50l460m254j168L041M441J564k569m410j976K265M322K452j953m591
$$ 3873 4423 963 -3291 -4459 -1418 3023 4587 2018 -2392 -4368 -2103 2219 4671 2718 -1873
1980a873k544J235M317L291q14m279l801M81L957L971n0l551l988o44L450M188
$$ -1873 -4417 -3182 1135 4426 3612 -667 -4468 -3987 -30 3941 3891 340 -3648 -4292 -842 3346
1996C346R18l039m204j489K564M619K089k364m531k323J914M214K792j397m134
$$ 3346 4264 1225 -2979 -4468 -1904 2715 4804 2440 -2091 -4414 -2500 1714 4506 3109 -1025
2011a025l182J014M173L347n98m140l743mL962L996M44l553m162r75K997M192
$$ -1025 -4207 -3193 980 4327 3729 -411 -4154 -4158 -196 3800 4244 691 -3471 -4446 -1449 2743
2027B743J549k598m316j931K335M407K404k045m340k701J492M295L097r82l916
$$ 2743 4292 1694 -2622 -4553 -2218 2189 4593 2548 -1792 -4493 -3001 1294 4391 3409 -507
2042e07l492L77L928L611O1l571m122k51L501M072P59l087m483j379K848M359
$$ -507 -3999 -3622 306 3917 3978 407 -3715 -3966 -465 3607 4366 1279 -3204 -4583 -1735 2624
2058B624J861k431m276k226J821M274K674j582m205k984J222M014L332n19m025
$$ 2624 4485 2054 -2222 -4448 -2627 1647 4321 2739 -1466 -4450 -3228 786 4118 3599 -426
2073d26l371k05L675M035M44l410l958q54K974M225J249k830m187j720K569M215
$$ -426 -3797 -4002 -327 3708 4152 742 -3216 -4070 -1096 3129 4378 1548 -2639 -4359 -1790 2425
2089B425K184k007m358k789J559M194L095r03m306l241N63L934L389o0l672l643
$$ 2425 4609 2602 -1756 -4545 -2986 1208 4303 3400 -906 -4147 -3584 350 3739 3679 7 -3636
2105c636m36L430L989Q35l102m004j365K772M239J570k253m181k024J948M013
$$ -3636 -4072 -642 3347 4182 1080 -2924 -4289 -1517 2722 4292 2039 -2142 -4166 -2218 1795
2120A795K489j453m201k884J113M197L078m73l885l556N5L582L685M93l449l813
$$ 1795 4284 2831 -1370 -4254 -3141 1056 4134 3661 -224 -3780 -3725 -143 3542 4035 586 -3227
2136c227p78K824M066J276k716m164j702K246M395K084j900m093k620J433M193
$$ -3227 -4005 -1181 2885 4161 1445 -2719 -4421 -2175 2220 4304 2404 -1689 -4309 -2876 1317
2151A317K766r84l906l086N31L895L317o8l730l695k32L403L755J016l142l954
$$ 1317 4083 3099 -807 -3893 -3362 533 3850 3782 52 -3643 -3875 -472 3283 4299 1157 -2797
2167b797j402K448M153J706k021m115k154J723M066K410j437l919k778R05L943
$$ -2797 -4199 -1751 2402 4108 2087 -2028 -4182 -2459 1607 4017 2580 -1339 -4117 -3212 731
2182G31L034l17l726l436J38L250L599M21l190l635o40K810L847J310k579m051
$$ 731 3765 3448 -278 -3714 -3576 -326 3273 3694 504 -3131 -3771 -961 2886 4196 1617 -2434
2198b434j635K078M044K115j562m105k451J319L718K932j145l642l046O21L410
$$ -2434 -4069 -1991 2053 4168 2606 -1499 -3950 -2631 1087 4019 2874 -768 -3814 -3193 217
2213B17L471j32l399l578l02L062L664Q16k784l674j215K372L659J804k135l831
$$ 217 3688 3556 157 -3421 -3723 -661 3003 3819 1035 -2639 -3854 -1482 2177 3981 1846 -1985
2229a985k096J796L995K429j489l595k865R12L509K966l33l388l064k39L272L310
$$ -1985 -4081 -2285 1710 4139 2650 -945 -3810 -2898 611 3577 3244 -144 -3208 -3447 -175 3135
2245C135N07k878l714o74K507L693J285k270l850j573J883L599K184j564l720
$$ 3135 3642 764 -2950 -3624 -1117 2576 3861 1591 -2259 -3832 -1949 1650 3834 2270 -1450
2260a450k257J159L549K645p41l495k914L92L267L228n8l121l162m62K655L526
$$ -1450 -3707 -2548 1001 3646 2905 -590 -3504 -3112 155 3383 3325 204 -2958 -3420 -765 2761
2276B761Q32k377l613j257K257L339J622j696l495k082J532L521K391j151l463
$$ 2761 3593 1216 -2397 -3654 -1397 1942 3564 1868 -1627 -3709 -2177 1344 3735 2584 -879
2291h79k602P31L136K782j88l157k805j38K768L107N44k652l268r51K463L233
$$ -879 -3481 -2750 386 3168 2980 -177 -2982 -3120 -352 2755 3299 647 -2621 -3572 -1109 2124
2307B124J379j924l567j578J782L317J994j368l332k115Q33L173K403k94l223
$$ 2124 3503 1579 -1988 -3566 -1784 1533 3527 2159 -1173 -3288 -2455 718 3121 2827 -396
2322c96k679J12L036K884O8k630k932p83K601L020R49k172l225j051J678L365
$$ -396 -3075 -2963 73 2957 3025 395 -2537 -3320 -719 2301 3250 1078 -2147 -3198 -1520 1845
2338A845J588j555l381j864J084L223K120o43l067k422M67K800K693j46k648k760
$$ 1845 3433 1878 -1503 -3367 -2283 940 3060 2417 -650 -3072 -2605 195 2888 2742 94 -2666
2354b666k82K445K941M87k046l031r76J875L114J239j547l146j427J193L158J703
$$ -2666 -2948 -503 2438 2925 879 -2152 -3128 -1253 1861 3100 1553 -1593 -3020 -1827 1331 3034
2370C034j052k966k134Q94K712K489m76k707k503j4K422K699L37j987k871o85
$$ 3034 1982 -984 -3118 -2224 488 2977 2501 -206 -2709 -2723 -301 2398 2735 748 -2123 -2808
2386b808K036K703R47j781k666j459J543K850J501j185k660k018J073K581K089
$$ -2808 -772 1931 2878 1097 -1569 -3028 -1485 1365 2866 1681 -979 -2997 -1924 657 2746
2401B746o49k498k166J71K441K267K56k195k738l00K163K532R02k015k626j024
$$ 2746 2097 -401 -2567 -2396 45 2312 2568 373 -2365 -2665 -502 2030 2932 917 -1709 -2733
2417b733J521K622J280j313k500j445R29K490J730o88k500j981M18K562J997p4
$$ -2733 -1212 1410 2690 1377 -1123 -2568 -1639 851 2581 1893 -607 -2588 -2170 392 2389 2315
2433B315k418k126j92K078K331M78j745k486q35J725K361J081j469k494j230J279
$$ 2315 -103 -2229 -2421 -343 1988 2466 721 -1765 -2600 -875 1486 2567 1098 -1396 -2626 -1347
2449a347K346J567r82k156j677K69K267J873k21k129j948J28J823K095L69j877
$$ -1347 999 2566 1584 -572 -2249 -1980 287 2160 1939 -190 -2138 -2010 -187 1908 2277 400
2465D00k240l87J682K080Q39j518k167r95J182K129J333j042k110j391P84K047
$$ 400 -1840 -2227 -545 1535 2374 856 -1311 -2306 -1124 1005 2338 1296 -814 -2205 -1421 626
2481F26J607n32k062j737L07J774J982J0j605k190k16J591K049K85j330j876p27
$$ 626 2233 1701 -361 -2098 -1791 -17 1965 1975 370 -1820 -2036 -445 1604 1889 559 -1317 -2044
2498b044J328J972R76j197j809j448Q62K040J375o48j928j340M03J695J552k22
$$ -2044 -716 1256 2232 1035 -774 -2222 -1360 680 2055 1407 -521 -1861 -1458 237 1789 1567
2514A567j475j835mJ540J909J31j423j861m50J296J741P04j006j810p95Q23J726
$$ 1567 92 -1743 -1747 -207 1702 1833 410 -1451 -1901 -605 1136 1840 834 -976 -1771 -948 778
2531G78R63o38j788j039N36J673J334n31j539j475K71J340J432J65j222j603k38
$$ 778 1741 1103 -685 -1724 -1188 485 1819 1288 -251 -1726 -1455 -115 1317 1482 260 -1343 -1581
2548a581J193J680K63j068j643m19Q98J623O96o62j759q22M18J413J265m54j431
$$ -1581 -388 1292 1555 487 -1156 -1575 -677 946 1642 980 -779 -1601 -1183 230 1495 1041 -390
2565c90j180L97J364J112j12j300j187j41J223J375M31j225j504l90J020J422
$$ -390 -1570 -1173 191 1303 1191 -109 -1296 -1437 -214 1161 1592 367 -1137 -1527 -507 915
2581I15N02q18j309o10N02J430Q14m76j422q53K23J400J100j89j243j172n7J223
$$ 915 1417 599 -710 -1320 -818 612 1426 950 -472 -1325 -1102 298 1398 1209 -34 -1206 -1263 -40
2599d0J124J42j058j169l57J081J065L11p26j332m10P82J283N76p20j006o50M41
$$ -40 1084 1226 168 -1001 -1358 -277 788 1099 373 -959 -1369 -587 696 1272 552 -454 -1104 -663
2617f63J055O63k64j074o54J23J184P91j50r94r80r5R14J150l0p87r45l25O98
$$ -663 392 1055 791 -283 -937 -814 370 1161 1011 17 -963 -1058 -144 1006 976 189 -756 -1081 -383
2636c83J047M25o79r69n31N62J010N61m20j084n75K81J003O86k47q66o41J21P74
$$ -383 664 1089 410 -559 -1090 -528 482 1043 623 -461 -1036 -755 248 934 687 -179 -820 -699 75
2655G5P55n3p79p42j71P83Q37J82o46q13k45M43R59K55m10q87m91N36Q41N16m14
$$ 75 830 777 -2 -744 -915 -132 705 887 241 -572 -817 -374 585 840 430 -457 -948 -412 429 945 531
2676E31r04m61K76P28O16M1j005o33OO55Q22K1o32o90p8O40P70rm33q57j99L80
$$ 531 -373 -834 -558 170 786 827 -178 -811 -805 -150 672 693 61 -629 -707 -67 703 694 261 -596 -795 -415
2698d15Q96L38l65p71l52K94O84M95k73p63m57O5P46O66o8p98o85k6P93N15J46
$$ -415 481 819 454 -317 -669 -375 309 804 531 -232 -689 -624 122 788 720 -78 -763 -789 4 519 665
2719F65o34o27j46O27O27Q0m19o29j86L32P94K52l77q35l31M02O87M10j92n52
$$ 665 31 -596 -742 -115 512 592 173 -456 -642 -310 484 736 359 -476 -807 -405 282 692 500 -52
2739e2n75J71N74N30j67o10l20p7N68N93k6m97n97l1K83P80Q0n15n62k18L20Q57
$$ -52 -627 -456 118 648 481 -129 -449 -526 42 635 609 112 -485 -516 -233 547 627 112 -450 -668 -348 509
2761E09J13l90o32j77Q6P35M48k70n55l66PO25L35O7o49m82K65L91M27L4m79m19
$$ 509 622 232 -400 -577 -491 244 692 422 -133 -499 -492 133 468 535 -114 -596 -331 60 487 521 42 -377
2783c77j02M66N21m2k39n85k67M35O11J97l03o67l61M38M80M89l64n51m84K75
$$ -377 -479 -13 508 466 227 -358 -625 -190 421 618 315 -352 -713 -275 205 694 330 -221 -705 -430
2803d30O99L53j65n15m86jM26N52qm28l91k33N39M33K86m74o24j30L10O59K99
$$ -430 269 622 457 -58 -544 -545 -119 433 425 -3 -394 -627 -88 345 631 157 -467 -597 -287 372 671
2824F71m35n51k68K70N54K92l09k82m93J21N22M12Jo15m99J01M91N34j62l25l86
$$ 671 236 -315 -583 -313 241 533 224 -58 -551 -430 92 504 505 -110 -609 -508 -17 517 355 30 -356
2845c56j87L58O18K11m29n04k56M72L94J88k79m84k08J51O45J79r0n84l38J14
$$ -356 -543 -185 433 644 215 -289 -545 -73 321 509 230 -254 -462 -311 334 513 423 -161 -499 -385
2865c85M31N47r8n09n52K3N19N33r5l85o02l5N95M37K46n24n36j12K59O35J67
$$ -385 46 593 495 -14 -566 -543 -24 509 414 29 -573 -608 -13 424 670 146 -390 -502 -243 392 559
2886E59k69n23l62J95N79M29j92n76o10L60L85N17Jm50n65J35L76M52J09o00m14
$$ 559 290 -233 -595 -400 179 608 416 -160 -770 -410 -25 492 493 43 -522 -387 -11 441 550 -50 -464
2907d64j60N64N08K26m52o30j98L39N96K26k62o15l40L83N95K83j87n79m42K41
$$ -464 -624 -60 448 674 222 -408 -606 -267 329 555 293 -322 -662 -279 316 599 412 -167 -609 -368
2927c68M71M85L9o61n78M1M98N61N0n71m14j22M59N33K07m40n53k41K71O01L22
$$ -368 103 588 627 -34 -612 -571 -73 488 538 -33 -447 -569 -110 423 630 190 -363 -604 -333 268 590
2948E90l05o49k20J71O32M28l05n38l54J15M82M31O1n74o82J51M64N64K00m19
$$ 590 285 -364 -584 -413 219 647 342 -196 -550 -435 47 478 539 -35 -717 -566 -102 462 662 243
2968B43p23n5K04O93K46l31m94m67M05N95L59l43o55l00J27O25N43k37m75n33
$$ 243 -480 -535 -331 362 608 277 -217 -684 -279 316 675 332 -323 -623 -496 129 672 435 -40 -573
2988e73K3O54N36q1m44n82j62N77N25Q7m53o29q1K88O45L20j82q51k74J89P76
$$ -573 -550 104 640 559 115 -467 -629 -52 473 560 107 -522 -603 -315 330 650 468 -383 -657 -468 308
3009C08K28k34l70o18OQ43O49k49n52p85J97M56O82Ll97p34l7M29P18J81l64p50
$$ 308 536 302 -68 -686 -680 163 812 563 11 -774 -577 -121 561 564 167 -567 -604 -175 543 724 360 -390
3031c90k78L63O19N98m60p11m13K16O33N68j46p43m83j00R55N11n1n76n71k34
$$ -390 -668 -305 314 912 452 -259 -672 -456 177 745 599 -144 -627 -727 228 739 688 112 -459 -693
3051f93N45Q26R4p17m97l27N46O64L07l54p41l44J75Q91M06l57q37l67J38Q33
$$ -693 -148 678 772 55 -442 -769 -223 441 748 394 -347 -691 -516 375 781 424 -413 -780 -642 191
3071A91O09k61n61o22p6O62O93l8n75m45l70N87P29K32m77q64l41N13R42L00l68
$$ 191 800 539 -22 -644 -720 -58 635 597 22 -423 -793 -206 523 755 278 -586 -927 -414 528 828 460
3092D60o80n70J48R29N43k45p80o52R1P43Q31j31o48p23k17P88P00L27o81p58
$$ 460 -220 -790 -642 287 830 585 -195 -847 -756 -13 818 687 39 -684 -901 -113 587 914 233 -525
3112e25l96O31P88L97m38q84m16L05R55M40k80q24o77K36Q31P08K0q63o39j12
$$ -525 -921 -290 498 895 457 -427 -843 -538 417 857 577 -247 -924 -688 143 851 871 8 -631 -743
3132g43N98R43M5o48q72k90O51R41J53l50j004m21M70R19N01l90p47p30L13Q46
$$ -743 -145 798 843 195 -677 -967 -316 625 778 428 -576 -997 -527 392 893 503 -244 -974 -661 185
3152A85P51k75q17o98PR02Q72p6p62o83l76O71R27K97n85r85m21N46J205M52o88
$$ 185 936 661 -156 -854 -847 55 927 851 89 -594 -970 -299 628 925 340 -645 -1066 -520 685 1137 449
3173D49q87o47L90J041O94k90q78p51K6Q38R17k2p35q32k80P23R48K20o33r65
$$ 449 -438 -1085 -695 346 1040 750 -128 -879 -853 -15 902 880 145 -687 -967 -244 704 924 291 -674
3193f74l81N63J070N55n73r88n98M04R92P45k83j056p46J05R79Q48p9q74q26k00
$$ -674 -1055 -492 578 1133 560 -428 -1026 -622 370 1115 832 -224 -970 -865 114 962 883 9 -817 -1017
3213a017Q51J106J14p45r69l99O41J067K77m93j010n73M91J074P44l89j011r27
$$ -1017 -166 940 1054 309 -660 -1059 -418 649 926 433 -577 -1150 -659 415 1159 770 -241 -1168
3231a168M26R72Q16q9r43r93J8R41R26L2q46r53m7O57J092K50o24j177m89O19
$$ -1168 -742 230 1046 957 14 -979 -961 -20 906 938 92 -861 -908 -251 841 1091 467 -710 -1199 -580
3251e80J114O02l80j261n61J79J135Q57k95q49j023J46Q40J068Q9r70j013j33
$$ -580 534 1136 756 -505 -1066 -887 248 1105 810 -39 -1062 -916 -76 992 1081 111 -902 -1035
3269a035P29J229J93o86j185l53N50J187N80n65j001q23L96J199Q35l75j080r66
$$ -1035 -306 923 1116 430 -755 -1108 -558 629 1209 644 -357 -1180 -784 415 1250 875 -205 -1171
3287a171J19J176R49j16r44j025j54Q53J145K40o96j192m11Q55J095M22m36j213
$$ -1171 -1052 124 1073 957 13 -1012 -1166 -313 832 1072 376 -816 -1227 -372 723 1145 709 -504
3305e04p32M15J256O84j85j246p29K10Q92J102k02j002r61j27R63J138R0p15j181
$$ -504 -1236 -821 435 1119 934 -312 -1041 -831 61 1163 961 -41 -1002 -1129 -166 972 1062 347 -834
3324h34k62O52J161N08o32j281o28O56J087P49l17j315q39M17J051J022k12j037
$$ -834 -1096 -444 717 1225 593 -688 -1316 -660 427 1176 859 -456 -1295 -878 173 1195 983 -54
3342e4j072M1Q86J166J75q90j230k52P76J364L59p54j137p27P39J106Q81o01j278
$$ -54 -1126 -1085 -199 967 1142 252 -978 -1230 -454 910 1269 515 -622 -1349 -610 496 1377 776 -502
3361e02p04L06J201R19k47j212r25j1J122J070M9j007j127j35Q66J075M78q12
$$ -502 -1206 -900 301 1220 973 -239 -1164 -1175 -53 1017 1066 59 -1068 -1203 -337 738 1216 404
3379D04j173n19O63J234O03n45j227o82M95J064R98m99j141q79J75J093J091n9
$$ 404 -769 -1288 -625 609 1212 667 -560 -1242 -747 317 1315 816 -325 -1204 -1029 64 1155 1096
3397A096j073j116j94R86J267L91j023j210m50Q40J204O69p15j330n87M52J398
$$ 1096 23 -1093 -1287 -301 966 1357 334 -876 -1326 -486 718 1387 672 -658 -1245 -793 605
3414F05N73l21j273p17J18J147J111j32j153j176J48J018J123K04j049j193l77
$$ 605 1178 857 -416 -1133 -1015 132 1243 1111 -42 -1218 -1070 -52 1071 1275 226 -967 -1344
3431a344J018J201L90p01j345l95N49J264O74n24j255q41L72J234R94l30j151
$$ -1344 -326 875 1265 564 -781 -1176 -627 637 1311 787 -468 -1309 -937 297 1291 961 -190
3448a90j038N4J257J022J81j027j239j64Q19J158M56q45j383m60Q60J263O12o07
$$ -190 -1228 -1174 83 1105 1286 259 -980 -1144 -325 833 1289 444 -939 -1399 -539 724 1336 729
3466G29j434o40M72J359Q79m60j294q67J94J222J102p5j285j081m5J066J383J77
$$ 729 -705 -1345 -873 486 1365 905 -389 -1256 -1062 160 1262 1187 -98 -1179 -1224 -158 1225 1402
3484A402j014j325m41J039J158N53p42j226p71O23J247J023n15j408r61M08J201
$$ 1402 388 -937 -1378 -339 819 1372 630 -596 -1367 -744 503 1526 1011 -397 -1358 -950 251
3501B51J062j07j316j171M8J163J298O2j070j249l62R48J388M94j040j161o75
$$ 251 1313 1206 -110 -1281 -1233 -70 1228 1290 220 -1029 -1391 -443 945 1439 399 -762 -1437
3518a437O17J462P13n22j438q36M64J279R93r0j366j106J25J151J199L7j157j126
$$ -1437 -820 642 1355 833 -605 -1441 -977 302 1295 1205 -161 -1267 -1142 9 1208 1245 88 -1038
3536a038j41R17J307L33q88j407n29Q89J267O50o23j445p47N83J304J032n34j258
$$ -1038 -1179 -262 1045 1378 490 -917 -1446 -557 710 1360 737 -708 -1455 -872 432 1464 930 -328
3554c28j074K60J163J351k29j190j243M6J089J301J91j064j263l89Q64J374O05
$$ -328 -1402 -1142 21 1372 1143 -47 -1290 -1244 -155 1146 1337 273 -990 -1379 -515 859 1464
3571A464o68j619o81P66J231Q76l71j465j103N68J284J028j46j357j110n0J332
$$ 1464 796 -823 -1504 -738 493 1369 998 -467 -1570 -1002 282 1310 1164 -193 -1303 -1353 -21
3588b1J293J77j207j466k71J059J448L72p99j353p20Q00J384P59n20j470r07L67
$$ -21 1272 1449 242 -1224 -1495 -436 1012 1384 585 -768 -1488 -688 696 1455 935 -535 -1442 -1075
3606a075J486J014k94j517j165K26J338J326m3j141j357k54J208J401K97j022
$$ -1075 411 1425 1131 -386 -1551 -1325 13 1339 1296 155 -1202 -1456 -248 1153 1450 428
3622D28j309o94R52J475N87o41j465r22O34J498R35l89j400j139L20J276J178
$$ 428 -881 -1575 -623 852 1439 798 -667 -1589 -955 543 1478 1089 -311 -1450 -1130 146 1324
3639A324o1j291j263j0J283J070M13j182j343m56J034J460N07q28j418p89P10
$$ 1324 1263 -28 -1291 -1301 -18 1052 1465 283 -1060 -1516 -482 978 1485 657 -761 -1550 -840
3656h40J525Q61o28j466r53K44J602J152k35j359j314l9J438J232K32j272j325
$$ -840 685 1546 918 -548 -1501 -1257 345 1497 1262 -97 -1411 -1450 -12 1220 1452 180 -1145
3673a145l56R83J604M34j029j462o00P96J582P76p51j543r29M74J585J155k64
$$ -1145 -1501 -518 1086 1520 491 -971 -1571 -775 807 1583 832 -711 -1640 -1166 419 1574 1310
3690A310j583j109jJ492J300M8j322j499j81J151J465M89j143j396n55R15J451
$$ 1310 -273 -1382 -1383 109 1409 1457 135 -1364 -1545 -394 1071 1560 417 -979 -1534 -619 832
3707H32P64p57j607o81M87J522J024o56j384j204M47J324J309k8j369j318j98
$$ 832 1596 839 -768 -1449 -962 560 1584 928 -456 -1660 -1213 111 1420 1392 23 -1295 -1493
3724a493J191J522L29j057j626n11J004J532P89r27j535r00P30J657Q30k83j771
$$ -1493 -302 1220 1549 492 -1134 -1645 -641 891 1680 753 -782 -1682 -952 705 1535 1252 -519
3741e19j145L68J480J329l03j416j266M5J248J556J06j098j657l65J156J563M93
$$ -519 -1664 -1296 184 1513 1210 -206 -1472 -1427 -179 1377 1483 385 -1272 -1637 -481 1082 1575
3758A575r83j597p43J011J573Q05o96j489j013L74J624J107k14j604j209N0J384
$$ 1575 592 -1005 -1748 -737 836 1641 945 -544 -1557 -1183 441 1548 1334 -270 -1479 -1429 -45
3775d5J384J44j262j473l21J202J513M12j049j616o00R64J646Q12q05j618r12
$$ -45 1339 1483 221 -1252 -1573 -371 1142 1554 505 -1111 -1711 -747 899 1711 906 -712 -1624
3792a624O17J644R48m78j395j173J17J495J234J65j564j352j91J331J553K32j096
$$ -1624 -1007 637 1585 1107 -288 -1461 -1344 151 1385 1550 -14 -1366 -1557 -226 1327 1559 463
3809D63j594n13R85J672N85q09j578r33Q45J504J048n61j615j180L98J633J047
$$ 463 -1131 -1644 -659 1013 1598 789 -789 -1722 -877 627 1675 1114 -501 -1681 -1283 350 1397
3826A397L7j424j488rJ252J583K45j181j653l26J122J496N07q37j783n52N81J802
$$ 1397 1434 10 -1478 -1487 -235 1348 1593 412 -1241 -1567 -445 1051 1558 721 -1062 -1614 -1033 769
3844G69R18o92j451j154M59J434J210k37j490j367J80J543J283L4j289j506k88
$$ 769 1687 995 -456 -1610 -1151 283 1493 1256 -234 -1601 -1421 122 1405 1439 150 -1356 -1644
3861a644J237J660M13j083j667o61J014J679P99q30j676p68M04J627J146l96j757
$$ -1644 -407 1253 1666 583 -1084 -1745 -731 948 1747 917 -759 -1527 -1123 504 1650 1254 -503
3878e03j093L26J293J415J3j299j532M6J085J437L93j023j615n52J087J428O84
$$ -503 -1596 -1270 23 1438 1451 152 -1380 -1334 -249 1188 1581 558 -1057 -1609 -522 906 1590
3895A590p45j685q35O61J649R85m24j602j135K31J378J451l4j488j463O7J320
$$ 1590 845 -840 -1675 -1014 635 1620 1196 -406 -1541 -1310 68 1519 1485 -3 -1466 -1399 -79
3912g9J501J08j093j529n67J087J609O46q75j584r01Q04J654Q73n92j496j206
$$ -79 1422 1530 437 -1092 -1659 -572 1037 1683 808 -776 -1677 -873 781 1654 1062 -434 -1640
3929a640M92J589J090k55j387j391L6J319J533K92j361j521m26J171J468N56r73
$$ -1640 -1148 441 1531 1276 -111 -1502 -1466 -147 1386 1678 317 -1204 -1630 -459 1009 1565 592
3946E92j552n87O08J693R91p24j603j125N87J543J150l82j511j166J47J349J357
$$ 592 -960 -1547 -939 754 1745 1021 -582 -1707 -1120 423 1573 1191 -320 -1486 -1339 10 1367
3963A367p2j203j335l00J304J528L48j127j557m21P76J549O60n69j495j130O52
$$ 1367 1295 92 -1243 -1543 -239 1289 1637 510 -1047 -1468 -692 857 1517 948 -547 -1677 -1025
3980a025J560J108m89j546j133J86J383J382n7j293j294k37J148J416M44j192
$$ -1025 535 1643 1154 -392 -1525 -1339 44 1426 1369 76 -1218 -1455 -307 1109 1553 361
3996C61j318o19J148J332O32p90j480q45Q31J343R14n02j350j098K14J496J052
$$ 361 -957 -1576 -428 904 1536 746 -734 -1579 -748 595 1509 1007 -343 -1441 -1227 269 1321
4013A321n3j442j085j28J202J418K19j117j393m83R61J554N66q19j430q06P30
$$ 1321 1268 -174 -1259 -1387 -185 1233 1452 335 -1058 -1541 -580 974 1540 721 -709 -1515 -785
4030g85J527P83n93j546p96M13J334J097j61j594j050J14J286J199K63j343j277
$$ -785 742 1525 932 -614 -1410 -997 337 1434 1273 -321 -1371 -1257 29 1228 1491 148 -1129
4047a129l11J113J306M78j042j313n52P08J438P89n49j552r18M91J489J017l30
$$ -1129 -1440 -327 979 1457 415 -898 -1450 -742 696 1485 936 -616 -1534 -1043 446 1463 1133
4064A133j329j099J19J278J221k2j188j316k79J219J343K14r35j296n35R35J357
$$ 1133 -196 -1295 -1176 102 1323 1301 113 -1203 -1482 -263 1080 1294 359 -937 -1472 -537 820
4081H20N86o15j362p62L97J421Q97l54j271j138J95J423J093k19j193j127j33
$$ 820 1406 791 -571 -1333 -936 485 1382 1028 -243 -1381 -1186 237 1330 1111 -82 -1209 -1342
4098a342J167J266J99r22j356k98Q46J326M78o48j312q45P00J244Q43m61j222
$$ -1342 -175 1091 1290 368 -988 -1286 -440 886 1364 716 -596 -1441 -741 503 1346 885 -337
4115c37r30K10J378R46r5j186j215J09R55J288K28j183j240l59J034J246N91q20
$$ -337 -1267 -1057 321 1267 1172 -14 -1229 -1120 -165 1123 1351 168 -1072 -1431 -397 849 1440 620
4133F20j440m81O14J265Q61p41j319p17M33J185R58l13j122j098J79J151J160
$$ 620 -820 -1301 -687 578 1439 698 -621 -1338 -905 280 1238 925 -197 -1295 -1116 35 1195
4150A195P4j124j164k52R84J204L36q17j230n30O89J270O18n67j224q24M99J260
$$ 1195 1269 145 -1019 -1271 -287 917 1253 436 -794 -1324 -635 635 1253 686 -538 -1362 -863 397
4168C97Q98m72j021q84J2J121J123m0j014j145k07J099J056K80r74j153l29P27
$$ 397 1295 823 -198 -1082 -1070 51 1174 1134 120 -1025 -1232 -133 923 1203 229 -924 -1253 -526
4186e26J310M19m26j405n18M05J229P72l70j220q32K14J232Q12q4r99j028j08
$$ -526 784 1203 777 -628 -1146 -741 488 1260 890 -330 -1162 -948 284 1096 1012 13 -1015 -1123
4204a123J014R30K39o73j289l28Q23J200M07p58j039m85M46J052O07l01j015r61
$$ -1123 -109 821 1060 387 -902 -1230 -407 793 1200 442 -597 -1082 -636 416 1023 722 -293 -1254
4222a254L11J257P60j40r07j140Q8J088R66K7j016j018j67Q43J022M29o83j159
$$ -1254 -943 314 1074 934 27 -1113 -1025 63 1029 1056 40 -978 -1145 -302 720 1149 466 -693
4240f93m26M61J225N53m98j140m99L37R91Q10l75j000q24J74Q86R79N7r12r42
$$ -693 -1119 -658 567 1120 622 -518 -1017 -680 311 1121 746 -254 -1078 -904 -18 961 1018 106 -836
4259h36j98P04J230J04o76j112l24O05J059N45n86j064n56K75J285P15l88r20
$$ -836 -1034 -330 900 1004 328 -784 -1108 -503 556 1101 515 -549 -1105 -830 455 1170 782 -138
4277a38q42J01J005O75J0p61q53j45Q57Q63K64q85p12l88N79R77M07o26j033m17
$$ -138 -980 -879 126 801 811 50 -803 -948 -91 772 1036 151 -561 -949 -370 607 1014 388 -645 -1062
4297a062L85J075O84l73j078n45J75R44O34o4q05q90K7Q67Q13J36p30r69j95O82
$$ -1062 -677 398 1082 709 -369 -914 -739 205 839 775 -30 -920 -893 -26 787 923 193 -776 -971 -289
4317b89R12K10m95p70n13L68J022M86l90r14n22J73R46O87r2r72n94n3Q89O15
$$ -289 623 833 338 -432 -945 -577 445 931 541 -373 -895 -722 224 911 819 -153 -747 -800 89 704
4337G04J11o62j028J41N00P33M94p36q87k75N39R65L31m62q78m18K35R42M32j94
$$ 704 815 153 -875 -734 -234 499 993 257 -630 -905 -366 599 930 468 -410 -828 -593 349 781 587
4357E87o90p63K50P54O50j7o96q62n3O62P63J59n89q36k57N60R13L01m54q29l08
$$ 587 -103 -866 -616 138 788 771 75 -787 -840 -178 585 744 155 -681 -938 -378 535 836 382 -447 -755
4378g55J16R56N51l61o55p23K80O68O94m4q64n50MO68P78k2o49o86j69N26P33
$$ -755 -639 317 868 507 -148 -871 -591 77 771 727 -137 -687 -683 -15 763 741 92 -594 -763 -237 496
4399D96K65l68p98l41L90O93N37l24p34o21J82Q79M35k51o20n48J65N39N55J50
$$ 496 761 393 -405 -746 -356 337 874 550 -184 -805 -623 256 691 440 -180 -728 -563 -24 531 681
4419F81n95p06l2M56Q29K02o72o54k14N27N75L90l38q32m62L02P45N40q0r97m50
$$ 681 86 -620 -652 -196 633 835 163 -491 -705 -178 397 787 449 -383 -845 -543 202 742 662 -335 -785
4440g85J97O40P45k80n77m89k9L76O89J98n54o83k80N32P47K74m39n64m37K82
$$ -785 -588 52 797 517 -60 -549 -578 -202 487 685 131 -552 -832 -300 447 721 282 -282 -719 -437
4460d37Q12L74l70n34n41J41O84O60k46o10n39j14P49N67nm17o59j15L86O33K39
$$ -437 375 749 379 -155 -696 -555 129 789 543 -67 -606 -720 29 596 591 174 -485 -600 -214 419 658
4481F58l25p16n17O73N52K29j09p35m16L27N43N40k27n23n86j4O79M87O5o81m22
$$ 658 333 -383 -900 -227 325 554 445 -290 -706 -379 164 704 477 -46 -632 -646 33 520 585 -96 -518
4502e18l7M21N95K38m69p84m1L37N84M48l93o93l74K56O27M79j03p25m33K31M32
$$ -518 -555 -134 461 699 230 -554 -595 -258 326 774 381 -312 -686 -430 197 676 573 -152 -585 -354 78
4523G8M58R8o34n08j66O66N29J31l74q00j2M24M12L42m08n71k84J92P55K92l05
$$ 78 536 634 0 -508 -674 -8 521 652 278 -522 -534 -110 302 644 236 -335 -619 -427 328 620 315
4544C15m58m68J58M81M81m2m14n22j5M54N66%l30n57l12N04N17K87l84p47j00
$$ 315 -143 -611 -453 28 509 467 53 -469 -484 -30 536 536 206 -351 -663 -159 358 645 261 -486 -586
4565e86L02O24K33l27m05m82K54N89M13k51m76m75O5N72L58J39m07o23j7K98O26
$$ -586 -284 340 573 246 -159 -641 -387 202 615 364 -112 -587 -522 50 408 547 140 -483 -500 -202 424
4586D24J25l65o12K1N8N44K90k70l85l78J62M66N33k07n33n84K00M75M86K7m75
$$ 424 549 184 -428 -407 -349 195 485 215 -170 -548 -386 80 613 406 -127 -711 -511 -36 450 477 2
4607Bl97j3K79L82L66l30o07p8K07N02J97l20n65l5L4N50L82k30m95k37N2M59
$$ 2 -395 -408 -129 253 619 289 -318 -396 -189 313 510 190 -375 -410 -376 174 556 326 -169 -406 -354 105
4629A05L76J1m84m32n6L50M72P2l70l05j53K49M09K10k66l69l22J71N01K53k8
$$ 105 481 492 8 -424 -480 -130 342 414 44 -261 -414 -165 244 454 188 -181 -503 -332 169 422 394
4650C94m77l55R8M08L63K3m26l20o0J49M44J57k39n08%J27M66K62k95l95j98K08
$$ 394 -83 -438 -340 68 431 454 28 -292 -352 -203 241 398 159 -349 -349 -222 244 506 211 -184 -382 -174
4672a74K76K38j4n42k79J29M04L64j31n14j0j50K81K96J90j95m35p3J36L53J35
$$ -174 102 340 326 -216 -495 -366 38 402 271 -243 -253 -403 -122 174 364 169 -266 -339 -203 150 285
4693B85j30l64k61K65L37K28l3m54k22N9K19M84q3l76l24J18J89L37L6j51l16
$$ 285 155 -209 -470 -205 132 360 327 -127 -349 -290 -71 413 330 -46 -370 -252 -63 274 310 159 -157
$$ [...]
8191a3
##END NTUPLES=NMR FID
##END=
