##TITLE=1H ikalashn
B1d0911-2
11.11.2024
##JCAMPDX= 6.0         $$ Bruker NMR JCAMP-DX V2.0
##DATA TYPE= NMR FID
##DATA CLASS= NTUPLES
##ORIGIN= UXNMR, Bruker Analytische Messtechnik GmbH
##OWNER= root
$$ TOPSPIN		Version 1.3
$$ 2024-11-11 10:12:35.687 +0400  Irina@DPX200
$$ Compression mode = diff/dup
##.OBSERVE FREQUENCY= 200.131300845
##.OBSERVE NUCLEUS= ^1H
##.DELAY= (6, 6)
##.ACQUISITION MODE= SIMULTANEOUS
##.ACQUISITION SCHEME= undefined
##.AVERAGES= 32
##.DIGITISER RES= 18
##SPECTROMETER/DATA SYSTEM= spect
##.PULSE SEQUENCE= zg
##.SOLVENT NAME= CDCl3
##.SHIFT REFERENCE= INTERNAL, CDCl3, 1, 17.49637
##AUDIT TRAIL= $$ (NUMBER, WHEN, WHO, WHERE, WHAT)
$$ ##TITLE= Audit trail, TOPSPIN		Version 1.3
$$ ##JCAMPDX= 5.01
$$ ##ORIGIN= Bruker BioSpin GmbH
$$ ##OWNER= Irina
$$ $$ F:/spectra/data/iren/nmr/1H/4/audita.txt
$$ ##AUDIT TRAIL=  $$ (NUMBER, WHEN, WHO, WHERE, VERSION, WHAT)
(   1,<2024-11-11 10:12:11.203 +0400>,<Irina>,<DPX200>,<TOPSPIN 1.3>,
      <created by zg
	started at 2024-11-11 10:10:03.187 +0400,
	POWCHK disabled, PULCHK disabled
       configuration hash MD5:
       BE 6D 3F 07 2A EA 11 49 91 17 2B D3 AF B3 58 0D
       data hash MD5: 16K
       5B C5 77 89 91 78 61 AD 00 03 70 6D B8 C7 24 49>)
$$ ##END=
$$ 
$$ $$ hash MD5
$$ $$ 31 57 1C 75 35 05 B4 B6 1F 74 C1 8E 8B 86 90 3C
##$RELAX= 
##$RELAX= 
##$RELAX= 
##$RELAX= 
##$RELAX= 
##$RELAX= 
##$RELAX= 
##$RELAX= 
##$RELAX= 
$$ Bruker specific parameters
$$ --------------------------
##$DU= <F:/spectra>
##$EXPNO= 4
##$NAME= <1H>
##$PROCNO= 1
##$TYPE= <nmr>
##$USER= <iren>
##$AMP= (0..31)
100 100 100 100 100 100 100 100 100 100 100 100 100 100 100 100 100 100 
100 100 100 100 100 100 100 100 100 100 100 100 100 100 
##$ANAVPT= -1
##$AQSEQ= 0
##$AQ_mod= 1
##$AUNM= <au_zg>
##$AUTOPOS= <>
##$BF1= 200.13
##$BF2= 200.13
##$BF3= 200.13
##$BF4= 200.13
##$BF5= 200.13
##$BF6= 200.13
##$BF7= 200.13
##$BF8= 200.13
##$BYTORDA= 1
##$CFDGTYP= 0
##$CFRGTYP= 5
##$CHEMSTR= <none>
##$CNST= (0..63)
1 1 145 1 1 1 1 1 1 1 1 1 1 1 1 1 1 1 1 1 1 1 1 1 1 1 1 1 1 1 1 1 1 1 
1 1 1 1 1 1 1 1 1 1 1 1 1 1 1 1 1 1 1 1 1 1 1 1 1 1 1 1 1 1 
##$CPDPRG= <>
##$CPDPRG1= <>
##$CPDPRG2= <>
##$CPDPRG3= <>
##$CPDPRG4= <mlev>
##$CPDPRG5= <mlev>
##$CPDPRG6= <mlev>
##$CPDPRG7= <mlev>
##$CPDPRG8= <mlev>
##$CPDPRGB= <>
##$CPDPRGT= <>
##$D= (0..63)
0 2 0 0 0 0 0 0 0 0.06 0 0.03 0 0 0 0 0.0002 0 0 0 0 0 0 0 0 0 0 0 0 0 
0 0 0 0 0 0 0 0 0 0 0 0 0 0 0 0 0 0 0 0 0 0 0 0 0 0 0 0 0 0 0 0 0 0 
##$DATE= 1731305530
##$DBL= (0..7)
120 120 120 120 120 120 120 120 
##$DBP= (0..7)
150 150 150 150 150 150 150 150 
##$DBP07= 0
##$DBPNAM0= <>
##$DBPNAM1= <>
##$DBPNAM2= <>
##$DBPNAM3= <>
##$DBPNAM4= <>
##$DBPNAM5= <>
##$DBPNAM6= <>
##$DBPNAM7= <>
##$DBPOAL= (0..7)
0.5 0.5 0.5 0.5 0.5 0.5 0.5 0.5 
##$DBPOFFS= (0..7)
0 0 0 0 0 0 0 0 
##$DE= 6
##$DECBNUC= <off>
##$DECIM= 32
##$DECNUC= <off>
##$DECSTAT= 4
##$DIGMOD= 1
##$DIGTYP= 9
##$DL= (0..7)
0 120 120 120 120 120 120 120 
##$DP= (0..7)
150 150 150 150 150 150 150 150 
##$DP07= 0
##$DPNAME0= <>
$$ [...]
##$SW= 21.9926040160658
##$SWIBOX= (0..15)
0 0 2 0 0 0 0 0 0 0 0 0 0 0 0 0 
##$SW_h= 4401.40845070422
##$TD= 16384
##$TD0= 1
##$TE= 300
##$TE2= 300
##$TE3= 300
##$TEG= 300
##$TL= (0..7)
0 120 120 120 120 120 120 120 
##$TP= (0..7)
150 150 150 150 150 150 150 150 
##$TP07= 0
##$TPNAME0= <>
##$TPNAME1= <>
##$TPNAME2= <>
##$TPNAME3= <>
##$TPNAME4= <>
##$TPNAME5= <>
##$TPNAME6= <>
##$TPNAME7= <>
##$TPOAL= (0..7)
0.5 0.5 0.5 0.5 0.5 0.5 0.5 0.5 
##$TPOFFS= (0..7)
0 0 0 0 0 0 0 0 
##$TUNHIN= 0
##$TUNHOUT= 0
##$TUNXOUT= 0
##$USERA1= <user>
##$USERA2= <user>
##$USERA3= <user>
##$USERA4= <user>
##$USERA5= <user>
##$V9= 5
##$VALIST= <valist>
##$VCLIST= <CCCCCCCCCCCCCCC>
##$VD= 0
##$VDLIST= <DDDDDDDDDDDDDDD>
##$VPLIST= <PPPPPPPPPPPPPPP>
##$VTLIST= <TTTTTTTTTTTTTTT>
##$WBST= 1024
##$WBSW= 25
##$XGAIN= (0..3)
0 0 0 0 
##$XL= 0
##$YL= 0
##$YMAX_a= 1201006
##$YMIN_a= -1231951
##$ZGOPTNS= <>
##$ZL1= 120
##$ZL2= 120
##$ZL3= 120
##$ZL4= 120
##$ABSF1= 10
##$ABSF2= 0
##$ABSG= 5
##$ABSL= 3
##$ALPHA= 0
##$AQORDER= 0
##$ASSFAC= 0
##$ASSFACI= 0
##$ASSFACX= 0
##$ASSWID= 0
##$AUNMP= <proc_1d>
##$AXLEFT= 0
##$AXRIGHT= 0
##$AXTYPE= 0
##$AXUNIT= <>
##$AZFE= 0.1
##$AZFW= 0.1
##$BCFW= 1
##$BC_mod= 2
##$BYTORDP= 1
##$COROFFS= 0
##$CY= 7568.61572265625
##$DATMOD= 1
##$DC= 2
##$DFILT= <>
##$DTYPP= 0
##$F1P= 17.9538593292236
##$F2P= -4.03888763876832
##$FCOR= 0.5
##$FTSIZE= 32768
##$FT_mod= 4
##$GAMMA= 1
##$GB= 1
##$INTBC= 1
##$INTSCL= 1
##$ISEN= 128
##$LB= 0.02
##$LEV0= 0
##$LPBIN= 0
##$MAXI= 945.577
##$MC2= 0
##$MEAN= 0
##$ME_mod= 0
##$MI= -402.1523
##$NCOEF= 0
##$NC_proc= 0
##$NLEV= 6
##$NOISF1= 8.587773
##$NOISF2= 6.764455
##$NSP= 1
##$NTH_PI= 0
##$NZP= 0
##$OFFSET= 17.49637
##$PC= 1
##$PHC0= 112.1524
##$PHC1= 14.5626
##$PH_mod= 0
##$PKNL= yes
##$PPARMOD= 0
##$PPDIAG= 0
##$PPIPTYP= 0
##$PPMPNUM= 100
##$PPRESOL= 1
##$PSCAL= 0
##$PSIGN= 0
##$REVERSE= no
##$SF= 200.13
##$SI= 32768
##$SIGF1= 18.5376
##$SIGF2= -6.396296
##$SINO= 400
##$SIOLD= 32768
##$SREGLST= <1H.CDCl3>
##$SSB= 3
##$STSI= 0
##$STSR= 0
##$SW_p= 4401.40845070422
##$SYMM= 0
##$S_DEV= 0
##$TDeff= 0
##$TDoff= 0
##$TI= <>
##$TILT= no
##$TM1= 0
##$TM2= 0
##$TOPLEV= 0
##$USERP1= <user>
##$USERP2= <user>
##$USERP3= <user>
##$USERP4= <user>
##$USERP5= <user>
##$WDW= 1
##$XDIM= 8192
##$YMAX_p= 0
##$YMIN_p= 0
$$ End of Bruker specific parameters
$$ ---------------------------------
##NTUPLES= NMR FID
##VAR_NAME=  TIME,          FID/REAL,        FID/IMAG
##SYMBOL=    X,             R,               I
##VAR_TYPE=  INDEPENDENT,   DEPENDENT,       DEPENDENT
##VAR_FORM=  AFFN,          ASDF,            ASDF
##VAR_DIM=   8192,          8192,            8192
##UNITS=     SECONDS,       ARBITRARY UNITS, ARBITRARY UNITS
##FACTOR=    0.0002272,     1,               1
##FIRST=     0,             0,               0
##LAST=      1.8609952,     -265,            -355
##MIN=       0,             -1231951,        -1231951
##MAX=       1.8609952,     1201006,         1201006
$$ Real data points
##PAGE= N=1
##DATA TABLE= (X++(R..R)), XYDATA
$$ [...]
$$ plain form
3150 42 -724 -214 836 239 -683 -794 535 903 -384 -1147 -369 734 286 -935 -305 697 496 -631
3168 -631 -669 235 891 18 -1134 -113 869 353 -693 -453 944 1046 -72 -777 230 1108 -146 -824
3186 -824 -420 879 580 -723 -1076 525 937 -64 -1081 -162 867 449 -662 138 874 699 -690
3203 -690 -1070 376 1228 97 -1139 -314 850 747 -697 -723 571 696 -432 -1085 306 1165 77
3220 77 -734 -787 821 566 -624 -780 763 894 77 -1152 -189 1054 165 -817 -792 537 1035 -623 -1227
3239 -1227 239 989 -206 -1148 -177 1370 735 -1211 -1075 614 1091 -597 -1299 148 1022 117 -1029
3256 -1029 -542 637 831 -778 -1099 632 1222 -279 -1247 25 1164 622 -728 -789 1045 1020 -651
3273 -651 -1166 47 1208 -16 -742 -477 968 1020 -869 -1191 698 1072 -375 -1125 -36 1411 434
$$ packed form
3150D2p66N10J050n97r22j11J329L68j287p63P78J103m48j221O30J002k01j127
3168f31l8R04O56q73j152J021R82n16j046K40J397J02j118p05J007Q78j254o78
3186h24M04J299k99j303l53J601M12j001j017R19J029m18j111Q00P36j75j389
3203f90l80J446Q52j131j236Q25J164j03j444k6J294J25j128o53J391Q59j088
3220G7q11n3J608k55j190j56J543J31q17j229R63J243q89r82K5J329M98j658o04
3239a227J466P50j195r42R71J547o35j946J36J689M77j688p02J447Q74r05j146
3256a029M87J179J94j609l21J731N90j501r68J272J139n42j350o1J834k5j671
3273f51n15J213J161j224p26K65J445N2j889l22J889L74j447p50J089J447r77
$$ plain form
3290 434 -1392 -775 902 908 -544 -1060 629 1051 299 -1199 -477 951 699 -1448 -1181 693 1162 -462
3308 -462 -1201 -180 975 480 -1109 -765 741 1184 -1093 -1561 459 1092 -122 -1373 -253 1120 422
3325 422 -1431 -905 1230 930 -349 -1129 374 1440 129 -1049 -349 1022 899 -817 -952 850 1503
3342 1503 -665 -1187 123 1315 750 -1238 -497 1103 1237 -681 -1198 554 1725 -335 -1440 -533
3358 -533 1253 991 -1028 -821 880 1484 -641 -1386 140 1787 184 -1221 -411 974 771 -666 -1327
3375 -1327 282 1555 -398 -1198 -279 1386 305 -1298 -1101 940 1349 -751 -1800 105 1314 326
3391 326 -1199 -393 1468 867 -1000 -1136 848 1607 -551 -1423 -307 1791 669 -1528 -1042 719 1065
3408 1065 -813 -1369 572 1833 -49 -1595 -499 1884 752 -1382 -1109 1048 1375 -202 -1649 282
$$ packed form
3290D34j826O17J677Oj452n16J689M22p52j498P22J428k52k147K67J874M69j624
3308d62p39J021J155m95j589L44J506M43k277m68K020O33j214j251J120J373o98
3325D22j853N26K135l00j279p80J503J066j311j178P00J371j23j716j35J802O53
3342A503k168n22J310J192n65j988P41J600J34j918n17J752J171k060j105R07
3358e33J786k62k019K07J701O04k125p45J526J647j603j405Q10J385k03j437o61
3375a327J609J273j953q00R19J665j081j603J97K041M09k100j049J905J209r88
3391C26j525Q06J861o01j867j36J984P59k158q72J116K098j122k197M86J761L46
3408A065j878n56J941J261j882j546J096K383j132k134K73K157L27j577j447J931
$$ plain form
3424 282 1721 63 -1986 -996 1134 1380 -856 -1703 309 1120 -212 -1620 -326 1820 730 -1193
3440 -1193 -1167 1008 1445 -651 -1430 0 1985 175 -1766 -481 1490 1339 -934 -1258 840 1497 -384
3457 -384 -1515 -495 1956 500 -1641 -1166 1133 1424 -682 -1884 157 1930 -214 -1536 -332 1593
3473 1593 837 -1310 -1089 1097 1524 -569 -1618 327 1884 512 -1817 -695 1471 1390 -915 -1596
3489 -1596 927 1983 -75 -1685 -428 1785 720 -1405 -1026 1151 1395 -419 -1802 353 1863
3504 1863 206 -1780 -774 1388 1262 -1129 -1340 887 1472 -406 -1858 523 2002 817 -1822 -1213
3520 -1213 1162 1223 -910 -1647 291 1437 -30 -1856 -463 1724 1250 -1268 -1504 1076 1433 -697
3536 -697 -2330 -220 2045 208 -1731 -780 1348 931 -857 -1459 503 1805 -172 -1733 -30 1748
$$ packed form
3424B82J439j658k049R90K130K46k236q47K012Q11j332j408J294K146j090j923
3440a193K6K175M37k096p79J430J985j810j941J285J971j51k273l24K098O57j881
3457c84j131J020K451j456k141M75K299K91k106j202K041J773k144j322J204J925
3473A593p56k147K21K186M27k093j049J945J557j372k329J122K166q1k305o81
3489a596K523J056k058j610J257K213j065k125L79K177K44j814j383K155J510
3504A863j657j986J006K162j26k391k11K227N85j878j452K381J479j185k639O09
3520a213K375O1k133p37J938J146j467j826J393K187m74k518k36K580L57k130
3536f97j633K110K265j837j939R51K128m17j788o02J962J302j977j561J703J778
$$ plain form
3552 1748 624 -1543 -1477 1003 1561 -854 -1480 152 1527 326 -1466 -725 1586 1164 -1227 -1499 1096
3569 1096 1956 -520 -1996 -87 1811 421 -1833 -1137 1574 1153 -794 -1988 489 1834 209 -1561
3585 -1561 -754 1750 947 -1434 -1475 941 1960 -613 -1944 283 1972 409 -1644 -815 1378 1270
3601 1270 -1192 -1761 491 1778 -182 -2009 -95 1676 1130 -1689 -894 1614 1612 -434 -1924 51
3617 51 1913 466 -1982 -962 1624 1247 -1473 -1476 818 1909 -597 -1812 -560 1739 991 -1669 -967
3634 -967 1317 1640 -1042 -1660 563 1996 6 -1903 -560 2052 925 -1464 -1505 1205 1834 -647
3650 -647 -1994 -32 1912 342 -2235 -828 1382 1059 -1214 -2000 512 2131 -85 -1833 -288 2029
3666 2029 889 -1732 -1173 1400 1653 -792 -1865 401 2124 294 -1693 -510 1605 1322 -1451 -1741
$$ packed form
3552A748j124k167O6K480N58k415o26J632J375j201j792P41K311m22k391k72K595
3569A096Q60k476j476J909J898j390k254O96K711m21j947j194K477J345j625j770
3585a561Q07K504q03k381m1K416J019k573j331K227J689j563k053Q29K193j08
3601A270k462n69K252J287j960j827J914J771n46k819P95K508kk046j490J975
3617E1J862j447k448J020K586l77k720lK294J091k506j215J252K299p48k660P02
3634i67K284L23k682o18K223J433j990j909J343K612j127k389m1K710O29k481
3650f47j347J962J944j570k577J407K210l23k273p86K512J619k216j748J545K317
3666B029j140k621N59K573K53k445j073K266J723j830j987J183K115k83k773k90
$$ plain form
3682 -1741 498 2160 -402 -2390 -404 1993 783 -1834 -1108 1395 1654 -825 -1844 503 2092
3697 2092 -238 -1818 -607 1794 1037 -1507 -1943 867 1595 -764 -2315 -126 2058 234 -1770 -1338
3713 -1338 1479 1843 -1235 -1773 782 2241 75 -2213 -328 1689 1031 -1513 -1519 728 1996 -653
3729 -653 -2157 583 1939 107 -2106 -668 1492 1401 -1127 -1805 994 2253 -229 -1597 -291 2002
3745 2002 933 -1449 -1225 1494 1323 -734 -2145 410 2300 85 -2364 -959 1981 1176 -1605 -1872
3761 -1872 941 1821 -531 -2093 -303 2039 542 -2030 -1111 1356 2012 -847 -2085 736 1935 -81
3777 -81 -2191 -493 1847 909 -1559 -1315 1515 2239 -449 -2234 310 1912 707 -1900 -1121 1578
3793 1578 1148 -1297 -2003 761 2081 -455 -2261 -327 1971 997 -1987 -1670 1395 1829 -1015 -1863
$$ packed form
3682a741K239J662k562j988J986K397j210k617P26K503K59k479j019K347J589
3697B092k330j580J211K401p57k544m36K810P28k359j551K189K184j824k004M32
3713a338K817L64l078n38K555J459k166k288J885K017o58k544oK247J268k649
3729f53j504K740J356j832k213J438K160r1k528o78K799J259k482j368J306K293
3745B002j069k382K24K719j71k057j411K555J890k215k449J405K940q05k781k67
3761a872K813Q80k352j562J790K342j497k572R19K467O56k859j238K821J199k016
3777h1k110J698K340r38k468K44K830P24k688j785K544J602j205k607P79K699
3793A578m30k445p06K764J320k536j806J934K298r74k984L17L065M34k844q48
$$ plain form
3809 -1863 635 2166 94 -1919 -651 2022 1393 -1480 -1667 780 1755 -605 -2750 -176 1792 359
3825 359 -2077 -1075 1653 1524 -1232 -1447 725 2430 31 -2147 -556 1970 1243 -1401 -1786 1189
3841 1189 2108 -1016 -1806 -72 1968 413 -2147 -947 1772 1401 -1363 -2028 842 2117 -186 -1757
3857 -1757 -429 1991 871 -1368 -1280 1322 1829 -795 -2091 491 2096 -1 -2087 -872 1693 877
3873 877 -1694 -1774 763 1790 -483 -1943 -201 2304 1076 -1948 -1279 1598 1586 -863 -1818 447 2084
3890 2084 144 -2122 -485 2168 919 -1409 -1686 1306 1842 -907 -2166 175 1801 259 -1873
3905 -1873 -1063 1835 1397 -1200 -1440 815 1970 -82 -2090 -211 2093 855 -2028 -1726 1190 2123
3921 2123 -959 -1891 189 2047 439 -1943 -932 1857 1126 -1494 -1940 1060 2061 -372 -2337 -135
$$ packed form
3809a863K498J531k072k013J268K673o29k873j87K447R75k360k145K574J968j433
3825C59k436J002K728j29k756k15K172J705k399k178J591K526p27k644l85K975
3841A189R19l124p90J734K040j555k560J200K719l71k764o65K870J275k303j571
3857a757J328K420j120k239Q8K602N07k624j296K582J605k097k086J215K565q16
3873H77k571q0K537J027k273j460J742K505j228l024O69K877j2k449r55K265J637
3890B084j940k266J637K653j249k328k77K992N36k749j259K341J626j542k132
3905a873Q10K898m38k597k40K255J155k052k008J879K304j238k883L02K916R33
3921B123l082r32K080J858j608k382J011K789p31k620m46L000J001k433j965K202
$$ plain form
3937 -135 2389 670 -1783 -1275 1856 1541 -1273 -2216 640 2544 -41 -1945 -428 2018 1011 -1617
3953 -1617 -1694 1214 1990 -519 -2099 249 1680 457 -1856 -1098 1695 1234 -1360 -1355 570 2016 -360
3970 -360 -2606 -521 2109 1242 -1651 -1468 1289 1994 -839 -2325 263 2507 416 -1951 -1037 2035
3986 2035 1581 -1407 -1752 928 2063 -152 -2160 -304 1800 878 -1800 -1513 1682 1718 -908 -2196
4002 -2196 584 2223 362 -2057 -398 1817 1502 -1444 -1946 734 2093 -786 -2126 -208 2216
4017 2216 628 -2303 -1098 1558 1809 -1173 -2077 294 2277 -127 -2090 -679 2354 1296 -1660
4032 -1660 -1359 968 2099 -967 -2241 324 1681 590 -2155 -1132 1580 1331 -1157 -1970 892 2152
4048 2152 -240 -2075 -197 1867 652 -1735 -1306 1361 1654 -1068 -1889 524 2169 193 -2086 -904
$$ packed form
3937a35K524j719k453N08L131l15k814r43K856J904k585j904J517K446j007k628
3953a617p7K908P76k509j580K348J431j223k313P58K793m61k594NJ925J446k376
3970c60k246K085K630q67k893J83K757P05k833j486K588K244k091k367R14L072
3986B035m54k988l45K680J135k215k008J856K104r22k678K87L195L6k626j288
4002b196K780J639j861k419J659K215l15k946n02K680J359k879j340J918K424
4017B216j588k931J205K656K51k982r04K371J983k404j963J411L033j058k956
4032a660L01K327J131l066j274K565J357j091k745J023K712k49k488q13K862J260
4048B152k392j835J878K064j215k387M29K667K93k722q21K413J645j976k279J182
$$ plain form
4064 -904 1938 1155 -1476 -1743 743 1936 -519 -2038 44 2236 931 -1739 -1185 1741 1674 -1041
4080 -1041 -2000 500 1965 -403 -2100 -825 2000 1210 -1703 -1459 1139 1967 -829 -2377 169 2112
4096 2112 156 -2090 -970 2164 1637 -1119 -1522 891 2154 -106 -1969 -399 1972 1085 -1751 -1222
4112 -1222 1543 1712 -592 -1978 39 2123 211 -2205 -1189 1602 1575 -1310 -1805 888 1735 -580
4128 -580 -1813 -235 1989 520 -1901 -1105 1526 1379 -1187 -2019 417 1953 -113 -2293 -366 1963
4144 1963 900 -1483 -1739 1038 1682 -454 -1872 194 2381 594 -1683 -1061 1826 1424 -1279 -1730
4160 -1730 1230 1998 -82 -2038 43 2048 873 -1686 -1739 1664 1710 -777 -1944 163 1994 293
4176 293 -2143 -781 1727 1434 -1463 -1692 816 2164 -218 -2197 33 1614 672 -1635 -1224 1395
$$ packed form
4064i04K842p83k631k67K486J193k455j519K082K192j305k670N54K926o7k715
4080a041r59K500J465k368j697J275K825p90k913K44K598Q28k796j548K546J943
4096B112j956k246J120L134n27k756m03K413J263k260j863J570K371q87k836N29
4112a222K765J69k304j386K017K084j912k416J016K791k7k885m95K693Q47k315
4128e80j233J578K224j469k421P96K631j47k566q32K436J536k066k180J927K329
4144A963j063k383k56K777O44k136j418K066K187j787k277O22K887m02k703m51
4160a730K960P68k080j956K081K005j175k559n3L403M6k487j167K107J831j701
4176B93k436J362K508k93k897k29K508J348k382j979K230J581r42k307M11K619
$$ plain form
4192 1395 1766 -873 -2003 101 2049 -59 -2199 -751 2084 1099 -1459 -1357 942 1708 -659 -2032
4208 -2032 -10 2008 783 -1614 -749 1521 1321 -916 -1709 781 1869 -178 -1919 -399 1569 1071
4224 1071 -1324 -1818 1051 2266 -849 -2030 222 1821 387 -1883 -661 1836 1628 -1496 -1539 958
4240 958 2293 -238 -2110 -112 1772 922 -1787 -1152 1110 1600 -912 -2062 385 1908 395 -2136
4256 -2136 -662 1872 1187 -1295 -1545 1134 1957 -209 -1648 310 1944 733 -2141 -1157 1679 1737
4272 1737 -1018 -1413 643 2055 174 -1978 -388 1511 920 -1779 -1543 1506 1898 -667 -1948 29
4288 29 1647 290 -2053 -856 1899 1332 -1056 -1581 1012 1892 -348 -1854 -320 2003 624 -1762
4304 -1762 -1037 1138 1533 -1054 -1698 194 1836 535 -2099 -656 1476 1105 -1655 -1813 481 2048
$$ packed form
4192A395L71k639j130K104J948k108k140J448K835r85k558J02K299P66k367j373
4208b032K022K018j225k397Q65K270k00k237p93K490J088k047j741J520J968m98
4224A071k395m94K869J215l115j181K252J599j434k270J222K497k08l124m3K497
4240I58J335k531j872J998J884q50k709O35K262M90k512j150K447J523j513k531
4256b136J474K534o85k482k50K679Q23k166j439J958J634j211k874R84K836N8
4272A737k755l95K056J412j881k152J590J899n91k699K36L049L92k565j281J977
4288B9J618j357k343J197K755n67k388n25K593Q80k240j506J534K323j379k386
4304a762P25K175L95k587o44J892J642j301k634J443K132l71k760j58K294J567
$$ plain form
4320 2048 -380 -1796 -123 1476 941 -1698 -891 1514 1500 -1121 -1356 246 2055 231 -2367 -537
4336 -537 1772 1206 -1578 -1532 1177 1698 -573 -1852 85 1648 243 -1842 -872 1432 1580 -1339 -1882
4353 -1882 594 1687 -231 -1770 -263 1796 1369 -1545 -1281 1389 1599 -741 -2044 214 1799 374
4369 374 -1627 -866 1355 993 -1370 -1473 708 1751 -169 -1768 -28 2309 508 -1332 -846 1343
4385 1343 1537 -679 -2035 215 1841 -162 -1936 -863 1514 1172 -1451 -1603 1100 1871 -785 -1912
4401 -1912 314 1633 770 -1946 -810 1371 1613 -672 -1877 403 1759 -48 -2014 -586 1812
4416 1812 1082 -1623 -1617 1103 1534 -844 -1992 -22 1736 358 -1743 -1075 1527 1528 -1379 -1263 856
4433 856 1878 -192 -1594 -201 1863 905 -1489 -1448 1378 1420 -1075 -1596 301 1615 336 -1894 -715
$$ packed form
4320B048k428j416J673J599n35k639Q07K405j4k621k35J602J809j824k598J830
4336e37K309n66k784M6K709N21k271j279J937J563j405k085R70K304J48k919n43
4353a882K476J093j918j539J507K059m27k914K64K670K10k340j303K258J585j425
4369C74k001P61K221l62k363j03K181J043j920j599J740K337j801j840M86K189
4385A343J94k216j356K250J626k003j774J073K377l42k623j52K703P71k656j127
4401a912K226J319q63k716J136K181K42k285j205K280J356j807j966J428K398
4416A812p30k705OK720M31k378j148J970J758j378k101O68K602Jk907J16K119
4433H56J022k070j402J393K064r58k394M1K826M2k495n21J897J314j279k230J179
$$ plain form
4450 -715 1685 960 -1470 -1362 820 1821 -262 -1986 -141 1761 433 -1877 -944 1315 1173 -606
4466 -606 -2062 120 1916 -379 -1448 -627 1754 978 -1415 -1476 1005 1675 -522 -1710 48 1762
4482 1762 477 -1448 -1055 1538 1408 -1051 -1511 462 1759 -5 -1999 -136 1350 802 -1431 -1596
4498 -1596 970 1391 -657 -1756 244 1740 44 -1765 -927 1485 1316 -1071 -1864 847 1724 -290
4514 -290 -1508 -295 1485 595 -1594 -1154 980 1290 -1167 -1487 251 1846 63 -1665 -916 1659
4530 1659 1203 -1421 -1529 529 1624 -294 -1752 -73 1686 706 -1805 -824 1618 1580 -1317 -1493 754
4547 754 1818 37 -1340 -506 1724 702 -1359 -1234 957 1660 -804 -1792 -29 1678 218 -1923
4563 -1923 -1009 1559 1156 -1174 -1570 809 1811 -278 -1518 234 1607 926 -1627 -1104 1432 1210
$$ packed form
4450g15K400p25k430J08K182J001k083j724J845J902j328k310R33K259j42j779
4466f06j456K182J796k295j069Q21K381p76k393o1K481O70k197j188J758J714
4482A762j285j925L93K593j30k459m60J973J297j764j994J863J486n48k233j65
4498a596K566M21k048j099K000J496j696j809Q38K412j69k387p93K711Q77k014
4514b90j218J213J780q90k189M40K134L10k457l20J738J595j783j728P49K575
4530A659m56k624j08K058J095j918j458J679J759r80k511R81K442l8k897j76K247
4547G54J064j781j377Q34K230j022k061J25K191P03k464r88J763J707j460k141
4563a923R14K568m03k330l96K379J002k089j240J752J373o81k553N23K536k22
$$ plain form
4579 1210 -646 -1671 296 1537 525 -1352 -626 1480 1069 -1145 -1439 495 1477 -214 -1769 -3
4595 -3 1385 566 -1451 -992 1223 1470 -551 -1474 402 1594 30 -1380 -548 1439 1223 -1296 -1493
4612 -1493 753 1467 -706 -1730 -127 1718 459 -1781 -869 1432 1355 -715 -1381 913 1716 -56
4628 -56 -1967 -272 1850 781 -1594 -1127 1105 1359 -371 -1729 506 1968 391 -1901 -594 1223
4644 1223 1098 -1216 -1786 608 1758 -357 -1460 -342 1357 684 -1346 -1058 1268 897 -508 -1731
4660 -1731 394 1488 126 -1828 -511 1105 1074 -1152 -1125 861 1570 -439 -2230 -150 1659 325
4676 325 -1227 -1027 1311 1434 -738 -1594 555 1927 -373 -1893 -232 1555 982 -873 -1082 869
4692 869 1669 -356 -1753 186 1987 97 -1468 -1097 1263 1414 -1317 -1481 720 1561 -250 -1689
$$ packed form
4579A210j856j025J967J241j012j877P26K106m11k214k94J934R82j691j555J766
4595cJ388q19k017M59K215K47k021r23J876J192j564j410Q32J987k16k519j97
4612a493K246P14k173j024J603J845j259k240R12K301p7k070o66K294Q03j772
4628e6j911J695K122j069k375M67K232K54j730j358K235J462j577k292J307J817
4644A223j25k314n70K394J150k115j103J118J699o73k030K88K326l71j405j223
4660a731K125J094j362j954J317J616l1k226K7J986P09k009j791K080J809j334
4676C25j552K00K338J23k172q56K149J372k300j520J661J787n73j855k09J951
4692H69Q00k025j397J939J801j890j565L71K360J51k731j64K201Q41j811j439
$$ plain form
4708 -1689 -321 1490 856 -1439 -1052 1342 1587 -594 -1501 390 1695 79 -1670 -778 1161 736
4724 736 -1264 -1607 642 1717 -401 -1449 -198 1210 730 -1519 -736 1370 1159 -685 -1558 345
4740 345 1423 249 -1257 -436 1508 1044 -853 -1117 842 1203 -501 -1463 -143 1862 459 -1519
4756 -1519 -937 1436 1312 -940 -1616 750 1549 -213 -1642 -352 1745 921 -1370 -1134 634 1240 -656
4773 -656 -1304 292 1410 -95 -1805 -770 1392 1017 -1060 -1586 424 1681 -82 -1271 -460 1298
4789 1298 452 -1169 -1028 1015 1340 -262 -1299 354 1498 70 -1528 -599 1564 910 -1116 -1204 921
4806 921 1744 -211 -2040 -221 1562 694 -1451 -1166 752 1236 -705 -1365 178 1617 279 -1452
4822 -1452 -184 1407 706 -1163 -1450 1059 1364 -482 -1414 -14 1313 329 -1345 -710 1112 1031 -989
$$ packed form
4708a689J368J811o34k295L87K394K45k181r07J891J305j616j749Q92J939m25
4724G36k000l43K249J075k118j048J251J408m80k249P83K106k11j844q73J903
4740C45J078j174j506Q21J944m64j897k64J959L61j704r62J320K005j403j978
4756a519N82K373j24k252o76K366P99j762j429J290K097q24k291K36J768O06j896
4773f56o48J596J118j505j710J035K162l75k077n26K010J257j763j189Q11J758
4789A298q46j621J41K043L25j602j037J653J144j428j598R29K163o54k026q8K125
4806I21Q23j955j829J819J783q68k145K85J918M84j941o60J543J439j338j731
4822a452J268J591p01j869k87K509L05j846r32J400J327r84j674O35J822q1k020
$$ plain form
4839 -989 -1619 302 1378 -138 -1775 -450 1214 456 -1327 -1204 977 1581 -459 -1774 463 1864
4855 1864 452 -1510 -853 1202 1117 -1164 -1546 707 1690 -28 -1636 131 1420 595 -1626 -788 831
4872 831 1231 -776 -1575 486 1821 350 -1997 -353 1673 892 -977 -928 961 1354 -618 -1372 -194
4889 -194 1459 454 -1324 -758 862 1163 -900 -1178 482 1398 63 -1401 -391 1460 818 -1079
4905 -1079 -1077 823 1596 -777 -1409 238 1745 124 -1426 -818 1056 797 -985 -1144 111 1734 -173
4922 -173 -1522 -282 1392 501 -1046 -1252 1158 1439 -335 -1307 175 1490 152 -1516 -637 1454
4938 1454 909 -1135 -1580 489 1515 -408 -1744 -312 1522 602 -1157 -880 1093 1393 -739 -1472
4954 -1472 645 1475 -84 -1325 -261 1947 1082 -905 -1265 907 1202 -568 -1591 -551 1405 435
$$ packed form
4839i89o30J921J076j516j637J325J664p58j783J23K181O04k040j315K237J401
4855A864j412j962O57K055q5k281l82K253R83j718j608J767J289q25k221Q38J619
4872H31M00k007p99K061J335j471k347J644K026p81j869M9J889L93j972p54J178
4889a94J653j005j778N66J620L01k063k78J660R16j335j464J010J851o42j897
4905a079KJ900P73k373o32J647J507j621j550O08J874k59j782j59J255J623j907
4922a73j349J240J674q91j547k06K410K81j774r72J482J315j338j668Q79K091
4938A454n45k044m45K069J026j923j336J432J834r20j759K77J973L00k132p33
4954a472K117Q30j559j241J064K208q65j987l60K172K95j770j023J040J956r70
$$ plain form
4970 435 -1529 -866 1017 1037 -827 -1551 542 1543 -284 -1379 -148 1345 898 -1240 -1029 1109 1299
4987 1299 -598 -1923 -113 1542 578 -1288 -647 1164 1118 -889 -1431 354 1708 -85 -1649 -486
5003 -486 1546 651 -1145 -1001 1270 1472 -734 -1145 189 1640 152 -1575 -763 1219 1021 -1294 -1415
5020 -1415 554 1339 -320 -1513 -94 1904 522 -1500 -933 704 1043 -849 -1381 378 1450 180
5036 180 -1085 -320 1455 956 -1115 -980 819 1336 -178 -1629 -201 1616 391 -1324 -797 923
5052 923 1070 -758 -1323 340 871 -169 -1493 -471 1207 515 -1245 -876 1131 1367 -498 -1517 -10
5069 -10 1167 273 -1312 -665 1339 1103 -834 -1261 671 1327 -78 -1835 -321 1275 494 -1228 -851
5086 -851 939 927 -455 -1285 228 1408 260 -1193 -575 1438 702 -915 -1384 878 1563 -30 -1355
$$ packed form
4970D35j964O63J883K0j864p24K093J001j827j095J231J493m47k138K11K138J90
4987A299j897j325J810J655r64j866O41J811m6k007n42J785J354j793j564J163
5003d86K032q95j796J44K271K02k206m11J334J451j488j727Q12J982j98k315j21
5020a415J969P85j659j193J419J998j382k022N67J637L39j892n32J759J072j270
5036A80j265P65J775m99k071J35J799N17j514j451J428J817j225j715N27J720
5052I23J47j828n65J663N31j040j324J022J678o92j760L69K007K36j865j019J507
5069a0J177q94j585O47K004k36j937m27J932O56j405j757J514J596p81j722L77
5086h51J790j2j382q30J513J180j148j453O18K013p36j617m69K262O85j593j325
$$ plain form
5103 -1355 23 1656 674 -1403 -803 1487 1201 -739 -1592 363 1016 -395 -1587 -607 1346 1010 -954
5120 -954 -1077 1170 1340 -247 -1476 105 1933 326 -1397 -960 1127 1205 -1126 -1395 199 1338 -128
5137 -128 -1859 -581 1726 803 -1238 -1106 1158 1279 -546 -1281 154 1500 7 -1261 -461 1019
5153 1019 922 -860 -1114 886 1316 -235 -1409 -8 1420 703 -1207 -959 1140 1173 -515 -1293 506
5170 506 1521 -43 -1649 -296 1428 1237 -1073 -1068 745 1096 -600 -1756 63 1449 504 -1173 -1027
5187 -1027 921 1169 -814 -1417 653 1314 -89 -1050 -612 1378 1230 -876 -943 1069 1317 -92 -1244
5204 -1244 180 1478 20 -1280 -867 1254 1135 -764 -1108 603 1425 -337 -1398 33 1044 678
5220 678 -1387 -846 929 1316 -605 -1521 288 1250 437 -1464 -867 1237 926 -1055 -1407 899 1725
$$ packed form
5103a355J378J633r82k077O00K290k86j940q53J955O53j411j192R80J953l36j964
5120i54j23K247J70j587j229J581J828j607j723M37K087P8k331k69J594J139j466
5137a28j731J278K307r23k041J32K264J21j825p35J435J346j493j268Q00J480
5153A019r7j782k54K000M30j551j174J401J428p17j910K48K099L3j688p78J799
5170E06J015j564j606J353J724j91k310NJ813L51j696j156J819J386r45j677J46
5187a027J948K48j983o03K070O61j403r61M38J990j48k106o7K012K48j409j152
5204a244J424J298j458j300M13K121j19j899l44J711Q22j762j061J431J011l66
5220F78k065N41J775L87j921r16J809R62q13j901N97K104l11j981l52K306Q26
$$ plain form
5237 1725 -456 -1543 -200 1446 701 -1175 -785 949 1231 -914 -1363 266 1305 171 -1584 -581
5253 -581 1313 679 -985 -1108 807 1506 -105 -1002 177 1150 396 -1112 -388 1190 951 -691 -1219
5270 -1219 753 1259 8 -1562 -451 1105 886 -1194 -1169 1017 1183 -303 -1382 75 1319 256
5286 256 -1285 -753 1087 1173 -769 -1128 668 942 -44 -1531 -354 1379 583 -1277 -1046 715 1071
5303 1071 -787 -1624 87 1667 397 -1374 -60 1127 957 -1063 -1287 687 1392 -245 -1278 -245
5319 -245 1379 414 -1336 -724 1000 993 -990 -1294 154 1610 56 -1176 -575 1365 816 -1063 -1098 832
5337 832 1455 -584 -1067 87 1485 211 -1265 -905 894 1044 -1202 -1098 582 1659 -369 -1335 -370
5354 -370 1085 790 -1078 -863 555 1281 -519 -1064 18 1565 542 -1323 -593 1200 1053 -471 -915
$$ packed form
5237A725k181j087J343J646p45j876L90J734K82k145m49J629J039j134j755J003
5253e81J894o34j664j23J915O99j611q97J179R73p54j508P24J578k39j642n28
5270a219J972N06j251j570J111J556k19k080K5K186J66j486j079J457J244j063
5286B56j541N32J840Q6j942l59J796K74r86j487J177J733p96j860K31J761L56
5303A071j858q37J711J580j270j771J314J187j70k020k24J974P05j637j033J033
5319b45J624r65j750O12J724pj983l04J448J456j554j232O01J940n49j879l5J930
5337H32O23k039m83J154J398j274j476L60J799J50k246J04J680J077k028r66R65
5354c70J455k95j868K15J418P26j800n45J082J547j023j865P30J793j47j524m44
$$ plain form
5371 -915 461 1357 -296 -1492 -77 1311 493 -1495 -593 1079 1023 -328 -1382 513 1521 -103
5387 -103 -1100 -331 845 604 -940 -994 862 1714 -667 -1103 187 1237 220 -1082 -856 1067 1003 -682
5405 -682 -1558 299 783 -60 -1444 -292 1489 518 -1038 -819 886 1278 -620 -1173 262 1979 604
5422 604 -1319 -789 1281 1077 -659 -741 364 1658 -373 -1466 -468 1261 769 -1285 -1212 933 1033
5439 1033 -305 -1377 114 1385 60 -1289 -531 1008 689 -1052 -1201 846 1170 -468 -1406 -232
5455 -232 1137 457 -1069 -651 508 1149 -539 -1401 299 1576 -21 -1457 -355 1161 992 -1041
5471 -1041 -908 794 1419 -467 -1500 -22 1415 238 -1569 -822 662 1052 -807 -1405 792 1490
5487 1490 -391 -1286 -325 1343 624 -868 -1007 880 1156 -577 -1352 60 1442 432 -1346 -376 1178
$$ packed form
5371i15J376Q96j653j196J415J388q18j988R02J672n6j351j054J895J008j624
5387a03r97P69J176k41j544n4J856Q52k381m36J290J050j017j302K26J923o4j685
5405f82q76J857M84q43j384J152J781r71j556K19J705L92j898n53J435J717j375
5422F04j923N30K070k04j736q2J105J294k031j093R98J729m92k054P3K145J00
5439A033j338j072J491J271j325j349P58J539l19j741j49K047L24j638r38J174
5455b32J369o80j526M18J159O41j688q62J700J277j597j436J102J516j69k033
5471a041J33J702O25j886j033J478J437j177j807P47J484L90j859n98K197O98
5487A490j881q95R61J668p19j492j39J887K76j733p75J412J382j010j778R70J554
$$ plain form
5504 1178 1184 -720 -1426 591 1203 -238 -1235 -338 1281 624 -1564 -842 1006 1173 -449 -1160 262 1363
5522 1363 -211 -1197 -435 1294 803 -1082 -720 318 1099 -77 -1155 168 1317 458 -986 -805 633
5539 633 1390 -615 -1304 380 1223 -232 -1362 -392 1308 937 -869 -970 911 932 -428 -1214 52
5556 52 1457 463 -1068 -295 1069 1146 -547 -1405 728 1360 -236 -1065 -340 1430 768 -1077 -817 812
5574 812 1036 -517 -1336 42 1446 493 -1314 -216 1047 761 -868 -943 498 1401 -136 -1651 63
5591 63 1606 650 -1395 -1054 1176 740 -786 -1516 402 974 83 -1302 -352 1624 866 -698 -741 357
5609 357 1187 -184 -1428 441 1427 452 -1156 -848 1170 942 -739 -1088 322 1398 -228 -1212 -302
5626 -302 1248 676 -1316 -1190 1159 1068 -619 -1469 42 1371 471 -1588 -715 1251 711 -696 -1328
$$ packed form
5504A178Oj904p06K017O12j441r97Q97J619o57k188P22J848J67j622p11J422J101
5522A363j574r86P62J729m91j885L62J038P81j176j078J323J149q59j444J81J438
5539F33P57k005o89J684Q43j455j130R70J700l71j806j01J881K1j360p86J266
5556E2J405r94j531P73J364P7j693q58K133O32j596q29P25J770o62j845K60J629
5574H12K24j553q19J378J404r53j807J098J263k86j629p5J441R03j537j515J714
5591F3J543r56k045L41K230m36j526p30J918N72q91j385R50J976p58j564m3J098
5609C57Q30j371j244J869R86r75j608L08K018k28j681l49J410J076j626r84R10
5626c02J550n72j992J26K349r1j687q50J511J329r00k059Q73J966n40j407o32
$$ plain form
5643 -1328 296 1251 -286 -1163 -245 1165 290 -1039 -469 1021 851 -989 -1455 -43 1602 34 -1135
5660 -1135 -362 1402 841 -650 -776 427 1247 -77 -1416 117 1308 431 -976 -606 1109 1305 -786
5677 -786 -1163 352 1393 146 -1241 -322 1158 502 -1040 -1086 488 1510 -706 -1401 -181 1371 463
5694 463 -891 -863 1201 852 -841 -1201 230 1395 -90 -1085 -338 924 609 -1229 -997 991 1156
5711 1156 -801 -1456 531 1087 124 -1333 -682 739 892 -780 -859 673 1260 -64 -1237 6 1433
5728 1433 393 -1301 -649 1052 1143 -164 -1158 466 1271 -77 -1232 -436 1175 656 -1181 -1145 889
5745 889 1298 -528 -1017 97 1119 561 -1130 -501 1331 1033 -690 -1130 444 1454 -159 -1382 -536
5762 -536 1149 665 -1062 -847 956 1476 -164 -1260 100 1252 201 -1706 -689 1153 902 -1040
$$ packed form
5643a328J624R55j537q77R18J410q75j329N70J490j70j840m66J412J645j568j169
5660a135P73J764n61j491j26J203Q20j324j339J533J191q77j407L70J715J96k091
5677g86l77J515J041j247j387R19J480o56j542m6J574J022k216o95J220J552r08
5694D63j354K8K064l49j693l60J431J165j485r95P47J262l15j838K32J988J65
5711A156j957o55J987N56r63j457O51J421J53j672p9J532N87j324j173J243J427
5728A433j040j694O52J701R1j307r94J624Q05j348j155P96J611n19j837L6K034
5745H89M09j826m89J114J022n58j691O29J832k98j723m40J574J010j613j223Q46
5762e36J685m84j727K15J803N20j640j096J360J152j051j907J017J842k51j942
$$ plain form
5778 -1040 -1011 417 1523 67 -1429 -158 1450 595 -997 -720 1107 1089 -632 -1187 334 1350 216
5795 216 -1353 -370 1343 608 -817 -1209 333 1322 -485 -1158 176 1257 531 -993 -341 1035 1122
5812 1122 -785 -1555 117 1453 67 -1300 -223 1145 485 -1362 -992 841 1218 -177 -1769 103
5828 103 1366 644 -1256 -566 1117 781 -807 -953 605 1165 -69 -1138 31 824 532 -1435 -796
5845 -796 877 1029 -417 -1385 117 1158 408 -1238 -440 1049 696 -950 -834 298 1233 -162 -1517
5862 -1517 -161 1362 451 -1239 -444 998 1140 -682 -1172 303 1176 292 -1484 -303 963 812 -965
5879 -965 -942 1026 833 -695 -1344 10 1472 233 -1397 -366 1328 428 -859 -1323 535 1126 -41
5896 -41 -1160 -402 838 632 -977 -1067 747 1322 -717 -1226 217 1000 253 -1185 -569 924 979 -885
$$ packed form
5778a040K9J428J106j456j496J271J608q55j592K77J827j8j721n55J521J016j134
5795B16j569R83J713p35j425l92J542R89j807o73J334J081p26j524O52J376Q7
5812A122j907p70J672J336j386j367J077J368o60j847L70J833L77j395j592J872
5828A03J263p22j900O90J683l36j588j46J558N60j234j069J169P93k92j967O39
5845g96J673J52j446r68J502J041p50j646P98J489l53j646J16J132R35j395j355
5862a517J356J523r11j690P95J442J42j822m90J475Q73q84j776J181J266j51j777
5879i65K3J968j93j528o49J354J462j239j630J031J694r00j287m64J858N91j167
5896d1j119P58J240k06j609r0J814N75k039n09J443P83p47j438O16J493N5j864
$$ plain form
5914 -885 -855 833 1008 -47 -1305 -72 1254 787 -1044 -1058 865 1195 -362 -1484 190 1362 47
5931 47 -1310 -512 848 517 -1033 -1121 591 1127 -344 -1285 168 1160 204 -1023 -694 1168 1030 -963
5949 -963 -1370 213 1357 33 -1771 -141 1326 613 -1123 -1019 1130 1180 -477 -1470 220 1277 90
5966 90 -1195 -718 973 992 -949 -632 595 1322 -164 -1115 -80 1138 617 -1116 -634 964 1303 -477
5984 -477 -1302 77 1455 -29 -1478 -421 919 901 -859 -1171 550 1591 -425 -1571 367 1364
6000 1364 668 -1138 -832 889 959 -812 -964 263 1085 48 -1458 -437 1130 810 -1221 -733 640
6017 640 1034 -289 -1310 294 977 -31 -1172 -480 592 972 -768 -929 580 1248 -197 -1184 -220
6034 -220 1125 521 -989 -583 986 817 -197 -1240 54 1503 -126 -833 -338 823 732 -677 -1247
$$ packed form
5914h85L0J688J75j055j258J233J326m67j831j4J923L30j557j122J674J172j315
5931D7j357P98J360l31j550q8J712N36j471r41J453R92r56j227L29J862j38j993
5949i63m07J583J144j324j804J630J467p13j736J04K149N0j657r93J690J057j187
5966I0j285M77J691J9j941L17J227P27j486r51J035J218n21j733M82J598L39j780
5984d77q25J379J378j484j449J057J340j8j760l12J721J041k016j146J938R97
6000A364o96j806L06J721P0j771j52J227Q22j037j506J021J567l20k031M88J373
6017F40L94j323j021J604O83j008j141O92J072L80j740j61J509O68j445r87R64
6034b20J345o04j510M06J569j69j014j043J294J449j629p07M95J161r1j409n70
$$ plain form
6051 -1247 250 1279 -341 -1339 -140 1205 376 -965 -551 892 1403 -593 -1399 324 1512 16
6067 16 -949 -600 1037 499 -869 -891 461 976 -600 -1208 170 1257 175 -1112 -464 785 393 -407
6085 -407 -966 532 1329 76 -1296 -119 1262 168 -1106 -1132 749 885 -371 -1209 213 1284 -42
6102 -42 -1453 -294 1179 690 -963 -996 547 748 -153 -1091 -241 1112 762 -956 -995 603 1038 -679
6120 -679 -1262 322 1211 258 -1432 -94 922 598 -752 -899 686 1239 -381 -972 98 1386 133
6137 133 -1095 -672 1184 782 -858 -983 38 1182 -120 -1018 -328 673 473 -807 -738 909 1422
6154 1422 -848 -1386 67 1386 -287 -1015 -540 1130 788 -843 -1138 468 1138 -128 -1299 -41
6170 -41 1190 331 -1002 -868 870 679 -623 -1290 213 1241 -253 -1591 -245 948 739 -617 -982
$$ packed form
6051a247J497J029j620r98J199J345q29j341M14J443N11j996q06J723J188j496
6067A6r65L49J637n38j368k2J352N15j576o08J378J087j082j287O48J249l92q00
6085d07n59J498P97j253j372J177J381j094j274k6J881J36j256q38J422J071j326
6102d2j411J159J473m89j653l3J543K01r01r38Q50J353l50j718l9J598M35j717
6120f79n83J584Q89r53j690J338J016l24j350j47J585N53j620n91J070J288j253
6137A33j228M23J856m02j640j25J021J144j302q98O90J001k00j280O9J647N13
6154A422k270n38J453J319j673p28M75J670l42j631k95J606O70j266j171J258
6170d1J231q59j333J34J738j91j302o67J503J028j494j338J346J193k09j356l65
$$ plain form
6187 -982 567 1006 -98 -901 210 1113 340 -1156 -549 998 825 -1015 -1227 449 920 -147 -732
6204 -732 -253 905 809 -838 -1014 126 1013 -122 -985 174 1060 -76 -872 -347 936 874 -703 -762
6222 -762 373 1259 96 -1041 42 1220 551 -1006 -785 715 753 -716 -1181 -97 1119 201 -1211
6239 -1211 -242 986 502 -592 -860 386 1156 -227 -794 -269 1196 700 -1025 -537 976 1059 -556
6256 -556 -842 65 1273 -181 -1299 -362 624 393 -790 -643 313 1137 -42 -889 420 1137 568 -970
6274 -970 -484 604 773 -966 -860 255 835 249 -1138 217 1172 436 -961 -889 317 813 -242 -1103
6292 -1103 327 795 232 -680 -415 1087 485 -685 -649 583 994 -98 -1073 -101 824 349 -1193 -959
6310 -959 767 1019 -711 -1177 -174 998 -74 -1096 -25 939 684 -844 -720 610 908 -447 -1031
$$ packed form
6187i82J549M39j104q03J111R03p73j496O07J547j73j840k12J676M71j067n85
6204g32M79J158r6j647j76J140Q87j135q63J159Q86j136p96N25J283o2j577n9
6222g62J135Q86j163j137J083J178o69j557K21J500L8j469m65J084J216r18j412
6239a211R69J228m84j094k68J246P70j383n67N25J465m96j725M88J513Q3j615
6256e56k86R07J208j454j118R37R86k31j183J47R56Q24j179q47J309P17n69j538
6274i70M86J088J69j739J06J115N80n86j387J355R55p36j397P2J206M96j055q61
6292a103J430M68n63r12K65J502o02j170L6J232M11j092r75R72R25m75j542K34
6310i59J726K52j730m66J003J172j072j022J071R64k55j528J24J330K98j355n84
$$ plain form
6327 -1031 -168 1283 316 -1032 -669 1094 606 -726 -1000 538 854 129 -1195 -321 1239 682 -945
6344 -945 -911 621 890 -112 -1091 -36 1346 637 -1027 -532 925 1107 -682 -888 636 1047 -87
6361 -87 -1026 -130 1041 349 -788 -675 759 883 -485 -1113 120 1103 384 -1172 -478 1123 503 -704
6379 -704 -1022 661 1210 -244 -1312 218 912 50 -753 -353 844 989 -162 -718 212 1144 -94 -1133
6397 -1133 -277 979 762 -731 -589 636 1074 -203 -787 147 812 301 -1019 -509 871 1039 -699
6414 -699 -841 541 824 58 -1156 -391 787 316 -994 -598 392 760 -529 -831 201 1101 -185 -1143
6432 -1143 -181 884 874 -482 -615 528 958 -166 -725 -72 1373 279 -1280 -681 1233 960 -555
6449 -555 -1002 -75 857 -70 -1108 -166 752 587 -871 -699 673 934 -383 -1009 -90 993 469 -765
$$ packed form
6327a031Q63J451r67j348L63J763m88j332k74J538L16p25j324Q74J560n57j627
6344i45L4J532K69j002r79J055J382p09j664M95J457J82j789k06J524M11j134
6361h7r39Q96J171o92j137J13J434J24j368o28J233R83p19j556O94J601o20j207
6379g04l18J683N49j454j068J530O94q62q03M00J197J45j151n56R30R32j238j039
6397a133Q56J256k17j493J42J225M38j277n84R34O65n11j320N10J380J68j738
6414f99j42J382K83p66j214P65J178m71j310L96R90L68j289l02J032R00j286r58
6432a143R62J065j0j356j33J143M30j124n59O53J445j094j559N99J914k73j515
6449e55m47R27R32r27j038R42R18j65j458J72J372K61j317o26R19J083n24j234
$$ plain form
6467 -765 -576 838 667 -727 -771 101 1026 -30 -1073 -439 770 227 -1056 -773 721 935 -384 -1162
6485 -1162 62 1012 -92 -1042 -400 1023 801 -400 -1073 637 875 -262 -1201 -3 1109 364 -980
6502 -980 -537 561 696 -640 -911 9 1033 -15 -807 -186 754 656 -668 -818 302 1008 -177 -1025
6520 -1025 297 1095 315 -798 -637 831 631 -610 -1192 36 1334 -15 -719 -235 780 430 -1077
6537 -1077 -513 491 1180 -181 -833 -103 1205 350 -1011 -596 1430 659 -734 -866 512 835 -154
6554 -154 -751 -74 619 475 -1081 -1024 614 700 -345 -622 342 1006 142 -842 -401 654 931 -479 -517
6573 -517 657 862 -35 -1329 -421 863 236 -578 -469 588 537 -504 -947 434 1149 23 -1184 -401
6591 -401 844 306 -780 -649 599 1036 -127 -1239 36 1041 343 -823 -375 900 556 -614 -606
$$ packed form
6467g65J89J414j71j394m4Q72R25j056j043O34J209n43j283K83J494K14j319p78
6485a162J224R50j104r50O42J423k22j201o73J710K38j137r39J198J112p45j344
6502i80M43J098J35j336k71R20J024j048p92O21R40r8j324j50J120P06j185q48
6520a025J322P98p80j113J61J468k00j241n82J228J298j349p04M84J015l50j507
6537a077N64J004O89j361o52P30J308q55j361M15K026p71j393j32J378L23r89
6554a54n97O77O93j44j556N7J638Q6j045k77R64O64q64r84M41J055K77j410l8
6573e17J174K05q97j294R08J284o27q14J09J057n1j041m43J381P15j126j207P83
6591d01J245n38j086J31J248M37j163j112J275J005o98j166M48J275l44j170Q
$$ plain form
6608 -606 535 1148 -158 -863 -169 1138 508 -885 -546 687 710 -519 -1178 330 1147 156 -931 -616
6626 -616 1110 661 -747 -765 489 1262 -499 -1091 78 818 267 -790 -725 757 1160 -706 -865 135
6644 135 1106 -189 -1075 -179 660 494 -780 -532 529 1081 -80 -1002 -7 896 536 -640 -601 680
6662 680 728 -831 -915 138 1094 -118 -992 -230 912 567 -904 -498 378 786 -610 -663 250 1008 503
6681 503 -939 -364 878 563 -756 -935 184 669 -202 -452 71 752 245 -661 -686 444 521 -374 -810
6700 -810 376 892 -462 -1130 -207 536 434 -738 -700 133 656 -411 -1115 -259 807 293 -748 -545
6718 -545 291 675 -663 -551 18 922 -137 -1154 -304 917 442 -705 -653 780 1036 -637 -1072 17
6736 17 1051 334 -537 -621 901 860 -634 -1004 381 1069 156 -657 -205 1019 587 -916 -640 814 946
$$ packed form
6608f06J141O13j306p05O94J307o30j393L39J233K3j229o59J508Q17r91j087L15
6626f16J726m49j408j8J254P73j761n92J169P40n51j057O5J482M03j866j59J000
6644A35R71j295q86Q96Q39j66j274K48J061N52j161r22R95R03l60j176L9J281
6662F80M8j559q4J053R56j212q74P62J142l45j471M06Q76M08j396n3R13P58n05
6681E03j442N75J242l15j319j79J119M85q71k50N23O81n07r06k5J130P7q95m36
6700h10J186N16j354o68R23P43j02j172L8Q33N23j067p04Q56J066n14j041K03
6718e45Q36L84j338J12N69R04j059j017Q50J221m75j147N2J433K56j673m35J089
6736A7J034p17q71q4J522m1j494l70J385O88r13q13M52J224m32j503K76J454J32
$$ plain form
6755 946 -535 -931 -69 1063 -119 -933 -814 965 841 -733 -647 751 1156 -149 -736 -81 759 234
6773 234 -1075 -375 559 487 -80 -925 191 1018 -239 -686 109 1140 452 -1101 -841 699 940 -592
6791 -592 -999 184 722 242 -649 -532 929 626 -757 -1082 701 730 -55 -1350 100 978 84 -1059
6809 -1059 -742 413 562 -485 -918 97 1100 71 -671 -51 378 502 -805 -817 621 800 -305
6826 -305 -724 -193 659 423 -1066 -823 586 791 -335 -1156 287 910 155 -907 -223 693 499 -698
6844 -698 -632 590 1175 81 -493 -138 706 203 -834 -137 984 513 -708 -1303 78 848 -65 -809
6862 -809 -84 899 369 -866 -710 422 612 -521 -857 -328 1106 51 -740 -291 576 909 -719 -562
6880 -562 247 1061 -14 -562 -262 594 353 -607 -533 294 1023 -538 -684 232 1089 -118 -810 -187 769
$$ packed form
6755I46j481l96Q62J132j182q14J19J779j24j574Q6J398M05j305n87O55Q40n25
6773B34j309P00R34p2n67q45J116Q27j257m47P95J031o88j553K60J540K41j532
6791e92m07J183N38m80q91J17J461l03j383l25J783K9p85j295J450Q78q94j143
6809a059L17J155J49j047m33J015J003j029p42O20M29J24j307j2J438J79j105
6826c05m19N31Q52k36j489K43J409K05j126q21J443O23p55j062O84R16j94j197
6844f98O6J222N85j094n74L55Q44n03j037O97J121m71j221n95J381P70r13p44
6862h09P25R83n30j235J56J132J90j133l36N29J434j055p91M49Q67L33j628J57
6880e62Q09Q14j075n48L00Q56k41r60P4Q27P29j561j46R16Q57j207o92O23R56
$$ plain form
6899 769 359 -423 -626 322 773 -154 -843 357 740 325 -453 -515 544 434 -398 -987 154 821 -258
6918 -258 -842 -472 508 212 -733 -900 577 772 -352 -717 73 871 159 -752 -407 712 367 -289 -843
6937 -843 343 1117 -84 -552 -36 1029 567 -674 -558 423 1035 -167 -487 465 704 0 -636 -190
6955 -190 573 278 -217 -684 271 864 76 -1135 -100 877 267 -801 -689 545 687 -420 -865 161
6973 161 630 -336 -992 -236 580 525 -982 -746 569 646 -495 -948 -150 668 348 -645 -678 636 576 -527
6993 -527 -813 348 790 -109 -642 -160 920 173 -852 -271 462 718 -147 -1036 -95 683 331 -838 -152
7012 -152 593 90 -535 -768 350 865 327 -862 276 739 -76 -814 -332 442 920 -521 -907 86 712
7031 712 -167 -666 -278 598 416 -564 -595 275 534 -331 -734 128 660 22 -718 -298 527 563 -310 -550 -54
$$ packed form
6899G69m10p82k03R48M51r27o89J200L83m15p78o2J059j10q32n89J141O67j079
6918b58n84L70R80k96r45j67J477J95j124l65P90P98p12r11L45J119l45o56n54
6937h43J186P74j201m68N16J065m62j241J16R81O12j202l20R52K39p04o36M46
6955a90P63k95m95m67R55N93p88j211J035R77o10j068J12J234J42j107m45J026
6973A61M69r66o56P56Q16n5j507K36J315P7j141m53P98Q18l20r93l3J314o0j103
6993e27k86J161M42q99n33M82J080p47j025N81P33K56q65q89R41P78l52j169O86
7012a52P45n03o25k33J118N15n38j189J138M63q15p38M82P74M78j441l86R93O26
7031G12q79m99L88Q76j82r80l1Q70K59q65m03Q62N32o38p40M20Q25L6q73k40M96
$$ plain form
7052 -54 1148 81 -981 246 417 86 -595 -1085 114 694 -346 -659 371 795 -151 -662 -450 351
7070 351 389 -648 -423 276 732 -280 -901 -131 515 287 -734 -690 700 647 -631 -722 -239 439 78 -869
7090 -869 -120 636 576 -778 -113 647 861 68 -841 40 636 189 -889 -510 829 616 -384 -920 238
7109 238 644 8 -625 -407 877 230 -652 -836 467 905 -311 -967 94 1199 142 -761 -335 789
7127 789 574 -414 -518 427 744 -289 -1016 129 734 168 -323 -562 567 616 -533 -965 -92 867 208
7146 208 -787 -200 423 435 -661 -268 621 683 -83 -801 50 153 426 -723 -481 1042 733 -35 -740 577
7166 577 1028 -198 -723 -235 881 321 -640 -443 546 459 -164 -519 222 598 442 -396 -257 435 616 -459
7186 -459 -876 472 1069 24 -1093 -330 649 204 -496 -612 310 503 -366 -483 -4 941 15 -835 -412
$$ packed form
7052e4J202j067j062J227J71l31o81m90J199N80j040l13J030M24r46n11K12Q01
7070C51L8j037K25O99M56j012o21P70O46k28j021M4J390n3j278r1M83O78l61r47
7090h69P49P56o0j354O65P60K14p93r09Q81N96m47j078L79J339k13j000n36J158
7109B38M06o36o33K18J284o47q82j84J303M38j216o56J061J105j057r03M26J124
7127G89k15r88j04R45L17j033p27J145O05n66m91k39J129M9j149m32Q73R59o59
7146B08r95N87O23J2j096L93Q89O2p66p18Q51J03K73j149K42J523l09p68p05J317
7166E77M51j226n25M88J116n60r61J97R89q7o23l55P41L76j56q38J39O92J81j075
7186d59m17J348N97j045j117P63R79m45p00j16R22J93q69j17M79R45r26q50M23
$$ plain form
7205 -412 731 743 -507 -731 455 793 -158 -865 351 660 218 -236 -522 447 513 -472 -664 208 632
7224 632 -3 -413 -231 659 409 -412 -331 666 672 -402 -495 -399 855 294 -941 -649 640 913 -340 -420
7244 -420 -65 844 110 -582 -286 322 683 -652 -512 330 532 -575 -683 263 905 231 -292 -53 243
7263 243 823 -415 -664 -81 951 7 -812 182 596 426 -328 -512 146 737 -371 -607 401 740 125
7282 125 -509 -393 552 410 -761 -643 19 555 -238 -930 -54 230 -83 -878 -480 534 110 -520 -1038
7301 -1038 515 667 -148 -745 -379 652 214 -543 -284 186 629 -260 -432 397 957 50 -545 -311 737
7320 737 495 -512 -502 -68 812 -85 -657 -687 976 141 -854 -557 348 792 -659 -885 86 789 -263
7339 -263 -830 -566 374 420 -496 -595 282 542 -143 -191 295 796 228 -435 17 269 580 -699 -549 284 388
$$ packed form
7205d12J143J2j250k24J186L38r51p07J216L09m42m54k86R69O6r85j92Q72M24
7224F32o35m10J82Q90k50q21Q1R97Oj074r3R6J254n61j235K92J289K73j253q0
7244d20L55R09p34o92K96O08L61j335J40Q42K02j107j08R46O42o74n23K39K96
7263B43N80j238k49N83J032r44q19R94M14j70p54j84O58N91j108k36J008L39o15
7282A25o34J16R45j42j171J18O62N36p93o92Q76K84l13p95L98J014m24o30n18
7301a038J553J52q15n97L66J031m38p57K59M70M43q89j72Q29N60r07n95K34J048
7320G37k42j007J0M34Q80q97n72l0J663q35r95K97R05M44j451k26R71P03j052
7339b63n67K64R40M6r16r9Q77K60o85m8M86N01n68o63M52K52L11j279J50Q33J04
$$ plain form
7360 388 -31 -615 -121 984 623 -441 -348 389 393 -377 -425 54 1050 147 -392 -254 552 514 -382 -57 313
7381 313 544 125 -503 -279 536 409 -268 -673 147 415 -374 -967 -287 775 69 -607 -337 527 420 -101
7401 -101 -485 214 489 -143 -777 15 330 324 -631 -271 545 334 -546 -741 356 718 470 -682 -312 729
7421 729 455 -578 -805 224 412 -320 -718 -41 472 -332 -832 -561 292 544 -257 -637 450 427 -388
7440 -388 -599 -91 523 197 -862 -501 342 632 -63 -835 409 509 -27 -390 -300 566 388 -394 -382 423
7460 423 663 190 -1268 -4 577 314 -560 -391 324 672 -376 11 59 714 -10 -574 31 225 473
7479 473 -304 -53 227 545 -249 -795 134 834 155 -510 -209 365 170 -347 -650 -57 624 -75 -727 -93
7499 -93 519 370 -717 -584 53 423 -123 -498 260 473 302 -495 -332 794 645 -96 -276 59 458 54
$$ packed form
7360C88m19n84M94J105l61j064R3P37Mp70m8M79R96r03n39J38Q06l8q96L25L70
7381C13K31m19o28K24Q15j27o77m05Q20K68p89n93O80J062p06o76K70Q64j07n21
7401a01l84O99K75o32o34P92L15or55L60Q16k11q80j95J097L62k48j152L70J041
7421G29k74j033k27J029J88p32l98O77N13q04n00K71Q53K52q01l80J087k3q15
7440c88k11N08O14l26j059L61Q43K90o95p72J244J00n36l63R0Q66j78p82J2Q05
7460D23K40m73j458J264N81k63q74J69P15L48j048L87M8O55p24n64O05J94K48
7479D73p77K51K80L18p94n46R29P00o79o65L01N74j95n17l03N93O81o99o52O34
7499i3O12j49j087J33O37L70n46l75P58K13j71p97J63J126j49p41j80L35L99m04
$$ plain form
7519 54 -538 189 388 143 -673 -270 77 385 -68 -608 -94 443 211 -512 -496 723 305 -461 -406 251 474
7540 474 -267 -837 -145 524 12 -634 -577 320 742 -547 -849 208 761 251 -690 -12 545 264 -409 -126
7560 -126 220 630 -217 -455 94 569 204 -709 -621 418 -101 -278 -528 285 610 71 -556 -147 382 73
7580 73 -234 -316 780 258 -406 -325 174 358 11 -436 204 423 314 -858 -444 522 290 -284 -585 -70
7600 -70 364 382 -700 155 720 129 -562 -512 33 201 40 -500 -449 335 121 -56 -317 420 559 -118 -354
7621 -354 -27 845 3 -797 160 461 83 -381 -623 174 316 55 -383 -275 472 307 -444 -66 200 418
7641 418 -368 -330 64 836 208 -353 -200 407 263 -282 -731 -31 277 -436 -247 -77 451 23 -482 5
7661 5 -113 507 -583 -466 130 374 -267 -268 -218 430 415 -470 -19 501 614 -167 -358 -168 646 135 -750 -286
$$ packed form
7519E4n92P27J99k45q16M03L47L08m53n40N14N37k32p23J6J219m18p66N5O57K23
7540D74p41n70O92O69n12o46N7Q97M22j289l02J057N53n10r41O78N57k81o73K83
7560a26L46M10q47k38N49M75l65r13Q8J039n19j77k50Q13L25n39o27M09N29l09
7580G3l07q2J096n22o64Q1M99J84l47m47O40K19j09j172M14R66k32n74l01N15
7600g0M34J8j082Q55N65n91o91N0N45J68j61n40N1P84k14j77k61P37J39o77k36
7621c54L27Q72q42q00R57L01l78m64k42P97J42k61m38J08P47j65p51L78K66K18
7641D18p86L8L94P72o28n61J53O07j44n45m49P00L08p13J89J70N28m28n05M87
7661Ej18O20j090J17N96K44o41jN0O48j5q85M51N20J13p81j91J90Q14n11q85M64
$$ plain form
7683 -286 437 135 -472 -569 -79 -16 -157 -375 131 653 294 -333 -339 486 385 -371 -108 -71 562 92 -343 -327
7705 -327 264 32 -95 -208 225 306 -179 -448 -241 527 148 -290 -520 298 304 -167 -476 245 546 18 -568
7726 -568 -185 333 265 -552 -423 364 272 -236 -411 55 782 180 -280 -304 538 438 -600 -498 519 774
7746 774 -124 -145 4 109 245 -436 -267 126 306 -36 -139 30 195 -32 -184 -154 316 332 -1 -386 267
7767 267 334 33 -595 170 263 94 -480 -575 138 508 -114 -659 84 240 -55 -223 -102 548 298 -620 -339
7788 -339 569 421 -159 -482 95 375 226 -465 -212 368 300 -624 -296 -37 401 -187 -478 -209 200 302
7808 302 -263 -342 462 490 -348 -744 51 236 -149 -410 -312 164 156 -505 -153 392 659 -44 -484 -359 312 576
7830 576 -535 -321 53 156 -243 -50 230 472 -142 -281 -120 300 125 -677 -117 -93 374 -166 -365 92
$$ packed form
7683b86P23l02o07r7M90O3j41k18N06N22l59o27oQ25j01p56K63L7O33m70m35J6
7705c27N91k32j27j13M33Q1m85k69K07P68l79m38k30Q18Om71l09P21L01n28n86
7726e68L83N18o8q17J29P87r2n08j75M66P27o02m60k4Q42j00j038J02J017K55
7746G74q98k1J49J05J36o81J69L93J80l42j03J69J65k27j52L0M70J6l33l85O53
7767B67O7l01o28P65R3j69n74r5P13L70o22n45P43J56k95j68J21O50k50r18K81
7788c39R08j48n80l23N77K80j49o91K53N80o8r24L28K59M38n88k91K69M09J02
7808C02n65p9Q04K8q38l96P95J85l85k61R8M76qo61L52N45K67p03m40J25O71K64
7830E76j111K14L74J03l99J93K80K42o14j39J61M20j75q02N60K4M67n40j99M57
$$ plain form
7850 92 325 -76 -453 -401 390 428 -322 -138 149 259 14 -456 134 631 122 -286 -328 91 171 -331 -751 94
7872 94 240 22 -440 -63 399 346 -244 -226 182 260 -76 -215 -411 369 16 -357 -47 543 481 57 -421 265
7894 265 113 -201 -248 223 467 277 -105 223 240 354 -315 -108 54 195 103 -280 -303 400 209 -524 -228
7915 -228 -125 369 -181 -474 -388 348 1 -184 -191 -76 320 -304 -286 17 453 273 -255 77 416 273 -230
7936 -230 -264 -44 302 -453 -382 -248 137 140 -332 -70 181 385 49 -123 263 324 -270 -348 -146 216 49 -92
7958 -92 -230 132 440 -302 -487 263 154 200 -374 -164 659 64 -354 -279 302 228 -98 -311 -8 188 179 -79
7980 -79 -182 179 373 -188 -192 50 383 267 -591 -127 148 189 -792 -483 -64 345 -296 -387 87 149 1 -197
8002 -197 -171 565 362 -438 -240 92 148 344 -67 64 242 108 -159 -83 159 528 -112 -143 125 447 486 -104
$$ packed form
7850I2K33m01l77N2P91L8p50J84K87J10k45m70N90M97n09m08m2M19Q0n02m20Q45
7872I4J46k18m62L77M62n3n90J8M08P8l36j39j96P80l53l73L10N90o2m24m78O86
7894B65j52l14m7M71K44j90l82L28J7J14o69K07J62J41r2l83k3P03j91p33K96
7915b28J03M94n50k93Q6P36l47j85pJ15L96o24J8L03M36j80n28L32L39j43n03
7936b30l4K20L46p55P1J34L85Lm72K62K51K04l36j72L86O1n94p8K02L62j67j41
7958i2j38L62L08p42j85P50j09M6n74K10Q23n95m18P5N81p4l26k13L03J96rk58
7980g9j03L61J94n61mK42L33j16q58M64K75M1r81L09M19M09o41r1M74O2j48j98
8002a97K6P36k03q00J98L32N6J96m11J31J78j34k67P6K42L69o40l1K68L22L9n90
$$ plain form
8024 -104 -142 62 156 -4 -367 141 241 -344 -208 -281 221 3 -153 -183 425 42 20 -134 -15 357 -59 -228
8046 -228 -120 172 210 -24 -242 419 296 -177 -108 -290 193 250 -51 -225 306 -244 -33 -244 405 289 -81
8067 -81 -269 114 364 -32 -274 -157 -250 215 199 -73 33 -1 122 -4 -189 -17 388 -113 -347 206 333
8088 333 27 -502 24 498 -104 -354 -243 153 300 -105 -506 -113 250 150 -582 114 466 163 -237 -103
8108 -103 -95 114 -326 201 143 421 166 -103 -103 164 159 239 -115 -13 345 -205 -365 56 135 -60 172 -242 -50
8131 -50 137 -462 -337 237 84 -210 -201 237 453 -136 -287 -89 254 160 -145 -132 -452 121 46 -291 -181 93
8153 93 60 -491 -249 97 154 -32 -535 -96 207 113 -310 58 -86 280 -197 -462 -14 169 43 -604 -66
8174 -66 279 -171 9 -146 152 262 -286 -64 -65 579 -76 -366 -91 356 369 -214 -265
$$ packed form
8024a04l8K04R4j60l63N08J00n85J36p3N02k18j56l0O08l83k2j54J19L72m16j69
8046b28J08K92L8k34k18O61j23m73O9j82M83N7l01j74N31n50K11k11O49j16l70
8067h1j88L83K50l96k42J17r3M65j6k72J06l4J23j26j85J72M05n01k34N53J27
8088C33l06n29N26M74o02k50J11L96J47m05m01L93L63j00p32O96L52l03m00J34
8108a03QK09m40N27n8K78k55k69%K67nQ0l54J02L58n50j60M21P9j95K32m14J92
8131e0J87n99J25N74j53k94RM38K16n89j51J98L43r4l05J3l20N73p5l37J10K74
8153I3l3n51K42L46N7j86n03M39L03r4m23L68j44L66m77k65M48J83j26o47N38
8174f6L45m50J80j55K98J10n48K22jO44o55k90K75M47J3n83n1
8191b65
$$ Imaginary data points
##PAGE= N=2
##DATA TABLE= (X++(I..I)), XYDATA
$$ plain form
0 0 0 0 0 0 0 0 0 0 0 0 -32 32 -32 32 -32 33 -64 65 -96 97 -128 160 -192 224 -257 289 -353 390 -459 525 -606
31 -606 682 -780 881 -994 1120 -1260 1407 -1571 1755 -1953 2165 -2403 2665 -2939 3247 -3584
47 -3584 3956 -4352 4798 -5286 5823 -6419 7087 -7837 8679 -9640 10750 -12042 13568
60 13568 -15412 17689 -20579 24378 -29631 37389 -50032 74143 -136621 633047 1201006
71 1201006 -491202 -739872 453208 1048725 -268224 -1231951 -380912 856385 303074
80 303074 -964301 -761066 651516 821351 -476174 -1026280 138918 980076 131909
89 131909 -881208 -219653 1025845 810722 -455196 -584982 571001 940571 -229428
98 -229428 -1013985 -164895 778026 141361 -966018 -630296 571515 573419 -597884 -918820
$$ packed form
0@%%%%%%%%%%l2O4o4O4o4O5r7J29j61J93k25K88l52M16m81N46o42P43q49R84j131
31f06J288j462J661j875K114k380K667k978L326l708M118m568N068n604O186o831
47c584P540q308R150j0084J1109j2242J3506j4924J6516j8319K0390k2792K5610
60A3568k8980L3101l8268M4957n4009O7020q7421J24175k10764P69668N67959
71A201006j692208k48670J193080N95517j316949r63727Q51039J237297n53311
80C03074j267375K03235J412582J69835j297525n50106J165198Q41158q48167
89A31909j013117O61555J245498k15123j265918j29786J155983L69570j169999
98b29428p84557Q49090R42921o36665j107379L35722J201811J904j171303l20936
$$ plain form
108 -918820 158730 780192 -92239 -902213 -183234 891828 540531 -559123 -459889 665069
118 665069 850056 -253075 -792780 85762 808172 98120 -843683 -413821 639426 498329
128 498329 -597402 -763156 277076 717830 -190954 -857137 -107149 803778 368730 -596571
138 -596571 -386357 663977 761101 -261923 -658596 222544 819445 68301 -753090 -253571
148 -253571 669611 408583 -587348 -621997 324714 599110 -273479 -792038 -64934 666849
158 666849 174456 -647338 -340607 590587 563293 -346794 -563611 264280 689146 -27239
168 -27239 -663241 -147767 612708 298021 -557373 -488015 371570 519222 -310478 -687704
178 -687704 31111 600972 57541 -632552 -258729 553017 431661 -387857 -477046 323686
$$ packed form
108i18820J077550O21462q72431q09974P18979J075062l51297j099654R9234J124958
118F65069J84987j103131n39705Q78542P22410p10052r41803M29862J053247j41097
128D98329j095731j65754J040232M40754r08784o66183P49988R10927m35048r65301
138e96571K10214J050334R7124j023024l96673Q81140N96901p51144q21391M99519
148b53571R23182k61028r95931l4649R46711K74396q72589n18559P27104P31783
158F66849m92393q21794L06731R31194k7294r10087k16817Q27891M24866p16385
168b7239o36002N15474P60475l14687q55394O9358Q59585J47652q29700l77226
178f87704P18815N69861n43431o90093L73823Q11746j21356q19518q9189Q00732
$$ plain form
188 323686 632265 -86528 -592892 -19404 628532 225810 -532277 -350306 434936 458613
198 458613 -323915 -576611 120930 562367 -7882 -596807 -174841 542924 331792 -422858
208 -422858 -405330 352311 542073 -154704 -536601 40142 570201 139756 -512542 -270543
218 -270543 436819 377756 -352448 -498443 175803 492698 -90880 -558318 -107101 483584
228 483584 212901 -430524 -329600 345888 439699 -200446 -464836 101526 514891 60737
238 60737 -474016 -172655 429659 288835 -350814 -396549 215624 424292 -131202 -494943
248 -494943 -37780 455150 138391 -429585 -255525 365433 367306 -240488 -401300 158440
258 158440 472068 4284 -437010 -96219 434050 234052 -357197 -323437 268330 383831
$$ packed form
188C23686L08579p18793n06364N73488O47936m02722p58087J81971P85242K3677
198D58613p82528k52696O97541M41437n70249n88925M21966P17765k11132p54650
208d22858J7528P57641J89762o96777l81897N76743N30059m30445o52298K41999
218b70543P07362n9063p30204j45995O74246L16895n83578m67438M51217N90685
228D83584k70683o43425J00924O75488R3811o40145k64390N66362M13365m54154
238F0737n34753L01361O02314j40824o39649m5735O12173K08668n55494l63741
248d94943M57163M92930l16759n67976J74060O20958J873o07794j60812N59740
258A58440L13628m67784m41294L40791N30269j99998n91249L3760N91767J15501
$$ plain form
268 383831 -181015 -452330 29966 426234 59662 -429555 -196539 358886 287617 -278632
278 -278632 -357617 192166 425010 -57956 -415775 -30449 427537 167275 -357238 -248008
288 -248008 291863 325370 -207176 -393724 77848 388192 215 -413987 -135521 353985
298 353985 212494 -304541 -295851 220702 357345 -109513 -367826 25037 391577 103025
308 103025 -341781 -176524 309756 271147 -228869 -329184 134774 352383 -51772 -379119
318 -379119 -71426 335895 144547 -310522 -241804 235419 302121 -153106 -337919 72644
328 72644 370036 42650 -337075 -115309 319679 216202 -245745 -275036 170848 318024
338 318024 -91314 -354690 -19501 332639 91679 -323389 -192410 256205 250132 -189863
$$ packed form
268C83831n64846k71315M82296L96268l66572m89217K33016N55425p1269n66249
278b78632p8985N49783K32844m82966l57819L85326M57986k60262n24513J09230
288b48008N39871L3507n32546j86548M71572L10344l87977m14202K78466M89506
298C53985j41491n17035Q690N16553J36643m66858k58313L92863L66540k88552
308A03025m44806J65257M86280l8609n00016j00315M63958K17609m04155l27347
318c79119L07693M07321j91348m55069O8718M77223O6702m55227j84813M10563
328G2644K97392l27386l79725K21766M34988j03477m61947k9291M45884J47176
338C18024m09338k63376L35189L52140k40960m15068J30979M48615o073m39995
$$ plain form
348 -189863 -299218 109003 333146 -5185 -319308 -66748 316789 168525 -255696 -224659
358 -224659 202839 281201 -125549 -315820 29672 307295 40606 -307482 -141220 251155
368 251155 195495 -208481 -260087 133187 294326 -49942 -297751 -18432 303097 116273
378 116273 -250341 -166907 215915 237258 -141049 -270876 67413 285269 1759 -295999
388 -295999 -94935 254046 146073 -227992 -220071 153540 250892 -87539 -273459 15939
398 15939 286348 74499 -251097 -125914 235207 206470 -163435 -235608 107838 267251
408 267251 -32387 -276664 -51517 248799 105339 -235232 -187479 166272 215604 -123160
418 -123160 -260293 44268 265292 26546 -251565 -87300 234224 163105 -171919 -193770
$$ packed form
348a89863j09355M08221K24143l38331l14123K52560L83537j48264m24221L1037
358b24659M27498P8362m06750j90271L45492K77623k66689l48088J66262L92375
368B51155n5660m03976n1606L93274J61139l44268k47809K79319L21529j86824
378A16273l66614Q3434L82822K1343l78307j29827L38289K17856k83510k97758
388b95999K01064L48981j07973l74065P921L73611R7352l38431j85920K89398
398A5939K70409k11849l25596J25183L61121k8737l69905p2173L43446J59413
408B67251k99638k44277K25147L00316j43460l40571M7753L53751M9332l38764
418a23160j37133L04561K21024k38746k78111J64265L21524p1119l35024k1851
$$ plain form
428 -193770 131940 242958 -54467 -249744 -9199 246257 70756 -232958 -143518 177360
438 177360 174354 -141819 -224816 65672 230890 -7990 -235044 -55038 224786 124646
448 124646 -179128 -157525 151491 213000 -76184 -215310 30104 232552 43257 -212926
458 -212926 -99476 184637 146557 -152128 -197416 87512 207795 -44174 -229500 -28233
468 -28233 211026 80038 -188770 -130585 154001 177675 -98406 -197358 52040 219124 12574
479 12574 -211121 -67341 190736 114546 -163124 -164827 105780 181128 -66050 -209902 -2856
490 -2856 199400 49395 -192008 -105271 161786 148622 -117233 -173190 74492 197286 -11780
501 -11780 -190626 -33760 185601 90364 -155434 -129218 123640 165122 -76978 -182288 29362
$$ packed form
428a93770L25710J11018k97425j95277K40545K55456j75501l03714Q9440L20878
438A77360l006l16173q2997K90488J65218k38880k27054J80006K79824j00140
448A24646l03774K1603L09016O1509k89184j39126K45414K02448j89295k56183
458b12926J13450K84113l8080k98685m5288K84928J20283k51969j85326K01267
468b8233K39259j30988k68808N8185K84586K3674k76081r8952K49398J67084k06550
479A2574k23695J43780K58077p6190k77670j703K70607P5348k47178j43852K07046
490b856K02256j50005k41403Q6737K67057j3164k65855n5957K47682J22794k09066
501a1780j78846J56866K19361r5237k45798K6216K52858M1482k42100j05310K11650
$$ plain form
512 29362 189907 24629 -176925 -69679 159191 116815 -120600 -144582 85659 173896 -33719
523 -33719 -179269 -12155 176548 58408 -160786 -104800 125055 131364 -94076 -162254 42193
534 42193 168690 413 -171199 -47771 158937 91610 -132528 -125230 98187 149450 -58713
545 -58713 -167136 6773 159912 29101 -160537 -83719 127023 108682 -107440 -145947 60416
556 60416 155474 -21708 -160010 -19758 155919 69978 -124637 -91338 112479 136963 -58834
567 -58834 -139027 34188 158814 16545 -148155 -54518 129504 83877 -110890 -120667 67827
578 67827 130300 -36876 -143510 -3958 144351 48079 -124405 -71869 114910 113632 -70535
589 -70535 -119043 47630 138771 -2130 -134061 -34356 120706 61482 -114156 -106124 69881
$$ packed form
512B9362J60545j65278k01554J07246K28870m2376k37415k3982K30241Q8237k07615
523c3719j45550J67114J88703j18140k19194N5986K29855O309k25440o8178K04447
534D2193J26497j68277j71612J23428K06708o7327k24138P298K23417N1263k08163
545e8713j08423J73909J53139j30811j89638P6818K10742j8341k16122l8507K06363
556F0416R5058j77182j38302J40252J75677q5941j94615L3299K03817K4484j95797
567e8834q0193J73215J24626j42269j64700R3637J84022m5627j94767r777J88494
578F7827O2473j67176j06634J39552J48309r6272j72484N2536J86779j278j84167
589g0535m8508J66673R1141j40901j31931R9705J55062n9224j75638Q032J76005
$$ plain form
600 69881 106755 -60176 -141335 2742 122607 15881 -128084 -59018 106186 88013 -77860
611 -77860 -102478 60091 131395 -11548 -121343 -8973 128098 50345 -107788 -77649 82202
622 82202 93499 -63677 -121196 17710 113312 1698 -123532 -42555 106966 70544 -83218
633 -83218 -84309 71210 116579 -20038 -100381 12342 123109 41360 -94283 -53961 89743
644 89743 83720 -65705 -104914 28996 98973 -16759 -118441 -33483 89498 41697 -90312
655 -90312 -76481 62101 92141 -34539 -95097 19340 112043 24274 -90697 -36225 88513
666 88513 65767 -66937 -85582 35638 84626 -25240 -107951 -21989 84765 27751 -92430
677 -92430 -65590 64292 75578 -45153 -84404 26441 99081 13649 -80517 -20347 91938
$$ packed form
600F9881L6874j66931q1159J44077J19865j06726j43965O9066J65204j8173j65873
611g7860k4618J62569P1304j42943j09795J12370J37071p7753j58133L0139J59851
622H2202J1297j57176n7519J38906R5602j11614j25230Q0977J49521l6422j53762
633h3218j091J55519M5369j36617q0343J12723J10767q1749j35643M0322J43704
644H9743o023j49425l9209J33910O9977j15732j01682Q4958J22981m7801j32009
655i0312J3831J38582L0040j26680o0558J14437R2703q7769j14971N4472J24738
666H8513k2746j32704j8645J21220M8988j09866q2711Q5962J06754n7014j20181
677i2430K6840J29882J1286j20731l9251J10845P2640q5432r4166O0170J12285
$$ plain form
688 91938 62135 -59813 -65096 53225 85759 -26281 -91339 -2462 81969 15695 -86610
699 -86610 -50847 60966 58531 -51535 -77131 28747 86837 -92 -78399 -10808 85457 46402
711 46402 -57795 -49058 53831 71946 -26611 -76126 4537 73902 8124 -82110 -42738 55646
723 55646 41874 -59325 -71787 25263 66104 -14394 -73931 -7581 73559 33800 -55889 -38538
735 -38538 57788 66723 -27409 -62097 18966 71947 3600 -69512 -26117 53918 31774 -55915
747 -55915 -60192 26610 55805 -21443 -69841 -1977 67544 22403 -54184 -27485 57503 56025
759 56025 -25904 -48063 25813 68160 3566 -60127 -15670 56870 28122 -54405 -50411 29711
771 29711 45203 -28935 -64225 -982 52768 8265 -55083 -25510 49057 43314 -30021 -41824
$$ packed form
688I1938k9803j21948n283J18321L2534j12040o5058Q8877Q4431o6274j02305
699h6610L5763J11813k435j10066k5596J05878N8090q6929p8307O7591R6265l9055
711D6402j04197Q737J02889J8115r8557m9515Q0663O9365o5778r0234L9372R8384
723E5646j3772j01199j2462R7050M0841q0498n9537O6350Q1140l9759q9689J7351
735c8538R6326Q935r4132l4688Q1063N2981o8347p3112M3395Q0035k2144q7689
747e5915m277Q6802K9195p7248m8398O7864O9521m5141p6587K6699Q4988j478
759E6025q1929k2159P3876M2347o4594o3693M4457P2540k8748q2527L994Q0122
771B9711J5492p4138l5290O3243N3750m4503o3348K9573P4567n743p3335j1803
$$ plain form
783 -41824 29513 60395 -1169 -48904 -3901 52604 21723 -44905 -37092 28480 37687 -28300
795 -28300 -56909 1580 45273 441 -53799 -21741 42059 30270 -31476 -35201 26692 50235
807 50235 -2908 -40993 1993 52435 21233 -38615 -24841 35085 35135 -25956 -44677 7240 38097
820 38097 -4691 -48369 -18598 34736 21306 -34263 -34163 24320 42177 -9376 -37949 5729
832 5729 45946 15780 -32022 -17093 33200 31619 -20674 -36655 10685 37124 -4583 -43782
844 -43782 -13076 32174 14107 -34087 -29248 19538 30030 -12616 -34125 4273 38533 10934
856 10934 -29818 -12754 32959 27860 -18376 -26899 14302 32167 -3602 -33194 -8540 27132
868 27132 11518 -29726 -25995 17010 24873 -15172 -32151 3837 31743 5375 -26784 -9525
$$ packed form
783d1824P1337L0882o1564m7735M5003N6505l0881o6628P813O5572R207o5987
795b8300k8609N8489M3693m4832n4240L2058O3800j1789o1746l725O1893K3543
807E0235n3143l8085M2986N0442l1202n9848J3774N9926N0o1091j8721N1917L0857
820C8097m2788m3678K9771N3334j3430n5569J00N8483J7857n1553k8573M3678
832E729M0217l0166m7802J4929N0293j581n2293j5981M7340K6439m1707l9199
844d3782L0706M5250j8067m8194M839M8786J0492m2646k1509L8398L4260k7599
856A0934m0752J7064M5713n099m6236q523M1201J7865l5769k9592K4654L5672
868B7132j5614m1244L731M3005P863m0045j6979L5988K7906k6368l2159J7259
$$ plain form
880 -9525 27154 22409 -15738 -21952 14101 30130 -3589 -29829 -3840 27163 9395 -27182 -19997
893 -19997 15591 19284 -14017 -27111 2577 25766 3623 -25316 -9848 24762 19102 -16019
905 -16019 -18915 14498 26361 -2933 -22968 -1927 23312 8587 -22144 -17675 14584 18368 -13835
918 -13835 -25910 2814 22568 792 -23171 -8186 19840 14997 -12704 -15536 11532 23299
930 23299 -1474 -20204 -787 22689 8385 -19055 -13473 12998 14701 -11317 -21251 186 17021
943 17021 1044 -20750 -9501 17135 14043 -12928 -15077 11030 21712 -581 -16246 163
955 163 20261 10028 -14054 -11534 11925 15354 -9619 -20812 442 16309 -894 -21018 -9603
968 -9603 12883 9466 -12187 -15134 6722 18120 277 -15939 -614 20286 10686 -12116 -9663
$$ packed form
880i525L6679m745l8147o214L6053J6029l3719k6240K5989L1003j7768l6577P185
893a9997L5588L693l3301j3094K9688K3189k2143k8939J5468L4610n660l5121
905a6019k896L3413J1863k9294k0035K1041K5239j4725l0731M469L2259L784l2203
918a3835j2075K8724J9754k1776k3963J4985K8026m843k7701k832K7068J1767
930B3299k4773j8730J9417K3476j4304k7440N582K6471J703k6018r934K1437J6835
943A7021j5977k1794J1249K6636l092k6971k149K6107J0682k2293j5665J6409
955A63K0098j0233k4082K520K3459L429k4973j1193K1254J5867j7203k0124J1415
968i603K2486l417k1653k947K1856J1398j7843j6216J5325K0900r600k2802K453
$$ plain form
981 -9663 13161 15985 -5944 -16784 -76 14476 1444 -18588 -11877 10372 9561 -13028 -17689
994 -17689 4644 16017 -1970 -15768 -1806 17406 10997 -8855 -8659 11793 17915 -1927 -14666
1007 -14666 2063 17779 3682 -15970 -9370 10934 9216 -11455 -17171 982 13000 -908
1019 -908 -17718 -6388 14487 9699 -11406 -10744 11141 17558 -1801 -13321 2217 17573 7367
1032 7367 -13007 -9692 11581 12558 -9879 -17721 2163 13972 -3481 -19466 -8006 11922 7466
1045 7466 -12817 -14049 7759 16637 -1552 -14842 1163 19344 8619 -13011 -7344 13740 14244
1058 14244 -6972 -15109 2380 15655 772 -17868 -8370 12741 8988 -13590 -15245 7685 15565
1071 15565 -3710 -16338 -374 17631 8206 -12256 -9419 13369 16732 -5511 -15914 4310
$$ packed form
981i663K2824K824k1929j0840J6708J4552j3032k0032O711K2249q11k2589m661
994a7689K2333J1373j7987j3798J3962J9212o409j9852J96K0452O122j9842j2739
1007a4666J6729J5716j4097j9652O600K0304j718k0671n716J8153J2018j3908
1019i08j6810J1330K0875m788k1105O62K1885O417j9359j1520J5538J5356j0206
1032G367k0374L315K1273R77k2437p842J9884J1809j7453j5985J1460J9928m456
1045G466k0283j232K1808Q878j8189j3290J6005J8181j0725k1630N667K1084N04
1058A4244k1216q137J7489J3275j4883j8640R498K1111l753k2578j655K2930P880
1071A5565j9275j2628J5964J8005r425k0462K837K2788L363k2243j0403K0224
$$ plain form
1083 4310 18093 1327 -17763 -6846 13880 9185 -13627 -16155 5822 15213 -3985 -19612 -3108
1096 -3108 17452 6355 -16133 -10249 13925 15136 -8163 -16134 4252 18541 2023 -17678 -7708
1109 -7708 15480 11266 -14477 -16299 8900 16696 -5519 -19324 -888 17853 6130 -16193 -10696
1122 -10696 14010 16502 -8043 -16872 5733 20917 1574 -18937 -4950 17984 10746 -14514
1134 -14514 -15238 9576 17475 -4889 -20082 -1308 19902 6372 -18117 -10505 16109 15378 -10787
1147 -10787 -17037 6991 19521 66 -19385 -6025 17909 10260 -16790 -16605 10427 17203 -8566
1160 -8566 -21459 499 19731 3429 -19601 -10533 16407 15216 -11904 -17915 7918 21717 -1195
1173 -1195 -20416 -2781 20968 9346 -17553 -14197 13007 17087 -9156 -21639 1178 20590
$$ packed form
1083D310J3783j6766j9090J0917K0726m695k2812k528K1977R391j9198j5627J6504
1096c108K0560j1097k2488N884K4174J211k3299p971K0386J4289j6518j9701R970
1109g708K3188m214k5743j822K5199P796k2215j3805J8436J8741j1723k2323N497
1122a0696K4706K492k4545q829K2605J5184j9343k0511J3987K2934p238k5260
1134a4514p24K4814P899k2364j5193J8774K1210j3530k4489P612K6614p31k6165
1147a0787o250K4028J2530j9455j9451J3360K3934p649k7050J85K7032O776k5769
1160h566j2893K1958J9232j6302k3030R068K6940j191k7120o011K5833J3799k2912
1173a195j9221J7635K3749j1622k6899L356K7204M080k6243j2483K2817J9412
$$ plain form
1185 20590 2494 -22037 -9530 18979 14246 -14399 -16610 11396 22129 -2416 -19673 -702
1197 -702 22730 10189 -18117 -13128 15998 18140 -10817 -21592 4077 20926 -667 -23165 -8826
1210 -8826 18278 12022 -16917 -18180 10607 21427 -5179 -21848 637 23532 6796 -20179
1222 -20179 -10713 18177 16884 -12060 -20454 6309 22087 -1246 -24457 -7180 21092 10243
1234 10243 -20252 -17572 13530 19441 -9212 -22573 2171 23784 5479 -21227 -9978 20827
1246 20827 17687 -14238 -19667 11343 24069 -3030 -23420 -2265 23361 9588 -20325 -16297
1258 -16297 15436 19403 -11118 -24092 3797 23937 1267 -24433 -8059 21653 14529 -16447
1270 -16447 -18268 12243 23163 -4636 -23866 -642 25012 7981 -21999 -13403 18176 18132 -14223
$$ packed form
1185B0590j8096k4531J2507K8509m733k8645k211K8006J0733k4545j7257J8971
1197g02K3432j2541k8306M989K9126K142k8957j0775K5669J6849k1593k2498J4339
1210h826K7104o256k8939j263K8787J0820k6606j6669K2485K2895j6736k6975
1222b0179R466K8890j293k8944q394K6763J5778k3333k3211J7277K8272j0849
1234A0243l0495K680L1102N911k8653j3361K4744K1613j8305k6706J1249L0805
1246B0827l140l1925n429L1010J2726k7099k0390K1155K5626j3773k9913M028
1258a6297L1733L967l0521j2974K7889K0140k2670k5700J6374K9712p124l0976
1270a6447j821L0511J0920k7799j9230K3224K5654j7031k9980Q596L1579m4l2355
$$ plain form
1283 -14223 -22568 6499 22976 -1039 -24556 -7705 21925 12535 -19820 -19079 14133 22134 -8794
1296 -8794 -24219 1946 25143 5375 -22615 -11157 20508 18162 -14663 -21537 10043 24835
1308 24835 -2694 -24964 -3329 24728 10119 -21899 -16298 16480 20526 -11056 -25087 3481
1320 3481 25387 2331 -25398 -9742 22849 15525 -18029 -19838 13336 24452 -5182 -24136
1332 -24136 -538 26015 9254 -22387 -15082 18818 19716 -14298 -24351 6501 24408 -1635
1344 -1635 -26173 -7387 22174 12656 -19857 -19451 14096 23596 -8037 -25101 2308 26541 6097
1357 6097 -23235 -10976 21406 18408 -15388 -22003 9495 24871 -2930 -26745 -5060 24216
1369 24216 9964 -23198 -17703 16904 20742 -12152 -24855 4253 26240 2988 -24351 -9053
$$ packed form
1283a4223q345K9067J6477k4015k3517J6851K9630r390l2355P41L3212Q001l0928
1296h794j5425K6165K3197j9768k7990J1458L1665k346l2825o874L1580J4792
1308B4835k7529k2270K1635K8057j4609l2018N601L2778M046l1582j4031K8568
1320C481K1906k3056k7729J5656L2591p324l3554j809L3174J1116k9634j8954
1332b4136K3598K6553j6761l1641P305L3900Q98l4014j0053L0852J7907k6043
1344a635k4538J8786K9561r518l2513M06L3547R500l1633j7064K7409K4233k0444
1357F097k9332J2259L2382k998l3796o615L1498J5376k7801k3815K1685K9276
1369B4216j4252l3162N495L4607L838l2894j2703K9108K1987k3252k7339J5298
$$ plain form
1381 -9053 24118 17113 -17741 -20007 14015 25106 -6052 -25966 -909 24808 7408 -23722
1393 -23722 -15300 18549 19723 -15034 -24693 7116 25769 -550 -26466 -6058 24386 13498
1405 13498 -19531 -17950 15744 24120 -7726 -24688 1805 26500 5555 -24831 -12244 21044
1417 21044 16937 -17250 -22770 9925 24210 -3663 -25806 -4396 24670 10688 -21765 -16596
1429 -16596 17904 21856 -11287 -23687 5626 25912 2137 -24937 -9006 22353 15625 -18626
1441 -18626 -20837 12501 24067 -7078 -26337 -493 25435 7023 -23478 -13437 20011 19417
1453 19417 -14235 -23130 7726 25700 -637 -25955 -6049 24688 12375 -21196 -18090 15653
1465 15653 21975 -9819 -25068 2474 25876 4473 -24423 -10865 22072 17572 -16810 -21458
$$ packed form
1381i053L3171p005l4854k266L4022J1091l1158j9914K5057K5717j7400l1130
1393b3722Q422L3849J174l4757r659L1809J8653k6319k5916K0408L0444j0888
1405A3498l3029J581L3694Q376l1846j6962K6493K4695k0945l0386J2587L3288
1417B1044m107l4187n520L2695J4285k7873k2143K1410K9066j3982l2453N169
1429a6596L4500L952l3143j2400K9313K0286k3775k7074J5931L1359o728l4251
1441a8626k211L3338J1566l1145j9259K5844K5928j8412l0501J0041L3448n94
1453A9417l3652q895L0856J7974k6337k5318J9906L0737j2313l3571L106L3743
1465A5653O322l1794j5249K7542K3402k1403k8896J3558L2937m500l4382m648
$$ plain form
1477 -21458 11856 24729 -4562 -25364 -2917 24320 9146 -22249 -16426 16943 20310 -12726
1489 -12726 -24535 5181 25484 1000 -24729 -7277 23321 14713 -18012 -18445 13976 24281
1501 24281 -6274 -24920 -100 25808 6500 -24367 -13615 19381 17377 -16054 -23107 8044
1513 8044 23818 -2144 -25799 -5438 24304 12348 -20684 -17005 17148 22912 -9919 -23537
1525 -23537 4670 25852 3761 -23804 -10117 21127 15898 -18007 -22309 10470 22975 -6477
1537 -6477 -26549 -2710 23711 7669 -22449 -14561 17961 19743 -11919 -22552 7012 26403
1549 26403 1884 -24034 -6173 23831 13926 -19048 -18634 13962 21788 -8433 -25404 -370 23535
1562 23535 4766 -24533 -13526 19708 17176 -15773 -21550 10092 24560 -1795 -23279 -2814
$$ packed form
1477b1458L3314J2873k9291k0802K2447K7237j5174l1395N823L3369L367l3036
1489a2726j1809K9716K0303k4484k5729J7452L0598q608l2725m33L2421J0305
1501B4281l0555j8646K4820K5908j9308l0867J0752L2996k004l3431p053L1151
1513H044J5774k5962k3655K0361K9742j1956l3032L679L4153N764l2831j3618
1525b3537K8207K1182k2091k7565J3687L1244n229l3905m302L2779J2505k9452
1537f477k0072K3839K6421j6042l0118P888L2522J782l1662j0633K9564J9391
1549B6403k4519k5918J7861L0004r905l2974M14L2596P826l0221j6971K5034K3905
1562B3535j8769k9299J1007L3234k532l2949n777L1642J4468k6355k1484K0465
$$ plain form
1574 -2814 24842 12147 -19136 -15587 16837 21387 -10436 -24097 3493 23929 1004 -25139
1586 -25139 -9895 20315 14009 -18671 -20690 11116 22822 -5362 -24817 -519 25114 8622
1598 8622 -21535 -12218 19927 19534 -12258 -21176 7167 24359 -20 -24712 -6947 21252 11479
1611 11479 -20504 -18750 13158 20594 -9708 -24146 1752 23757 4956 -21772 -10235 20620
1623 20620 18004 -14245 -19547 10858 24189 -2708 -23577 -2734 22722 9170 -20941 -15770
1635 -15770 14965 18690 -11600 -23649 3236 23313 1515 -23849 -8478 21458 14017 -16913
1647 -16913 -17492 13209 22616 -5144 -22799 -42 23726 7211 -21518 -13095 17739 16910 -14681
1660 -14681 -22045 6904 22020 -2202 -23697 -5969 21227 11487 -18294 -16437 14610 21609 -8209
$$ packed form
1574b814K7656j2695l1283L549L2424M550l1823j3661K7590K0436k2925k6143
1586b5139J5244L0210o306l2680k019L1806J1706k8184j9455K4298K5633j6492
1598H622l0157R317L2145l93l1792q918K8343J7192k4379k4692J7765K8199r773
1611A1479l1983J754L1908P436l0302j4438K5898K2005j8801k6728J1537L0855
1623B0620k616l2249n302L0405J3331k6897k0869K0843K5456j3552l0111N171
1635a5770L0735L725l0290j2049K6885K0077k1798k5364J5371K9936p441l0930
1647a6913n79L0701R407k7760j7655K2757K3768j6515k8729Q423L0834q29l1591
1660a4681p364K8949J5116k4222k1495J7728K7196r740k9781J857L1047O999k9818
$$ plain form
1673 -8209 -22199 3621 23936 4212 -21475 -9291 18795 15602 -15335 -20102 8911 21484
1685 21484 -4223 -23852 -3304 22115 8160 -20422 -13748 16244 18476 -10324 -20773 4949
1697 4949 23354 2242 -21562 -7216 20867 12963 -16891 -17125 11771 19992 -6770 -22900 -902
1710 -902 20939 5306 -20963 -12617 16932 16418 -12767 -19476 7901 22435 -831 -20926 -3412
1723 -3412 21519 10536 -17468 -14744 13489 18734 -8767 -21978 1884 21298 2191 -22464
1735 -22464 -9540 17906 12967 -14705 -17731 9649 20805 -2951 -20643 -1132 21890 8901
1747 8901 -17921 -11794 16347 17156 -10939 -19503 5079 20026 -239 -21651 -7470 18030 10607
1760 10607 -16974 -17131 10991 18605 -6463 -20210 1337 21569 5474 -18359 -8877 17179 15783
$$ packed form
1673h209j3990K5820K0315j9724k5687J2184K8086l193l0937m767K9013J2573
1685B1484k5707j9629K0548K5419j3955k8582O674K9992K232k8800j0449K5722
1697D949J8405k1112k3804J4346K8083p904k9854k34K8896Q221k6762j6130K1998
1710i02K1841j5633k6269Q346K9549n14k9185o709K7377J4534k3266k0095J7514
1723c412K4931j0983k8004K724K8233N245k7501j3211K3862J9414j9107k4655
1735b2464J2924K7446m939k7672l026K7380J1156k3756j7692J9511K3022j2989
1747H901k6822O127K8141Q09k8095q564K4582J4947k0265k1412J4181K5500p423
1760A0607k7581j57K8122P614k5068j3747K1547K0232j6095k3833R482K6056j396
$$ plain form
1773 15783 -11559 -17296 7501 20256 -1805 -20667 -4231 18867 8183 -17813 -14444 12288
1785 12288 16242 -8932 -19963 2485 20025 2789 -19017 -7319 18295 13402 -13407 -15552
1797 -15552 10408 19417 -3440 -19549 -829 19120 6250 -18499 -12090 13745 14474 -11576 -18622
1810 -18622 4978 18746 -845 -19756 -5195 17922 10484 -14225 -13447 11504 18241 -5832 -18675
1823 -18675 2167 20213 4461 -17980 -8644 15535 13206 -12317 -16712 6472 17837 -3052
1835 -3052 -19595 -3725 17485 7476 -16599 -11858 12770 15743 -7961 -17320 3974 19157 2273
1848 2273 -17654 -6279 16838 11048 -13087 -14602 8998 16573 -4823 -18460 -907 17593 4460
1861 4460 -16448 -10063 13281 13435 -9974 -16249 5657 18006 -480 -17897 -3661 17279 8648
$$ packed form
1773A5783k7342n737K4797J2755k2061j8862J6436K3098j0684k5996L369K6732
1785A2288L954k5174j1031K2448J7540j7236k1806J1698K5614m893k6809k145
1797a5552K5960R009k2857j6109J8720J9949j2870k4749O409K5835P29k6050p046
1810a8622K3600J3768j9591j8911J4561K3117p438k4709P78K4951O737k4073j2843
1823a8675K0842J8046j5752k2441R336K4179k329k5523m395K3184J1365k0889
1835c052j6543J5870K1210j0009k4075M741K4628K973k3704r359K1294J5183j6884
1848B273j9927J1375K3117n790k4135j515K3600P575k1396j3637J7553J8500j3133
1861D460k0908O385K3344J54k3409o275K1906J2349j8486j7417J4236K0940q631
$$ plain form
1874 8648 -14050 -12357 11227 15837 -6291 -17676 1617 17603 2927 -17366 -7444 14599 11041
1887 11041 -11723 -14819 7735 16366 -3224 -17290 -2128 16482 6598 -14651 -10954 12216 14318
1900 14318 -8293 -16063 3852 17300 959 -16456 -5249 15325 9772 -12586 -12742 8954 15198
1913 15198 -4654 -17075 445 16498 4132 -15799 -8329 12976 11702 -9803 -14404 5426
1925 5426 16191 -1254 -16674 -3368 16031 7538 -13426 -10901 10885 13941 -6477 -15405 2231
1938 2231 16772 2213 -15529 -6653 13803 10226 -11597 -13656 7401 14869 -3701 -16201 -1126
1951 -1126 14979 5323 -13712 -8994 11310 12482 -7817 -14267 4494 15938 640 -15333 -4078
1964 -4078 14521 8229 -11805 -11311 8673 13556 -5086 -15199 478 14769 2992 -14424 -7186
$$ packed form
1874H648k2698J693K3584M610k2128j1385J9293J5986j4676k0293R922K2043l558
1887A1041k2764l096K2554Q631j9590j4066J5162J8610r884k1249L697K3170K102
1900A4318k2611p770J9915J3448j6341j7415J1207K0574n553k2358j56K1696O244
1913A5198j9852j2421J7520J6053j2366j9931P470K1305j274k1505m601J9830
1925E426J0765j7445j5420J3306J9399q493k0964K525K1786L056k0418q928J7636
1938B231J4541j4559j7742Q876K0456l577k1823k059K1057P468j8570j2500J5075
1951a126J6105r656j9035M718K0304J172k0299o450J8761J1444j5298j5973J1255
1964d078J8599o292k0034M94J9984M883j8642j0113J5677J4291j1777j7416P238
$$ plain form
1977 -7186 12110 10371 -9066 -12734 5759 14414 -1281 -14453 -2326 14273 6697 -12217 -9396
1990 -9396 9817 12580 -6330 -14068 2395 14698 1307 -14423 -5584 12076 8719 -10402 -12116
2003 -12116 6546 13205 -3394 -14174 -600 14371 4337 -12721 -7558 10622 10960 -7150 -12562
2016 -12562 3976 13745 -197 -13552 -3755 12713 7016 -11222 -9943 7660 11714 -4741 -13136
2029 -13136 818 13153 2856 -12570 -6256 11490 9315 -8443 -11478 5495 13127 -1768 -12724
2042 -12724 -1709 12559 5349 -11291 -8309 8844 10582 -5988 -12294 2060 12934 931 -12837
2055 -12837 -4121 11375 7288 -9247 -9911 6330 11705 -3153 -12482 -208 12617 3488 -11398
2068 -11398 -6520 9615 9432 -6583 -11060 3762 12265 -604 -11983 -3217 11262 5841 -9603
$$ packed form
1977g186J9296j739j9437l668J8493Q655j5695j3172J2127J6599p576j8914K821
1990i396J9213K763j8910p738J6463J2303j3391j5730Q839J7660l357j9121j714
2003a2116J8662O659j6599j0780J3574J4971j0034j7058N163J8180L38j8110n412
2016a2562J6538R769j3942j3355R797J6468n697j8238J279J7603M054j6455q395
2029a3136J3954J2335j0297j5426O314J7746k175j7758l035J6973P632j4895j0956
2042a2724J1015J4268p210j6640K982J7153J738j6570o306J4354J0874j2003j3768
2055a2837Q716J5496m087j6535o64J6241N375j4858r329J2274J2825r129j4886
2068a1398M878J6135j83j6015m477J4822Q503j2869j1379Q766J4479n421j5444
$$ plain form
2081 -9603 -8772 7691 10518 -4757 -11674 1519 12111 1825 -11304 -4831 9877 7845 -7613
2094 -7613 -9973 5205 11130 -2246 -11800 -1273 11323 4154 -10172 -6791 8167 9166 -5494
2107 -5494 -10880 2262 11284 600 -10984 -3542 9744 6087 -8730 -8313 6016 9722 -3115
2120 -3115 -11007 35 10900 2821 -10263 -5622 8612 7782 -7039 -9431 3949 10573 -949
2133 -949 -10575 -1727 9796 4805 -8551 -7427 6761 8803 -4527 -10107 1661 10505 1041 -10291
2147 -10291 -3967 8625 6133 -6694 -8141 4578 9649 -2085 -9868 -680 9982 3081 -9390
2160 -9390 -5830 7478 7357 -5625 -9250 2626 9781 -145 -9706 -2815 8476 5101 -7911 -7521
2174 -7521 5556 8995 -3268 -9546 556 9338 1963 -8817 -4174 7722 6540 -5773 -7951
$$ packed form
2081i603Q31J6463K827j5275o917J3193J0592j0286j3129O473J4708k032j5458
2094g613k360J5178N925j3376r554J0527J2596p169j4326L381J4958R99j4660
2107e494n386J3142R022j0684j1584P442J3286l657j4817M17J4329L706j2837
2120c115p892J1042J0865q079j3084M641J4234q30j4821k392J3380O624j1522
2133i49r626Q848J1523m991j3356J124J4188K042j3330n580J1768Q844r464j1332
2147a0291O324J2592k492j2827j447J2719N071j1734p783R188J0662o901j2471
2160i390L560J3308j21j2982l625J1876P155r926r561O891J1291l375j3012L90
2174g521J3077L439j2263o278J0102Q782p375j0780M643J1896j182j2313k178
$$ plain form
2187 -7951 3723 9218 -1398 -9504 -1370 8842 3696 -8143 -5966 5878 7599 -4005 -8908
2200 -8908 1707 9397 1128 -9449 -2821 7977 5443 -6368 -7077 4383 8145 -1774 -8652 -463
2214 -463 8704 2646 -7967 -4854 6434 6961 -4980 -8254 2835 8497 -174 -8447 -2148 8043
2228 8043 4414 -6613 -6229 5198 7746 -2897 -8305 750 8223 1701 -7441 -3596 6438 5933
2242 5933 -4889 -6854 3161 8260 -756 -8176 -1162 7824 3215 -7174 -5268 5406 6628 -3656
2256 -3656 -7706 1437 7555 645 -7620 -2835 7052 4501 -5329 -6293 4189 7593 -1638 -7495 -178
2271 -178 7573 2282 -6605 -4015 5601 5591 -4280 -6801 2181 7331 -270 -7203 -1963 6757 3674 -5710
2287 -5710 -4891 4231 6512 -1685 -6715 775 7437 1548 -6821 -2994 6118 5005 -4262 -6144 2565
$$ packed form
2187g951J1674N495j0616q106Q134J0212n146j1839K177J1844J721j1604m903
2200h908J0615P690q269j0577O628J0798k534j1811p09J1460L762r919o878Q189
2214d63R167o058j0613L113J1288N27j1941l274J1089N662q671q273O299J0191
2228H043l629j1027L84J1427K548j0643n408R055P473o522r142L845J0034n05
2242E933j0822j965J0015N099r016p420P014Q986m609j0389J906J0674J222j0284
2256c656m050R143O118o910q265M785R887k551r830r64J0482L404r231n857P317
2271a78P751n291q887K590R616j0r871k521Q982N150p601o933N240Q720l083r384
2287e710Q19R122K281q197n030P490O662n889q369L827R112j113r267j882Q709
$$ plain form
2302 2565 6544 -1060 -7286 -1377 6428 2840 -6137 -4381 4134 5527 -3182 -6271 1168 6711 787
2317 787 -6053 -2012 5653 4063 -4396 -5373 3335 5882 -1666 -6186 -317 5959 1693 -5396 -3976
2332 -3976 4191 4627 -3591 -6051 1285 6212 -128 -6352 -1233 5781 3271 -4410 -3963 3696 5475
2347 5475 -1634 -5498 612 6040 1458 -5345 -2369 4632 3493 -3987 -5115 2377 5276 -813 -5669
2362 -5669 -974 5407 2413 -4565 -3529 4195 4840 -2462 -4924 1185 5368 492 -5690 -1680 4612
2377 4612 3045 -3628 -4144 2317 4755 -1317 -5445 -377 5066 1588 -4814 -2708 3986 3686 -2602
2392 -2602 -4070 1503 4912 -85 -4831 -835 4830 2504 -4034 -3107 3096 3877 -1665 -4638 472
2407 472 4499 638 -4349 -2351 3748 3145 -3080 -4025 1985 4724 -735 -4495 -776 4620 1808 -3766
$$ packed form
2302B565L979p604o226N909P805l588q977J756Q515J393q709l089P439N543n924
2317G87o840M041P665j590q459r77Q708K547p548m520N869O276m266p089J420
2332c976Q167M36q218k460P336M927o340o224N119P014k510p681M47P659J779
2347E475p109l864O110N428m582o803K976P001j139p480j128P492K899o089m856
2362e669M695O381k994o978J036P724O45p302k462O109M183m876o182M010O292
2377D612j567o673n16O461K438o072m128N068N443l478o402K106O694l00o288
2392b602j468N573L409m997m746L996N665k326o538R27O203P81n542k973N110
2407D72M027l861m987J998O099o03o225r45O010K739n459l760L719N396k812n574
$$ plain form
2423 -3766 -2618 2840 3815 -1954 -4278 884 4477 488 -4293 -1475 3646 2471 -3249 -3407 2286
2438 2286 3777 -1197 -4444 -240 4394 1248 -3532 -2143 3519 2894 -2261 -3645 1380 3935 46
2453 46 -3992 -911 3923 2318 -3325 -3018 2759 3859 -1361 -3920 635 3908 599 -3615 -2234 2983
2469 2983 2464 -2665 -3298 1285 3629 -759 -3871 -352 3744 1328 -3276 -2269 2207 2947 -1602 -3549
2485 -3549 874 3650 337 -3141 -1244 3032 1850 -2925 -2694 1913 3026 -1315 -3502 -77 3583
2500 3583 953 -2978 -1965 2657 2563 -1898 -3010 1460 3541 -200 -3317 -279 3166 1686 -2900
2515 -2900 -2393 2307 2964 -1232 -3495 211 3119 52 -3209 -1375 2531 2120 -2289 -2687 1122 2672
2531 2672 -319 -2864 -133 3031 1213 -2390 -1732 2243 2456 -1294 -2675 619 3107 155 -2736
$$ packed form
2423c766J148N458R75n769k324N162L593l989m781K818N121j175n720j58N693
2438B286J491m974l247M204M634l146m780J389N662o25n155j384N025K555l889
2453D6m038L081M834j605n643L07N777J100n220k559M555L273l309m214J381N217
2469B983n19n129o33M583K344m388l112L519M096k416m604J007M476P40m549j947
2485c549M423K776l313l478J897M276j182m775K31M607J113m341k187L425L660
2500C583k630l931J013M622r4m461j112M470K081l741l117L038L445j480m586
2515b900N07M700O57m196k263L706K908l067l261J834L906m11m409l98L809J550
2531B672k991k545K731L164j818l603O58L975K13l750j381L294K488k952k891
$$ plain form
2546 -2736 -661 2527 1443 -2247 -2249 1354 2947 -1179 -3011 161 2684 961 -2765 -1012 1744 2104
2562 2104 -1434 -2544 1061 2782 -117 -2719 -539 2521 1120 -2614 -1481 1662 2075 -1123 -2722
2577 -2722 90 2297 179 -2410 -1049 2141 1714 -1965 -2366 1142 2395 -146 -2569 -427 2485
2592 2485 863 -1833 -1468 1867 2091 -1184 -2200 580 2648 -122 -2554 -900 1646 1053 -1744 -1675
2608 -1675 963 2061 -593 -2124 -107 2342 432 -2116 -1491 1719 1745 -1495 -1915 541 2388 52
2624 52 -1989 -523 1824 958 -1696 -1445 1190 1889 -487 -2251 388 1888 94 -2009 -851 1462
2640 1462 1172 -1392 -1844 842 1955 -429 -2228 51 1864 809 -1458 -1233 1224 1297 -717 -2017
2656 -2017 382 1890 -53 -1688 -549 1430 1111 -1328 -1578 773 1617 -419 -1714 119 1884 698
$$ packed form
2546b736K075L188j084l690kL603J593m126j832L172K523j723l726J753K756L60
2562B104l538j110L605J721k899k602K180L060j401l734J133L143M13l198j599
2577b722K812K207k118k589J361L190m27l679m01L508J253k541k423K142K912
2592B485j622k696L65L335K24l275j016K780K068k770k432J654K546n93k797O9
2608a675K638J098k654j531K017K449j910k548O25L210K6l240m20K456J847k336
2624E2k041J466K347q66k654K51K635O99k376j764K639J500j794k103J158K313
2640A462k90k564m52K686J113k384j799K279J813j055k267K25K457P3k014j300
2656b017K399J508j943j635J139J979l19k439k50K351Q44k036j295J833J765j186
$$ plain form
2672 698 -1620 -808 1321 1677 -1144 -1722 779 1672 70 -1516 -120 1601 732 -1478 -1269 1060 1209
2689 1209 -409 -1612 575 1621 0 -1642 -632 1365 1039 -527 -793 655 1947 -236 -1126 43
2705 43 1380 803 -1369 -558 959 1041 -753 -1168 54 1694 -59 -1764 -505 1436 585 -971 -964 818
2723 818 1038 -310 -1072 -71 1373 322 -1153 -483 1288 1181 -817 -1001 487 1164 191 -1290 -164
2740 -164 896 751 -1074 -892 593 984 -478 -1080 38 1327 -54 -985 -530 906 856 -844 -990
2757 -990 533 1245 -425 -901 107 1071 418 -923 -541 698 1132 -573 -1009 228 1016 48 -848 -445
2775 -445 984 731 -851 -596 622 1037 -180 -1040 -197 796 -263 -869 -686 935 285 -377 -845 448
2793 448 848 -102 -903 -171 862 214 -799 -294 928 933 -270 -1223 505 1065 -79 -750 -470 527 284
$$ packed form
2672F98k318Q12K129L56k821n78K501Q93j602j586J396J721q69k210K09K329J49
2689A209j618j203K187J046j621j642J010J997l26j566k66J448J292k183q90J169
2705D3J337n77k172Q11J517Q2j794m15J222J640j753j705J259J941q51j556PJ782
2723H18K20j348p62J001J444j051j475O70J771j07j998j84J488O77r73j481J126
2740a64J060j45j825J82J485L91j462o02J118J289j381r31M55J436n0j700j46
2757i90J523P12j670m76J008R64o53j341L82J239M34j705m36J237P88r68q96M03
2775d45J429k53j582K55J218M15j217q60Q43R93j059o06J83J621o50o62m68J293
2793D48M00r50q01P32J033o48j013N05J222Nj203r53J728N60j144o71K80R97k43
$$ plain form
2812 284 -634 -530 487 781 -146 -308 -118 649 -61 -757 -487 650 572 -718 -634 277 881 -21 -816 -269
2832 -269 601 176 -729 -393 634 975 -615 -827 168 689 90 -815 -182 891 269 -748 -390 318 661
2851 661 -170 -276 -245 150 507 -734 -311 494 517 -197 -462 561 677 33 -619 -290 416 307 -254 -140
2871 -140 765 603 -90 -521 -49 566 262 -817 -35 727 346 -546 -614 621 519 200 -415 -159 556 175
2891 175 -597 -213 465 518 -488 -276 89 63 86 -549 104 333 173 -382 -271 261 202 17 -511 -88 602
2912 602 -190 -709 -204 291 151 -236 -197 313 808 56 -465 232 440 134 -140 -292 160 49 -63 -316
2932 -316 348 361 -193 -444 45 251 -282 -306 -391 464 210 -29 -450 -51 557 23 -553 216 791 57 -558
2953 -558 -277 122 268 27 -343 547 203 -261 -658 3 174 -95 54 -260 67 185 -363 -197 -175 424
$$ packed form
2812B84r18J04J017K94r27j62J90P67p10o96K70J137p8j290Q4R11O04r02p95N47
2832b69Q70m25r05L36J027L41j590k12R95N21n99r05O33J073o22j017L58P08L43
2851F61q31j06L1L95L57j241M23Q05K3p14k65J023J16o44o52L29P06j09n61J14
2871a40R05j62o93m31M72O15l04j079P82P62l81q92o8J235j02l19o15K56P15l81
2891A75p72L84O78N3j006K12L65k6K3o35O53K29j60n55J11N32n9j85n28M23O90
2912F02p92n19N05M95j40l87L9N10M95p52n21O97K08l06k74j52M52j11j12k53
2932c16O64J3n54k51M89K06n33k4q5Q55k54k39m21L99O08n34n76P69N75p34o15
2953e58K81L99J46k41l70Q90l44m64l97O61J71k69J49l14L27J18n48J66K2N99
$$ plain form
2973 424 13 -439 -108 149 234 -177 6 408 140 -258 -494 123 496 44 -223 -357 566 195 -400 -452 75
2994 75 327 63 -376 156 210 10 -647 -802 150 121 -93 -226 209 622 -57 -442 -57 605 294 -122 -31
3015 -31 170 553 -250 -279 287 413 -190 -221 -124 534 -2 -331 -179 351 688 101 -357 -69 564 -129 -616
3036 -616 120 407 38 -187 -363 358 701 -5 -596 -114 530 -39 -565 -481 445 168 -284 -540 512 734
3056 734 -59 -435 27 561 -5 -211 -418 589 663 -405 -278 204 986 -95 -744 -43 175 557 -731
3075 -731 -209 347 693 -97 -1011 119 689 145 -740 -159 516 582 -466 -550 371 865 -37 -708 -499 889
3095 889 428 -696 -716 334 622 -207 -619 231 675 -21 -657 -186 816 363 -733 -610 226 661 -218
3114 -218 -854 -141 773 250 -648 -194 419 628 -411 -1007 142 1205 368 -750 -175 621 654 -387 -636
$$ packed form
2973D24m11m52L31K57Q5m11J83M02k68l98k36O17L73m52k67j34R23l71n95n2N27
2994G5K52k64m39N32N4k00o57j55R52k9k14j33M35M13o79l85L85O62l11m16R1
3015c1K01L83q03k9N66J26o03l1R7O58n36l29J52N30L37n87m58K88O33o93m87
3036f16P36K87l69k25j76P21L43p06n91M82O44n69n26Q4R26k77m52k56J052K22
3056G34p93l76M62N34n66k06k07J007P4j068J27M82P82j081o49P01K18L82j288
3075g31N22N56L46p90r14J130N70n44q85N81O75O6j048q4R21M94r02o71K09J388
3095H89m61j124k0J050K88q29m12Q50M44o96o36M71J002m53j096J23Q36M35q79
3114b18o36P13R14n23q98M54O13K09j039n96J149J063q37j118N75P96L3j041k49
$$ plain form
3133 -636 738 922 -638 -862 141 1025 380 -971 -450 748 1000 -566 -722 159 817 -63 -771 -120
3151 -120 611 245 -787 -593 676 1021 -637 -1042 -40 842 -123 -1035 -502 941 769 -788 -515 741
3169 741 751 -167 -382 -315 907 321 -1011 -641 310 1010 -624 -727 396 908 161 -1058 -168 998 588
3188 588 -942 -589 683 765 -332 -1122 385 1071 81 -1023 -365 1024 614 -623 -957 404 1221 36
3206 36 -958 -299 1353 456 -1066 -886 777 710 -351 -1029 204 1342 -131 -1355 -110 860 651 -1067
3224 -1067 -790 474 1003 -14 -812 283 1133 -101 -797 -850 1207 838 -665 -1111 199 1018 39 -1413
3242 -1413 -295 811 357 -929 -698 506 972 -341 -1345 250 1188 200 -1209 -193 881 570
3258 570 -1028 -964 699 946 -128 -998 -204 1055 444 -966 -654 1022 1010 -754 -864 225 1088 210
$$ packed form
3133f36J374J84j560k24J003Q84o45j351N21J198K52j566j56Q81O58q80p08O51
3151a20P31l66j032J94J269L45j658m05J002Q82r65r12N33J443j72j557K73J256
3169G41J0r18k15O7J222n86j332L70R51P00j634j03J123N12p47j219Q90J166m10
3188E88j530L53J272Q2j097p90J507O86r90j104O58J389m10j237l34J361Q17j185
3206C6r94O59J652q97j522J80J663o7j061o78J233J138j473j224J245R70k09j718
3224a067K77J264N29j017p98J095Q50j234o96n3K057l69j503m46J310Q19r79j452
3242a413J118J106m54j286K31J204M66j313j004J595R38r88j409J016J074l11
3258E70j598O4J663K47j074q70P94J259o11j410L12J676j2j764j10J089Q63q78
$$ plain form
3276 210 -1219 -286 1291 637 -1047 -1005 962 1278 -444 -1191 292 1229 458 -1169 -722 986 598 -925
3294 -925 -1123 226 1422 -256 -1111 -56 1368 381 -1117 -770 772 976 -434 -1328 540 1244 -115
3311 -115 -1124 -181 1147 914 -723 -1487 817 1133 -67 -1062 -32 1328 725 -776 -703 1268 880
3328 880 -598 -1166 390 1052 -8 -1185 -175 1498 769 -1137 -1006 1291 1369 -342 -1406 274 1271
3345 1271 726 -1294 -430 1111 1079 -950 -1029 460 1509 -178 -1651 -555 1030 729 -1157 -1005 910
3362 910 1206 -762 -1617 328 1425 253 -1503 -461 1332 917 -1099 -1301 1164 1643 -270 -1771
3378 -1771 98 1870 497 -1621 -969 1179 1282 -853 -1505 353 1436 169 -1502 -619 1396 501
3394 501 -1443 -1205 1114 1168 -602 -1240 796 1861 79 -1140 -355 1042 1225 -1350 -1065 368 1262
$$ packed form
3276B10j429R33J577o54j684M2J967L16j722p47J483R37p71j627M47J708l88j523
3294i25j98J349J196j678q55J055J424r87j498L47J542K04j410q94J868P04j359
3311a15j009R43J328k33j637p64K304L16j200r95J030J360o03j501P3J971l88
3328H80j478n68J556O62j060j177J010J673p29j906J31K297P8j711j064J680R97
3345A271n45k020Q64J541l2k029p9J489J049j687j473J096J585l01j886J52J915
3362I10K96j968q55J945J097j172j756J042J793m15k016k02K465M79j913j501
3378a771J869J772j373k118O52K148J03k135o52J858J083j267j671Q83K015q95
3394E01j944K38K319N4j770o38K036J065j782j219P85J397J83k575K85J433Q94
$$ plain form
3411 1262 118 -1686 -145 1482 718 -1187 -1291 1073 1122 -627 -1288 -21 1797 -86 -1346 -340
3427 -340 1732 994 -1007 -1248 1138 1545 -593 -1845 125 1406 504 -1432 -749 1268 1205 -1017 -1795
3444 -1795 661 1422 -216 -1564 -437 1358 1151 -1458 -1248 948 1397 -405 -1828 135 1620 305
3460 305 -1757 -720 1327 925 -1203 -1824 702 1791 -431 -1828 -57 1984 936 -1572 -1214 1004
3476 1004 1219 -860 -1283 253 1770 149 -1853 -513 1702 966 -1515 -1537 881 1472 -796 -1776 -154
3493 -154 2024 605 -1574 -651 1379 1319 -1186 -1590 354 1967 80 -1865 -508 1205 973 -1395
3509 -1395 -1376 1181 1504 -754 -1938 -146 1925 257 -1553 -777 1001 1235 -971 -1702 376 1127 -228
3526 -228 -1592 -456 1621 432 -1532 -1087 1277 1497 -784 -1603 75 1642 134 -1911 -579 1694
$$ packed form
3411A262j144j804J541J627p64j905j04K364M9j749o61J267J818j883j260J006
3427c40K072p38k001k41K386M07k138j252J970J281r02j936O83K017o3k222p78
3444a795K456P61j638j348J127J795k07k609K10K196M49j802j423J963J485j315
3460C05k062J037K047m02k128o21K526J089k222j397J771K041j048k508L58K218
3476A004K15k079m23J536J517j621k002J340K215p36k481k2K418N91k268r80J622
3493a54K178j419k179R23K030o0k505m04J944J613j887j945J357J713k32k368
3509a395J9K557L23k258j184J792K071j668j810P76J778K34k206p31K078P51j355
3526b28j364J136K077j189j964M45K364K20k281q19J678J567j508k045J332K273
$$ plain form
3542 1694 832 -1175 -1637 657 1692 -173 -1880 37 1853 217 -1554 -963 1755 1381 -1240 -1733
3558 -1733 516 1692 292 -1968 -579 1671 831 -1356 -1043 1050 1903 -705 -1917 123 1959 633
3574 633 -2030 -1002 1650 1421 -1546 -1718 738 1742 -356 -1697 -574 2001 946 -1680 -1349 1354
3590 1354 1640 -870 -1803 812 2037 384 -1390 -703 1596 948 -1159 -1584 1101 1640 -377 -1816
3606 -1816 -52 1606 453 -1857 -1232 1365 1576 -872 -1773 681 2036 329 -1712 -634 1863 1073
3622 1073 -1343 -1326 1148 1922 -740 -2129 65 1773 -48 -1522 -1076 1847 1360 -1188 -1795 599
3638 599 1983 -398 -2147 -225 1905 1050 -1324 -1053 1305 1572 -613 -2015 436 1897 508 -2013
3654 -2013 -990 1625 1154 -1142 -2066 1008 1658 -252 -2151 -563 2186 643 -1879 -1228 1580 1783
$$ packed form
3542A694q62k007m62K294J035j865j707J917J816j636j771N91K718l74k621m93
3558a733K249J176j400k260J389K250q40k187L13K093Q53k608j212K040J836j326
3574F33k663J028K652k29k967j72K456J004k098j341J123K575j055k626L31K703
3590A354K86k510r33K615J225j653j774O87K299o48k107m25K685N39k017j439
3606a816J764J658j153k310O25K597K11k448r01K454J355j707k041J078K497p90
3622A073k416J7K474P74k662j389K194J708j821j474M46K923m87k548o07K394
3638E99J384k381j749J922K130q55k374K71K358K67k185j402K451J461j389k521
3654b013J023K615m71k296r24L074O50j910j899J588K749j543k522O51K808K03
$$ plain form
3670 1783 -1089 -1547 572 2238 55 -2062 -573 1747 1019 -1413 -1459 966 2027 -449 -1860 71
3686 71 1881 422 -2432 -1045 1701 1519 -908 -1585 764 2120 -605 -1889 -8 1878 1162 -1638
3702 -1638 -1113 1404 2062 -940 -2102 326 1975 191 -2146 -925 1964 1350 -1468 -1832 1048 1868
3718 1868 -588 -2107 -149 2180 624 -1506 -1065 1733 1629 -874 -1935 583 1982 116 -2059
3733 -2059 -854 1962 1477 -1449 -1696 1118 1872 -378 -2115 139 2192 667 -1843 -871 1266 1848
3749 1848 -866 -2007 861 2222 189 -2281 -710 2019 776 -1730 -1429 1091 1952 -867 -2208
3764 -2208 328 1936 576 -2288 -530 1669 1435 -1228 -1684 972 1989 -442 -2241 -162 1895
3779 1895 645 -1879 -994 1678 1906 -1138 -1928 304 2085 51 -1798 -390 2053 1359 -1658 -1715
$$ packed form
3670A783k872m58K119J666k183k117J489K320p28k432m6K425J061k476j411J931
3686G1J810j459k854J387K746j82k427o77K349J356k725j284J881J886p16k800
3702a638N25K517O58l002j162K428J649j784k337J221K889o14k818l64K880Q20
3718A868k456j519J958K329j556k130M41K798j04k503j061K518J399j866k175
3733b059J205K816m85k926k47K814P54k250j737K254K053j525k510R72K137N82
3749A848k714j141K868J361k033k470J571K729j243k506L01K520Q61k819j341
3764b208K536J608j360k864J758K199k34k663m56K656J017k431j799K079K057
3779A895j250k524Q85K672K28l044p90K232J781k034j849J408K443o94l017n7
$$ plain form
3795 -1715 1244 1613 -520 -2123 -52 1935 752 -1746 -1541 1337 1577 -1262 -1942 725 1812 113
3811 113 -2355 -417 2001 1192 -1866 -1346 1251 1744 -492 -2085 141 2285 347 -2179 -1091 1598
3827 1598 1205 -1384 -1435 602 1988 -353 -1867 -379 2253 495 -1922 -1260 1620 2035 -1001 -1629
3843 -1629 587 2090 371 -1695 -895 1715 1599 -1792 -1502 1346 1735 -400 -2237 -25 2116 654
3859 654 -1876 -1137 1404 1521 -904 -1628 733 2130 -102 -1981 -281 1859 1006 -1708 -1460 1226
3875 1226 1702 -1130 -2570 82 1674 445 -2043 -1178 1603 1454 -1313 -1597 588 1930 -204 -1934
3891 -1934 -301 1889 1083 -1937 -1412 1535 2073 -855 -1818 425 1789 299 -1879 -902 2013 1189
3907 1189 -1435 -2085 827 1831 -426 -2101 -226 1920 745 -1782 -1048 1720 1538 -1023 -1962 106
$$ packed form
3795a715K959L69k133j603K071J987j183k498K05K878K40k839o80K667J087j699
3811A13k468J938K418q09l058N20K597M93k236j593K226K144j938k526J088K689
3827A598l93k589n1K037J386k341j514J488K632j758k417O62K880M15l036o28
3843a629K216J503j719k066Q00K610j16l391K90K848L89k135j837K212K141j462
3859F54k530P39K541J17k425p24K361J397k232j879J700K140q53k714K48K686
3875A226M76k832j440K652J592j229k488Q65K781j49k767k84K185J342k134j730
3891a934J633K190q06l020N25K947N38k928r63K243J364j490k178R77K915q24
3907A189k624o50K912J004k257j675J875K146j175k527P34K768j82k561r39K068
$$ plain form
3923 106 1796 -78 -2154 -809 1623 1175 -2081 -1625 1195 2125 -545 -2028 290 1809 447 -2080
3939 -2080 -675 1711 1482 -1537 -2090 712 2124 125 -2385 -242 2007 1311 -1753 -1395 1392 1868
3955 1868 -1036 -2237 414 2281 184 -1867 -527 1908 1299 -1643 -1669 1226 2016 -517 -2072 32
3971 32 2250 933 -2230 -1228 1654 1505 -772 -1805 618 2078 17 -1827 -883 2034 1097 -1736
3987 -1736 -1376 1033 1876 -813 -2064 158 1966 583 -1689 -1264 1496 1115 -1170 -1785 668 2333
4003 2333 -47 -2302 -304 1877 596 -1947 -1391 1537 1450 -676 -1895 241 1786 271 -2128 -908
4019 -908 1750 1293 -1067 -1670 1132 1779 -365 -2449 -642 2121 626 -1761 -1396 1784 2004 -962
4035 -962 -1987 619 1995 174 -2041 -427 2013 1309 -1723 -1566 1132 1722 -501 -2280 -184 2201
$$ packed form
3923A06J690j874k076J345K432m48l256M56K820R30k670j483K318J519j362k527
3939b080J405K386k29l019n53K802J412j999k510K143K249o96l064L58K787M76
3955A868k904j201K651J867k097k051J340K435o09k942k6K895P90k533j555K104
3971C2K218j317l163J002K882j49k277j033K423J460k061j844R44K917r37k833
3987a736L60K409Q43k689j251K222J808j383k272M25K760l81k285o15K453J665
4003B333k380k255J998K181j281k543N56K928q7k126j219K136J545j515k399J220
4019i08K658m57k360o03K802O47k144k084J807K763j495k387L65L180K20k966
4035i62j025K606J376j821k215J614K440p04l032J57K698N90k223j779K096K385
$$ plain form
4051 2201 674 -2013 -1150 1780 1605 -1278 -1729 675 2145 -89 -1677 -318 2165 1339 -1919 -1245
4067 -1245 1146 1579 -531 -2215 -90 2189 610 -2188 -872 1752 1683 -1464 -1840 1252 2243 -280
4083 -280 -2330 -207 2043 996 -1693 -1372 1391 1714 -704 -2457 451 2113 368 -2220 -426 1537
4099 1537 1175 -1361 -1745 1224 1660 -409 -1943 -129 2256 503 -1988 -1123 1435 1376 -1055 -1836 701
4116 701 1785 -268 -2075 -338 1951 998 -1513 -1580 1098 1636 -931 -1988 364 2005 441 -2128
$$ packed form
4051B201j527k687Q63K930j75k883m51K404J470k234j588J359K483q26l258O74
4067a245K391M33k110j684K125K279j579k798J316K624o9l147l76L092R91k523
4083b80k050K123K250j047k689L21K763L23k418j753K908J662j745k588J794J963
4099A537l62k536l84K969M36k069j534J814K385j753k491Q65K558n9k431p81K537
4116G01J084k053j807J737K289r53k511o7K678N38k567j057K352J641j564k569
$$ [...]
8191c55
##END NTUPLES=NMR FID
##END=
