##TITLE=1H ikalashn
B1d 2410
25.10.2024
##JCAMPDX= 6.0         $$ Bruker NMR JCAMP-DX V2.0
##DATA TYPE= NMR FID
##DATA CLASS= NTUPLES
##ORIGIN= UXNMR, Bruker Analytische Messtechnik GmbH
##OWNER= root
$$ TOPSPIN		Version 1.3
$$ 2024-10-25 10:30:21.546 +0400  Irina@DPX200
$$ Compression mode = diff/dup
##.OBSERVE FREQUENCY= 200.131300845
##.OBSERVE NUCLEUS= ^1H
##.DELAY= (6, 6)
##.ACQUISITION MODE= SIMULTANEOUS
##.ACQUISITION SCHEME= undefined
##.AVERAGES= 64
##.DIGITISER RES= 18
##SPECTROMETER/DATA SYSTEM= spect
##.PULSE SEQUENCE= zg
##.SOLVENT NAME= CDCl3
##.SHIFT REFERENCE= INTERNAL, CDCl3, 1, 17.49637
##AUDIT TRAIL= $$ (NUMBER, WHEN, WHO, WHERE, WHAT)
$$ ##TITLE= Audit trail, TOPSPIN		Version 1.3
$$ ##JCAMPDX= 5.01
$$ ##ORIGIN= Bruker BioSpin GmbH
$$ ##OWNER= Irina
$$ $$ F:/spectra/data/iren/nmr/1H/4/audita.txt
$$ ##AUDIT TRAIL=  $$ (NUMBER, WHEN, WHO, WHERE, VERSION, WHAT)
(   1,<2024-10-25 10:30:04.750 +0400>,<Irina>,<DPX200>,<TOPSPIN 1.3>,
      <created by zg
	started at 2024-10-25 10:25:51.609 +0400,
	POWCHK disabled, PULCHK disabled
       configuration hash MD5:
       BE 6D 3F 07 2A EA 11 49 91 17 2B D3 AF B3 58 0D
       data hash MD5: 16K
       C0 D4 27 C0 A6 F8 A2 B4 AF E4 4F 58 8A 96 2A 8F>)
$$ ##END=
$$ 
$$ $$ hash MD5
$$ $$ 73 6B 03 EB 42 B7 C2 85 8D 0C 74 60 55 71 EF 0E
##$RELAX= 
##$RELAX= 
##$RELAX= 
##$RELAX= 
##$RELAX= 
##$RELAX= 
##$RELAX= 
##$RELAX= 
##$RELAX= 
$$ Bruker specific parameters
$$ --------------------------
##$DU= <F:/spectra>
##$EXPNO= 4
##$NAME= <1H>
##$PROCNO= 1
##$TYPE= <nmr>
##$USER= <iren>
##$AMP= (0..31)
100 100 100 100 100 100 100 100 100 100 100 100 100 100 100 100 100 100 
100 100 100 100 100 100 100 100 100 100 100 100 100 100 
##$ANAVPT= -1
##$AQSEQ= 0
##$AQ_mod= 1
##$AUNM= <au_zg>
##$AUTOPOS= <>
##$BF1= 200.13
##$BF2= 200.13
##$BF3= 200.13
##$BF4= 200.13
##$BF5= 200.13
##$BF6= 200.13
##$BF7= 200.13
##$BF8= 200.13
##$BYTORDA= 1
##$CFDGTYP= 0
##$CFRGTYP= 5
##$CHEMSTR= <none>
##$CNST= (0..63)
1 1 145 1 1 1 1 1 1 1 1 1 1 1 1 1 1 1 1 1 1 1 1 1 1 1 1 1 1 1 1 1 1 1 
1 1 1 1 1 1 1 1 1 1 1 1 1 1 1 1 1 1 1 1 1 1 1 1 1 1 1 1 1 1 
##$CPDPRG= <>
##$CPDPRG1= <>
##$CPDPRG2= <>
##$CPDPRG3= <>
##$CPDPRG4= <mlev>
##$CPDPRG5= <mlev>
##$CPDPRG6= <mlev>
##$CPDPRG7= <mlev>
##$CPDPRG8= <mlev>
##$CPDPRGB= <>
##$CPDPRGT= <>
##$D= (0..63)
0 2 0 0 0 0 0 0 0 0.06 0 0.03 0 0 0 0 0.0002 0 0 0 0 0 0 0 0 0 0 0 0 0 
0 0 0 0 0 0 0 0 0 0 0 0 0 0 0 0 0 0 0 0 0 0 0 0 0 0 0 0 0 0 0 0 0 0 
##$DATE= 1729837803
##$DBL= (0..7)
120 120 120 120 120 120 120 120 
##$DBP= (0..7)
150 150 150 150 150 150 150 150 
##$DBP07= 0
##$DBPNAM0= <>
##$DBPNAM1= <>
##$DBPNAM2= <>
##$DBPNAM3= <>
##$DBPNAM4= <>
##$DBPNAM5= <>
##$DBPNAM6= <>
##$DBPNAM7= <>
##$DBPOAL= (0..7)
0.5 0.5 0.5 0.5 0.5 0.5 0.5 0.5 
##$DBPOFFS= (0..7)
0 0 0 0 0 0 0 0 
##$DE= 6
##$DECBNUC= <off>
##$DECIM= 32
##$DECNUC= <off>
##$DECSTAT= 4
##$DIGMOD= 1
##$DIGTYP= 9
##$DL= (0..7)
0 120 120 120 120 120 120 120 
##$DP= (0..7)
150 150 150 150 150 150 150 150 
##$DP07= 0
##$DPNAME0= <>
$$ [...]
##$SW= 21.9926040160658
##$SWIBOX= (0..15)
0 0 2 0 0 0 0 0 0 0 0 0 0 0 0 0 
##$SW_h= 4401.40845070422
##$TD= 16384
##$TD0= 1
##$TE= 300
##$TE2= 300
##$TE3= 300
##$TEG= 300
##$TL= (0..7)
0 120 120 120 120 120 120 120 
##$TP= (0..7)
150 150 150 150 150 150 150 150 
##$TP07= 0
##$TPNAME0= <>
##$TPNAME1= <>
##$TPNAME2= <>
##$TPNAME3= <>
##$TPNAME4= <>
##$TPNAME5= <>
##$TPNAME6= <>
##$TPNAME7= <>
##$TPOAL= (0..7)
0.5 0.5 0.5 0.5 0.5 0.5 0.5 0.5 
##$TPOFFS= (0..7)
0 0 0 0 0 0 0 0 
##$TUNHIN= 0
##$TUNHOUT= 0
##$TUNXOUT= 0
##$USERA1= <user>
##$USERA2= <user>
##$USERA3= <user>
##$USERA4= <user>
##$USERA5= <user>
##$V9= 5
##$VALIST= <valist>
##$VCLIST= <CCCCCCCCCCCCCCC>
##$VD= 0
##$VDLIST= <DDDDDDDDDDDDDDD>
##$VPLIST= <PPPPPPPPPPPPPPP>
##$VTLIST= <TTTTTTTTTTTTTTT>
##$WBST= 1024
##$WBSW= 25
##$XGAIN= (0..3)
0 0 0 0 
##$XL= 0
##$YL= 0
##$YMAX_a= 5915317
##$YMIN_a= -5886118
##$ZGOPTNS= <>
##$ZL1= 120
##$ZL2= 120
##$ZL3= 120
##$ZL4= 120
##$ABSF1= 10
##$ABSF2= 0
##$ABSG= 5
##$ABSL= 3
##$ALPHA= 0
##$AQORDER= 0
##$ASSFAC= 0
##$ASSFACI= 0
##$ASSFACX= 0
##$ASSWID= 0
##$AUNMP= <proc_1d>
##$AXLEFT= 0
##$AXRIGHT= 0
##$AXTYPE= 0
##$AXUNIT= <>
##$AZFE= 0.1
##$AZFW= 0.1
##$BCFW= 1
##$BC_mod= 2
##$BYTORDP= 1
##$COROFFS= 0
##$CY= 7568.61572265625
##$DATMOD= 1
##$DC= 2
##$DFILT= <>
##$DTYPP= 0
##$F1P= 17.9538593292236
##$F2P= -4.03888763876832
##$FCOR= 0.5
##$FTSIZE= 32768
##$FT_mod= 4
##$GAMMA= 1
##$GB= 1
##$INTBC= 1
##$INTSCL= 1
##$ISEN= 128
##$LB= 0.05
##$LEV0= 0
##$LPBIN= 0
##$MAXI= 945.577
##$MC2= 0
##$MEAN= 0
##$ME_mod= 0
##$MI= -402.1523
##$NCOEF= 0
##$NC_proc= 0
##$NLEV= 6
##$NOISF1= 8.587773
##$NOISF2= 6.764455
##$NSP= 1
##$NTH_PI= 0
##$NZP= 0
##$OFFSET= 17.49637
##$PC= 1
##$PHC0= 115.9654
##$PHC1= 7.64522
##$PH_mod= 0
##$PKNL= yes
##$PPARMOD= 0
##$PPDIAG= 0
##$PPIPTYP= 0
##$PPMPNUM= 100
##$PPRESOL= 1
##$PSCAL= 0
##$PSIGN= 0
##$REVERSE= no
##$SF= 200.13
##$SI= 32768
##$SIGF1= 18.5376
##$SIGF2= -6.396296
##$SINO= 400
##$SIOLD= 32768
##$SREGLST= <1H.CDCl3>
##$SSB= 3
##$STSI= 0
##$STSR= 0
##$SW_p= 4401.40845070422
##$SYMM= 0
##$S_DEV= 0
##$TDeff= 0
##$TDoff= 0
##$TI= <>
##$TILT= no
##$TM1= 0
##$TM2= 0
##$TOPLEV= 0
##$USERP1= <user>
##$USERP2= <user>
##$USERP3= <user>
##$USERP4= <user>
##$USERP5= <user>
##$WDW= 1
##$XDIM= 8192
##$YMAX_p= 0
##$YMIN_p= 0
$$ End of Bruker specific parameters
$$ ---------------------------------
##NTUPLES= NMR FID
##VAR_NAME=  TIME,          FID/REAL,        FID/IMAG
##SYMBOL=    X,             R,               I
##VAR_TYPE=  INDEPENDENT,   DEPENDENT,       DEPENDENT
##VAR_FORM=  AFFN,          ASDF,            ASDF
##VAR_DIM=   8192,          8192,            8192
##UNITS=     SECONDS,       ARBITRARY UNITS, ARBITRARY UNITS
##FACTOR=    0.0002272,     1,               1
##FIRST=     0,             0,               0
##LAST=      1.8609952,     -470,            610
##MIN=       0,             -5886118,        -5886118
##MAX=       1.8609952,     5915317,         5915317
$$ Real data points
##PAGE= N=1
##DATA TABLE= (X++(R..R)), XYDATA
0@%%%%%%%%%%O4j28J28j28J92k88L52m16N12o09P06q96J088j276J495j756K075
27A115k370K709l152L650m156M717n363O061o813P680q651R669j0780J2038j3411
42g057J4870j6490J8286k0218K2313k4621K7161k9922L2948l6312M0020m4103
54b3125M8675n3827N9625o6208P3818q2710R3201j05848J21487j41349J67523
65I1262k03879K58171l48965N37966j606054K947888J172899o834243j603010
74e587965N874431M135549m681752m492073L598543O173147j672848n950346J90898
83b412416O278795J411432n673058l093074M613787L757677l920613n311738K073464
92b275744N407413p69818n854890r61798N500489K638193m598005l676068L677496
$$ plain form
0 0 0 0 0 0 0 0 0 0 0 0 64 -64 64 -64 128 -160 192 -224 288 -321 385 -511 577 -699 796 -960 1115
27 1115 -1255 1454 -1698 1952 -2204 2513 -2850 3211 -3602 4078 -4573 5096 -5684 6354 -7057
42 -7057 7813 -8677 9609 -10609 11704 -12917 14244 -15678 17270 -19042 20978 -23125
54 -23125 25550 -28277 31348 -34860 38958 -43752 49449 -56399 65088 -76261 91262
65 91262 -112617 145554 -203411 334555 -1271499 1676389 2849288 -3984955 -5587965
74 -5587965 286466 4422015 -259737 -4751810 -1153267 5019880 3347032 -2603314 -2412416
83 -2412416 3866379 5277811 -395247 -3488321 1125466 4883143 962530 -4349208 -2275744
92 -2275744 3131669 2361851 -3493039 -4454837 1045652 3683845 -914160 -4590228 -912732
101i12732M832292k119313n054842R53283N487591P55758n008397j997838M485363
110A421165L184215l687000m396463K148406M543394j272030n136748l73661M737577
119A168855J500359m292189k588808L644545L726839k402647m208776J352668
127b099154M687637R3712m455973j149012M197025K328665l437430l130352K600352
136c64530L777920j624678m314114K86187M239601P66397m117053j993038L441641
145I8333K831852k653593l469820J704164L869504o04557l892259l67787L845521
154A361358J565926l192315k247380K685765L055664j751116l430261P95897L451000
163B294538q6922l638347j072622L123176J730368k767504k568563K027128L174451
$$ plain form
101 -912732 3919560 1800247 -3254595 -2301312 3186279 3942037 -1066360 -3064198 1421165
110 1421165 4605380 918380 -3478083 -1329677 3213717 1941687 -3195061 -3568722 1168855
119 1168855 2669214 -1622975 -4211783 -567238 3159601 756954 -3451822 -2099154
127 -2099154 2588483 2682195 -1773778 -2922790 1274235 3602900 165470 -2964882 -364530
136 -364530 3413390 1788712 -2525402 -2239215 2000386 2766783 -1350270 -3343308 98333
145 98333 2930185 276592 -3193228 -1489064 2380440 1775883 -2116376 -2484163 1361358
154 1361358 2927284 -265031 -2512411 173354 3229018 1477902 -1952359 -1156462 2294538
163 2294538 2207616 -1430731 -2503353 619823 2350191 -417313 -2985876 -958748 2215703
172B215703j058955l360105K16886L459265P76964l147655j544402K728009K271964
181B557674k046324k754463J313229L117815m23660l208934m89749K973774J170077
190B209439k747935j967859K122002K398171j562697k804849Q54376L095048P2335
199A668031k986303q07678K857459J701726k305915k275367J700038K716110r69713
208A298388k950054J65291K923694N67822k786308j370684K335607J959703j817858
217C25601k478485J103458K743096l61800k791263l23569K730714J075309k382867
226c59806j650658J969433K222863j319467k577961N70843K699158J52594k675999
235i69000r20303K346637J466147j996848k008376J431741K357585q00049k560428
$$ plain form
172 2215703 1156748 -2203357 -1986471 1472794 2249758 -897897 -2442299 285710 2557674
181 2557674 511350 -2243113 -929884 2187931 1764271 -1444663 -1934412 1039362 2209439
190 2209439 -538496 -2506355 -384353 2013818 451121 -2353728 -1499352 1595696 1668031
199 1668031 -1318272 -2125950 731509 2433235 127320 -2148047 -448009 2268101 1298388
208 1298388 -1651666 -1486375 1437319 2005141 -781167 -2151851 183756 2143459 325601
217 325601 -2152884 -1049426 1693670 1331870 -1459393 -1782962 947752 2023061 -359806
226 -359806 -2010464 -41031 2181832 862365 -1715596 -1144753 1554405 1706999 -969000
235 -969000 -1889303 457334 1923481 -73367 -2081743 -650002 1707583 907534 -1652894
244a652894J14363K626684O73509k389623j303905K059771J896101j512479k281381
253a769854Q98356K497092k36221k562610m86035K387259J126962k072696j720808
262a938555J552128K116351r78531k369117L48806K447674K85043k355768q70636
271a762605K156561J487912j722672j942334J200071K319148n06996k447500j94830
280a413245K362968Q24797k142022j428544J687226J812970j216041k148380N84475
289a075796K268759N7865k205216o46008K031770J231360j640335j613817J233546
298c57872J941494p12143k114877J43096K133703M33785k018326j027977J691054
307A11937J490722j264447j850734P11472K000570j83248k032970l64093J907445
$$ plain form
244 -1652894 -1538531 1088153 1761662 -627961 -1931866 127905 2024006 511527 -1769854
253 -1769854 -871498 1625594 1389373 -1173237 -1659272 727987 1854949 -217747 -1938555
262 -1938555 -386427 1729924 751393 -1617724 -1268918 1178756 1463799 -891969 -1762605
271 -1762605 393956 1881868 159196 -1783138 -583067 1736081 1229085 -1218415 -1413245
280 -1413245 949723 1774520 -367502 -1796046 -108820 1704150 488109 -1660271 -1075796
289 -1075796 1192963 1250828 -954388 -1600396 431374 1662734 22399 -1591418 -357872
298 -357872 1583622 871479 -1243398 -1100302 1033401 1467186 -551140 -1579117 111937
307 111937 1602659 338212 -1512522 -801050 1199520 1016272 -1016698 -1380791 526654
316E26654Q69834j637695j278871J301961J669815p77444j836701K82773J919941
325A040267K55242j838456p55840J592922J131029j322510j510155Q68998J705698
334A167195m08290j814012j14185J764849O23722j547768j012041J281248J360134
343A300852q87208j546650N02634J679929m8276j674572m14745J534936Q33028
352A279928j304163j218950R19111J433710n37138j575032R8159J565748L09466
361I70839j455637o78578J260510J029060r31811j245812N84694J403420j72725
370G63960j407813j87154J341810N19729j206395q22055R76354J050139p18735
379C09840j263139L42520J335133K3985j330158m10832J201287P37756r80921
$$ plain form
316 526654 1396488 -241207 -1520078 -218117 1451698 674254 -1162447 -879674 1040267
325 1040267 1295509 -542947 -1298787 294135 1425164 102654 -1407501 -538503 1167195
334 1167195 758905 -1055107 -1169292 595557 1219279 -328489 -1340530 -59282 1300852
343 1300852 413644 -1133006 -630372 1049557 1001281 -673291 -1088036 446900 1279928
352 1279928 -24235 -1243185 -324074 1109636 572498 -1002534 -904375 661373 970839
361 970839 -484798 -1163376 97134 1126194 194383 -1051429 -466735 936685 763960
370 763960 -643853 -831007 510803 1030532 -175863 -997918 -21564 1028575 309840
379 309840 -953299 -610779 724354 748339 -581819 -992651 208636 946392 -34529
388c4529r72145P34166J172230l98244j234770R0864J260510K67899j156372n77840
398h48231R71767Q16964p61868j026285M72777J111945k24453j187988p9385J167310
408D12553L85148j062297o68348Q85056R30020n99395j079518L03764J164122
417F71105J7526j135454k97146J061521N70900r01968p93599O81017R61836m26280
427D09458j084733R8340J072023J64670j045523m54463R16715O84140p40441q62198
437h42012N38018J029267k31739j063954n0123J048515L56443r29135o07909P47175
447e454P89189n51707r36625L09957J008202o8351j042226k21272R75807M84501
457G42021q43991p31468O30872R12687l64579r99788J09117J050650J88121r80228
$$ plain form
388 -34529 -1006674 -272508 899722 501478 -733292 -642428 618082 885981 -270391 -848231
398 -848231 123536 940500 178632 -847653 -374876 737069 512616 -675372 -754757 412553
408 412553 797701 -264596 -932944 -47888 882132 282737 -796781 -493017 671105
417 671105 688631 -446823 -743969 317552 888452 -13516 -807115 -126098 835738 409458
427 409458 -675275 -576935 495088 659758 -385765 -840228 76487 760627 20186 -842012
437 -842012 -303994 725273 493534 -570420 -620543 427972 784415 -144720 -752629 -5454
447 -5454 783735 232028 -704597 -394640 613562 545211 -497015 -718287 257520 742021
457 742021 -101970 -833438 -202566 710121 345542 -654246 -545129 505521 693642 -286586
467b86586m34008Q73555O74968o75625q55116M19782R46833j63242r91545j14820
477f05804R44530L45551q75414n77515P33554P75492n38313r29657K86711J025102
487E84237K8154r97442l09618R10782N79329p30566p76702N08081Q96649k83582
497D09322r83732l02R51378K48652q78580m91200P23296O91364n11619q10460
507f51881L02061Q97504o2027r11785j71939Q75401M08916p64804o26742N79129
517a26167P87656l40949q80212P2258Q76701J67510q30518l94704P17553N81217
527F30345n55760p10506L79150Q30363j16992q31951j03874P98968L32475p00048
537d7830n34830N32846O49959l83959p70895J64949Q00520N2022p80147k63376
$$ plain form
467 -286586 -720594 152961 827929 152304 -702812 -283030 663803 500561 -490984 -605804
477 -605804 338726 684277 -191137 -768652 -35098 740394 202081 -727576 -440865 584237
487 584237 612391 -385051 -694669 216113 795442 64876 -711826 -203745 692904 409322
497 409322 -574410 -574712 376666 625318 -253262 -744462 -21166 670198 158579 -651881
507 -651881 -349820 547684 485657 -426128 -598067 277334 686250 -78554 -705296 -126167
517 -126167 661489 320540 -559672 -487414 389287 556797 -273721 -668425 49128 630345
527 630345 74585 -635921 -256771 573592 456600 -375351 -479225 319743 652218 -47830
537 -47830 -582660 -49814 600145 216186 -554709 -389760 410760 462782 -317365 -580741
547e80741O98345M70063n36686o02955L62145O93544j66118p25276j2975P21509
557C20855K04017o62215l74523N56117N21496m09565o45127J91648O63336k3670
567C42369o79999j84555O07647L38724n07747m54883M04286N78905k08201n96727
577c60181N8607O05861J26331n44716k73685M47285L67030l64614m65255K37871
587a65466N13567j20286n48521k5273N39676J83725m73707l12226L78356M19516
597C89361k45598m77660J16459N02212J2923m91935j35842M53040K57331l64924
607A5367l36317K67052M06580j40218m23133K8496M15274N4975m22513j74413
617c08850L62394K40060l30799l46876K27009M03456j01926m09690l006M12952
$$ plain form
547 -580741 117604 587667 50981 -551974 -189829 503715 337597 -387679 -400654 320855
557 320855 524872 -137343 -511866 44251 565747 156182 -488945 -297297 366039 342369
567 342369 -337630 -522185 85462 424186 -83561 -538444 -134158 444747 236546 -360181
577 -360181 -301574 304287 430618 -114098 -387783 59502 426532 61918 -403337 -165466
587 -165466 348101 227815 -320706 -345979 193697 377422 -96285 -408511 -30155 389361
597 389361 143763 -333897 -217438 284774 297697 -194238 -330080 122960 380291 15367
607 15367 -320950 -53898 352682 212464 -210669 -182173 233101 288076 -134437 -308850
617 -308850 53544 293604 -37195 -384071 -157062 246394 144468 -265222 -268228 144724
627A44724J33636l49548k06804L07513K87833k33077l40432J51239L77676n3208
637B19552l84065n3380L49970J31388l23262k36976K32747K68031j96582l43987
647c36564J01243L74190N744l48853o2529L70072K11805k49143k28540K11361
657D8786K91071j32381l34244K6753L11541j469l71867j36031L10325J96167k71923
668f3272k73583J96112L39771p4516l28164Q220L56274J10625l11935j80437K80527
679E9622K61026k06714l13350J13307L22574l9699l35998o5747K93429J15320
689B03770k88344k10137K34115K70269j75912l31147R5326L73158K5443l46474
699a49933j11915L21597K17824k32302k64157J65058L15723p6085l37689j6854
$$ plain form
627 144724 278360 -71188 -277992 29521 317354 84277 -256155 -104916 272760 219552
637 219552 -164513 -217893 132077 263465 -59797 -296773 -64026 204005 7423 -336564
647 -336564 -235321 138869 144613 -204240 -266769 103303 315108 65965 -162575 48786
657 48786 339857 207476 -126768 -100015 211526 210057 -161810 -297841 12484 208651 -63272
668 -63272 -336855 -140743 199028 124512 -203652 -195432 160842 271467 -40468 -220905 59622
679 59622 320648 113934 -199416 -86109 236465 196766 -139232 -204979 88450 203770
689 203770 -84574 -294711 -60596 209673 33761 -297386 -202060 171098 196541 -149933
699 -149933 -261848 59749 277573 45271 -218886 -53828 261895 185810 -151879 -168733
709a68733L25323R0892l14828j91069K35970K30856j79509k79141R5600K99920
719A45281j4034k99106n4874L09249J57056k62354k22117K10583K93347j14588
729A48443l06215K7478L07827O3453k80058j40537K34524J91986k02900k71143
739b27142J09087K78567n7270l09123m2034K82544J23310k24046j59017J99262
749b5862K39342j05846k44224O2706K75638J6068k78710j04570K28398J46117
759B09057j98064k09443J13665K14068o2708k30422j712K30056O1243k16720j16996
770b07976J98442J80614j33963k00896Q7368K29344m59k03408m6252J86651R6645
781A86110j64176j49860J06921J62007q1421j95424J2871J74381K6200j54996
$$ plain form
709 -168733 156590 247482 -67346 -258415 -22445 208411 28902 -250239 -154639 145281
719 145281 131247 -167859 -222733 86516 243572 -18782 -240899 -30316 263031 148443
729 148443 -157772 -130294 177533 240986 -39072 -179609 54915 246901 44001 -227142
739 -227142 -118055 160512 103242 -205881 -247915 34629 157939 -66107 -225124 -25862
749 -25862 213480 107634 -136590 -73884 201754 217822 -60888 -165458 62940 209057
759 209057 10993 -198450 -84785 129283 66575 -163847 -165559 64497 125740 -90980 -207976
770 -207976 -9534 171080 37117 -163779 -76411 152933 152474 -50934 -97186 89465 186110
781 186110 21934 -127926 -21005 141002 59581 -135843 -122972 51409 77609 -77387
791g7387n8578J32619R1979r7461j01250Q6501J38345m9195j49733J8718J66708
802A01266L3239j51283p3979J18511R8736q7929j22334L7661J14166j8897j27796
813g8639k2535J13957M4713j01200o2107Q7534P9468n5587p0177N2706Q4238k8257
825D4114q7257J6065J03610J4512j11016n1852R4494P4555p9486r9210M2194R0342
837E1065k8718r2002M747Q8309J5090q6538l4520R0135O6615p0122p8064O1676
849a2327R7127l5605r7999J9844J06517K058j09952l7374R9069O4210q7613j04075
861i6120N1523J08680k9956j20559K530J19127K0404j12715l8117J17998Q2360
872A05155r0743j07482O6617J42498k0499j50524k5847J40009N4550j29757r0838
$$ plain form
791 -77387 -135965 -3346 88633 -8828 -110078 -23577 114768 65573 -84160 -65442 101266
802 101266 134505 -16778 -90757 27754 126490 38561 -83773 -46112 68054 49157 -78639
813 -78639 -101174 12783 57496 -43704 -105811 -18277 61191 5604 -64573 -11867 72371 44114
825 44114 -43143 -27078 76532 91044 -19972 -71824 22670 97225 17739 -81471 -39277 51065
837 51065 22347 -69655 -64908 23401 38491 -48047 -82567 7568 74183 4061 -74003 -12327
849 -12327 84800 49195 -48804 -28960 77557 79615 -30337 -67711 31358 95568 7955 -96120
861 -96120 -44597 64083 34127 -86432 -83902 35225 55629 -57086 -95203 22795 105155
872 105155 14412 -93070 -26453 116045 95546 -54978 -80825 59184 113734 -16023 -106861
883a06861R8800J06012p7479j32371L6470J43200M176j44947m2576J38168Q3280
894A05872j14343j04119J01826J36154o6909j53003L2634J69096K0791j70962
904d2963q3655J39354J26083j06962j64476N2659J66562j1273j65672k8000J55486
915C7143O9604j31506r8454J08640J38189o5265j52655K6198J62919J6574j59195
926d7808n5566J44976Q7040j29402j27760Q8643J54548m4389j75613j3774J67659
937D8554O7071j44796j05535J14576J33590p5568j41993M5622J53994j731j49427
948e5643l9607J39006Q2842j16139j17816P8824J35064m9531j49105R313J45445
959F2653K0467j42673o1735J24510R8560r1373j24591N4977J44374o096j37049
$$ plain form
883 -106861 -8061 97951 20472 -111899 -75429 67771 71947 -73000 -115576 22592 105872
894 105872 -8471 -112590 -10764 125390 58481 -94522 -61888 107208 127999 -42963
904 -42963 -126618 12736 138819 31857 -132619 -79960 86602 75329 -90343 -118343 37143
915 37143 106747 -24759 -123213 -14573 123616 58351 -94304 -68106 94813 111387 -47808
926 -47808 -103374 41602 128642 -760 -128520 -39877 114671 70282 -105331 -119105 48554
937 48554 115625 -29171 -134706 -20130 113460 37892 -104101 -58479 95515 93784 -55643
948 -55643 -95250 43756 126598 10459 -107357 -28533 106531 57000 -92105 -82792 62653
959 62653 83120 -59553 -121288 3222 101782 10409 -114182 -59205 85169 79073 -57976
970e7976k0088J33048N2743j16790p4293R7499R6185p5961j23441L1237J29043
981G1206J735j32522m5099J13162P2695r3197q6750P2348J06431m2644j08855
992g1490J8359J15778J8126j04038m5819R1533O8143p4577q3324N4663R3624m3326
1004C7652j09129J5304J11506R430j14740n0859R7924P9615o9240r7552M4455
1015d5634J09244j3302j03123k683J06389K6033r5774m7015Q4915O7429o8415
1026A8064q6398M2120R5862k5267j09221j730J11537K3476j16335n5699J03708
1037A17Q8781p6964j08995M4537J25039j512j16387k5512J13405N4358j01126
1048d259p6895Q9332R5945o9668j20656L6630J26798l136j32352m0110J18628
$$ plain form
970 -57976 -78064 54984 107727 -9063 -83356 14143 110328 34367 -89074 -57837 71206
981 71206 72941 -59581 -104680 8482 81177 -12020 -98770 -26422 80009 37365 -71490
992 -71490 -53131 62647 80773 -23265 -69084 22449 90592 16015 -67309 -12646 80978 37652
1004 37652 -71477 -56173 55333 64763 -49977 -100836 -2912 76703 7463 -90089 -45634
1015 -45634 63610 50308 -52815 -55498 50891 76924 -18850 -65865 19050 86479 18064
1026 18064 -68334 -26214 69648 44381 -64840 -66570 44967 68443 -47892 -103591 117
1037 117 88898 11934 -97061 -52524 72515 71003 -45384 -70896 42509 96867 -4259
1048 -4259 -81154 8178 104123 34455 -86201 -49571 77227 74091 -58261 -98371 20257
1059B0257P0568j03854j00819Q2547J27557n0637j39346J7544J51380K9679j35442
1070c0566o5438J14078R8985q9002j24438N2954J37383k6400j54228j4602J55134
1081E3860N5044j43189r8448J15258J34443p1255j54085K5081J61255K0722j54315
1092e5629n8928J43683R9014j18980j29247Q7579J53793m5331j66703m092J60764
1103F5923M6473j51877r0787J31135J27516j00810j59148O2587J82406p735j83784
1114g8101m7869J67592R8608j35197j36461R1608J61329m6816j72799M843J74150
1125H0887L9740j65192q4396J41067J20091j09431j51112O1635J67307j4741j71155
1136h5300l0243J68927P8455j49108j19586J21310J54281p6923j76613K0444J76760
$$ plain form
1059 20257 90825 -13029 -113848 -31301 96256 45619 -93727 -76183 75197 104876 -30566
1070 -30566 -96004 18074 117059 28057 -96381 -43427 93956 67556 -86672 -101274 53860
1081 53860 108904 -34285 -132733 -17475 116968 45713 -108372 -83291 77964 98686 -55629
1092 -55629 -114557 29126 128140 9160 -120087 -32508 121285 75954 -90749 -94841 65923
1103 65923 112396 -39481 -130268 867 128383 27573 -131575 -68988 113418 105683 -78101
1114 -78101 -125970 41622 140230 5033 -131428 -39820 121509 74693 -98106 -93263 80887
1125 80887 120627 -44565 -128961 12106 132197 22766 -128346 -66711 100596 85855 -85300
1136 -85300 -115543 53384 131839 -17269 -136855 -15545 138736 61813 -114800 -94356 82404
1147H2404L1308j63159p8962J36413J16424j06184j42702P2518J62050l1519j69705
1158i1114j5386J65387O1232j45223j00848J13537J33409p3462j52841L4237J66830
1169I5758P476j64981n2674J50398R1313j24223j26774Q3624J43773l9526j52295
1180h8131k940J50199M2700j41565p5561J27082J11085r7585j34253N8189J52377
1191A01597j3367j51534l3003J36043O9490j18610j01080Q6680J22502n9935j36298
1202i7515K4369J41415J5036j33246m9085J18589P9863r1994j03222O7532J21651
1213I3393l8658j34225N216J40251L1381j32256p0654J09816R9437p8971j20290
1224i5560M0332J26551m885j26515k5489J20550N7140j06443p9643Q9258J02659
$$ plain form
1147 82404 113712 -49447 -128409 8004 124428 18244 -124458 -51940 110110 78591 -91114
1158 -91114 -106500 58887 120119 -25104 -125952 -12415 120994 47532 -105309 -71072 95758
1169 95758 103234 -61747 -114421 35977 127290 3067 -123707 -40083 103690 64164 -88131
1180 -88131 -91071 59128 101828 -39737 -115298 11784 122869 25284 -108969 -50780 101597
1191 101597 88230 -63304 -96307 39736 109226 -9384 -110464 -23784 98718 38783 -97515
1202 -97515 -73146 68269 83305 -49941 -99026 19563 99426 7432 -95790 -28258 93393
1213 93393 54735 -79490 -74274 65977 97358 -34898 -105552 4264 103701 24730 -95560
1224 -95560 -55228 71323 66438 -60077 -85566 34984 92124 -14319 -93962 -4704 97955
1235I7955o2178j16361K9803J21457J547j23591l5069J15634O6248j03005r5709
1246a03269Q2575J22292m8256j34204J0991J31729K8604j22365o1637J00464Q4275
1257I1199q0158j06025N4514J21694k4577j30428m973J30777M1792j18414p2491
1268i7090R8765R8555o9132j20314L7684J29844k781j36519l4041J28994O7655
1279A01620j10424r7334Q2416J17097m8479j26601J3973J30950K1812j29609n4502
1290i9081J18911Q9412r8961j18502O7159J38106k6310j45011j5159J39557N1440
1301A01561j20009q6088R7099J14586o9880j35290L6050J44591K640j43941m1708
1312a00389J29797P5430j09038j06374Q1626J28214m7097j44896Q212J53396L5863
$$ plain form
1235 97955 35777 -80584 -50781 70676 72223 -51368 -86437 29197 95445 -7560 -103269
1246 -103269 -20694 101598 53342 -80862 -69871 61858 90462 -31903 -93540 6924 91199
1257 91199 11041 -94984 -40470 81224 56647 -73781 -78754 52023 93815 -24599 -97090
1268 -97090 1675 100230 31098 -89216 -51532 78312 75531 -60988 -95029 33965 101620
1279 101620 -8804 -106138 -23722 93375 44896 -81705 -67732 63218 85030 -44579 -99081
1290 -99081 19830 109242 10281 -108221 -41062 97044 70734 -74277 -89436 50121 101561
1301 101561 -18448 -104536 -7437 107149 37269 -98021 -61971 82620 85260 -58681 -100389
1312 -100389 29408 104838 -4200 -110574 -28948 99266 52169 -92727 -84515 68881 104744
1323A04744j42892p5834J23883J12049q7359j35413M5937J43625n594j47388l5354
1334i9596J34246O9779j19399j03139R2162J27995n5216j42999J8998J45596K5124
1345I3551j37252n9748J21994R6374r6360j25251O4404J44902k3080j53367k1128
1356i4961J43675O1738j25677r6042R2789J18592n9711j35445K3345J42139J4628
1367H5070j40554n1721J28738Q7596j00598j13268P0381J31334l0053j37265q102
1378g8442J35983M6058j25933q1600J02276J08319p3770j31357L5349J34407J096
1389G2386j30759l7904J17756P0469r6544r4845P5549J18788m1697j29577P801
1400f8577J32784L0914j22858o4429R9503R0256p3626j10690L9319J19391r907
$$ plain form
1323 104744 -38148 -113982 9901 121950 34591 -100822 -54885 88740 83146 -64242 -99596
1334 -99596 34650 104429 -14970 -118109 -25947 102048 46832 -96167 -77169 68427 93551
1345 93551 -43701 -103449 18545 114919 18559 -106692 -42288 102614 79534 -73833 -94961
1356 -94961 48714 110452 -15225 -111267 -18478 100114 40403 -95042 -71697 70442 85070
1367 85070 -55484 -107205 21533 109129 8531 -104737 -34356 96978 66925 -70340 -78442
1378 -78442 57541 103599 -22334 -103934 -1658 106661 32891 -98466 -63117 71290 72386
1389 72386 -58373 -96277 21479 91948 -4596 -99441 -23892 94896 53199 -76378 -68577
1400 -68577 64207 95121 -27737 -92166 7337 97593 23967 -86723 -47404 71987 62080
1411F2080j21708k4870J14517N4237r8522p7821P5611R7851m7177j05412K0359
1422e0855J10414J1634j09194l9746J01290O7345q4454r2015N7351J06281k6551
1433E1500j12701o041J05773L3341r3182n9492P6475P9700n5629r3594L3031J02910
1445F2091o954j00692j9279R4486M4285q1281o4568O4813Q0597m3626r4844J7146
1457d7826J01751R101j00442l7892Q8786O1050p0691p7223M7153Q7487k1917r1112
1469e1775j460R2772K5427q6051m7187P4730P0128n8223q4588L3677Q9184r583
1481D7051r2333j6558Q6860L9582p8403o0746O3732P9276l9698q9934J8838R3977
1493E1644P107q9171l0125P9734M9396o7412o8767M9126Q4817l0179r6198L460
$$ plain form
1411 62080 -59628 -84498 30019 84256 -14266 -92087 -16476 81375 34198 -71214 -50855
1422 -50855 59559 71193 -38001 -77747 23543 90888 6434 -85581 -28230 78051 51500
1433 51500 -61201 -67242 38531 71872 -21310 -80802 -4327 75373 19744 -73850 -40819 62091
1445 62091 55137 -45555 -64834 29652 73937 -7344 -71912 -7099 73498 29872 -64972 -47826
1457 -47826 53925 63026 -37416 -75308 13478 74528 3837 -73386 -26233 61254 39337 -51775
1469 -51775 -53235 39537 64964 -21087 -68274 6456 76584 18361 -66227 -32550 56634 47051
1481 47051 -45282 -61840 25020 64602 -13801 -74547 -10815 68461 28763 -61171 -42333 51644
1493 51644 58751 -30420 -60545 19189 68585 1173 -67594 -18468 66349 36170 -60028 -56568
1505e6568R6909K4782r1201m8858P6471O8271n5341q1010L3186R1072p515r2222
1517d2024j7800R0653M1590p9539o2755O3323P7321m2367q8202J7555R2008M101
1529E3864r3020l1587Q5601N5640p0787p8991N0488R4283k1784r7646m671R6230
1541C7620L2991q4494n2332O8844P2950m9565q7694K4051R4141r57r7283k5835
1553f7563Q7313M7791p5300o7358N4179Q3772l2212r2531Q137R7954K2117r0637
1565b4338m7176P9339P1215n6742q4734L3259R0660r279r2537j9276Q5887M0453
1577F6731p7705o3886N8673Q0739l7317r1471J2208R4947J3276q7794l4745P6746
1589A0402O0483n9661p5884L9840Q9135j4443r2536j2092Q6709L5511p6423n6454
$$ plain form
1505 -56568 40341 65123 -26078 -74936 1535 69806 14465 -66545 -33359 57713 50198 -42024
1517 -42024 -59824 30829 72419 -7120 -69875 -6552 70769 28402 -59800 -42245 49763 53864
1529 53864 -39156 -70743 14858 70498 -289 -79280 -28792 65491 43707 -53939 -58610 37620
1541 37620 70611 -13883 -66215 2629 75579 26014 -61680 -37629 56512 55555 -41728 -67563
1553 -67563 19750 67541 -7759 -75117 -20938 62834 30622 -61909 -53772 44182 66299 -24338
1565 -24338 -71514 7825 79040 22298 -62436 -29177 61483 52204 -40333 -59609 26278 66731
1577 66731 -10974 -74860 -16187 64552 27235 -64236 -52028 42919 56195 -31599 -66344 10402
1589 10402 70885 11224 -64660 -24820 64315 49872 -42664 -54756 31953 67464 -8959 -65413
1601f5413N8935O8284m0716q0271J6910Q4758N042q5293k8812P8414N2100o1925
1613B013o8053M3271Q0539j8030q1403k933P9509K6895p0200m8652N8954O1235
1625F3145m2719p4407K0515P4979j94p6780k0378O9199L7338n7912n2489M4317
1637a5386O8311k5350p4051O022P8417J7355p0464l6632N9315N1043m4351o1357
1649d7128K3874O6266p680o7989j3946O3454K9269n7433m3956M6230N4326k9963
1661A5324n9506J4611O4317L105o2386j8820N8190L6343m7104n0397L2296O0793
1673D6766j6450o3276j722N9293J5823n3168l1824M4143M0435l2640n1233J9658
1685b4195N7484l957n8323r304N5410K4626m5682l6463L7863M6364k5073n2008
$$ plain form
1601 -65413 -6478 61806 21090 -59181 -42271 42487 47529 -37764 -66576 11838 63938 2013
1613 2013 -66040 -22769 57770 39740 -41663 -44596 34913 61808 -8392 -57044 1910 63145
1625 63145 20426 -53981 -33466 41513 41319 -35461 -55839 13360 50698 -7214 -59703 -15386
1637 -15386 52925 27575 -46476 -40454 37963 55318 -15146 -51778 7537 58580 14229 -47128
1649 -47128 -23254 43012 35332 -32657 -46603 16851 46120 -11313 -55269 -9039 45287 15324
1661 15324 -44182 -29571 34746 37851 -24535 -43355 14835 51178 4074 -46323 -14027 46766
1673 46766 30316 -32960 -34682 24611 40434 -12734 -44558 -415 40020 7380 -43853 -24195
1685 -24195 33289 29332 -28991 -38295 17115 41741 -3941 -40404 -2541 43823 18750 -33258
1697c3258J0628N4571N009n5315k1574M7393L2100m1098m1316K7553M7608j4698
1709A7603m9506K881N1485J2701m9106k3675M2584L8997l3110m7334J9538N2174
1721C5232o568n3668q340M9797K0122m4035l3142L4194M2418k3150m8957R776
1733b6321N1513L175m9175j4065M6538K6557l7419l5842K8958M5638j7833n0994
1745b9270K431N1234J2874n0397k8003M2428L6756l2471m4721J8438M9033m319
1757B4013m9046q647M8599K2819m1177l3353L3109M3758k3353m7021R615M9640
1769B8956L185m9720j7307M3469L0667l6965m2880K4731M8983j1228n1256m027
1781c3392M9592J7151m3472k7698L7040L8430k5757m5038J5146M9230J325n0984
$$ plain form
1697 -33258 -22630 31941 36950 -18365 -39939 7454 39554 -1544 -42860 -15307 32301 17603
1709 17603 -31903 -29022 22463 35164 -13942 -37617 4967 43964 10854 -36480 -16942 35232
1721 35232 28664 -25004 -33344 16453 36575 -7460 -40602 -6408 36010 12860 -36097 -26321
1733 -26321 25192 28367 -20808 -34873 11665 38222 803 -35039 -6081 39557 21724 -29270
1745 -29270 -26839 24395 37269 -13128 -41131 1297 38053 5582 -39139 -20701 28332 24013
1757 24013 -25033 -33680 14919 37738 -3439 -36792 -3683 40075 16722 -30299 -20684 28956
1769 28956 32141 -17579 -34886 8583 39250 2285 -40595 -15864 33119 21891 -29365 -33392
1781 -33392 16200 33351 -10121 -37819 -779 37651 11894 -33144 -17998 31232 32557 -18427
1793a8427j4368M6374K5414l9905l7614K7872M4063j8104m7723K617M9275J3565
1805C3039m6285k5418L9840L7297k7993m2235J5696M5713l190m7085q872M3514
1817A4021K0710l8798l1209K9108M1637j7793m7176N847M6667Q045m5707k0766
1829c5414L8745K9142k8810l8033J7959M3432m114m4159p240M2353J9395l6001
1841b745k7059K8095L2622j8395l9366Q190M1353K066m0712j4845L6098K6550
1853C1852k9323l5294K0156L8694p340m0907j702L6700J4090l2915k2300K7057
1865a232K9461j8090l4143Q384L7401J82l6481r622L2089J8528k7828k5175K0305
1878f221K9628j0376l5356J532L4721R299l1328j6919K6191K3235j8459k7772
$$ plain form
1793 -18427 -32795 13579 38993 -912 -38526 -10654 33409 15305 -32418 -29801 19474 33039
1805 33039 -13246 -38664 1176 38473 10480 -31755 -16059 29654 26464 -20621 -29493 14021
1817 14021 34731 -4067 -35276 -6168 35469 17676 -29500 -23653 23014 31059 -14648 -35414
1829 -35414 3331 32473 3663 -34370 -16411 27021 22907 -21252 -28492 13861 33256 -2745
1841 -2745 -29804 -1709 30913 12518 -26848 -18658 22695 24761 -15951 -30796 5302 31852
1853 31852 2529 -32765 -12609 26085 18745 -22162 -23864 12836 26926 -5989 -28289 -1232
1865 -1232 28229 10139 -24004 -15620 21781 21963 -14518 -24140 7949 26477 -1351 -26526 -6221
1878 -6221 23407 13031 -22325 -20793 13928 23227 -8101 -25020 1171 24406 5947 -21825
1890b1825J1176K9137k889k9557m873K8327J2892k5230j9833J8933K6055j3101
1902I212k7416N628K9127J048k6881j0383K4394J5448j9488k2327J2634K6179
1914A7175o120k6246M17K5548O194k2959j1097K0102J6181j5640k0756R699K2739
1927A5237k102k5648l429K4120Q994k0166j5587J7000J9049j1430k2397N719K2257
1940A1617K130k3002p676K0269J3306j6526j7164J3824J8475q663k0093M111K1784
1953A2392J933k1557p400J8440J3560j4243k0143J0129K1074l712k2677j298K2046
1966H544M431j8717j1390J5654J6520j0622j9069M749K2406k29k0385n015K0268
1979G145Q750j7805j2609J2181J8847r555k0848K550K1396M617k0845j0016J6858
$$ plain form
1890 -21825 -10649 18488 15599 -13958 -18831 9496 22388 -2842 -22675 -3742 22313 9212
1902 9212 -18204 -12576 16551 17599 -9282 -19665 4729 20177 689 -21638 -9004 17175
1914 17175 11055 -15191 -14774 10774 16968 -5991 -17088 3014 19195 3555 -17201 -7502 15237
1927 15237 13135 -12513 -15942 8178 17172 -2994 -18581 -1581 17468 6038 -16359 -10640 11617
1940 11617 13747 -9255 -16931 3338 16644 118 -17046 -3222 15253 6590 -13503 -9392 12392
1953 12392 14325 -7232 -14632 3808 17368 3125 -17018 -6889 14185 10473 -12204 -13502 8544
1966 8544 12975 -5742 -17132 -1478 15042 4420 -14649 -9900 12506 12277 -8108 -13123 7145
1979 7145 15895 -1910 -14519 -2338 16509 6954 -13894 -11344 10052 14669 -6176 -16192 666
1992F66J4763j3901j6664Q970J8870l874k0425j653K0006Q163j8095j2954J6493
2005C65J5759j0448j9098M601K1515m15k0860n619J9082J0809j5493j6089J0447
2018e444J9190n495k0736M0J9369N786j7696r903J6119J2787j0618j7720Q009
2031f312J9490j500k0032m882J8846R473j5758j5120J2350J8152q115j8431J342
2044a0497J8676L584j8426r242J5521J3646j0863j6221Q582J6402j394j7908j545
2057i685J7079O195j5420j1811J1666J5400p835j7605J643J8509K697j7573n385
2070a2125J4520J0819j1023j3437O917J4788k757j5820j730J5034O123j3791q745
2083a1227J0672J2512p133j5039M618J5005k10j4575m690J2218R413r957j3349
$$ plain form
1992 666 15429 1528 -15136 -6166 12704 8830 -11595 -13248 6758 14921 -3174 -16128 365
2005 365 16124 5676 -13422 -8821 12694 12279 -8581 -14200 4882 15691 198 -15891 -5444
2018 -5444 13746 8251 -12485 -12445 6924 12710 -4986 -14889 1230 14017 3399 -14321 -6312
2031 -6312 13178 11678 -8354 -13236 5610 15083 -675 -15795 -3445 14707 6592 -11839 -10497
2044 -10497 8179 11763 -6663 -15905 -384 13262 2399 -13822 -5240 11162 9768 -8140 -9685
2057 -9685 7394 13589 -1831 -13642 -1976 13424 5589 -12016 -10373 8136 10833 -6740 -12125
2070 -12125 2395 13214 2191 -11246 -4329 10459 7702 -8118 -9848 5186 11309 -2482 -11227
2083 -11227 -555 11957 4824 -10215 -5597 9408 9198 -5377 -10067 2151 11564 1607 -11742
2096a1742P454J3275l395j3238q16J3082M226j1320p191J0814R011o159j2596
2109h595K139J3370k59j2092m024J2697N810r623q939Q416J0516m546j1718l79
2123g227J1476M165j1428n288P899P408n809q810L615Q829p53r160j364R657L751
2138F961p212o213O623O887m222r590L345Q693J46r317k915R065N262o142p233
2153e862M639O916k340p649o59O791K580p560l513N986N050m468n013L944P031
2168E873r50p200q18O599K272p087l782N379M938m556o058J547P336k28o926j947
2184e608O968L441n671n080M089O832l486o828K013P960k70n817k190N278N533
2199G164n829n242K795N734j405p201j044O834K145p517k114N689L914m223m671
$$ plain form
2096 -11742 -4288 8987 5592 -7646 -8462 4620 8846 -2474 -9665 1149 10160 4001 -8595
2109 -8595 -6456 6914 6655 -5437 -9461 3236 9046 -577 -9516 -1100 9416 4870 -6848 -7227
2123 -7227 4249 8414 -3014 -8302 -403 7005 1196 -7614 -3999 4830 4077 -5083 -6447 3210 6961
2138 6961 -251 -6464 159 7046 2824 -6766 -3421 5272 5418 -3899 -6814 2251 7513 1371 -5862
2153 -5862 -1223 5693 3353 -4296 -4955 1836 4416 -3144 -6657 -671 4379 -89 -5102 -1158 5873
2168 5873 4923 -2277 -3095 3504 5776 -1311 -5093 286 5224 668 -5390 -3843 3493 3265 -3661 -5608
2184 -5608 1360 4801 -870 -5950 -1861 4971 1485 -5343 -3330 4630 4360 -1457 -3647 1631 7164
2199 7164 1335 -3907 -1112 4622 3217 -3984 -5028 1806 3951 -3566 -5680 9 3923 -300 -4971
2214d971K606P415j845o392R1O055L585p044m947N634N234k701p866K518O240
2229C612O95o243k717M321M923n294m654L461N993k718n360K9O962K538o784l713
2245d949N868N035m112n890J792P884j449q183j230P017L147n944n328M587O547
2260D792j406o980k99O609K858p230k804M918M372m533n449L414N854p62o022
2275b668j810O849K461m842n511M964O311l820o799J340P565O97o869m243O534
2290A59N586m046o227J910O939p35p228j491P591K556n999m177M356N641k379
2305B456o444P54O377J611o707l068N662M713m279o040L358N725j380o197m85
2320c944N669K993m927m971N041M969l303o048M50P088N18n966k324M671M845
$$ plain form
2214 -4971 -2365 5050 3205 -3187 -3096 2959 6544 -500 -5447 187 5421 2720 -5146 -2628 3612
2229 3612 4307 -1936 -4653 -332 4591 -703 -5357 -1896 4097 1379 -3981 -3952 3010 5548 -1236 -4949
2245 -4949 919 5954 1842 -4048 -2256 5628 4179 -4004 -5234 1783 4930 -1014 -6342 -1755 4792
2260 4792 3386 -3594 -3893 2716 5574 -1656 -4460 458 4830 297 -5152 -1738 4116 3354 -2668
2275 -2668 -4478 2371 4832 -10 -5521 -557 5754 1934 -4865 -3525 4040 4737 -2132 -6375 159
2290 159 5745 1699 -4528 -2618 4321 3586 -3642 -5133 2458 5014 -985 -5162 -806 4835 2456
2305 2456 -3988 -3234 3143 4754 -1953 -5021 641 5354 1075 -4965 -1607 4118 2738 -3459 -3944
2320 -3944 1725 4718 -209 -5180 -139 4830 1527 -4521 -4071 3017 3535 -2431 -4755 -84 4761
2335D761l566o295L415N770j00n812j260M620K783n213k944L304M870l976m119
2350c762Q01N753o74m140j873M828K470m137m147L489N821j725n300q03N338K178
2366D117m236k833K428M912l670m190J041M330L72l973k266M914K587l510l898
2381c875K538M363m27n184J299M250j55m459k633M570L901l221m415J272M887
2396B711k64l838j545M206K314l348l681K308M087k571l665J203L296P87l080
2411a080j687K292L713k350l496K430L609j277l685J90K376K424l690l439K345
2426a325M337l042m077K214K758J816n299M61L614J204k116l728J835L728L6m623
2442b207o14M556J958m319k109K825K460j615l360P99L325L75l471j385L865J163
$$ plain form
2335 4761 1195 -5100 -1685 4085 3985 -1827 -3087 1533 4316 -897 -3841 -537 4333 357 -3762
2350 -3762 -2961 2792 2118 -2022 -3895 933 3403 -734 -4881 -1392 4429 2704 -2596 -3399 1939 4117
2366 4117 -119 -2952 -524 4388 718 -3472 -2431 1899 2271 -1702 -3968 946 3533 23 -3875
2381 -3875 -1337 3026 2599 -2585 -1286 2964 2809 -1650 -4283 287 4188 967 -3448 -2176 2711
2396 2711 2447 -1391 -2936 1270 3584 236 -3445 -1137 2950 379 -3286 -2083 1213 2000 -1080
2411 -1080 -2767 -475 3238 888 -2608 -178 3431 2154 -1531 -1341 1035 3459 -231 -3670 -1325
2426 -1325 3012 -30 -4107 -1893 865 2681 -2618 -2157 1457 2661 545 -3183 -1348 2380 2416 -2207
2442 -2207 -2821 1735 3693 -626 -2735 90 2550 935 -2425 -1626 1699 2074 -1397 -2782 1083 2246
2458B246m453k53K367K885j489m394J709L895R19m997j703L462L474l259l989
2473c580J913M654n54l527p43L720O63k826j929J671L186k132l783J601L974o71
2489A637l746P75L079L47l418j799L430K824j323n080J378M720J181n279j823
2504c097L952K869l106m510J802M722m95n112j00M869J797l953k852L888K920
2519C594j914m432Q33N001o06n607j554N101L453l991l385K338N570k297m834
2534b730J34M606J633n468j952M563L613l934m975J731O090J017n998l326N677
2549F81K602l650m125L437N144k091n648N71O413P87m808l529M742L552k902n798
2565d622L529N648k100o873J29P193K422p222l494M516O942l428p318N05P902
$$ plain form
2458 2246 -2207 -2460 -93 2792 1303 -3091 -1382 2513 3432 -1565 -3268 194 3668 409 -3580
2473 -3580 -1667 2987 2433 -1094 -1837 1883 2546 -280 -2209 -538 2648 516 -3267 -1666 2308 1637
2489 1637 -2109 -1334 1745 2092 -1326 -3125 305 3129 1806 -3274 -1896 2824 4005 -1274 -3097
2504 -3097 855 3724 618 -3892 -2090 2632 2137 -2975 -3075 1794 3591 -362 -3214 674 3594
2519 3594 1680 -2752 -1919 3082 2476 -3131 -4685 416 3869 -122 -3507 -1169 4401 2104 -2730
2534 -2730 -2596 2010 3643 -1825 -3777 786 4399 465 -4510 -2779 3311 4328 -1670 -4996 681
2549 681 3283 -367 -4492 -1055 4089 1998 -3650 -3079 3334 4121 -687 -4216 526 4078 1176 -4622
2565 -4622 -1093 4555 2455 -4418 -4289 2904 5326 -1896 -5390 -874 6068 2640 -4678 -4173 3729
2580C729J305o745l773O527M398m064n533K429N610o92p197l45O058L297o612
2595a608l586M636N989l718o282J882P571n82q275j812P198M633n238o693L744
2610b141P439p76q591j047P721L834p972m643N486O096l263p984K475P049O47
2625D330p619j146O999L450n511o071L934P448j839q877K54Q075J664n945n027
2640e881O193N769m557p508K769P315l14o979k857P764M350n613o206M665O617
2655E527j799p575j211Q794J808q382l395O163M855l253p502K725O928J122q080
2670c275o98O684K591o053m672N931N634m621o832O96Q881K69p326l750O833O079
2686F371n863o415L149P345m50q098q80P878K528n221n754M664O535l727o692
$$ plain form
2580 3729 5034 -1711 -5484 1043 5441 1377 -4156 -1727 3883 3191 -4006 -4351 1707 5004 -1608
2595 -1608 -5194 -558 5431 1713 -4569 -2687 4884 4302 -3973 -5785 1413 6046 808 -5885 -2141
2610 -2141 5298 4522 -4069 -5116 2605 6439 -1533 -6176 -690 5406 2143 -5841 -3366 3683 4330
2625 4330 -3289 -4435 2564 6014 503 -5568 -1634 5814 3975 -4902 -4648 3427 5091 -854 -5881
2640 -5881 312 6081 1524 -5984 -3215 4100 3786 -3193 -6050 1714 6064 451 -5755 -1090 5527
2655 5527 3728 -3847 -5058 3736 5544 -2838 -6233 -70 4785 1532 -5970 -3245 3683 4805 -3275
2670 -3275 -3973 2711 5302 -751 -5423 508 6142 1521 -5311 -4615 4266 4535 -2791 -6541 292 6371
2686 6371 508 -5907 -2758 4587 4137 -3961 -4841 3037 5565 344 -5410 -746 5789 2062 -4630
2701d630K284O707l6p336j573O331L765p330m742M892P407l966p071J401P114
2716C217J979o785l551N711M908m055p211L139P271o91p846j259Q098J670o130
2731a535l472N644O276m995o420J964P338o96q076k032O561N091o464m371M538
2746f49O551k953p263Q69Q613J120q727m532Q677M198o605o647M236R217k323
2761C782q181q81Q929K570p833n616N693P535l342r345K317Q553K06q857j060
2776e530Q761L182o883n666N459P891k937j0583L83J0494J919r702m576P226P992
2791G430o956q425M085J0818j063j0095j193Q882M777q214p254O409Q617m152
2805C666r476K022R363p1j0946k338R953N257p908q677O431J0883l416j1828L4
$$ plain form
2701 -4630 -2346 4361 4325 -3011 -4584 1747 5512 -1818 -6560 -1668 5739 1773 -5298 -3897 3217
2716 3217 5196 -1589 -5140 571 5479 1424 -5787 -2648 4623 3932 -3914 -5173 2925 4595 -1535
2731 -1535 -5007 637 6913 1918 -4502 -2538 4800 4104 -3972 -6004 557 5648 -816 -5187 -649
2746 -649 5902 2949 -4314 -3445 5168 6288 -2439 -6971 1706 5904 -701 -7348 -3112 6105 3782
2761 3782 -4399 -5280 3649 6219 -1614 -7230 -1537 5998 2656 -6689 -4372 4181 4387 -4470 -5530
2776 -5530 3231 6413 -470 -6136 -677 7214 4277 -6306 -5923 4571 6490 -3212 -7788 -562 7430
2791 7430 474 -7951 -3866 6952 5889 -4206 -5399 3483 8260 46 -7208 -799 7818 3666
2805 3666 -5810 -3788 5575 5504 -5442 -7780 2173 7430 -478 -9155 -2724 8159 4743 -7085 -7051
2820g051J1800K715r585o913Q828R259n563j0669K552J1763O67j1570m480J0422
2834B175O324r220q679O621J0546l000j2044K99J2381L456j1351o402J0409Q060
2848I575o968j1777M107J1653p83j1748j823J0912N937r231q962P366J1477n414
2862D321j1196k13J2298L133j2175m805Q785R814q419j0727M092J1990P91j3135
2876e446l066J1491O212r329r582Q123J1356m904j2482J590J2441J733j2182n145
2890i190J0070Q317q794j1385N376J3712j904j3711j049J2180O042j0908p808
2903i052Q107J0957n835j1487J718J1552K084j2087l204R307N833p819q774O395
2917b305J0359m002j1054k68J3162K418j0470o249R179Q671o864j0891L384J2327
$$ plain form
2820 -7051 4749 7464 -2121 -9034 -206 9053 3490 -7179 -4627 7136 7803 -3767 -8247 2175
2834 2175 8499 -721 -9400 -2779 7767 4767 -7277 -6978 5403 8859 -2492 -8894 1515 9575
2848 9575 2607 -9170 -5063 6590 5807 -5941 -7764 3148 9085 -146 -9108 -1742 9735 4321
2862 4321 -6875 -7088 5210 8343 -3832 -8637 148 9962 1543 -9184 -5092 6898 7689 -5446
2876 -5446 -8512 2979 9191 -138 -9720 -1597 9759 4855 -7627 -6037 6404 8137 -4045 -9190
2890 -9190 880 9197 403 -10982 -5606 8106 6202 -7509 -8558 3622 9664 -1244 -9052
2903 -9052 -945 10012 4177 -7310 -5592 5960 8044 -4043 -7247 2060 7893 74 -8700 -2305
2917 -2305 8054 4052 -7002 -7270 5892 8310 -2160 -8409 770 9441 2577 -8314 -4930 7397
2931G397o36j0984l380J0174O517q661r161N604J0486k965j1122O97J0686K709
2945G361j0954m286Q479Q723p911r907M641J1064j839j1884l99J0328N265j0162
2959a481o932P577Q558m012j0945K617J1435K26j1311l510R369O270p879q893
2973h911O305R936l212j1956J653J0443L990j0560n100R470O326o177r191M497
2987b487Q946j975j0438n62J0409K904r717n976P958Q449n157j0314L567J0606
3001F213Q12j1235l942J1793N362q199r351O762R315k075j2445m41J1728K974
3015G271r793o303Q804P850p682q985M721J0884j731j1619j98J0325N584j0523
3029a395p851R510R855o345j2236K959J2149J075j2877l665J0790P645r198j0378
$$ plain form
2931 7397 6761 -4223 -7603 2571 9088 427 -8734 -3130 7356 4391 -6731 -6034 4652 7361
2945 7361 -3593 -7879 600 9323 1412 -8495 -3854 7210 5371 -6513 -6912 3416 8681 -1481
2959 -1481 -8413 -836 7722 3710 -7235 -4618 6817 7043 -4268 -7778 1591 7861 -18 -8911
2973 -8911 -2606 7330 4118 -7838 -6185 4258 8248 -2312 -7412 2058 8384 2207 -6984 -2487
2987 -2487 6459 4484 -5954 -6516 3893 6797 -2920 -8896 -938 7511 2354 -7960 -4393 6213
3001 6213 7025 -4210 -8152 3641 9003 804 -8547 -1785 7530 5455 -6990 -7431 4297 7271
3015 7271 -2522 -8825 -21 7829 147 -8838 -4117 6767 5036 -6583 -6781 3544 9128 -1395
3029 -1395 -9246 264 10119 3774 -8462 -5503 6646 7721 -5156 -8821 1969 9614 416 -9962
3043i962O497J1871l042j3116l49J3063M110j2761n350R966Q350o554j1848M547
3057d578J2199J12j4086k224J2485N513r729r516P655J1964o178j2441J731J2969
3071E876L178j3304o871J2317Q588q094j2186N651J4533l035j4118j493J3903
3084D945N347j1187r992R340J0465l744j3601J173J4579J581j4165l158J1158
3097B741Q305r755j1689N852J3291l165j3977j031J4806N337j4278p926J1027
3110d62J2937q222j3515L010J3539K916j4901m942J1143Q567r051j1553P412J2033
3124H911l379j3715n3J4858L243j3184p168J0457J0644o942j3539M950J3448j92
3138H339j3609l470J2620O432j1067r974P498J2401l892j2736r3J3100L435j1840
$$ plain form
3043 -9962 -3465 8406 5364 -7752 -8101 4962 9072 -3689 -9039 927 9277 2723 -9125 -4578
3057 -4578 7621 7733 -6353 -8577 3908 9421 -308 -9824 -2169 9795 3617 -8824 -7093 5876
3071 5876 9054 -4250 -11121 1196 9784 1690 -10496 -4845 9688 6653 -7465 -8958 4945
3084 4945 10292 -895 -10887 -1547 8918 5174 -8427 -7254 7325 8906 -5259 -8417 2741
3097 2741 11046 1291 -10398 -4546 8745 5580 -8397 -9428 5378 10715 -3563 -11489 -462
3110 -462 12475 4253 -9262 -6252 7287 10203 -4698 -9640 1503 10070 1019 -10534 -3122 8911
3124 8911 5532 -8183 -8236 6622 9865 -3319 -10487 -30 10614 3672 -9867 -4917 8531 8339
3138 8339 -5270 -8740 3880 10312 -755 -10729 -3231 9170 5278 -7458 -7551 5549 8984 -2856
3152b856o242J0769Q021q358j0650M082J4908k538j3248k500J2042O661j1084
3165i93j0005Q903J1627n213j1895J355J2458J579j2224m291J0994Q211r317r669
3179h480N033J2651l070j2989n74J1316L561j0485o555Q939J0157n760j0963K021
3193e198J1295O25j1159l463J0156O681r481p336N593R837l478j0440N49J1587
3207E768J563r466o871J0125Q035q620j0053N863J0755k227j1007j341J0852M598
3221G974p790q400P525Q977m120j1019K896Q972J036j0591l148J0003N417r257
3235a525p092O270J0076m195j0663J427J1648J077j0622m291J0542O746p730q614
3249f946M104J0330r37j2178j131J0156M147r596n860O513Q983n566r564K705
$$ plain form
3152 -2856 -9098 1671 9692 1334 -9316 -5234 9674 7136 -6112 -8612 3430 10091 -993
3165 -993 -10998 -2095 9532 4319 -7576 -6221 6237 7816 -4408 -8699 2295 10506 1189 -8480
3179 -8480 -3447 9204 6134 -6855 -7429 3887 7448 -3037 -9592 -653 9504 3744 -7219 -5198
3193 -5198 6097 6722 -4437 -7900 2256 8937 -544 -7880 -2287 7550 4072 -6368 -5819 5768
3207 5768 7331 -2135 -9006 1119 9154 534 -9519 -3656 7099 4872 -6135 -7476 3376 7974
3221 7974 184 -8216 -691 8286 4166 -6853 -3957 5015 6051 -4540 -7688 2315 7732 -1525
3235 -1525 -8617 -2347 7729 3534 -7129 -5702 5946 7023 -3599 -7890 2652 9398 1668 -6946
3249 -6946 -2842 7488 6551 -5627 -6758 3398 7545 -2051 -7911 -1398 7585 2019 -7545 -4840
3263d840J1549O0j1971k532J0173O969q988q314O101J0227l119j1562k18J2256
3277E791J293j0954n549Q886Q710p506q487M033J1102j602j1892j665J2547M728
3291I435j1024q540R104J1143m966j3240J022J3531J324j1321n774J1145O817
3304H656p559j0764N414J1388l385j1232m77J3156M065j1250p936J1284R244p209
3318C395j2921M397J3859o94j4089m707J2573Q718r545j1552O205J3431k158j3890
3332f978j405J2829M598j2655p020J0431J0266p511j1833M435J2270P21j3204
3345e056l549J2290O503j0351j0596O996J3225m722j3465k70J3508M261j1297
3358b523p823R706J0358o515j1634L169J3137q82j3037l132J3351N127r712j0273
$$ plain form
3263 -4840 6709 6769 -5202 -7734 2439 9408 420 -7894 -1793 8434 5315 -6247 -6465 5791
3277 5791 7084 -3870 -9419 -533 8177 671 -7816 -3783 7319 5717 -6175 -7840 4707 9435
3291 9435 -1589 -10129 -1025 10118 5152 -8088 -7066 6465 7789 -3532 -9306 1839 8656
3304 8656 1097 -9667 -4253 7135 3750 -7482 -7959 5197 9262 -1988 -9924 1360 10604 3395
3318 3395 -9526 -5129 8730 8036 -6053 -10760 1813 10531 986 -10566 -4361 9070 6912 -6978
3332 -6978 -8383 4446 9044 -3611 -10631 -200 10066 2555 -9278 -4843 7427 8148 -5056
3345 -5056 -8605 3685 10188 -163 -10759 -3763 9462 4740 -8725 -8995 4513 8774 -2523
3358 -2523 -10346 -640 9718 3203 -8431 -5262 7875 6993 -6044 -9176 4175 9302 -410 -10683
3372a0683Q602J1039l506j2537j72J2844K866j2009n834R284R339o254j1541M411
3386d151J1843j422j1623k662J1628O701j0967q246P824J1119m555j2307J2J3211
3400F405J435j1550n231R492O715m458j0816L794J0534q79j0605j988J1072K700
3414F620q800o207P501Q260m414r537K550J1130q12r662m906J1070N258q031q493
3429h473N356J0077j583j2161j28R704N202r093o579O703P652l747q529K222Q540
3444E163j96q965k587Q123N151p728n837N521P653k243j0072N76R942J647r603
3459c455l583P882O346n224q927L298R529j254q054k361Q923L326p792n807O887
3474b66O264m569p536J540R796M22q998k510P829N228p068p042N303P630j911
$$ plain form
3372 -10683 -2081 8958 5452 -7085 -7257 5587 8453 -3556 -9390 -106 9233 2979 -8562 -4151
3386 -4151 7692 6270 -5353 -8015 3613 10314 -653 -8899 -1075 10044 5489 -6818 -6806 6405
3400 6405 7840 -3710 -8941 551 7266 2808 -8008 -4214 6320 5441 -5164 -7152 3920 6620
3414 6620 -2180 -8387 -886 7374 2960 -6577 -4027 7103 6291 -3371 -8277 2793 8051 20 -8473
3429 -8473 -3117 6960 5377 -6784 -6912 2792 7994 -1099 -7678 -975 6677 2930 -5599 -3377 5163
3444 5163 4967 -3998 -6585 1538 6689 -1039 -6876 -1355 6298 4055 -6017 -5441 4501 6148 -3455
3459 -3455 -7038 844 7190 1966 -6961 -3663 5866 4612 -3442 -5803 3120 6446 -1346 -7153 -266
3474 -266 5998 1429 -6107 -4567 5229 5651 -3347 -5857 1972 7200 132 -6910 -1607 6023 4112
3489D112r930K15R352J845p782m927Q018N619n504o747M039Q369k821q509o95
3504e346Q745L071q161n953O917Q309m529q948M06R897J512q252l914P724M834
3519F312n499o786N241O275k545q112M67Q421K425q600m977Q700P370p424q057
3534f789K593R462J135j0909k521R254N032p565n853L880R115k937q635j64J0284
3549E382J313r445l450P159O245n500q955L970J0091o96j2010j173J0649M808
3563H388j0060p393P278J0025l845j0937J726R438K429j0252m051P873O572n390
3577A801r782M957J0967k439j0186j804R830M129r037p307P051R616m106j0907
3591g217J955R554K925j0176m601Q794P575o681r196L923J0133j224j1661j146
$$ plain form
3489 4112 -5818 -5603 3749 5594 -2188 -7115 903 6522 1018 -5729 -1690 6679 3858 -4651 -5346
3504 -5346 3399 6470 -1691 -7644 -727 7582 3053 -5895 -5489 4408 5920 -2332 -6246 1478 6312
3519 6312 813 -5973 -732 5543 2998 -5114 -4647 3774 6199 -2401 -7378 1322 8692 1268 -6789
3534 -6789 -4196 5266 6401 -4508 -7029 2225 7257 -308 -6161 -2281 6834 3897 -4738 -4902 5382
3549 5382 6695 -2750 -6200 959 7204 1704 -7251 -3281 6810 6114 -5896 -7069 3580 8388
3563 8388 -1672 -9065 -1787 8238 4393 -6544 -4818 4620 7049 -3203 -7254 619 7191 1801
3577 1801 -7981 -3024 7943 5504 -4682 -6486 3344 7473 -1564 -8871 -1820 7796 3690 -7217
3591 -7217 -5262 4292 7217 -2959 -7560 1234 8809 2128 -7068 -3145 6988 5764 -5897 -7043
3605g043J0547M083r101o698P137Q401n667q560K47J1620K801j1443m464R858
3619A718P060p123r072M324R242j413r107j293R079M434r227n908O146Q300m336
3634B824r369J612R693Q01r215l913Q740O830p212q458M487J0511j136r943j995
3649e743Q106O134q692o775N876P619l510q901J169Q637J035q500k974O985N666
3664F132o187o549M379Q480j996q521p26R368K518p469n351M997Q081m519p909
3679e272J020Q013J119q256l249P269M004o006n218N224P251k275p477j030R331
3694D448K360o945n191O214N168m527o690K035P927j256o859j980N471L775n233
3709a283m385L949N769k507o244J446P211K53n682l806P316M228n319n873K546
$$ plain form
3605 -7043 3504 7587 -1514 -8212 -1075 7326 1659 -6901 -6654 4966 7767 -3676 -8140 1718
3619 1718 8778 1655 -7417 -3093 6149 4736 -4371 -5664 3415 7849 -1378 -7286 -1140 7160 2824
3634 2824 -6545 -4933 4760 5561 -3654 -7567 1173 8003 791 -7667 -3180 7331 6195 -3748 -5743
3649 -5743 2363 8497 -195 -6970 -1094 6525 3015 -5886 -4717 3920 4955 -3545 -6519 466 6132
3664 6132 -55 -6604 -2225 6255 4259 -4262 -4988 4380 6898 -571 -5922 -925 7156 2637 -5272
3679 -5272 -4252 3761 4880 -3376 -6625 644 4648 -1358 -6576 -1352 5899 3624 -3853 -4883 4448
3694 4448 6808 -137 -5328 886 6054 1527 -5163 -3128 4799 3543 -3316 -5296 175 3950 -1283
3709 -1283 -5668 -1719 4050 1543 -4701 -3255 3956 4209 -1473 -5279 2037 6265 946 -4927 -2381
3724b381O796p15p400k51N429K939n106m174M893M172l159n811K078O057k44o333
3740c210p61O437L222n936n589N552O283m399o094J065O794J852p083m371O229
3755iN221m927n922L146O590k436n888n92O998J926n314l780M637O060l947o456
3771d693K124P263j3q329j936P446M196o314o064L725Q081j869p647j056Q289
3786C203J835o924l813O366M792m180o121K663Q443k081p670o70P764K817o827
3801d03n797M953P483l774q270J350P982J830q487k427O806N359n067q167L863
3816b766R087j421q953j814R365K194o802n310O443N436j831j0321J580R825J204
3831E916q697l786P459N144n139p254L201Q925p88q890j502Q185L910q212m784
$$ plain form
3724 -2381 4415 3700 -3700 -3951 1478 4417 -689 -4863 30 4202 1043 -4768 -2690 3367 3123 -3210
3740 -3210 -3971 2466 5688 -248 -5837 -285 5998 1599 -4495 -3430 3364 5216 -1867 -6238 -9
3755 -9 5212 285 -5637 -2491 4099 1663 -4225 -4817 2181 4107 -1207 -4987 -350 5710 1763 -4693
3771 -4693 -2569 4694 4681 -3648 -5584 1862 6058 -256 -6320 -2595 5486 3617 -4030 -5086 3203
3786 3203 5038 -1886 -5699 667 5459 1279 -4842 -2179 6264 4183 -3487 -4157 3607 6424 -403
3801 -403 -6200 -1247 6236 2462 -5808 -4458 3524 5354 -3133 -5560 1246 6605 1538 -6629 -2766
3816 -2766 6321 4900 -4053 -5867 3498 5692 -1110 -6420 23 5459 3628 -6693 -5113 4712 5916
3831 5916 -2781 -6567 892 6036 897 -6357 -3156 5769 4981 -3909 -5411 2774 6684 -1528 -6312
3846f312N523O408l629p608J053R454O00r053m355R505N322o285p531L286J0529
3861F907j470r013j982Q671M687q053m904M270O708k659q408N94P456K446q765
3876c515l678Q360N866p033p884M931R488j750q759j918Q387L990p424n732N857
3891h14Q002k636r166O59P617J937q408l858P169N251n027p284L397Q734m15j0007
3907d849j089Q687M734p750o033N901O402l697o483Q42P384J796q376l354N489
3922c96O308n056p688M536O714j814q434J272Q078K128p335m765O031P373l639
3937C313p760J520Q455L61q437k584O426M063m924o077L204O693j691o066j580
3952e084P719J266n492m493P050M665l704o109K634O888j807o857j854O658L816
$$ plain form
3846 -6312 -789 5619 1990 -5618 -4565 4889 5489 -3564 -7919 1586 6908 623 -6908 -3622 6907
3861 6907 5437 -3576 -5558 3113 7800 -253 -5157 -887 5821 3162 -5246 -4652 2804 5250 -3515
3876 -3515 -7193 1167 7033 0 -7884 -2953 6535 4785 -3974 -5892 2495 6485 -939 -6671 -814
3891 -814 7188 4552 -4614 -3955 3662 5599 -2809 -6667 502 5753 726 -6558 -3161 5573 5158 -4849
3907 -4849 -5938 2749 7483 -267 -6300 -399 6003 2306 -4177 -3335 4049 5845 -2531 -5885 -396
3922 -396 5912 856 -6832 -2296 4418 2604 -5830 -4558 3520 5648 -1687 -6452 -421 6952 3313
3937 3313 -4447 -2927 5528 5889 -2548 -5132 1294 5357 433 -5644 -2440 4253 2562 -3504 -5084
3952 -5084 2635 3901 -1591 -6084 966 5631 1927 -4182 -1548 5340 3533 -3324 -5178 1480 5296
3967E296m837n428K881P079k812p061J301O082J139n147l107M240M859m032m771
3982d318K436O239j731o419l15P088K146o305l431M060N396k879n623O22O612
3997C578K19o314k135O021L540n891l810L325O076l142m988M53O035J667o005
4012a371m240P136M313n164n351K505O173q47p475m75P022K675n507m288M205
4027f89M986j813p318J872O785j06o518j880P272L520n981m917K878P213p08r159
4043d563j015Q004L139p262m849N893O478m179p246K293P075J037p505j916O577
4058A961M047o168n965M924P343m186p194N69Q364K300r203l649P364N364l918
4073A953q508K542R050K73q783k327P873L469n213o549N666O285k221q360M49
$$ plain form
3967 5296 459 -4969 -2088 4991 2179 -4882 -3581 2501 3640 -1507 -4614 -374 4485 453 -4318
3982 -4318 -1882 4357 2626 -3793 -4108 2980 5126 -1179 -4610 -550 4846 1967 -3656 -3034 3578
3997 3578 3797 -2517 -4652 1369 4909 -982 -4792 -1467 4609 1467 -3521 -3068 2967 4634 -1371
4012 -1371 -5611 1525 5838 674 -4677 -2172 4001 3154 -4321 -4796 2226 4901 -606 -4894 -689
4027 -689 4297 2484 -4834 -2962 3823 3717 -2801 -4681 2591 6111 130 -4787 -1909 5304 4596 -4563
4043 -4563 -5578 2426 5565 -1697 -6546 -653 5825 1646 -5600 -3307 3768 4805 -2700 -4616 1961
4058 1961 6008 -160 -6125 -1201 6142 1956 -5238 -4669 3695 5995 -3208 -6857 507 5871 1953
4073 1953 -6555 -4013 5037 5310 -3473 -5800 2073 5542 329 -6220 -554 5731 3510 -4850 -4401
4088d401Q655R18p686l956P902N606o222p098L492P780m67q562k263Q192N337
4103G227p624o025M506Q565l542q924K003P845J758q500l565O774O190m446q263
4118f021K453R740j440r870j115Q462L309o911n429O002O946k675q304O68P805
4133C620L010q169m505O950N847o164o324L573P227q53q712j489Q720L953o951
4148b67o858N392Q846l551q867N14Q123J766p229l503N846N995n000o539L386
4163a946P370j260q051q49P676L015o614n064N562N673l561p880J052Q902J382
4178E407q464k777O377N743n096o795K774P664j117o476j974O925L059o505m213
4193e468N178N678l567o764K270O104O29p144j754O140K895m434n347L849O108
$$ plain form
4088 -4401 4254 5172 -2514 -6470 1432 7038 816 -6282 -2790 4990 4523 -4039 -6302 1890 7227
4103 7227 -397 -6422 -1916 6649 3107 -5817 -3814 4031 5789 -2711 -6276 498 6688 2242 -6021
4118 -6021 -3568 6172 4732 -5138 -6253 2209 5518 -1393 -6822 -820 6126 3451 -4853 -4185 3620
4133 3620 6630 -1539 -6044 906 6753 589 -5735 -2162 5065 4212 -4500 -5989 2731 6684 -267
4148 -267 -7125 -1733 7113 3562 -5305 -4791 3332 5098 -2131 -5634 212 6207 1207 -5332 -1946
4163 -1946 5424 4164 -3887 -4736 2940 5955 -659 -5723 -161 5512 1951 -5929 -4877 4025 5407
4178 5407 -3057 -5834 543 6286 1190 -5605 -2831 4833 3716 -2760 -4734 2191 5250 -1255 -5468
4193 -5468 -290 5388 1821 -4943 -2673 3431 4060 -3084 -4838 1302 4197 -237 -5584 -1735 4373
4208D373j544o054j028O263K374o545k164M698M560m196m545K617N046n17o512
4223c174j229O192K309n245m440M541M756j881p155K031O041J194o492k279N591
4238G60L923m454l854J876N613o77o249J83N597J414n687l696M924L901k407o023
4254d856K637N975l55o913o04N739K347l559m991L780N433j407o201J085M867
4269B977K073o668k206N195L000l830n434K951O670k287o652J05O316K834p087
4284b043l768N555N886l652o571J482P854N9o530k833O319L451m645m435K249
4299a622O048k880o029j09P864J671p482k646N271N928n044n675K182O945n45
4314C877o564k034O355L741n776m087L298M629k637n924R24P472K049q377l682
$$ plain form
4208 4373 2829 -3225 -4253 2010 4384 -2161 -4325 373 4933 737 -3808 -1191 3855 3338 -3174
4223 -3174 -4403 1789 4098 -1147 -5587 -1046 3710 1829 -5326 -3295 2746 3940 -2552 -4831 760
4238 760 4683 229 -3625 -1749 3864 3187 -3062 -2879 2718 4132 -1555 -5251 -327 3574 1167 -4856
4254 -4856 -2219 3756 3401 -3512 -4116 1623 3970 411 -4580 -800 4633 3226 -2975 -1890 2977
4269 2977 5050 -1618 -3824 1371 4371 541 -4893 -1942 4728 2441 -4211 -4106 2210 5044 -2043
4284 -2043 -5811 -256 5630 1978 -4593 -3111 4743 4802 -1728 -4561 1758 5209 564 -3871 -1622
4299 -1622 4426 1546 -4483 -4592 3272 4943 -2539 -5185 86 6014 970 -4705 -2523 4422 3877
4314 3877 -2687 -4721 1634 5375 -401 -4488 -1190 3439 802 -5122 -4198 3274 5323 -3054 -6736
4329f736O728N580n470o582M269O791k38q963p1P392L616o981m672M342O374l136
4345B243p651J648P850M66o583l431O819M614n475o870L513Q219k443p168j709
4360e958R304L530p754n019N114O848l718o324q16R058P72p575k891N354N847
4375E772n653p301M791N759m5p297j036P532K839o405m498N568N908k926p811
4390d803J492O712K606q745k186N748N052n921o022L987O404p38p752q53P503
4405B484L221o949m169N104N860l369n818Q08O894J151q584j702O744L913n063
4420E25o325L538P130j926p154L9O414K036m482m952M778N488l408o082J753O617
4436C989J16o491j722N397M564n945n346L714N458j001n825j570O535K211o006
$$ plain form
4329 -6736 -8 5572 102 -6480 -2211 4580 4342 -4621 -4692 2700 6316 -665 -5337 -995 5379 2243
4345 2243 -5408 -3760 4090 4556 -2027 -5458 1361 5975 500 -6370 -2857 5362 2919 -4249 -5958
4360 -5958 3346 6876 -878 -5897 -783 6065 2347 -3977 -4793 4265 5037 -2538 -5429 -75 5772
4375 5772 119 -7182 -2391 3368 3323 -3974 -5010 2522 5361 -1044 -5542 26 5934 3008 -4803
4390 -4803 -3311 3401 6007 -2738 -4924 824 5876 -45 -6067 -2080 4324 3586 -4166 -5019 2484
4405 2484 5705 -1244 -5413 -309 5551 2182 -3636 -2828 4066 5217 -3367 -5069 1675 5588 525
4420 525 -5800 -2262 4868 2942 -4212 -4173 2241 4277 -205 -5157 -379 5109 1701 -4381 -2628 3989
4436 3989 4105 -2386 -4108 1289 5853 -92 -5438 -1724 3734 2733 -3092 -4662 1873 4084 -1922
4451a922l098M779M254k750m915J046O295n42n137j234N765K470n608l895M608
4466A16M326j998o856J032O657qo248r76M103M130m104m976L094N219k88n450
4482b227j439N844J984n803j710L841L090j574n403J108N888r93n425j321N889
4497A749K796m583m366L156M669j616n189P56M738J125m586j865L933M085l486
4512A316m978K924M780j747n452m25O377M02m338l301M126M021k202n193Q28N924
4528C062K87n615j464N081K574m040l884K648N564j918n468Q42M759J008n135
4543a699k695N412L858m505n537L568N892j075n687j681O060L136m354n480L378
4558a409N730j737n507l9O234Q89o245k391N211M181m069o057L566O008q40o734
$$ plain form
4451 -1922 -5020 -241 4013 1263 -3652 -2606 3689 3147 -1990 -3224 2541 5011 -597 -4492 116
4466 116 4442 2444 -4412 -3380 3277 3269 -2979 -3955 148 4278 174 -4802 -1708 3511 3223 -2227
4482 -2227 -3666 2178 4162 -1641 -3351 490 3580 2006 -3397 -2289 3599 2606 -2819 -4140 1749
4497 1749 4545 -38 -4404 -1248 3421 1805 -3384 -2628 2110 3235 -1351 -3216 717 4802 1316
4512 1316 -3662 -738 4042 2295 -3157 -3582 2795 3197 -1141 -4442 -316 3705 1503 -3690 -2862 3062
4528 3062 3349 -2266 -3730 1351 3925 -115 -3999 -1351 4213 2295 -3173 -2331 2428 3436 -1699
4543 -1699 -4394 1018 4876 371 -5166 -1598 4294 3219 -2468 -4149 1911 5047 693 -4787 -1409
4558 -1409 4321 2584 -2923 -2962 3272 4161 -2084 -4475 736 4917 848 -5209 -1643 4365 3525 -3209
4574c209n80N835L683o454m421M210N178k256n795Q48N675J599o295k950M526
4589d06N947m857m923K637O106j696o862%O118K227n346m296M699O224l061p271
4605d760K046O370O69o941k734O359L906m456m079J154O957q89p535M59N733K717
4621D976n851m118M180N931m021n810P20P704J202p124k383N013N178m000o221
4636d624K165O656j403n800j632O979K307n577l819L905N375k499o675J446O860
4651C664J54n977k248N993K544l735m619K680N103o98n929l79N016K731m722n093
4667e515N209M181k739n483J605O181N7n548k130N558L091l867n222L318N718
4682D414j545o125j338O394K397n011l170L805M112j994n774J290M970J75m481
$$ plain form
4574 -3209 -3789 2046 5729 -725 -5146 -936 4242 1986 -3809 -2961 2714 4313 -1982 -4932 -406
4589 -406 5541 684 -4239 -1602 4504 2808 -4054 -4054 2064 4291 -1055 -5351 -652 5572 2511 -4760
4605 -4760 -2714 3656 4325 -2616 -5350 1009 4915 459 -3620 -2466 4491 3602 -3933 -3474 2259 4976
4621 4976 -875 -4993 -813 5118 1097 -4713 -3993 3711 4913 -2211 -4594 419 5597 1597 -4624
4636 -4624 -2459 4197 2794 -3006 -4638 2341 4648 -929 -4748 -843 4532 2033 -4642 -3196 3664
4651 3664 3818 -2159 -4407 1586 4130 395 -4224 -1544 3559 2861 -3068 -3447 1569 4300 -422 -5515
4667 -5515 -306 3875 1136 -4347 -2742 3439 3496 -2052 -4182 1376 4467 600 -4622 -1304 4414
4682 4414 2869 -3256 -4594 1800 4197 -814 -3984 -179 3933 1939 -3835 -2545 2425 2600 -1881
4697a881k210N538L143m738l698K687M162j258m102k71N433R05m676l663M632
4712CL671k976m166J893M973p14m731j366M856J556l667l660L274M038j388m204
4728b608J552L052J129n550j296M841J687k800m143K501M881j180m651P5M667
4743B157K29l368k456M000J715j841k722M79M768r67m152p49M680J225l774j651
4759b427J955M159k704k993K84L403J277m095j567K788L421k450m199J845M060
4774B757j024l647k01L652J961m764k277L609L687k928m039R21M739N06n224q02
4790c074M346K339l432m701K765N035j697m203m37M351K078m826k212M277L376
4805C985l141l852J635M315j95n314j200N575J014l797k997K626N317k272n021
$$ plain form
4697 -1881 -4091 1447 4590 -148 -3846 -1159 3003 1745 -2357 -2628 2805 3710 -966 -4629 3
4712 3 3674 698 -3468 -1575 3398 2684 -2047 -3413 1443 2999 -668 -4328 -1054 2984 1596 -2608
4728 -2608 -1056 1996 3125 -2425 -3721 1120 2807 7 -4136 -1635 3246 2066 -2585 -2510 2157
4743 2157 2386 -982 -3438 562 2277 436 -2286 -1807 2961 1994 -2158 -2907 1773 2998 -776 -2427
4759 -2427 -472 3687 983 -2010 -1726 1677 2954 -1141 -2708 80 3501 1051 -3148 -1303 2757
4774 2757 1733 -1914 -2115 1537 3498 -1266 -3543 66 3753 825 -3214 -2293 2446 2952 -2272 -3074
4790 -3074 1272 3611 179 -4522 -1757 3278 1581 -2622 -3059 1292 3370 -1456 -3668 609 3985
4805 3985 844 -3008 -1373 2942 2747 -2567 -3767 1808 2822 -975 -3972 -1346 3971 1699 -3322
4820c322J404M258J277n137k408M408L009l015m338J828N288o01n771m5N180J627
4836C642m410l048M134L661k024m899N64N172N54m640k748M782K803l039m986
4851d482K829M263p9m925j89M765K024o108j470K896M496l772m184J449N684n9
4867C138m640j597L440K748k270m126J103N420j416m652j00M600J511m032l322
4882d195M718K505j314m402Q32M469j47m239j566M157K398l462l588L053M365
4897C584j182n523%M348K332m243k871L379K836j502l986Q25L942N12m942o74
4913c165M362K266l061l543J229M262k22m852l55N571P45m748k341M133K448j202
4929A527l580P11L546Q41m169j723L493K751l617l748L828K935j456l787j37M098
$$ plain form
4820 -3322 -1918 2340 3617 -1520 -3928 480 3489 474 -3864 -2036 3252 2651 -3120 -3165 2015 3642
4836 3642 -768 -3816 318 3979 1955 -2944 -2380 2792 3346 -1294 -4042 740 3543 504 -4482
4851 -4482 -1653 2610 2531 -2394 -2583 2182 4206 -1902 -3372 -476 4020 248 -3936 -2487 3197 3138
4867 3138 -1502 -3099 341 3089 819 -3307 -2204 3216 1800 -2852 -2952 1648 3159 -873 -4195
4882 -4195 523 3028 1714 -2688 -1856 2613 2466 -1773 -3339 818 3216 -246 -3834 -781 3584
4897 3584 2402 -3121 -3121 1227 3559 -684 -3555 -176 2660 1158 -2828 -2003 1939 2451 -2491 -3165
4913 -3165 1197 3463 402 -3141 -1912 2350 2128 -2724 -3079 2492 3237 -1511 -3852 281 2729 1527
4929 1527 -2053 -1342 2204 3045 -1124 -2847 646 3397 -220 -3968 -140 2795 1339 -2448 -2585 1513
4945A513J438l285k501K950L194k369l477O46M060L30l631p58L376J269k834k365
4961b444J407M113j165l840o37M767k74l420j728L060L252k286l774K255K131
4976A417N86l763n76L615J987l403k806L226K264j375m108J534K364l0k325L57
4992a036J670J612l188j934K620K501j375l764J248K936J360k965k356L230K611
5007C170l119k142J008L052l48k941j40K922K34k621k147K709L616k107l492Q65
5023a481L608n54l856q74M308J346k513k385K173K227j441k266K2K299J758l636
5039a265k830M902J939k184l148R42M025k91l095j147K788J660k549k872K104
5054a021K774n84k740j821N454J516m131k197L070J971j781k995J698L941j742
$$ plain form
4945 1513 2951 -334 -2835 115 3309 940 -2537 -1891 2169 2499 -1132 -1890 1486 2755 -79 -2444
4961 -2444 -1037 3076 1911 -1929 -2566 2201 1927 -1493 -3221 -161 3091 805 -2969 -714 1417
4976 1417 2003 -1760 -2336 1279 3266 -137 -2943 283 2547 1172 -2936 -1402 962 932 -1393 -1036
4992 -1036 634 2246 -942 -2876 -256 2245 870 -2894 -1646 1290 2650 -315 -2671 559 3170
5007 3170 51 -2091 -1083 1969 1621 -1320 -1460 1462 1696 -925 -3072 -363 3253 1146 -2346 -1481
5023 -1481 2127 1573 -2283 -3157 1151 2497 -16 -2401 -228 1999 558 -1708 -1686 613 2371 -1265
5039 -1265 -4095 807 2746 562 -2586 -1644 2381 2090 -1005 -2152 636 2296 -253 -3125 -1021
5054 -1021 1753 1169 -1571 -3392 2062 3578 -553 -2750 320 2291 510 -2485 -787 3154 1412
5069A412l047j041L135K185l344k949L309K850k100j857j55L643k58k329k160
5084b706L133K698k398l436J313M284j8m514o61L629P83k869k073K205L941k570
5100G41l353J526K843Q17l401k363L555J711k209l317K202L321l22l977M78L286
5116A538J985l879k290J308L795j954l341J101M096n96l630o52K687K366k937
5131d03l278K351L846p91l807k13L396N16j693k741K501K566r08l436J11M195
5147B212L53l834o70K525J596k017l061K194L334p86m428P82K952K053l858k086
5163b739K582K038j93l965J429K097J227l270j776K874J974k252k693J659K507
5178A499j48k459j547L544J066l336p09R84L163j817j900k80L153N94k421k190
$$ plain form
5069 1412 -1635 -2676 459 2644 -700 -3649 -340 2510 410 -1447 -1602 2041 1783 -546 -2706
5084 -2706 427 3125 727 -2709 -1396 2888 2870 -1644 -2305 1324 2107 -762 -2835 -630 3311 741
5100 741 -2612 -1086 1757 2574 -827 -3190 365 2076 -133 -3450 -1248 2073 1751 -2226 -1748 1538
5116 1538 3523 -356 -2646 -1338 2457 503 -2838 -1737 2359 1763 -1867 -2519 168 2534 -403
5131 -403 -3681 -1330 2516 1725 -2082 -2295 1101 1617 -76 -2817 -316 2250 1342 -2094 -1983 2212
5147 2212 2565 -1269 -1939 586 2182 165 -2896 -702 2632 1846 -2582 -1800 1152 3205 -653 -2739
5163 -2739 -157 1881 1688 -2277 -848 1249 2476 -794 -2570 304 2278 26 -2667 -1008 1499
5178 1499 1351 -1108 -2655 889 1955 -1381 -2090 -1106 2057 240 -1660 -1940 1213 1807 -614 -2804
5194b804K889J939k453j436J973K341o08l056o80L163K70j911j142J238K167j256
5210F34k193J48L143j148j913k65J524J369p33k194J35K718R37l379q37L203L19
5227A468k970R3J931M48j088l44j90J450N36k770M00K336R31k391r87K103N15
5244A471q90k270J049J342O1j893r92K974N25j181j182j99L013j880j497M15K471
5261A337J82k591j650L272J514j658k603N26L587m30k743J83J659J102j226j545
5277a084J067J052q3j478N41N19K37j760k60J980N06j368j480J420J026n72j339
5294a076J39J561P22j547k194J588L090q33k354P59J229k18j012j697K293J106
5310A556j516j520R60K125j448k200M96K288M65k775j99J412K049r69j923J93
$$ plain form
5194 -2804 85 2024 -429 -1865 108 2449 1841 -1215 -1895 1268 1538 -373 -1515 -277 1890 634
5210 634 -1559 -1411 1732 584 -1329 -1594 -70 1299 566 -1628 -1493 1225 2162 -1217 -2054 1149 1468
5227 1468 -1502 -1409 522 970 -118 -462 -652 798 1334 -1436 -1036 1300 2231 -160 -1147 956 1471
5244 1471 581 -1689 -640 702 763 -1130 -2122 852 1377 196 -986 -1185 1828 -52 -1549 -1134 1337
5261 1337 1519 -1072 -2722 550 2064 406 -2197 -1671 1916 1486 -1257 -1074 585 1687 461 -1084
5277 -1084 -17 1035 952 -526 15 534 771 -989 -1249 731 1237 -131 -1611 -191 835 263 -1076
5294 -1076 -937 624 1346 -201 -2395 -807 2283 1450 -904 -145 1084 866 -146 -1843 450 1556
5310 1556 40 -1480 -520 1605 157 -2043 -1547 741 1206 -1569 -1768 -356 1693 724 -1199 -1006
5326a006J879L79k354o29K397R42k503q82J558J842k13k300m00K394J36k118k142
5343c020L541J528k265k218J001K734J18j876j225K853M99j791j185J183K311
5358B188j408l437J285K779N2j725q79J363J352j096j984J163J639J175l606j025
5374b164K424J302j997j330J360J749p65k280Q88J160O61j559j754J840K499j491
5390E43j539j6K229J87k241o64K451L68j213j134O62K337j026j441j257K879M8
5407A173k196q87K734M95K84l426P31K304n6j312r77J463J485j394k356J687K319
5424B071m77l015O75J073Q92k255m67J445J319r99j713M80L004o98j808k97Q75
5441A05J208j654n71N40J342l88k107J069J735o45j792j45J556J144q59k070P05
$$ plain form
5326 -1006 873 1252 -1102 -1731 666 1608 -895 -1777 -219 1623 1410 -890 -1290 1104 1240 -878 -3020
5343 -3020 521 2049 -216 -2434 -1433 1301 1419 -457 -1682 1171 1670 -121 -1306 -123 2188
5358 2188 780 -2657 -1372 1407 1459 -266 -1145 218 1570 474 -1510 -347 1292 2467 -1139 -2164
5374 -2164 260 1562 -435 -1765 -405 1344 579 -1701 -813 347 1008 -551 -2305 -465 2034 543
5390 543 -996 -1012 1217 1404 -837 -1501 950 1318 105 -1029 -367 1970 944 -497 -1754 1125 1173
5407 1173 -1023 -1910 824 1319 1603 -1823 -1092 1212 1156 -156 -1133 330 1815 421 -1935 -248 2071
5424 2071 1594 -1421 -746 327 1219 -1036 -1503 -58 1261 262 -1451 -971 2033 1335 -473 -770 105
5441 105 1313 -341 -912 -372 970 582 -1525 -456 1279 634 -1158 -1303 253 1397 538 -1532 -827
5458h27J943K25k451J7J555R17j527r47J066R36r8j905J381O05k0j673N87M16
5476B00J631j866o00N05J121r95j340L21J667Q41j807p17J072J214o57j732L72
5493g70J653o27o74o58J676P38q16k124J316J329l18j399m68K237k6j577k08Q54
5511A38J16j61j685J635Q62j77j458j70J609m58p78m61Q98J060p72l55K1Q77K49
5530I90k168N4J967j67q61o36M12J742r40j962N01J323M89m09n60M66O99j141
5548b01p34L90K254o88j005o83J518O29j354j863J845J482r66j657o7J251M3m85
5566b91j936K383J353j097j434L1K008J47k155P3J184L34m21j558K25K356r29
5583B73j700J838N43M47k136q47K033L13k83j226l31K249j099j94r33J467L02
$$ plain form
5458 -827 1116 1341 -1110 -1093 462 1379 -148 -1095 -29 907 809 -1096 285 890 870 -803 -216 200
5476 200 1831 -35 -635 -130 991 -4 -1344 -1023 644 1485 -322 -1039 33 1247 590 -1142 -770
5493 -770 883 256 -418 -1076 600 1338 522 -1602 -286 1043 725 -674 -1142 1095 1069 -508 -716 138
5511 138 254 93 -1592 43 905 728 -730 -900 709 251 -527 -988 -90 970 198 -157 -136 741 990
5530 990 -1178 -1124 843 676 -185 -821 -409 1333 393 -1569 -1068 255 744 335 -225 241 940 -201
5548 -201 -935 -545 1709 1021 16 -667 851 1480 126 -1737 108 1590 624 -1033 -1100 151 194 -291
5566 -291 -2227 156 1509 412 -1022 -991 1017 1164 -991 -918 266 600 179 -1379 -1154 1202 273
5583 273 -1427 411 954 1401 -735 -1582 451 764 481 -745 -1076 1173 74 -120 -1053 414 716
5600G16j542m29J076R92j37k295J334J020O38k291j028K405J131j912j95O90N91
5617G64N47j703j226L242j194j347m22J101J861j207j308K48J856j045j81j560
5633a574J537J763j873j537J634J109p57m92o57J443k4j121n86Q61K260j915j916
5650a845J476J196n92o59k49j96J670L82k356J012J192J87k133j4K022p30p18
5667c55o16J002J031n04j374O1J452L11j041k021J770J286j452Ko45K405r31o07
5685b26J18M49J49n10q89R41k63k39j327J693J748q70j799MJ599P23j731n49M67
5704e12J132M6k054j45R20J804j443j92J150n1l12o31L6J085P58k202Q72L77M42
5723A080j278o71J430n5L93j225M01P2L70m14j203J043L81j80o28k12J580q96
$$ plain form
5600 716 -826 -1255 -179 813 676 -1619 -285 735 1373 -918 -1946 459 1590 -322 -517 173 764
5617 764 1311 -392 -1618 1624 430 -917 -1339 -238 1623 416 -892 -644 1212 167 -14 -1574
5633 -1574 -37 1726 -147 -1684 -50 1059 302 -190 -847 596 572 -549 -1135 -274 1986 71 -1845
5650 -1845 -369 827 235 -424 -673 -869 801 1183 -1173 -161 1031 1218 -915 -929 1093 363 -355
5667 -355 -971 31 1062 558 -816 -755 697 1008 -33 -2054 -284 1002 -450 -448 -1093 1312 381 -226
5685 -226 -108 341 490 -20 -909 32 -231 -470 -1797 -104 1644 774 -1025 -1021 578 1301 -430 -979 -512
5704 -512 620 666 -1388 -1533 -613 1191 -252 -444 706 655 343 -288 -252 833 1591 -611 261 638 1080
5723 1080 -198 -869 561 506 899 -326 75 147 517 103 -1100 -57 324 144 -484 -696 884 -12
5741a2q72R63L42k2n73j08K60Q57R9j139l35J343r21o52j61R47P65m30o01m34
5761f84Q60K11m5j158J154O07j810k95J501M51j85o67o0N9J237q95n21J524j103
5780A81m42O41p46O36n06r14J448l43K28m93L07j17P30q41q63N91J331L49k724
5799a547J155M7P15j480N89J93J824j614o52L27J919n40j202l77O20O68j526N0
5817h31R63m14Q74j436N35P56k06J14p12J069n98k55O04r67J644M8j828O84J253
5836A297o17m75q83Q34P89j261m67L83J426l30j328Q72o69J544m60j113L88J98
5854A28k06p3j137K351N99k254k11l00J803l04n85n84J787q96j52m81P47N71o85
5873A18l70j04J096j9j554n51J131K06K62r92R15P09j009p60L30P41L88p05j246
$$ plain form
5741 -12 -884 79 421 399 -174 -282 -22 835 934 -205 -540 803 -118 -770 -931 16 781 351 -250 -684
5761 -684 176 387 342 -816 338 945 -865 -1160 341 792 607 -60 -120 -61 1176 281 -240 1284 181
5780 181 -261 380 -366 270 -236 -1150 298 -45 183 -310 -3 -120 610 -231 -1094 -503 828 1177 -1547
5799 -1547 -392 -345 370 -1110 -521 -328 1496 -118 -770 -443 1476 936 -266 -643 -23 645 -881 -831
5817 -831 132 -282 592 -844 -309 447 241 355 -357 712 114 -141 463 -504 1140 1188 -640 44 1297
5836 1297 680 205 -678 156 945 -316 -783 -400 1026 696 -632 240 -429 1115 655 -458 -70 128
5854 128 -78 -151 -1288 1063 1662 -592 -803 -1103 700 396 -189 -773 1014 118 -34 -515 232 803 118
5873 118 -252 -356 740 721 -833 -1384 -253 -47 215 -777 138 847 -162 -922 -592 149 537 -168 -1414
5892a414J510J71n45l5L07n42M30k97n70P16O05R4p85P42l91l03p90L40J580q51
5912b8L49q16J084j232K69r5L1P0K49M56j36o91O42j84q02J013P02M59k353l31
5932a344J429J97j5m27N8K54L5m72mJ640j010k70o33J345M1n91m22k57N24P53
5952H31q18n43J98k46k64J106K73n61Q8j076N42N29kM48m47Q8J42k01r24l53J617
5973D27o14l49J491q74J62r30K83L26M26o55q87J696m02l89Q00o61M79J58p51
5992b64L63J538q98p19O56Mm38r6L89p94K15N7K37j115J447j160R37n96q7M71
6012A47k65m68L77J025j036L62l48o1N45o69L83M10q30O64K0n78K44K67j048M87
6032c72M01j05n50Q41q81M45k06M14k86J273o62k23J01N50n66l83M94Q1p94L29
$$ plain form
5892 -1414 96 267 -278 -313 -6 -548 -118 -415 -985 -269 336 430 -355 387 -4 -307 -1097 -757 823 -28
5912 -28 321 -495 589 -643 -374 -469 -438 -368 -119 337 201 -490 152 -32 -834 179 881 1340 -1013 -1344
5932 -1344 85 282 267 -160 -102 152 187 -285 -289 1351 341 71 -562 783 824 233 -189 -446 78 831
5952 831 13 -530 -332 -578 -842 264 537 -24 64 -1012 -470 59 57 505 58 146 288 87 -837 -1190 427
5973 427 -187 -536 955 81 243 -687 -404 -78 348 -307 -1194 502 100 -289 511 -150 329 487 -264
5992 -264 99 1637 739 20 676 680 242 146 535 -259 -44 13 250 -865 582 -578 359 -237 -324 147
6012 147 -118 -586 -209 816 -220 142 -206 -267 278 -391 -8 402 -428 236 256 -322 -78 189 -859 -372
6032 -372 29 -76 -626 215 -666 -221 -427 -13 -299 974 312 89 190 740 174 -209 285 366 -428 -99
6052i9q98Q12P10r73P34p39m09J165m75K83k11Q5K65m5k48k37J240p21j30k1k50
6073a62M17N3m05l29O20l93Q40j103O92l1j87K16l62K13k99k40QJ096q21K89k06
6094i4O2L89p9J26k39Q82j005n79j69P28j82N56j68l0kr09O00R24p76m68K62k59
6116d30k1M4Q04j360Q29O98j431K6P32R16j33j002N16p8J86K97j132P12J13m90
6136b04N14j017M90K89n5K91m76L52k98m41M99k04m04L60N78p26R01M9j074J2
6156e64Q01l91L74l16m8P48m86M23j126J40P31k85m49K6N65l30q75P92N98Q51
6176A179j618O65o30M53N09M13q90M8j55R77j761O07J89p6K71J82l62M05m16j70
6196a80N58l44K05k77j44L5lO67p26J364j227R70r10n0K40J27j47q66J210M51
$$ plain form
6052 -99 -997 -185 525 -448 286 -453 -862 303 -172 111 -100 -15 250 205 -43 -280 960 239 109 88 -162
6073 -162 255 308 -97 -426 194 -199 641 -462 230 199 12 228 -134 79 -220 -460 -452 644 -177 112 -94
6094 -94 -32 357 278 404 165 1047 42 -537 -706 22 -160 396 228 198 196 -713 -113 811 35 -433 -171 -430
6116 -430 -451 -407 397 -963 -134 564 -867 -841 -109 807 674 -328 188 110 296 593 -539 173 286 -204
6136 -204 310 -707 -217 72 17 308 -168 184 -114 -555 -56 -260 -664 -304 274 -452 449 498 -576 -564
6156 -564 237 -154 220 -96 -144 604 118 541 -585 -445 286 1 -448 -422 143 -187 -1062 -270 328 1179
6176 1179 -439 226 -404 49 558 971 81 129 -26 951 -810 -203 -14 -90 181 363 1 406 -10 -180
6196 -180 378 34 239 -38 -182 -147 -150 517 -209 1155 -72 898 -12 -62 178 305 158 -708 502 953
6216I53j354K13N2m08J173j161R69q85K8J43k7l5P50K0o02m20K42M98k0k2P35
6237H42q93j03m49N72J50K75L10J11r98P95p34j08M5K77q01Q92l30n20J114O86
6257A133q86k54J94J94k27j04P6O11j706J362J44j68p25k64J021n16P18p50l41
6276d88J512o80j58j98k17Q73m61j94k0N30J59n75l21M23N6N65j408J808q03J20
6296E23r12O86No1r8q23J027k74k26J24N0P07j285J87k57l37P25J64J5k86O37
6317B91m88j02M58N44k45n06j93O16P1pp96L83J01j32p26O54N00J11n72rM01j41
6339B13m65L48M02q42J4K4O30k26M06l57J2qJ44L44j467J084k39M97r25M91r46
6360h66J452p42l43L27J239j183L82l11k85N21q27K29J59k44J209j147J74k7L59
$$ plain form
6216 953 -401 -188 -136 -544 629 -532 437 -448 -420 -277 -304 -339 411 431 -171 -591 -349 149 129 107 842
6237 842 -51 -154 -603 -31 119 394 704 815 -183 612 -122 -230 -185 92 -709 183 -147 -667 447 1133
6257 1133 247 -7 187 381 154 50 126 737 -969 393 537 369 -356 -620 401 -115 603 -147 -488
6276 -488 1024 344 186 -12 -229 644 183 -11 -31 499 658 83 -238 185 241 806 -602 1206 403 523
6296 523 -389 297 302 241 143 -680 347 73 -153 -29 21 728 -557 -370 -627 -964 -239 -75 -60 -346 291
6317 291 -197 -299 159 703 458 -48 -241 375 446 439 -357 26 127 -5 -731 -77 423 534 -38 -47 354 213
6339 213 -252 96 498 -344 -330 -306 324 98 504 147 159 151 295 639 -828 256 17 514 -411 80 -866
6360 -866 586 -156 -499 -172 1067 -116 266 -45 -330 191 -636 -407 -248 -492 717 -430 -256 -283 76
6379G6J32r4n25J7M24M65q39K42M6p18O50o1J134j768J50L88J324m75o14r2J314
6400A176j378mn93O30M71N31q83j14O86p66M90L63j73P49j491L14K89m57n77Q31
6420I4p70R54L3l72o03J324J85n45l50n76J201m47O85p37k32j54Q50j31l63m15
6440c69J21m06m4P25M98m46n80j36J499j205O58r87J367q68L17p67J018lq04Q11
6460C99j67Q77j004k20k12R38o23j004K81J333l05j099P75j56P16k98j503J479
6478B07K01J87p02o82J78J530o77j77j61P91o76r35J92J491k88l67j99J01R9L21
6498D34j80j531J644J68l17J29r44J075M19j560Q18N14q95J136j743P74P5l16
6516c00N38k3O12l21j279N16j25K14M96k34Q19j566P0j19l90J716m2j798J823
$$ plain form
6379 76 208 114 -411 -394 30 495 -344 -102 -56 -774 -124 -185 949 -819 -669 -281 1043 568 -46 -138 1176
6400 1176 -202 -206 -799 -169 302 833 -50 -164 522 -244 246 609 436 1185 -306 8 297 -160 -737 94
6420 94 -676 278 311 -61 -664 660 845 300 -50 -626 575 128 813 76 -156 -310 540 409 46 -369
6440 -369 -248 -654 -698 27 525 79 -501 -637 862 -343 315 -672 695 -173 144 -623 395 392 -412 399
6460 399 232 1109 105 -115 -327 611 -12 -1016 -735 598 293 -806 -31 -187 529 231 -1272 207
6478 207 408 595 -107 -789 -611 919 242 65 -96 695 19 -916 -724 767 479 112 -87 14 113 434
6498 434 254 -1277 367 535 218 347 -597 478 897 -663 155 669 -226 910 -833 -59 16 -300
6516 -300 238 215 827 506 -773 -257 -382 -168 328 94 913 -653 -583 -702 -1092 624 582 -1216 607
6535F07l60l71K41k05n53J353n36l89j268J690o5k11l82O27M51l23r02J314l00
6554D18L28l82o56m7J332j200p99J068P22q27r27N45R60l97j190J174M28m04K54
6573D00j172J310l57l74K97r84J044q56N70j44N30J99n13p16J392m25l89m41J251
6592F22o08M26k02q1N01n40P37j340M65m56J393p97j22O82J08j106J7l14J636
6611A021j331n22R35J11M36j270j29N23N59j56n42L67k8J06l09J61p79J055Q58
6630A066j905J711n52k30R4R58j602J261j493J095j80J05L52p60M1P14n53o28
6648e06J23P55K60p42m54J028j88K21k39l45Q02j250K42k58K39K22Q9L45p63J73
6668b46M24p22M16O36p24J145j914K333j748J115q52m43R74K72j602J027K88J61
$$ plain form
6535 607 247 -124 117 -88 -641 712 176 -213 -1481 209 144 -67 -449 178 629 306 -596 718 418
6554 418 746 364 -292 -339 993 -207 -1006 62 784 -43 -970 -425 535 138 -1052 122 550 146 400
6573 400 -772 538 181 -193 104 -880 164 -692 -122 -266 264 463 -50 -766 626 201 -188 -629 622
6592 622 14 440 238 157 658 118 855 -485 -20 -476 917 120 -2 680 788 -318 -301 -615 1021
6611 1021 -310 -832 103 214 650 -620 -749 -226 333 177 -365 2 -26 80 -229 -68 -847 208 1066
6630 1066 -839 872 320 90 184 1142 -460 801 -692 403 223 328 680 -80 -39 675 122 -506
6648 -506 -383 372 632 -110 -564 464 276 497 258 -87 715 -535 -293 -551 -312 -90 -1 344 -419 -246
6668 -246 178 -544 -128 508 -216 929 -985 1348 -400 715 -137 -580 394 666 -936 91 379 540
6686E40j036K64j53k5l8R0k32J86Q14q35n67J544n59N61o11m94J453n95l5j290
6706a018O05L83O47p00l77O08K21k07p46J174Q21j672p9N56k44K29k98J17o30
6725f10N13j4m28K003j477N07l62m05J548j831j36J33Q21K61k39q30O24J46k18
6744Fk30K45R85p04m58k2J088m9q35n88L15J227p55q70R56J59k20P7l25n06Q06
6765C02M84o33n22J033k80o52P4o75J192k46O1M31k7l91j75l3L93L89j030J91
6785a14J92L75J98j423k01O54R34j057k77J042p0p1j59pk79M29o81N8j62Q62l80
6806a37M74j28M89j32q4m76l8l56J20k76J502q95j71m95L3P74k80j211J351O9
6826A33R95k025M32P00m6o38L06N95K20N5p76L53k22L8O4K16o95K14K86p95P8
$$ plain form
6686 540 -496 -232 -385 -410 -448 -358 -590 -404 410 -425 -992 552 -7 554 -57 -551 902 307 272 -1018
6706 -1018 -413 -30 617 -83 -460 148 369 162 -584 590 1411 -261 -340 216 -28 201 -97 20 -610
6725 -610 -97 -111 -539 1464 -13 494 132 -273 1275 -556 -692 -559 262 523 284 -546 78 224 6
6744 6 -224 21 1006 302 -156 -178 910 861 26 -562 -247 980 225 -645 311 470 250 327 2 -504 302
6765 302 786 153 -369 664 384 -268 -194 -869 323 77 138 569 542 151 -24 -57 336 725 -305 -114
6785 -114 78 453 651 -772 -973 -319 615 -442 -719 323 253 182 23 16 -263 166 -515 -457 -619 243 -137
6806 -137 337 209 698 566 482 6 -32 -388 -268 -544 958 63 -108 -603 -570 204 -76 -1287 64 133
6826 133 1128 -897 -465 235 189 -449 -143 452 672 727 -49 304 82 120 184 400 -295 -81 205 -590 -512
6847e12R73q71n49J151nJ16k06J65k45O28o21J48j367J189K92q05M74q60J594
6866F89o38l75l70J131N95j471m09J150L31o26l43P42O92j117PQo83J099r42m71
6886a001J104J160j750r2P89j03L10k069J204J052K0j121O10j65J058l13n43k80
6904a30M12j67p14N90L39o7q80k20Q08N11j51l28o08P65p1o38K30P96N33j376
6924c66p48J897P2l04K01j738J252J094k091l12J230O84k62n12k52M96N78j661
6942g42l80J849j25k52r86K61J048m25j744J379K41j40n0o81O50J677j980M17
6960A7p41J831j056k44ll16K49L51q95J092n43J055r59j17Q26p20j34o59J252
6979B86j29j19k42L08k73K82o37L46P07O29j343K47m1P68n63k09K91m68O93p26
$$ plain form
6847 -512 461 -410 -959 192 187 303 97 262 17 645 24 172 -1195 -6 286 -519 -45 -905 689
6866 689 51 -324 -694 437 1032 -439 -848 302 633 7 -336 406 1098 -19 -12 -4 -687 412 -530 -1001
6886 -1001 103 1263 -487 -579 210 107 417 -1652 -448 604 624 -497 113 -52 1006 693 150 -130
6904 -130 282 115 -599 -9 330 263 -617 -837 -29 482 331 3 -605 160 89 -549 -319 477 1010 -366
6924 -366 -1114 783 855 551 752 -986 266 1360 -731 -1043 187 871 609 97 -155 341 919 -742
6942 -742 -1122 727 602 350 -636 -375 673 248 -1496 -117 124 -16 -66 -747 -97 1580 -400 17
6960 17 -724 1107 51 -193 -196 -512 -263 88 -807 285 -258 797 -162 -279 547 -173 -307 -966 286
6979 286 157 38 -204 104 -169 113 -524 -178 529 1158 -185 62 21 789 226 17 308 -160 533 -193
6999a93k00L86J53M41o45n7J35L33q99q68N48J285o8j362J241P9K03m30J53N6
7019B91N6j179K74m79J044k77n60j55Q42N59m69j20L81N95m34j018M19Q59m32
7038A97k26m30J161o62j117N83M14J30M22m23J78J52j07p20l41J180L64j012n92
7057h49O47M46P20j189O45M37r90l88L19K48k45M49j029J048J20l21q74K83J467
7076I44j66j023j99R78Q22j212j17n67M50L10P6j017R78M01p86J08q7Q00n21p1
7096A01r16M9R64J70l79K36r1p00N65o97N61M07J86j211R63k49L20n23k85N96
7116F7j03q48l71J817j54j42l82N00K92m32r39J40Q00l97J78j30k19J642j639
7135c20M7K45L99O72j962L88J507m51m85m92M09M05M8j349J456M81j259l33J113
$$ plain form
6999 -193 -393 -7 146 587 -58 -115 20 353 -546 -1414 -866 419 351 -1011 230 309 512 82 235 291
7019 291 347 -832 -558 -1037 7 -270 -830 -985 -143 416 -53 -173 208 803 369 -649 -230 629 197
7038 197 -29 -459 702 40 -1077 -494 -80 50 472 49 227 379 272 -448 -789 391 755 -257 -849
7057 -849 -202 244 964 -225 420 857 -133 -521 -202 46 -199 250 -779 269 389 68 -806 -523 944
7076 944 778 -245 -444 534 1356 144 27 -540 -90 220 296 -721 257 658 -128 -20 -107 693 172 101
7096 101 -815 -766 198 368 -11 225 134 -566 -1 -698 -137 270 456 -755 208 -41 279 -244 -529 67
7116 67 -36 -884 -1255 562 408 266 -116 384 676 244 -695 -555 245 -152 26 -104 -323 1319 -320
7135 -320 -273 -28 371 1043 -919 -531 976 525 40 -452 -43 362 410 -939 517 998 -261 -594 519
7154E19L78j016n09l11R51P9O29r09j78M8M51K6j85J42Q90n29q79K11K68K22l41
7175d3n43O95Oo73n13Q10J349m66p24k78M65O20n21j13m62J416j244k15M72J40
7195A78j9J61o44P55J011j196l23l61N65k07k66j01K35L80o76k15J374l48r76
7214f73k43J036P54n43n23k71L78M04P32j540J172m76n92m96M49J112M9j9j047
7233c37P19k47j20q96k91J920q83r45K05J265j63p99P33j69k99N55q81Q77K29
7252D73N7n61m72O75k94R19j730P41M71K84j020k61J378j77j777J026P2J347r08
7271B43n57M04J78o20k8M61L23o64K99J71K32M40P3o70k40M50M72p02j653J349
7291c9M91q48r81J242l40J294r29q15P16J415j392k58Q49m73P91p66j17P7O71
$$ plain form
7154 519 897 -119 -628 -939 12 91 720 -189 -367 -319 132 158 -27 115 1005 476 -403 -192 76 298 -43
7175 -43 -586 109 115 -558 -1071 -261 1088 622 -102 -380 85 705 184 71 -391 1025 -219 -434 38 178
7195 178 159 320 -324 431 1442 246 -77 -438 127 -80 -346 -447 -212 168 -508 -723 651 303 -673
7214 -673 -916 120 874 331 -192 -463 -85 319 1051 -489 683 207 -385 -881 -432 680 729 710 -337
7233 -337 382 135 15 -881 -1172 748 -135 -1080 -875 390 227 -572 161 -8 -307 248 -633 244 473
7252 473 530 -31 -503 172 -122 797 -933 -192 279 563 -457 -718 660 483 -1294 -268 -196 1151 243
7271 243 -314 90 268 -352 -380 81 404 -260 39 210 442 882 955 285 45 495 967 265 -1388 -39
7291 -39 452 -396 -1377 -135 -475 819 -110 -925 -209 1206 -186 -444 405 -68 723 -43 -160 -83 588
7310E88j178M43P14M02r17m15O43L78m67r22M26PM63p48L13l08J217n25j01p53
7330g40R42L24O0j885Q96J198m39o32K96k91L11q06J192k43M81j522J044q31O14
7349c1J05n88P55q35J271n30q25K75J135j4p21r47J261K52j386Q48R53o16k52
7368A10n12K05M65J7r37J094N73j102K03r11J496J57k50o67J41J130n54k71j148
7387g61J054l17l44m6N85k87n07P1J72M00Q8q3k18j26P66j263K30L25K56J058
7407A053j543j119Q62J697r58n54O71O37q13k17N9l4Q44j073j83P49Q7m12j96
7426d43L17M12M72j507N42rN39q1j705J761j30K45k097J610L80l76Q50j100J234
7445I14q7p66r2l73J219j021m73k90J145l37Q4n46Q29Q58o49j712N43J350K1q41
$$ plain form
7310 588 -590 -147 567 969 52 -363 280 658 191 -731 -305 -298 165 -583 -270 -578 639 114 13 -740
7330 -740 202 526 586 -1299 -403 795 356 -276 20 -271 40 -766 426 183 664 -858 186 -645 -31
7349 -31 74 -514 241 -594 677 147 -678 -403 732 718 -3 -950 311 563 -823 25 978 362 110
7368 110 -402 -197 268 285 -652 442 1015 -87 116 -795 701 858 608 -59 82 1212 658 387 -761
7387 -761 293 -24 -368 -414 171 -116 -623 -552 -380 20 108 25 -193 -319 447 -816 -586 -261 -5 1053
7407 1053 -490 -1609 -747 950 -8 -562 109 746 -67 -284 -225 -259 585 -488 -671 78 165 -247 -443
7426 -443 -126 286 758 -749 -207 -216 323 242 -1463 298 168 413 -1684 -74 306 -70 780 -320 914
7445 914 827 61 -31 -404 815 -206 -679 -969 176 -161 -77 -623 206 1064 415 -1297 -754 596 617 -224
7465b24j95Q17P6k85l90j19O39J053j095j341P07J019j208q01J486N38j47j090
7483e60R13O88j091l10O00M32k38j66o29J71J131m76j203J86L73L64J19r58R66
7502C12M22l23j661J134N05o43r4k23J156P5k42j736J072R5N33o24M80L43L6j205
7522e88l41J549K71m79q76r55J999J44j620J87P75K27n61p99J021J161r27p32
7540e44M20M86l67J5j49N10n2l05j034K86J382m68o17Q37P31jj596j78J639o8
7560I27r82j245J391Q83l54k04J41K69R5j568l10Q42P01j29p52o77J248n76n71
7579h71J01J750m64n86k5j3J214j228k83p10K433r88M52j929J873l72J90j513
7597i69J70OJ817q81K27k63M07o40j40j06J757j244q60N54O98L93j380j35J7R59
$$ plain form
7465 -224 -419 398 474 189 -201 -320 319 1372 277 -1064 -357 662 -546 -1347 139 677 530 -560
7483 -560 353 1041 -50 -360 240 672 434 268 -361 -190 941 465 -738 -552 -179 185 304 -654 312
7502 312 734 411 -1250 -116 389 -254 -348 -571 585 660 418 -1318 -246 -151 382 -242 238 581 617 -588
7522 -588 -929 620 891 412 -464 -1419 580 724 -896 -709 66 293 -268 -1067 -46 1115 188 -544
7540 -544 -124 362 -5 10 -139 371 319 14 -1020 -734 648 180 -437 400 1131 1130 -466 -644 995 927
7560 927 -55 -1300 91 974 620 416 557 826 921 -647 -957 -115 586 457 -295 -972 276 -300 -871
7579 -871 -770 980 516 -70 -95 -108 1106 -122 -405 -1115 1318 330 782 -1147 726 354 544 -969
7597 -969 -799 -793 1024 143 370 107 514 -126 -266 -372 1385 141 -719 -165 533 926 -454 -589 -572 387
7617C87k20j296L69R33K27m99m02l82J773o87k220J993N05k19l86m01O86N21p22
7636d0j051O21J484j299qM42K32pp06q68P32R13n19o21m0J369K42k352M79J789
7656G92M75j370j91Q53j52p18j52k98R30J723k237j061J682J97q6q73N67K98J45
7675E24j405m18K036O31j586o00R44j33R48j516K21P92Q01k292L18J234L54l37
7693E16r75J411l56N45j791j069K527K17j655K66L62R25j269k15L73M54K94j407
7711h47n6J539q39j263J179L78Q33p20q99L57Q90l09n43k5N36J142j476m3J12
7730e4k42O19j205K10J492k95o41j162J396J547j531K5M01M86l12r53o11Q54Q13
7749H37q81n87L43J150p99o62K64J018O0p90j222J151J517j238o61R07P21L75
$$ plain form
7617 387 167 -1129 -760 173 400 -99 -501 -883 890 203 -2017 -24 481 262 -124 -525 161 682 -40
7636 -40 -1091 -470 1014 -285 -293 149 381 374 -332 -1200 -468 445 -74 -695 -735 634 876 -1476 -997 792
7656 792 1267 -103 -294 559 407 -311 -463 -761 169 1892 -345 -1406 276 473 387 -486 81 379 524
7675 524 -881 -1299 737 1368 -218 -818 126 -7 941 -575 -354 438 1239 -1053 -735 499 853 516
7693 516 -459 952 596 1141 -650 -1719 808 1025 -630 -364 -2 923 -346 -561 -188 266 560 -847
7711 -847 -903 636 -203 -1466 -287 91 924 204 -695 -338 552 243 -300 -325 211 1353 -123 -166 -54
7730 -54 -296 323 -882 -672 820 525 -116 -1278 118 1665 134 159 560 1046 734 -219 -830 24 837
7749 837 -44 -631 -288 862 63 -599 -335 683 743 -47 -1269 -118 1399 161 -500 407 1128 1503
7767A503j996q8K074j321n94n46J280N27j003j020J344M38l36n38j229P09J559
7784G63n72q45j57P02J22m14j62J309N77k263J004O08J69l92k131J218J825p08
7802F53j275O10p1J039r02n86l73J641q8j357k89K297jj277r57J878L08j664L22
7821i2l18Q39P41p22n35J167k58k78j057L63J719o59j917K58J728j41o85j820
7839a667J322J225j317l78P19L62K12j220J0J300J22l97k163J641O66L96j713
7856h80j01Q16R24r97q93J973N92p82j683P26N79K3n19m39J461M47j140r80J384
7875E11R06q65p10L8R46M70j799r79J643L31n16r99O09J383L68k219J92J503N72
7894A385k025k05L44J573j663m88J29J485M14j292j091J149O95j129j137K104
$$ plain form
7767 1503 -493 -581 1493 172 -422 -968 312 839 -164 -1184 160 598 262 -276 -1505 -796 763
7784 763 191 -654 -811 -109 13 -401 -563 746 1323 -940 64 672 841 449 -1682 -464 1361 653
7802 653 -622 -12 -83 956 54 -532 -905 736 648 -709 -998 1299 1298 21 -936 942 1250 -414 -92
7821 -92 -410 429 1170 448 -87 1080 822 544 -513 -150 1569 910 -1007 -749 979 838 153 -1667
7839 -1667 -345 880 -437 -815 -96 266 478 -742 -732 568 690 293 -1870 -229 437 833 -880
7856 -880 -981 -165 759 -238 -1131 842 1434 652 -1031 -305 274 297 -222 -661 800 1247 107 -873 511
7875 511 1417 552 -158 -120 826 1296 -503 -1482 161 492 -24 -1023 -414 969 1337 -882 -690 813 1385
7894 1385 -640 -845 -501 1072 -591 -1079 -950 535 949 -343 -1434 -285 410 -719 -1856 248
7910B48J70q3j426J099j96P98j065j052J212J033o92j704J480J107k86j268k35
7927h60J200J086o84j672K95K353j547j396M74N02Q65j295m32J141J154r97j393
7944a206J11J734k20j010KR20R81j751m37L88J092j64m69J1N28N75j541q34J867
7963E77R74j158j051N04N55L23j968N35J355O99n60j512O07J419q80j166R52M10
7981F15l38j129K7J322J38L1q65j96K063j089j369N18Q13j76L68j112j28J934
7999A427r70j649Q87J612n17j511N96j66Q54j00j125J11P89O61j969K88K016o94
8017E40l32r32M71L28N72j376J252N15j143o28M44P22P07j623j06N18J147j158
8035h2o30l61J573K71j334m69J054R43r27p57P40M30qn62q27J211R34j368m32
$$ plain form
7910 248 418 335 -1091 8 -188 610 -455 -1507 -295 738 46 -1658 -178 929 643 -625 -860
7927 -860 340 1426 742 -930 -635 1718 171 -1225 -751 -249 616 -679 -1111 30 1184 187 -1206
7944 -1206 -1095 639 419 -591 -589 331 1312 -439 -876 -488 604 440 -29 -18 510 1085 -456 -1290 577
7963 577 1551 393 -658 -154 401 724 -1244 -709 646 1345 785 -727 -120 1299 419 -747 205 615
7981 615 277 -852 -825 497 635 666 -199 -395 1668 579 -790 -272 541 365 733 -379 -507 1427
7999 1427 457 -1192 -305 1307 790 -721 -125 -291 563 463 -662 -551 238 899 -1070 -782 1234 540
8017 540 208 -724 -253 75 647 -729 523 1038 -105 -733 -289 433 1140 -483 -589 -71 1076 -82
8035 -82 -712 -1073 500 771 -563 -1032 22 965 38 -719 21 451 443 -119 -946 265 1199 -169 -601
8054f01M4K4R41k149J401L69Q78j371r9Q39M25q28o47L38J624o10j588L33P92
8073A15N56p85o56M94J838j517j409J15J190P0j102M61J996nk331L70K76J885
8091A561q69j315n49J610M37j731j90J385P69j989M6qJ595o43j310N7J438Q39
8109A133q91j796K536j33q86j163J229P66k98r72j012J560R62p06k451K172J395
8126A445p32j869O67J399m35j72q83M10J093o06q00k23J475L67j899j1J759Ko05
8145C82j359N9J684k96j554k30J066J007k062j82K140K66m82n41j45J326K75k003
8163f49L12J167K14j750j136J228J721r06j887O42K180l76j573p58J719Q16m28
8180E36j690Q7J800l91p92n41R88N38n88k25j92
$$ plain form
8054 -601 -557 -533 408 -1741 -340 29 907 -464 -563 276 701 -127 -774 -436 1188 578 -1010 -677 115
8073 115 671 -114 -770 -276 1562 45 -1364 -1249 -59 11 -1091 -630 1366 1361 -970 -600 -324 1561
8091 1561 692 -623 -1172 438 875 -856 -1046 339 1108 -881 -835 -843 752 109 -1201 -1144 294 1133
8109 1133 242 -1554 982 849 -37 -1200 29 795 497 -475 -1487 73 1035 329 -2122 50 1445
8126 1445 713 -1156 -489 910 475 303 -580 -170 923 317 -483 -706 769 1136 -763 -774 985 987 382
8145 382 -977 -918 766 470 -1084 -1314 -248 759 -1303 -1485 655 921 439 -102 -247 1079 1354 -649
8163 -649 -337 830 1044 -706 -1842 -614 1107 201 -1686 -1044 1136 760 -813 -1571 148 964 536
8180 536 -1154 -1067 733 342 -450 -991 -3 535 -53 -278 -470
8191d70
$$ Imaginary data points
##PAGE= N=2
##DATA TABLE= (X++(I..I)), XYDATA
0@%%%%%%o4O4%O4j28J29j93L20l84M48n76P04q33R63j155J444j749K035k371K809
26A527l257L736m345N014n719O512p418Q408r487J0702j2046J3500j5079J6839
40H887j8767K0843k3127K5642k8366L1327l4595L8179m2069M6333n1054N6253
52B9486o1985O8375p5550Q3600r2723J03206j15358J29615j46645J67461j93530
63a04048K27255k72876L38380m40905O25276j058714L869263K731686q085049
72b169732j125231N315759K606477o104715m408676L697827N449066k538604n518305
81d796134J127822O472185Q06129n630152k149903N431879L616315m132806m686722
90c941387L058480N525404j252430n763707k15379N524303J572513n456266l427236
$$ plain form
0 0 0 0 0 0 0 0 -64 0 0 64 -64 65 -128 192 -192 256 -320 384 -449 514 -641 803 -946 1089 -1282 1527
26 1527 -1730 2006 -2339 2675 -3044 3468 -3950 4458 -5029 5673 -6373 7127 -7952 8887
40 8887 -9880 10963 -12164 13478 -14888 16439 -18156 20023 -22046 24287 -26767 29486
52 29486 -32499 35876 -39674 43926 -48797 54409 -60949 68666 -77979 89482 -104048
63 -104048 123207 -149669 188711 -252194 373082 -685632 3183631 5915317 -2169732
72 -2169732 -3294963 2020796 4627273 -1477442 -5886118 -2188291 3260775 722171 -4796134
81 -4796134 -3668312 2803873 3610002 -2020150 -4170053 1261826 4878141 745335 -3941387
90 -3941387 -882907 4642497 3390067 -2373640 -2589019 2935284 4507797 -948469 -4375705
99d375705L956627M023235l282522n165116J563343N460745O0686n065358j192641
108d016706M939549K786048l843302l574675L042293M499892j720731m869498
116b757130M63871N004313R53263m666123k273103L835970L122116l109711m126539
125c553073J750748M383709o96363m596276n04509M522579J838052l831295k694233
134c380661L164606L607663k044923m039464R53419M282050K65826m116152j302182
143b609818L819818K377093l149754l250865K132938L639288j271292m102727
151b415319r2936L775984R65320l508867j888300L001180K739139k135664l117181
160b676644J474721L623281l94349l601453n23042L405781J407621l011095k260763
$$ plain form
99 -4375705 -419078 3604157 321635 -4843481 -3280138 2180607 2241293 -2824065 -4016706
108 -4016706 922843 3708891 -134411 -3709086 -666793 3833099 2112368 -2757130
116 -2757130 -2293259 2711054 3664317 -1001806 -3274909 561061 3683177 573466 -3553073
125 -3553073 -1802325 2581384 1885021 -2711255 -3215764 1306815 3144867 -686428 -3380661
134 -3380661 -216055 3391608 1346685 -2692779 -1739360 2542690 2808516 -1307636 -2609818
143 -2609818 1210000 3587093 437339 -2813526 -680588 2958700 1687408 -2415319
151 -2415319 -2508255 1267729 2233049 -1275818 -3164118 -162938 2576201 440537 -2676644
160 -2676644 -1201923 2421358 2027009 -1574444 -2097486 1308295 2715916 -295179 -2555942
169b555942K285710K769969j618211l288649O54584L412329K26888l372779j165644
178b651745L019202K001973k365401k546378J674490L001705p73569l085280K9364
187a695639L136307Q35419k880454j548996K496949K194410j938253k740433J127642
196a013048K931424m09891l083626m83506K898149J247829k557259j910274K110350
205b69852K563882j342796k858471O00754L018444K49901k886671j035950K519146
214E58387J658247k074336k221934J450795K573205q11037k835846J9769K806205
223A123455P02156k623475j420699K194141K007112j580798k358837R78178K663886
232A685119k00223k669998m87663K558705J176928k256979j815052J701807K205832
$$ plain form
169 -2555942 -270232 2499737 881526 -2407123 -1752539 1659790 1886678 -1486101 -2651745
178 -2651745 367457 2369430 4029 -2542349 -867859 2133846 1360277 -1725003 -1695639
187 -1695639 1440668 2276087 -604367 -2153363 343586 2537996 599743 -2140690 -1013048
196 -1013048 1918376 1508485 -1575141 -2058647 839502 2087331 -469928 -2380202 -269852
205 -269852 2294030 951234 -1907237 -1306483 1711961 1961862 -924809 -1960759 558387
214 558387 2216634 142298 -2079636 -628841 1944364 1133327 -1702519 -1682750 1123455
223 1123455 1825611 -797864 -2218563 -24422 1982690 401892 -1956945 -978767 1685119
232 1685119 1484896 -1185102 -1672765 885940 2062868 -194111 -2009163 -307356 1898476
241A898476j124068k511534M01984K570675K80017k493443r53547K261252J603870
250A933682j817472k092714J273552K479741n38900k565910j50528K495604Q45077
259A862132k214365j431984J789907J881479j313865k263296O89716K433057o6222
268A366559k474922o18693K280842J218765j935824j738060J446591K135848q35423
277H45683k347114K18117K458361N13360k283333j124013J969166J666955j476497
286D40685k060140Q39175K184492k74816k253980l74273K097557R08158j858438
295c51580j401664J504475J832955r77905k058315M33510K174829J93368k066978
304g17305p42905J845124J252110j477611j655157J017509J932638m91555k081590
$$ plain form
241 1898476 774408 -1737126 -1335142 1235533 1515550 -977893 -1931440 329812 1933682
250 1933682 116210 -1976504 -702952 1776789 1237889 -1328021 -1478549 1017055 1862132
259 1862132 -352233 -1784217 5690 1887169 573304 -1689992 -1000276 1432781 1366559
268 1366559 -1108363 -1727056 553786 1772551 -163273 -1901333 -454742 1681106 845683
277 845683 -1501431 -1283314 1175047 1688407 -594926 -1718939 250227 1917182 440685
286 440685 -1619455 -780280 1404212 1129396 -1124584 -1498857 598700 1506858 -351580
295 -351580 -1753244 -248769 1584186 606281 -1452034 -1018524 1156305 1349673 -717305
304 -717305 -1460210 384914 1637024 159413 -1495744 -478235 1454403 962848 -1118742
313a118742j12814J995137O27666j813281j135218J437409J480788j016734j725205
$$ plain form
313 -1118742 -1231556 763581 1391247 -422034 -1557252 -119843 1360945 344211 -1380994
$$ [...]
8191F10
##END NTUPLES=NMR FID
##END=
