##TITLE=1H ikalashn
B1d 1211
13.11.2024
##JCAMPDX= 6.0         $$ Bruker NMR JCAMP-DX V2.0
##DATA TYPE= NMR FID
##DATA CLASS= NTUPLES
##ORIGIN= UXNMR, Bruker Analytische Messtechnik GmbH
##OWNER= root
$$ TOPSPIN		Version 1.3
$$ 2024-11-13 10:35:04.578 +0400  Irina@DPX200
$$ Compression mode = diff/dup
##.OBSERVE FREQUENCY= 200.131300845
##.OBSERVE NUCLEUS= ^1H
##.DELAY= (6, 6)
##.ACQUISITION MODE= SIMULTANEOUS
##.ACQUISITION SCHEME= undefined
##.AVERAGES= 32
##.DIGITISER RES= 18
##SPECTROMETER/DATA SYSTEM= spect
##.PULSE SEQUENCE= zg
##.SOLVENT NAME= CDCl3
##.SHIFT REFERENCE= INTERNAL, CDCl3, 1, 17.49637
##AUDIT TRAIL= $$ (NUMBER, WHEN, WHO, WHERE, WHAT)
$$ ##TITLE= Audit trail, TOPSPIN		Version 1.3
$$ ##JCAMPDX= 5.01
$$ ##ORIGIN= Bruker BioSpin GmbH
$$ ##OWNER= Irina
$$ $$ F:/spectra/data/iren/nmr/1H/4/audita.txt
$$ ##AUDIT TRAIL=  $$ (NUMBER, WHEN, WHO, WHERE, VERSION, WHAT)
(   1,<2024-11-13 10:34:53.609 +0400>,<Irina>,<DPX200>,<TOPSPIN 1.3>,
      <created by zg
	started at 2024-11-13 10:32:41.109 +0400,
	POWCHK disabled, PULCHK disabled
       configuration hash MD5:
       BE 6D 3F 07 2A EA 11 49 91 17 2B D3 AF B3 58 0D
       data hash MD5: 16K
       CE 59 D7 8F C6 87 0D 9D 24 94 42 53 99 83 00 DF>)
$$ ##END=
$$ 
$$ $$ hash MD5
$$ $$ AF 52 BE 85 10 89 99 A2 E5 7F F5 F6 8B F3 C6 FF
##$RELAX= 
##$RELAX= 
##$RELAX= 
##$RELAX= 
##$RELAX= 
##$RELAX= 
##$RELAX= 
##$RELAX= 
##$RELAX= 
$$ Bruker specific parameters
$$ --------------------------
##$DU= <F:/spectra>
##$EXPNO= 4
##$NAME= <1H>
##$PROCNO= 1
##$TYPE= <nmr>
##$USER= <iren>
##$AMP= (0..31)
100 100 100 100 100 100 100 100 100 100 100 100 100 100 100 100 100 100 
100 100 100 100 100 100 100 100 100 100 100 100 100 100 
##$ANAVPT= -1
##$AQSEQ= 0
##$AQ_mod= 1
##$AUNM= <au_zg>
##$AUTOPOS= <>
##$BF1= 200.13
##$BF2= 200.13
##$BF3= 200.13
##$BF4= 200.13
##$BF5= 200.13
##$BF6= 200.13
##$BF7= 200.13
##$BF8= 200.13
##$BYTORDA= 1
##$CFDGTYP= 0
##$CFRGTYP= 5
##$CHEMSTR= <none>
##$CNST= (0..63)
1 1 145 1 1 1 1 1 1 1 1 1 1 1 1 1 1 1 1 1 1 1 1 1 1 1 1 1 1 1 1 1 1 1 
1 1 1 1 1 1 1 1 1 1 1 1 1 1 1 1 1 1 1 1 1 1 1 1 1 1 1 1 1 1 
##$CPDPRG= <>
##$CPDPRG1= <>
##$CPDPRG2= <>
##$CPDPRG3= <>
##$CPDPRG4= <mlev>
##$CPDPRG5= <mlev>
##$CPDPRG6= <mlev>
##$CPDPRG7= <mlev>
##$CPDPRG8= <mlev>
##$CPDPRGB= <>
##$CPDPRGT= <>
##$D= (0..63)
0 2 0 0 0 0 0 0 0 0.06 0 0.03 0 0 0 0 0.0002 0 0 0 0 0 0 0 0 0 0 0 0 0 
0 0 0 0 0 0 0 0 0 0 0 0 0 0 0 0 0 0 0 0 0 0 0 0 0 0 0 0 0 0 0 0 0 0 
##$DATE= 1731479688
##$DBL= (0..7)
120 120 120 120 120 120 120 120 
##$DBP= (0..7)
150 150 150 150 150 150 150 150 
##$DBP07= 0
##$DBPNAM0= <>
##$DBPNAM1= <>
##$DBPNAM2= <>
##$DBPNAM3= <>
##$DBPNAM4= <>
##$DBPNAM5= <>
##$DBPNAM6= <>
##$DBPNAM7= <>
##$DBPOAL= (0..7)
0.5 0.5 0.5 0.5 0.5 0.5 0.5 0.5 
##$DBPOFFS= (0..7)
0 0 0 0 0 0 0 0 
##$DE= 6
##$DECBNUC= <off>
##$DECIM= 32
##$DECNUC= <off>
##$DECSTAT= 4
##$DIGMOD= 1
##$DIGTYP= 9
##$DL= (0..7)
0 120 120 120 120 120 120 120 
##$DP= (0..7)
150 150 150 150 150 150 150 150 
##$DP07= 0
##$DPNAME0= <>
$$ [...]
##$SW= 21.9926040160658
##$SWIBOX= (0..15)
0 0 2 0 0 0 0 0 0 0 0 0 0 0 0 0 
##$SW_h= 4401.40845070422
##$TD= 16384
##$TD0= 1
##$TE= 300
##$TE2= 300
##$TE3= 300
##$TEG= 300
##$TL= (0..7)
0 120 120 120 120 120 120 120 
##$TP= (0..7)
150 150 150 150 150 150 150 150 
##$TP07= 0
##$TPNAME0= <>
##$TPNAME1= <>
##$TPNAME2= <>
##$TPNAME3= <>
##$TPNAME4= <>
##$TPNAME5= <>
##$TPNAME6= <>
##$TPNAME7= <>
##$TPOAL= (0..7)
0.5 0.5 0.5 0.5 0.5 0.5 0.5 0.5 
##$TPOFFS= (0..7)
0 0 0 0 0 0 0 0 
##$TUNHIN= 0
##$TUNHOUT= 0
##$TUNXOUT= 0
##$USERA1= <user>
##$USERA2= <user>
##$USERA3= <user>
##$USERA4= <user>
##$USERA5= <user>
##$V9= 5
##$VALIST= <valist>
##$VCLIST= <CCCCCCCCCCCCCCC>
##$VD= 0
##$VDLIST= <DDDDDDDDDDDDDDD>
##$VPLIST= <PPPPPPPPPPPPPPP>
##$VTLIST= <TTTTTTTTTTTTTTT>
##$WBST= 1024
##$WBSW= 25
##$XGAIN= (0..3)
0 0 0 0 
##$XL= 0
##$YL= 0
##$YMAX_a= 329119
##$YMIN_a= -397086
##$ZGOPTNS= <>
##$ZL1= 120
##$ZL2= 120
##$ZL3= 120
##$ZL4= 120
##$ABSF1= 10
##$ABSF2= 0
##$ABSG= 5
##$ABSL= 3
##$ALPHA= 0
##$AQORDER= 0
##$ASSFAC= 0
##$ASSFACI= 0
##$ASSFACX= 0
##$ASSWID= 0
##$AUNMP= <proc_1d>
##$AXLEFT= 0
##$AXRIGHT= 0
##$AXTYPE= 0
##$AXUNIT= <>
##$AZFE= 0.1
##$AZFW= 0.1
##$BCFW= 1
##$BC_mod= 2
##$BYTORDP= 1
##$COROFFS= 0
##$CY= 7568.61572265625
##$DATMOD= 1
##$DC= 2
##$DFILT= <>
##$DTYPP= 0
##$F1P= 17.9538593292236
##$F2P= -4.03888763876832
##$FCOR= 0.5
##$FTSIZE= 32768
##$FT_mod= 4
##$GAMMA= 1
##$GB= 1
##$INTBC= 1
##$INTSCL= 1
##$ISEN= 128
##$LB= 0.02
##$LEV0= 0
##$LPBIN= 0
##$MAXI= 945.577
##$MC2= 0
##$MEAN= 0
##$ME_mod= 0
##$MI= -402.1523
##$NCOEF= 0
##$NC_proc= 0
##$NLEV= 6
##$NOISF1= 8.587773
##$NOISF2= 6.764455
##$NSP= 1
##$NTH_PI= 0
##$NZP= 0
##$OFFSET= 17.49637
##$PC= 1
##$PHC0= 314.9476
##$PHC1= 14.40931
##$PH_mod= 0
##$PKNL= yes
##$PPARMOD= 0
##$PPDIAG= 0
##$PPIPTYP= 0
##$PPMPNUM= 100
##$PPRESOL= 1
##$PSCAL= 0
##$PSIGN= 0
##$REVERSE= no
##$SF= 200.13
##$SI= 32768
##$SIGF1= 18.5376
##$SIGF2= -6.396296
##$SINO= 400
##$SIOLD= 32768
##$SREGLST= <1H.CDCl3>
##$SSB= 3
##$STSI= 0
##$STSR= 0
##$SW_p= 4401.40845070422
##$SYMM= 0
##$S_DEV= 0
##$TDeff= 0
##$TDoff= 0
##$TI= <>
##$TILT= no
##$TM1= 0
##$TM2= 0
##$TOPLEV= 0
##$USERP1= <user>
##$USERP2= <user>
##$USERP3= <user>
##$USERP4= <user>
##$USERP5= <user>
##$WDW= 1
##$XDIM= 8192
##$YMAX_p= 0
##$YMIN_p= 0
$$ End of Bruker specific parameters
$$ ---------------------------------
##NTUPLES= NMR FID
##VAR_NAME=  TIME,          FID/REAL,        FID/IMAG
##SYMBOL=    X,             R,               I
##VAR_TYPE=  INDEPENDENT,   DEPENDENT,       DEPENDENT
##VAR_FORM=  AFFN,          ASDF,            ASDF
##VAR_DIM=   8192,          8192,            8192
##UNITS=     SECONDS,       ARBITRARY UNITS, ARBITRARY UNITS
##FACTOR=    0.0002272,     1,               1
##FIRST=     0,             0,               0
##LAST=      1.8609952,     -29,             -163
##MIN=       0,             -397086,         -397086
##MAX=       1.8609952,     329119,          329119
$$ Real data points
##PAGE= N=1
##DATA TABLE= (X++(R..R)), XYDATA
0 0 0 0 0 0 0 0 0 0 0 0 0 0 0 0 0 0 -32 32 -32 32 -32 32 -64 64 -64 96 -96 128 -128 160 -174 193 -224 256 -289
35 -289 321 -378 417 -462 513 -577 641 -708 792 -871 964 -1063 1174 -1295 1423 -1569 1729
52 1729 -1904 2101 -2322 2574 -2855 3179 -3548 3987 -4514 5156 -5960 7003 -8411 10434
66 10434 -13581 19226 -32391 126669 -94261 -369482 90745 329119 -18923 -380426 -103287
77 -103287 265211 129631 -246348 -178031 176014 234413 -68798 -190390 24847 200353
87 200353 51485 -157655 -120586 89994 136486 -46388 -177682 -26193 176761 90721 -162168
98 -162168 -137533 142060 187993 -104028 -219488 59621 242031 -7946 -241543 -30724
108 -30724 249323 86901 -225858 -123830 199658 146719 -183957 -190863 125010 184888 -99512
119 -99512 -198143 55866 200297 2086 -165193 -21515 159834 71672 -117815 -96973 73267
130 73267 104577 -40767 -122682 -17200 108760 61176 -88090 -98844 64322 141226 -20059
141 -20059 -164249 -26501 173170 69059 -179465 -123534 159009 164447 -130138 -197215 95265
152 95265 227577 -42431 -234453 -5131 233158 54629 -217229 -100300 186367 135543
162 135543 -144418 -156086 99551 168372 -47157 -163993 -4859 141810 43412 -120070
172 -120070 -86942 75725 107041 -34254 -118458 -8624 122553 60324 -101591 -94196 82888
183 82888 132035 -47956 -155690 8908 167397 29044 -171578 -70318 160906 104541
193 104541 -142707 -134960 113623 154905 -82478 -170166 43501 171306 -8378 -165986 -26102
204 -26102 152626 57939 -127140 -78447 101338 97121 -65872 -102939 31138 102009 4263
215 4263 -92404 -37290 74873 65378 -50850 -86727 21347 98927 9134 -105206 -44884 97414
227 97414 73872 -86840 -104452 65053 127390 -38319 -141463 10929 152051 23982 -146872
238 -146872 -51572 139184 81843 -118512 -104496 92656 120473 -63171 -131107 28178 128671
249 128671 2203 -122643 -34919 102985 57937 -80248 -77237 50319 87866 -16622 -88541
260 -88541 -14523 84112 47943 -67846 -72539 48701 94378 -21744 -106398 -7146 110616
271 110616 36965 -106778 -66706 93838 91405 -76293 -112944 51075 124916 -25887 -132274
282 -132274 -3428 128326 29190 -118895 -53628 102335 73966 -78595 -86332 54990 96236
293 96236 -25093 -94641 258 90142 25988 -76588 -47129 57622 62037 -36495 -74586 8274
305 8274 75798 15502 -75805 -43109 65334 64790 -51027 -82856 32640 96608 -8172 -100484
317 -100484 -13865 102234 40652 -93120 -61919 81070 81969 -62837 -96569 40603 103985
328 103985 -17700 -106782 -7936 100066 29800 -89240 -51454 70298 66442 -49175 -77520
339 -77520 24013 81169 1169 -78056 -24683 69423 46897 -52545 -61790 34199 75043 -9373
351 -9373 -78714 -13585 78657 37647 -71850 -59494 58009 74841 -42938 -88851 20109
362 20109 92717 -9 -94264 -23628 87588 44352 -75372 -60824 61122 75914 -39980
373 -39980 -81215 21517 85276 1508 -79828 -20869 70528 38791 -56928 -54294 38165 62940
385 62940 -19642 -69451 -2501 67648 21500 -62571 -40814 50829 55989 -35356 -67309 16807
397 16807 74334 4295 -75204 -23877 72256 44531 -62056 -59555 49603 73034 -31219 -79900
409 -79900 12008 82240 8025 -79843 -29222 69996 45220 -59294 -61477 40827 69251 -23232
421 -23232 -74219 2681 72688 17843 -64372 -34472 54479 51711 -36445 -60598 19897 67855
433 67855 465 -67790 -19468 62205 35763 -53557 -51822 37785 60927 -22522 -68829 2995
445 2995 69536 15003 -66702 -32346 58993 47418 -46508 -58106 32121 66055 -13883 -67535
457 -67535 -3528 66538 21821 -59350 -36929 49404 50094 -35844 -58952 19755 62746 -3508
469 -3508 -63678 -14602 57534 28928 -50241 -44112 36903 54032 -22497 -60584 6763 63713
481 63713 11066 -59514 -25006 54126 41117 -41158 -50755 28008 58999 -11582 -62710 -6199
493 -6199 60471 21187 -56456 -37547 45095 47770 -33270 -57207 16887 60784 -72 -60422
505 -60422 -16146 56899 32591 -47453 -44536 36922 54982 -21603 -59663 6311 61093 10000
517 10000 -57318 -25345 49537 38321 -38860 -49318 24684 54855 -10879 -58018 -5413 54761
529 54761 18954 -49191 -32793 38966 43088 -26031 -49721 12432 54597 4183 -52490 -17292
541 -17292 49749 32020 -40402 -42298 29549 50250 -16473 -55692 468 54658 12397 -53573
553 -53573 -28156 45579 38591 -36948 -48009 24948 53630 -10926 -54544 -1898 53995 16904
565 16904 -47183 -27939 39680 38814 -28056 -45515 15440 48690 -2271 -48708 -11662 43918
577 43918 23592 -36957 -34985 25456 42257 -13792 -47935 -455 48499 13668 -46248 -26337
589 -26337 40424 37751 -30520 -45442 19838 52213 -5301 -53117 -7129 52787 21281 -47435
601 -47435 -32847 39157 41421 -29502 -48928 15448 49793 -3454 -50362 -11305 44565 22704
613 22704 -37408 -32689 27537 40614 -14499 -42960 2916 44162 11311 -39360 -22290 33164
625 33164 33138 -23555 -41322 11540 45377 -126 -47711 -13449 44841 24349 -40156 -35077 31286
638 31286 42455 -21178 -47808 9410 49911 2901 -48490 -14075 44997 24903 -37323 -32182
650 -32182 29294 38672 -17652 -40704 6720 40814 5025 -37818 -16231 31269 24551 -24513
662 -24513 -32955 13169 35879 -3528 -38191 -8694 35736 19574 -30606 -28738 24221 38231
674 38231 -13413 -42214 4502 46247 7720 -44857 -17957 41597 27863 -35695 -36700 26114
686 26114 41652 -16564 -46127 4323 45572 6198 -43574 -17141 37692 25800 -29364 -31804
698 -31804 19560 35948 -7805 -36020 -3104 34393 14556 -28683 -23343 22077 31167 -12320
710 -12320 -35393 2170 36873 8307 -35912 -19421 31030 27776 -25516 -36590 16043 41136
722 41136 -7270 -44284 -2964 43888 13313 -40180 -21146 35582 29902 -26272 -34256 18230
734 18230 38339 -7510 -38490 -2302 36312 10853 -32566 -19944 24510 24788 -17359 -29699
746 -29699 6589 30454 3050 -29693 -13063 26343 22452 -20089 -28845 13270 34718 -3541
758 -3541 -36325 -5644 36609 15836 -33311 -24660 28080 32303 -21165 -38094 12354 40894 -3678
771 -3678 -41981 -6373 38945 14382 -34979 -22764 27300 28115 -19095 -31755 9958 33651 427
784 427 -31242 -8428 28483 17351 -21262 -22471 14078 27066 -4748 -28773 -5056 27309 13249
797 13249 -25545 -22640 19184 27950 -13717 -33249 5245 35116 3181 -34704 -11455 33069
809 33069 20253 -27930 -26176 22563 32192 -14669 -34593 7033 35601 1223 -33843 -9263
821 -9263 29660 15863 -24317 -21890 16762 25177 -9355 -27408 509 26444 6951 -24257 -14629
834 -14629 19489 20525 -12836 -24745 5784 28056 3418 -27565 -10653 26805 19265 -22407
846 -22407 -25331 17252 30281 -10552 -33664 2106 33447 5084 -33325 -13949 28826 19923
858 19923 -24447 -25798 17711 29480 -9960 -30287 2676 30338 6018 -26420 -12059 22203
870 22203 18695 -15257 -22801 7782 24831 -260 -25490 -8104 22719 14575 -19167 -21047 12829
883 12829 24997 -6072 -27985 -1782 28404 9458 -27059 -16552 24068 22812 -18670 -26801
895 -26801 13132 30314 -5329 -30323 -1565 29987 9274 -26730 -15316 22048 20202 -17041
907 -17041 -24345 9483 24777 -3463 -25409 -4429 22343 10284 -18564 -15894 13588 20489 -6564
920 -6564 -22125 875 23781 6836 -21563 -12324 19214 18503 -14490 -22856 8182 25525 -2498
933 -2498 -27386 -5145 26094 11034 -24623 -17531 20260 21857 -15076 -24950 8681 26726 -1578
946 -1578 -26230 -4841 24533 11725 -20771 -16593 16317 20868 -9967 -22772 3595 23247 3261
959 3261 -21718 -10211 18150 15497 -13985 -20786 7339 22723 -1806 -24524 -5478 23085 11536
972 11536 -20258 -16760 16489 21871 -10158 -24000 4785 26164 2581 -25184 -8344 23424
984 23424 13789 -19908 -18609 14328 21051 -9324 -23373 2174 22569 3551 -21555 -9631 18345
997 18345 14701 -13921 -18019 9131 20449 -2839 -20522 -2723 19879 8901 -16945 -13695 13572
1010 13572 18095 -8678 -20930 3256 22169 2078 -22171 -8125 19837 12549 -17224 -17709 11835
1023 11835 20505 -7034 -22783 1086 23295 5034 -21448 -9830 19454 15122 -14402 -17926
1035 -17926 10108 20736 -3645 -21249 -2400 20219 7791 -18761 -13631 14142 16843 -10289
1047 -10289 -20171 4154 20726 1458 -20262 -7310 18334 12907 -14498 -16765 10547 20385 -4822
1060 -4822 -21188 -296 21368 5865 -19403 -10945 15999 15068 -12145 -18460 6610 19915 -1746
1073 -1746 -20876 -4114 19359 8661 -17280 -13261 13092 16321 -8646 -18496 3466 19522 2484
1086 2484 -18379 -6855 17364 12177 -13575 -15009 10126 17700 -5223 -18862 -10 18355 4583
1099 4583 -17685 -10255 14238 13394 -11396 -17053 6592 18531 -1843 -18974 -2886 18414 8350
1112 8350 -15294 -11923 12497 16059 -7583 -18136 2983 19248 2031 -18871 -7141 16797
1124 16797 11118 -14242 -15132 9578 17332 -5246 -18844 -304 18706 4918 -17610 -9738 15073
1137 15073 13489 -11233 -16007 7084 17951 -1489 -17490 -2878 16923 8364 -14054 -12206 10938
1150 10938 15082 -6740 -17135 1629 16926 2374 -16829 -7833 13937 11308 -11355 -14869 7170
1163 7170 17325 -2617 -17832 -1312 18335 6589 -16042 -9985 13911 13744 -10071 -16066 5543
1176 5543 17185 -1339 -17743 -3708 16090 7148 -14667 -11099 11050 13257 -7466 -14898 2942
1189 2942 15344 1541 -14700 -5856 13031 10091 -10041 -12597 6998 15147 -2461 -15661 -1370
1202 -1370 15826 6197 -14015 -10175 11408 13387 -8514 -16408 3893 17135 -421 -17889 -4340
1215 -4340 16434 7695 -14514 -11286 11453 14251 -7156 -15519 3647 16725 1449 -15570 -5072
1228 -5072 14215 8845 -11382 -11943 7365 13105 -3688 -14512 -1534 13368 5317 -12615 -9675
1241 -9675 9786 12550 -6529 -14550 2760 15833 1560 -15227 -5336 14363 9713 -11813 -12618
1254 -12618 9134 15303 -5510 -16523 1866 16949 2077 -16202 -5993 13905 8713 -11520
1266 -11520 -11838 7549 12914 -4237 -14121 -201 13449 3808 -12001 -6713 9983 9799 -6205
1279 -6205 -11167 3312 12703 1172 -12228 -4896 11529 8448 -9923 -11923 6780 13562 -4091
1292 -4091 -15471 -333 15042 3755 -14798 -7607 12929 10988 -10306 -13159 7552 15123 -3743
1305 -3743 -15465 390 15457 3564 -13601 -6670 11282 9403 -8129 -11543 4305 12400 -692
1318 -692 -12641 -3287 11223 6284 -9372 -9727 6007 11227 -2709 -12761 -1262 12880 5205
1331 5205 -11782 -8389 10670 11954 -7580 -13346 5016 15074 -1280 -15255 -2326 14534 5558
1344 5558 -13418 -9225 10626 10862 -8502 -13149 4648 13349 -1713 -13145 -1677 11879 5120
1357 5120 -9323 -7321 6989 9642 -3386 -10482 297 10859 2993 -10034 -6173 8441 8599
1370 8599 -6227 -10969 2944 12134 78 -12927 -4043 12478 6947 -11640 -10154 9476 12206
1383 12206 -6930 -13884 3783 14682 -81 -13993 -2900 13507 6615 -11072 -8747 8982
1395 8982 10921 -5696 -11722 2399 11403 547 -11054 -4515 8486 6702 -6558 -9352 3190
1408 3190 10438 151 -10759 -3030 10538 6838 -8534 -9007 6743 11615 -3433 -12788 546
1421 546 13402 2828 -13157 -6257 11856 8482 -10347 -10753 7380 12061 -4825 -12851 1334
1434 1334 12520 1731 -11696 -4706 10047 7198 -7639 -8694 5243 9821 -2004 -9499 -784
1447 -784 9213 4141 -7409 -6353 5483 8704 -3222 -10286 30 10414 2421 -10842 -5677 9107
1461 9107 7914 -7744 -10104 5379 11956 -2265 -12468 -112 13168 3755 -11950 -5755 11051
1474 11051 8366 -8474 -9814 5870 10630 -3123 -11147 -407 10184 2865 -9473 -5875 7005
1487 7005 7505 -4918 -8905 1996 9326 1167 -8718 -4032 7813 6927 -5779 -8963 3598 10743
1501 10743 -766 -11274 -1882 11279 4827 -10272 -7418 8510 9295 -6436 -11195 3449 11669
1514 11669 -1177 -12382 -2108 11289 4256 -10035 -6521 8131 8274 -5340 -8883 2914 9712
1527 9712 375 -8717 -2759 8010 5305 -6245 -7177 3914 7990 -1844 -8961 -1617 8234 3737
1541 3737 -7840 -6608 6128 8415 -4234 -9921 2213 10971 527 -10807 -2534 10512 5275
1554 5275 -8924 -7198 7316 9118 -4908 -10135 2290 10617 159 -10299 -2694 9049 4475
1567 4475 -7672 -6621 5199 7521 -2987 -8392 -89 8244 2508 -7667 -4847 6462 7078 -4097
1581 -4097 -8085 2301 9331 914 -9032 -3154 8488 5736 -7360 -8157 5279 9419 -3705 -10708
1595 -10708 769 10504 1355 -10257 -3932 9058 6126 -7016 -7558 5235 8957 -2484 -9147
1608 -9147 467 9247 2242 -8076 -4074 6683 5736 -4609 -7195 2259 7620 56 -7912 -2788
1622 -2788 7190 4695 -6144 -6752 4231 7882 -2485 -8587 -41 8919 2501 -8212 -4461 7624
1636 7624 6669 -5827 -7837 4403 9166 -2009 -9372 -53 9231 2093 -8412 -4612 6592 5806
1650 5806 -5560 -7719 2879 8093 -798 -8410 -1334 7943 3720 -6137 -5078 4988 7070 -2518
1664 -2518 -7501 468 8127 2138 -7885 -4251 6903 5879 -5489 -7616 3345 8343 -1385 -8890
1678 -8890 -1325 8447 3387 -7832 -5657 6386 7145 -4602 -8185 2646 8520 -380 -8295 -1787
1692 -1787 7621 4064 -6184 -5439 4725 7072 -2721 -7730 556 7668 1182 -7435 -3592 5827 4945
1707 4945 -4719 -6483 2636 7297 -646 -7664 -1425 7730 3650 -6369 -4921 5673 6539 -3670
1721 -3670 -7282 2065 7730 82 -7804 -2310 6977 3989 -6477 -5902 4611 6668 -3074 -7658 915
1736 915 7463 993 -7057 -3013 6204 4858 -4767 -6096 3237 7237 -1130 -7433 -659 7419 2756
1751 2756 -6393 -4395 5020 5773 -3617 -6982 1349 7287 300 -7747 -2442 6755 3956 -5978 -5708
1766 -5708 4242 6656 -2210 -7046 416 7414 1979 -6618 -3458 6052 5374 -4571 -6326 2925 6824
1781 6824 -1123 -7349 -1302 6442 2520 -6134 -4820 4614 5760 -3331 -6764 1577 7183 300 -6797
1796 -6797 -1801 6325 3734 -4995 -4922 3777 6169 -1887 -6639 268 6737 1711 -6376 -3308 5444
1811 5444 4520 -4174 -5756 2231 6113 -718 -6679 -1312 6169 2917 -5790 -4369 4786 5733 -3177
1826 -3177 -6072 1900 6873 344 -6376 -1926 6187 3793 -5167 -5195 3659 5947 -2595 -6718 394
1841 394 6387 798 -6193 -2798 4978 4184 -3831 -5291 2552 6205 -500 -6053 -989 6123 2986
1856 2986 -5041 -4077 4165 5398 -2380 -6232 743 6371 884 -6267 -2781 5630 3995 -4885 -5443
1871 -5443 3440 5846 -2141 -6459 342 6254 1570 -5884 -3018 5335 4440 -3799 -5024 2739 5979
1886 5979 -758 -5586 -567 5387 2123 -4625 -3666 3190 4287 -2290 -5546 487 5509 804 -5502
1901 -5502 -2329 4800 3690 -3816 -4654 2851 5920 -972 -5849 -343 6290 1986 -5704 -3188 5109
1916 5109 4319 -4126 -5449 2588 5676 -1126 -5897 -780 5631 2007 -5040 -3466 3844 4336 -2833
1931 -2833 -4823 1378 5277 303 -5034 -1634 4588 3290 -3239 -4202 2430 5277 -894 -5700 -628
1946 -628 5465 2050 -5212 -3567 4071 4425 -3187 -5721 1435 5992 -223 -6082 -1311 5848 2741
1961 2741 -4958 -3582 4250 4772 -2564 -4792 1462 5431 206 -4920 -1429 4546 2711 -3852 -3864 2244
1977 2244 4289 -1240 -4646 -386 4342 1621 -3918 -3055 3098 4156 -2099 -4896 1013 5305 376
1992 376 -5263 -1508 5111 2891 -4283 -3825 3522 4882 -2189 -5335 975 5495 184 -5751 -1592
2007 -1592 4958 2461 -4335 -3668 3008 4170 -1841 -4529 542 4490 1140 -3902 -2080 3703 3443
2022 3443 -2275 -3784 1227 4324 68 -4507 -1630 4029 2578 -3672 -4176 2531 4678 -1637 -5504
2037 -5504 277 5447 1017 -5309 -2233 4714 3386 -3743 -4231 2756 5077 -1247 -5130 191 5104
2052 5104 1103 -4398 -2223 3792 3086 -2708 -3591 1363 3858 -263 -4099 -1269 3618 2215 -3088
2067 -3088 -3241 2042 3931 -992 -4101 -18 4462 1525 -3859 -2366 3750 3636 -2790 -4418 1769
2082 1769 4792 -947 -5213 -506 4831 1034 -4780 -2694 3587 3322 -2939 -4069 1735 4329 -476
2097 -476 -4286 -415 4108 1564 -3263 -2308 2479 3141 -1258 -3523 339 3744 1042 -3679 -2113 3073
2113 3073 2952 -2433 -3755 1269 4132 -342 -4485 -1058 4351 2145 -4026 -3175 3308 4174 -2369 -4454
2129 -4454 1618 4840 -128 -4555 -623 4273 1957 -3597 -2844 2626 3259 -1894 -3958 448 3631
2144 3631 396 -3738 -1467 2817 2299 -2051 -2953 1268 3573 -25 -3488 -866 3695 2073 -3173
2159 -3173 -2947 2578 3725 -1526 -4092 566 4141 402 -4155 -1524 3805 2418 -3371 -3227 2525
2174 2525 3500 -1846 -4025 858 4000 235 -3664 -1150 3354 2175 -2539 -2689 1794 3427 -592
2189 -592 -3323 -327 3207 1171 -2830 -2156 2012 2684 -1455 -3509 119 3622 488 -3804 -1685 3367
2205 3367 2620 -2846 -2989 2362 3882 -1023 -3901 325 4158 813 -3812 -1883 3530 2492 -2859
2220 -2859 -3208 1689 3444 -899 -3615 -233 3308 1067 -2916 -1884 2192 2702 -1396 -2997 541
2235 541 3278 266 -3016 -1095 2882 2225 -2015 -2695 1495 3453 -531 -3661 -343 3647 1175 -3603
2251 -3603 -2219 2819 2455 -2382 -3363 1309 3625 -397 -3825 -434 3414 1385 -3039 -1834 2655
2266 2655 2723 -1750 -2757 1144 3112 -100 -2852 -836 2587 1544 -2266 -2462 1382 2873 -824 -3328
2282 -3328 -281 3116 795 -2827 -1857 2322 2706 -1751 -3023 945 3451 -46 -3600 -653 3432
2297 3432 1524 -3098 -2274 2457 2739 -1638 -3318 754 3260 182 -3294 -1086 2813 1626 -2569
2312 -2569 -2395 1860 2738 -933 -2838 125 2996 1000 -2432 -1581 2380 2451 -1372 -2756 821 3274
2328 3274 -76 -3219 -877 2693 1445 -2552 -2396 1639 2700 -1185 -3323 454 3226 474 -3031
2343 -3031 -1010 2845 1796 -2194 -2218 1617 2706 -825 -2828 -66 2896 728 -2762 -1445 2199
2358 2199 1989 -1834 -2466 971 2699 -285 -2704 -776 2491 1310 -2252 -2132 1874 2615 -1060 -2883
2374 -2883 544 3118 433 -2770 -961 2492 1874 -1931 -2326 1459 2678 -705 -3135 -174 2786
2389 2786 669 -2849 -1511 2224 2050 -1628 -2534 822 2815 19 -2760 -617 2749 1481 -2141
2404 -2141 -1812 1876 2411 -999 -2448 364 2511 432 -2475 -1312 2219 1789 -1862 -2432 1222 2594
2420 2594 -590 -2658 -106 2680 834 -2347 -1555 1928 2171 -1393 -2422 824 2854 10 -2532
2435 -2532 -672 2586 1433 -1906 -1718 1501 1961 -996 -2553 194 2552 284 -2567 -1057 2162
2450 2162 1541 -1894 -1987 1287 2432 -388 -2368 -18 2528 891 -2182 -1418 1938 2087 -1298 -2267
2466 -2267 679 2333 -223 -2421 -674 2167 1227 -1920 -1937 1298 2273 -880 -2404 177 2690 487
2482 487 -2320 -922 2222 1818 -1538 -2000 1128 2509 -386 -2591 -150 2490 936 -2315 -1484 1706
2498 1706 1709 -1476 -2231 520 2062 -66 -2321 -791 2101 1187 -1766 -1712 1426 2165 -625 -2133 291
2515 291 2349 510 -1987 -1148 1767 1622 -1348 -2098 822 2368 -387 -2598 -276 2223 834 -2011
2531 -2011 -1339 1556 1838 -1094 -2148 681 2321 57 -2243 -467 2202 1005 -1710 -1398 1387 1783
2547 1783 -817 -1967 89 2064 429 -2239 -1151 1624 1454 -1538 -1950 804 2020 -281 -2188
2562 -2188 -419 2110 1128 -1762 -1450 1510 2196 -1004 -2163 739 2362 -76 -2313 -571 1950 1161
2578 1161 -1737 -1697 1203 1823 -863 -2217 289 2205 406 -1876 -692 1691 1365 -1201 -1499 745
2594 745 1805 71 -1788 -337 1889 1001 -1596 -1361 1148 1780 -861 -2121 175 1915 147 -2033
2610 -2033 -1030 1783 1227 -1650 -1870 1048 1998 -835 -2151 268 2163 331 -1748 -596 1771 1389
2626 1389 -1201 -1532 913 1760 -360 -1855 -145 1760 481 -1635 -1067 1139 1414 -827 -1786 189
2642 189 1840 418 -1845 -788 1788 1348 -1200 -1511 1032 1925 -384 -2129 -41 1986 561 -1998
2658 -1998 -1047 1740 1485 -1455 -1796 911 1877 -597 -2037 -182 1782 483 -1551 -1154 1142 1366
2674 1366 -746 -1576 366 1843 200 -1451 -471 1584 1033 -1058 -1343 754 1563 -200 -1931 -357
2690 -357 1725 586 -1688 -1337 1396 1540 -1149 -1720 621 1783 -58 -1824 -249 1840 1011 -1473
2706 -1473 -1148 1447 1489 -889 -1658 451 1602 -80 -1686 -409 1291 908 -1269 -1316 642 1320 -360
2723 -360 -1570 -83 1521 415 -1303 -866 1120 1266 -573 -1524 357 1962 213 -1804 -526 1822
2739 1822 1061 -1449 -1162 1147 1471 -918 -1783 284 1561 -25 -1891 -590 1626 919 -1405 -1158
2755 -1158 979 1373 -451 -1363 172 1486 438 -1192 -790 1079 1181 -778 -1455 311 1471 -17
2771 -17 -1357 -638 1333 701 -1226 -1254 778 1600 -476 -1690 80 1761 508 -1654 -557 1618 1121
2788 1121 -1092 -1177 858 1456 -211 -1498 93 1658 206 -1535 -744 1037 950 -991 -1280 378 1124
2805 1124 -208 -1251 -421 1149 694 -858 -994 725 1422 -438 -1330 41 1456 468 -1381 -738 1193
2822 1193 1063 -1106 -1467 580 1548 -383 -1681 -89 1627 392 -1569 -809 1243 994 -844 -1155
2838 -1155 641 1451 -70 -1274 -214 1320 543 -1084 -850 815 1027 -439 -1225 45 1098 390
2854 390 -1154 -839 910 849 -787 -1392 447 1400 -283 -1606 -233 1415 668 -1151 -874 1160 1316
2871 1316 -594 -1315 517 1561 -14 -1458 -319 1194 521 -1224 -967 714 972 -520 -1187 13
2887 13 1204 205 -1183 -400 1069 842 -828 -911 620 1199 -94 -1136 -212 1061 551 -1004 -931 843
2905 843 1096 -758 -1338 359 1239 16 -1482 -509 1202 852 -1039 -1079 742 1178 -505 -1334 323
2922 323 1267 213 -1197 -447 1225 839 -686 -928 502 1016 -139 -1026 -144 987 514 -1035 -940 715
2940 715 935 -440 -1065 180 1271 197 -1127 -531 1243 997 -908 -888 767 1245 -485 -1204 60
2957 60 1172 363 -1035 -540 930 822 -878 -1057 460 1098 -285 -1173 -103 1021 388 -905 -645
2974 -645 651 762 -439 -973 157 1092 3 -920 -276 1114 636 -800 -773 473 995 -298 -1073 -28
2992 -28 1087 246 -1237 -685 915 862 -801 -998 368 1017 -197 -988 -93 1114 390 -757 -514 821
3010 821 879 -524 -1106 136 1045 -64 -1032 -337 885 450 -907 -733 460 878 -144 -1096 -36 1086
3028 1086 410 -1066 -619 855 853 -466 -905 354 1142 55 -1080 -239 910 519 -897 -651 765
3045 765 935 -468 -1049 177 974 -136 -966 -400 783 626 -760 -800 517 948 -263 -947 124 992
3063 992 285 -815 -401 874 745 -483 -948 235 811 -102 -966 -236 975 423 -864 -610 565 793
3081 793 -364 -907 199 1064 142 -988 -334 977 572 -642 -657 615 861 -296 -839 124 923 349
3099 349 -891 -542 746 726 -621 -969 117 1023 -87 -1005 -96 815 346 -735 -452 499 952 -351
3117 -351 -863 171 805 16 -948 -227 838 477 -710 -685 377 927 -178 -966 -111 866 310 -841
3135 -841 -489 712 726 -509 -748 222 810 198 -738 -186 836 465 -681 -634 762 928 -455 -823 211
3154 211 916 58 -835 -356 799 383 -631 -709 379 768 -290 -843 -22 892 168 -783 -471 589 767
3173 767 -309 -699 175 819 -18 -918 -409 780 380 -804 -533 488 633 -532 -922 16 728 99
3191 99 -863 -303 748 681 -588 -752 643 814 -100 -720 19 801 240 -623 -446 632 603 -368 -685 134
3211 134 754 -57 -840 -319 649 347 -493 -636 300 727 -294 -841 -15 868 355 -573 -279 772 584
3230 584 -591 -591 403 706 -218 -772 -85 742 292 -751 -495 427 454 -326 -777 253 628 -50 -605 -83
3250 -83 603 384 -423 -499 483 785 -85 -765 94 803 178 -658 -435 427 461 -400 -756 186 644 -53 -829
3271 -829 -49 902 192 -731 -384 635 527 -342 -510 445 736 -6 -686 -107 702 400 -511 -497 469 556
3291 556 -236 -652 17 533 70 -644 -387 384 308 -440 -594 291 681 -2 -604 -26 758 295 -468 -456 537
3312 537 470 -360 -707 166 815 16 -864 -130 660 322 -574 -463 345 631 -359 -558 76 535 105 -666
3332 -666 -266 586 446 -319 -362 232 525 41 -619 -168 419 223 -550 -506 398 585 -152 -676 149 521 -74
3353 -74 -713 -273 512 334 -486 -465 380 541 -210 -634 262 829 -1 -523 -244 589 365 -388 -531 214 597
3374 597 -101 -587 -233 531 255 -515 -270 416 516 -295 -366 123 465 134 -410 -140 630 476 -301 -434
3394 -434 361 609 -247 -653 11 603 108 -469 -418 509 402 -360 -529 242 498 -155 -777 39 556 145
3414 145 -440 -195 354 350 -93 -383 102 500 16 -517 -121 341 281 -471 -525 105 461 -142 -586 -128 435
3435 435 145 -538 -406 571 408 -429 -486 370 496 -85 -443 -116 541 222 -380 -339 364 460 -297 -550 144
3456 144 568 -87 -464 -36 401 146 -274 -340 286 432 -94 -403 -31 547 122 -403 -257 439 477 -256 -469
3477 -469 72 608 91 -610 -80 456 366 -548 -474 358 507 -338 -509 164 456 17 -582 -29 579 421 -349
3498 -349 -393 279 540 -79 -539 127 438 54 -314 -142 306 363 -199 -371 65 420 -25 -407 -128 464 248
3519 248 -265 -379 353 450 -254 -436 75 563 5 -477 -64 443 336 -441 -179 354 563 -211 -444 7
3539 7 362 131 -393 -245 309 321 -286 -473 192 489 38 -421 67 340 209 -269 -245 382 449 -134 -481 92
3561 92 630 146 -459 -143 413 242 -381 -436 261 338 -124 -473 -162 514 207 -410 -200 413 431 -270 -432
3582 -432 148 346 -32 -386 -112 310 199 -265 -134 216 302 -251 -373 -20 382 90 -360 -105 293 182
3602 182 -143 -371 150 417 -23 -458 -30 447 187 -377 -199 362 378 -187 -321 53 298 -32 -427 -126
3622 -126 265 74 -314 -252 203 326 -157 -316 69 423 -30 -423 -160 267 269 -293 -269 36 474 48 -365
3643 -365 141 338 284 -118 -314 252 322 -90 -499 86 250 -197 -344 -46 380 101 -312 -297 220 305 -101
3664 -101 -325 90 484 12 -227 -126 413 232 -385 -331 91 244 -100 -389 -93 241 65 -361 -312 258 356
3685 356 -178 -268 162 229 110 -273 -76 260 196 -273 -199 166 397 -74 -288 94 390 4 -430 -318 224
3706 224 141 -230 -447 181 244 -134 -258 -19 408 180 -341 -216 243 249 -121 -317 33 372 91 -373 -77
3727 -77 285 215 -264 -216 242 222 -218 -380 63 373 39 -241 -183 181 366 -67 -175 109 284 42 -290 -25
3749 -25 303 222 -210 -203 300 234 -171 -259 107 273 115 -396 -97 228 180 -275 -283 148 258 -86 -278 -99 380
3772 380 120 -346 -101 225 183 -149 -275 216 309 -27 -237 20 266 71 -382 -263 197 225 -158 -286 118
3793 118 325 -119 -323 -126 331 243 -89 -199 156 273 -34 -363 -35 302 -23 -193 -296 257 149 -204
3813 -204 -317 246 208 117 -315 -95 364 145 -284 -113 183 237 -131 -279 59 225 15 -223 -82 219 271
3834 271 -258 -281 43 146 -92 -234 -57 247 98 -279 -185 174 201 -212 -406 17 324 -16 -300 66 427
3855 427 274 -204 -61 204 196 -26 -269 51 232 -24 -359 -33 132 142 -181 -181 51 146 -89 -267 -148 254
3877 254 147 -204 -23 120 244 -252 -296 217 322 -14 -471 -40 212 242 -245 -211 139 237 -188 -282 -97 153
3899 153 81 -399 -67 181 37 -305 -230 -34 304 -62 -269 64 365 85 -218 -128 310 231 -43 -183 137
3920 137 259 35 -207 -183 294 182 -377 -346 202 275 -112 -238 103 222 32 -207 -134 259 250 -95 -253 106
3942 106 175 58 -307 83 196 178 -245 -120 86 128 -137 -157 -32 206 90 -191 18 92 233 -135 -90 54
3964 54 171 -127 -136 64 257 52 -229 -117 214 276 -136 -182 135 219 -76 -317 34 156 -12 -181 -69 129
3986 129 151 -111 -237 59 207 32 -190 81 248 68 -116 -177 69 248 -50 -305 -22 227 50 -237 -98
4007 -98 212 125 -241 -170 117 213 -88 -94 74 155 186 -160 -97 173 220 -103 -111 39 330 -41 -83 -110 157 13 -10
4032 -10 -97 126 181 -122 -172 -121 228 -139 -187 -159 110 189 -131 -151 169 275 35 -325 -68 213 104 -194 -158
4055 -158 3 243 -245 -210 36 203 67 -173 -10 93 144 -334 -207 216 191 -55 -136 95 190 -108 -95 -74
4077 -74 202 124 111 -70 39 106 -72 -202 -209 70 -15 -210 -251 71 22 -129 -169 56 196 -16 -263 -105 241
4100 241 9 -164 -190 119 29 5 -215 7 265 84 -170 24 185 -86 -192 -191 45 133 12 -120 -85 30
4122 30 77 -38 -167 113 92 -102 -188 71 165 15 -204 -132 112 229 -147 -215 117 116 -73 -206 124 75 -79
4145 -79 -271 -4 203 69 -164 -178 -36 81 -96 -195 42 82 112 -99 -110 126 101 -94 -83 -47 134 9 -88
4168 -88 -78 246 131 -124 -230 70 221 -24 -129 14 66 81 -24 -9 179 96 -118 -232 81 116 25 -206 -61
4191 -61 195 72 -86 -2 149 78 -143 -135 54 261 -102 -93 -205 138 136 -120 -85 131 159 9 -150 -102 138 177
4215 177 -37 18 136 162 -55 -127 -120 66 -102 -72 27 -3 87 -151 -144 91 185 -108 -150 -36 95 32 -160 -31 50
4240 50 116 -79 -110 203 78 -150 -161 -11 70 -17 -235 -8 74 23 -110 -47 -19 106 -12 -54 73 64 63 -223 -246
4265 -246 -58 51 -31 -222 28 188 -51 -130 -110 -2 51 -129 -183 5 82 -50 -220 47 -64 152 12 -111
4287 -111 127 105 -81 -105 97 18 1 -100 -44 66 137 -53 -25 1 128 39 -100 -112 94 56 -141 -33 62 30
4311 30 -161 -267 156 216 -175 -198 -112 77 114 -138 -85 90 50 -128 -44 47 112 -46 -125 10 -21 -28 -144 -149 36
4336 36 22 -85 -70 -20 50 -29 -257 -99 10 49 -2 -163 11 101 108 -61 -40 202 113 10 60 78 83 -78 -22 19
4362 19 -54 -18 -230 14 104 220 18 -119 109 113 -194 -190 60 167 -1 -167 -73 106 71 -106 -105 77 110 -98
4386 -98 -180 46 44 12 -159 -84 88 45 -32 -111 -84 10 18 -139 -8 114 -2 -185 -99 212 39 112 -218 69 72 20
4412 20 -55 -88 91 58 -87 -151 76 -12 -47 -20 29 -36 111 -137 -53 24 140 4 -57 80 69 118 21 -132 149
4437 149 118 -142 -109 5 83 -113 -183 -5 54 21 -170 -98 141 17 -57 -119 1 143 -81 -30 -30 82 99 -15
4461 -15 -108 -24 90 -84 -77 50 22 -41 -119 -27 49 -10 -79 -157 90 75 -78 -109 9 145 -14 -131 10 125 -10
4486 -10 88 -65 23 -15 -14 -174 -146 11 -4 -67 -100 66 71 -110 -188 -56 -86 86 -117 -123 88 -40 -81 -63 50 225
4512 225 -93 -55 -139 48 59 6 -7 74 -19 -73 -130 21 71 -73 -50 -44 223 150 -112 7 16 120 -82 -12 -36 177
4538 177 29 -42 82 37 -7 -59 -9 48 185 -58 -155 0 114 128 -186 -54 155 -69 -113 -163 -165 66 -138 -167
4562 -167 9 134 0 -91 -30 40 162 -57 58 -34 47 -62 -46 -93 130 39 3 -237 -56 36 25 -68 46 -5
4586 -5 -14 -110 -65 17 66 -59 -67 64 120 67 -61 -68 1 52 -112 -31 123 79 -56 -64 23 56 -34 100 -13 -99 51 -125
4614 -125 -122 28 33 20 -186 -38 44 63 -73 61 139 229 36 -79 125 50 104 -179 -103 167 19 -75 24 70 43
4639 43 -55 -49 28 53 -12 -82 -49 29 96 -131 -17 9 23 2 -101 -64 27 41 -99 -84 71 -3 15 26 -34 83 -84
4666 -84 -26 -19 55 71 -112 -14 89 83 -24 22 27 -36 -24 -35 -14 -2 42 -10 -21 94 96 -12 -20 140 117 -35 -102 6 -23
4695 -23 133 -65 -33 -22 -43 -17 -39 -30 123 27 -110 -58 109 109 -69 -42 -13 24 66 -60 -79 149 -14 -119 -58 61
4721 61 -42 39 -53 -49 139 11 -213 -52 -9 68 70 -4 -26 186 33 -24 -114 130 57 -81 -50 74 67 12 -50 -64 54
4748 54 144 -109 -37 70 -49 -126 -107 26 159 -176 -60 38 124 -14 19 -80 156 1 -42 -20 3 39 -16 -129 -75
4773 -75 207 -109 -83 3 1 10 19 -79 56 24 -58 -41 -44 3 25 173 -12 -38 96 -125 -69 -97 -86 26 -4 -30 35 66
4801 66 9 81 87 88 -27 -150 -4 98 50 -87 -7 89 99 93 -184 57 94 74 75 -113 -5 93 -35 -109 86 51 -7
4828 -7 -59 -147 -90 144 43 -71 -43 46 145 -25 15 -8 -42 -10 102 41 -54 39 69 96 66 32 -57 28 -56 25 0 -87
4856 -87 -61 117 63 -46 -65 -8 35 25 87 -89 -116 -95 2 99 -86 -4 -63 -139 144 -76 -50 21 76 148 88 -43 -8
4883 -8 14 75 66 9 120 93 24 46 187 95 -10 -5 33 54 -14 13 -28 -106 99 -1 14 11 -6 41 -4 82 82 31 -78 31
4913 31 148 3 -87 -40 47 7 34 38 -32 -125 -137 -23 -64 -52 121 104 -64 74 77 85 -59 -21 88 79 117 78 78 -84
4941 -84 -35 -25 -22 -21 50 55 55 -5 25 78 -36 158 -91 31 147 -11 75 13 -111 -107 7 -13 2 -124 -6 55 -91
4968 -91 -101 76 84 108 18 -60 -54 118 -121 -70 73 -44 -54 -39 -30 -75 142 55 -10 3 13 -119 -60 9 16 174 45 -52
4996 -52 81 11 -17 -16 -70 18 65 -75 -68 34 8 59 -60 -75 81 -41 21 89 71 40 -15 -26 62 -59 22 -11 -38 193
5024 193 62 -50 79 -8 45 -29 -109 -31 62 35 101 31 50 55 33 -7 111 -115 58 -84 -23 18 41 -5 145 -31
5050 -31 96 8 -110 65 43 -85 -96 18 88 20 19 70 101 -19 -46 -71 64 133 -108 -227 -7 29 -24 -5 -21 48
5076 48 -38 -18 -11 -11 -10 3 53 -114 -38 -35 -14 -84 51 16 -13 -26 15 151 20 34 -53 9 -33 -47 -3 45 51 3 47 -6 13
5107 13 37 66 14 -14 104 -19 -42 -17 113 -18 -49 37 27 -67 -24 -11 -15 67 -47 -42 -106 -12 -103 2 -23 132 16
5134 16 -98 74 66 81 -23 -54 10 -76 -27 -152 -43 43 1 -3 77 20 113 -52 -92 -30 76 0 -77 -29 5 12 33 -53
5162 -53 -74 -23 -200 -178 -7 56 -72 -15 15 -14 0 -58 -65 -28 144 104 -101 -31 65 -96 96 64 33 97 19 -52 -68
5189 -68 -28 -23 -93 -46 -38 48 1 -54 -24 83 106 19 39 59 73 -101 12 -24 12 99 -75 90 -71 37 -22 -58 -103 53
5217 53 30 17 -3 -58 -88 -66 -51 84 52 37 55 115 -117 -75 -15 -32 -68 63 -47 -34 -123 -28 -5 -2 115 -42 -30 -20
5245 -20 52 45 -92 -33 39 144 96 -55 98 69 -25 -73 -4 45 71 -154 57 -8 -32 -147 32 -53 25 146 -104 -51
5271 -51 89 139 1 -32 143 -27 -29 73 -11 36 -110 -12 -72 -52 56 50 -59 -41 -40 -103 -69 58 -54 -95 103 -10
5297 -10 75 106 -34 -71 -28 -26 71 92 -44 61 -23 -34 -50 110 -46 27 -9 -58 57 41 39 -3 -70 67 -36 -182 25
5324 25 47 -189 -51 -13 -22 -103 -63 -93 -157 23 -41 -2 -44 85 -91 48 -22 -24 -40 127 27 -77 70 -25 75 -183
5350 -183 4 4 -10 -22 114 36 176 -73 -39 35 -41 -75 -110 -50 17 31 -13 9 25 32 -83 -97 3 -15 108 129 84
5377 84 85 -116 69 -80 -36 -5 -142 -24 36 106 -63 -20 44 -56 60 -96 -88 2 -23 14 46 91 64 18 -11 -48 66
5404 66 -92 -107 -89 -71 -73 122 -42 -112 -43 -12 -61 -60 -24 -80 20 -132 -76 -2 -122 78 -46 10 -16 -54 13 -17 -25 -67
5432 -67 -4 -104 66 -110 -71 -66 110 -34 -62 -106 109 28 -3 142 -49 -1 175 63 84 122 49 23 17 103 57 124
5458 124 70 -98 -33 -44 51 -21 -4 12 27 -47 -13 123 -11 25 -143 126 -77 -104 -52 -32 -76 1 6 0 116 13 77
5485 77 -47 -86 -149 -69 -161 7 -80 -36 65 -80 26 17 71 70 -59 -24 13 -43 -134 42 -14 10 23 16 0 91 -32 -45
5513 -45 -2 41 -59 7 -8 -93 -69 -62 -47 42 -13 -117 -1 -38 -87 26 16 -21 34 -29 -10 -117 7 -56 -16 -60 -16 -138
5541 -138 -62 -12 79 17 80 53 -75 66 -5 -107 -94 -43 61 39 -9 -5 51 -11 -14 -169 75 -43 -69 10 36 -30 -11
5568 -11 -30 10 10 13 -157 -3 14 -28 106 50 10 18 23 -42 12 45 -17 -90 90 -84 57 -73 -11 1 -28 -82 127 38
5596 38 109 -45 -79 58 -82 -6 -26 153 8 108 -52 -102 48 48 -32 42 86 28 47 59 -18 -72 37 0 -20 -121
5622 -121 60 -32 -36 25 14 69 -23 -91 11 9 -32 -172 -159 -74 -56 -115 56 66 89 -14 9 49 18 -30 -18 57 -2 -105
5650 -105 62 -44 -74 27 -19 -15 52 -31 -115 -29 -25 -42 -146 2 69 11 -158 -52 -15 -26 -78 57 -3 93 16 -34 81
5677 81 -14 1 39 -23 -118 20 2 -39 -31 40 170 -8 -2 94 -36 84 -112 31 10 55 124 18 -33 26 63 -25 38
5704 38 145 -3 37 -63 136 47 93 -75 95 -44 54 -91 74 18 20 68 -6 -8 -71 -7 -10 -37 64 -139 45 83
5730 83 -30 -64 122 -18 17 69 68 -14 -32 77 -108 -103 -109 -7 -95 14 121 87 -128 -66 69 55 -57 46 16 -15
5756 -15 130 44 140 25 88 -75 -42 53 -42 -17 65 -4 -93 -63 -38 59 -34 -61 -148 35 5 7 55 21 -24 -21 60 -155 -59
5785 -59 -118 -9 -28 -58 2 -51 -45 -100 20 -1 74 -124 22 21 -23 -21 -7 57 -90 -18 39 2 104 57 99 167 5 28
5813 28 19 7 67 109 13 29 -44 -58 13 -50 -96 29 -30 15 -16 40 -82 -50 79 -60 -1 -70 -3 -77 -63 -169 -82 -144
5841 -144 -35 -101 21 -25 -89 -65 -48 16 -19 -104 -54 69 25 37 -124 -41 77 19 -50 138 35 17 23 -47 -57 -13 -104
5868 -104 -66 13 -79 -25 93 -45 -59 -14 -49 -40 -70 -23 31 -13 58 -94 97 67 -22 -42 -70 -89 22 -63 80 22 -66
5895 -66 22 -13 -29 87 -36 -23 -43 63 189 18 -33 22 -146 -9 -2 -82 -4 118 36 -97 -31 25 115 -15 102
5920 102 71 -68 -11 -73 32 -51 -59 39 30 -78 13 -81 -137 -140 -80 -35 -6 -86 -154 -45 23 139 33 -40 9 -64 -61 -20 33
5949 33 106 132 72 -76 -85 -28 49 -31 27 38 -66 -47 -36 25 69 25 -108 -28 -34 -44 -29 13 -72 -65 -34 -14 35 9 115 -57
5979 -57 24 -31 -4 26 -64 -6 23 -4 -28 -30 -101 25 7 -55 -56 -62 -16 4 73 46 83 -17 59 45 -26 -111 -121 -66 -47 -30 -46
6010 -46 54 27 -71 21 -90 42 27 -32 -160 2 62 53 12 -11 -90 -30 -39 -23 -81 13 50 70 -87 2 -47 -108 55 46
6038 46 73 -42 38 -21 55 -70 -64 17 -44 -168 -87 -86 -5 -40 -134 -47 -11 0 -18 61 -25 -5 64 -31 66 23 -22 -27 -46 86
6068 86 -30 157 35 -66 3 -51 14 -49 -4 35 -29 -18 90 -43 -70 64 -37 -74 -30 170 -65 -134 -61 -97 6
6093 6 22 -31 -16 -104 -63 4 78 -97 48 -3 11 13 -34 71 92 109 59 95 -19 -57 79 118 -56 64 -83 -28 -18
6120 -18 37 -20 34 -18 65 -27 -76 74 36 -81 52 -38 -86 -28 18 -35 -144 -3 0 -24 -29 -64 -157 -117 -86 -85 -48 -4 5 25
6150 25 20 -21 61 61 147 -46 -56 -48 66 87 -77 38 -57 159 114 -46 -63 -16 -56 -86 -35 -84 29 -3 27 -47 -13 -49
6178 -49 66 -59 92 211 -101 64 -29 -61 -109 11 12 54 19 9 -75 28 -72 -18 -62 19 36 -61 26 -124 -58 -41
6204 -41 94 45 52 60 30 179 -17 -14 -61 -124 -81 151 29 13 47 102 16 49 -29 50 70 -28 114 -87 -3 -10 61 43 63
6233 63 60 -65 64 154 -2 -3 29 51 26 -49 -41 -15 44 -10 175 21 47 1 -64 -23 20 -105 47 -57 -23 37 -24 49
6261 49 43 21 105 37 106 -25 34 83 -7 -2 -57 -49 -33 -71 22 -5 -143 -7 -130 104 -49 27 -70 -79 12 -66 -115 -42 50
6290 50 -107 29 -29 -125 -41 84 2 -21 48 -60 38 -37 7 7 27 103 36 -5 -32 17 -212 35 51 88 -98 53 -59
6317 -59 41 122 -20 89 -94 35 -87 104 -53 -29 -30 37 50 -76 -25 -5 20 -44 135 5 46 -95 62 87
6341 87 48 -137 2 -25 -24 10 85 64 -45 -44 42 24 -22 31 20 88 203 45 -8 -14 67 -7 8 -36 89 31 -51 111
6369 111 57 63 -88 -3 183 79 111 -27 8 48 100 -34 -66 -52 -21 25 55 -7 -149 9 -116 -13 -123 -115 -81 -82
6395 -82 68 -32 -8 -77 60 -40 50 12 20 82 14 30 -12 -94 34 -101 24 62 67 10 -7 -96 36 78 -13 -60 60
6422 60 -84 43 56 -5 2 30 -21 -14 -118 -3 -53 103 -27 127 -54 -14 -4 65 -12 53 -17 -8 47 -95 94 -62
6448 -62 22 79 -27 14 75 -67 -12 29 0 95 -16 -19 69 155 100 -158 -40 -5 -61 -46 64 75 -9 33 -46 52 35 -142
6476 -142 -157 -160 120 -63 -64 74 -130 6 -2 -67 -41 10 19 73 44 13 -59 83 -44 -60 -164 -61 46 -40 114 40
6502 40 -45 12 46 4 2 38 -118 35 -114 -70 -52 -30 -131 -38 -36 13 102 38 72 -64 -42 41 -70 -22 4 -26 77 20
6530 20 13 -22 -3 -55 -7 -19 -20 -59 53 30 -132 -86 -116 19 35 -7 15 21 -34 29 -6 -49 -33 42 -81 -128 -16 1 71
6559 71 -5 -33 -66 80 -40 -45 -3 -34 -26 130 -87 -91 35 -29 -20 -102 83 -42 24 -18 10 138 52 21 3 80 19 -1
6587 -1 83 110 28 -48 -26 60 10 -23 -109 20 22 -102 -16 -28 -81 -14 20 -161 19 28 -20 0 27 8 3 -114 1 -144 70
6616 70 31 -25 154 37 -45 -82 124 -75 3 45 -77 -15 110 -4 -73 49 78 94 -59 189 1 10 53 -48 58
6641 58 -58 10 -46 81 -4 -70 40 25 20 65 48 54 25 21 -50 -138 38 -34 31 79 8 -20 -67 183 12 91 4 32 -16
6670 -16 19 31 -78 104 -61 -51 -39 -19 94 0 -27 40 -116 24 69 -42 8 -60 -20 144 -86 -19 71 -26 10 -153
6696 -153 -101 27 4 -38 69 -137 96 -27 -37 94 -8 2 -29 -39 -153 45 -30 -89 -39 -24 4 -18 -30 -16 55
6721 55 43 20 -57 9 69 70 12 8 -34 4 -40 -32 -71 -74 36 -135 -37 197 52 42 -10 29 11 18 37 -101 -38 82 -23
6750 -23 0 -30 -56 58 78 9 -86 -65 -50 -48 -120 -136 -10 70 -5 -20 15 92 138 26 24 12 -64 -37 27 95 39 149 -57
6779 -57 -66 85 -105 69 2 32 64 -5 -87 9 -96 56 177 -113 84 -181 85 -19 -53 -9 -59 -22 -32 -61 -58 42
6805 42 -3 -66 16 51 -142 -67 17 2 -95 -95 -77 110 79 25 -40 -84 -7 -97 24 39 26 183 -57 -20 -55 216 -155
6832 -155 76 175 98 -104 67 123 -74 -33 119 34 71 -14 58 -191 9 -24 -31 -14 -149 25 -29 -49 40 -15 18 -105
6858 -105 4 -120 -20 -29 -78 -24 -59 41 -147 -17 -90 21 -117 -31 60 -71 -30 -64 29 151 44 14 -24 42 -94
6883 -94 26 3 -78 34 -77 -128 55 -63 -8 77 40 -1 -53 108 -56 -77 -3 23 46 -60 8 -52 -33 120 22 -39
6909 -39 25 74 -36 -99 -7 7 -80 -35 -48 -54 -85 -31 141 -154 -54 19 13 104 -8 51 -72 1 -20 61 -16 -43 105 -86
6937 -86 18 -42 109 53 -35 -29 89 4 75 56 81 32 -72 -43 36 -2 -17 -34 -28 77 -37 -87 -88 5 80 -74 -85 47
6965 47 -76 -273 62 -66 -11 144 -140 -27 -36 40 -3 -73 20 77 -76 17 49 -27 -62 43 12 101 133 33 4 130
6991 130 -14 120 -3 20 0 -35 129 -42 47 -6 -89 49 -66 38 -22 -104 -11 -61 41 -37 -2 75 -17 -38 52
7016 52 -118 -24 40 10 -12 -121 31 46 103 30 86 36 -61 -9 -19 -41 3 12 -43 10 -89 72 58 180 -19 91 -29
7043 -29 -23 -74 36 -42 57 72 -103 -10 11 81 39 102 -11 69 -75 -116 50 -27 -29 49 -14 -4 15 -41 -177 -11 64 -91
7071 -91 -10 -24 -15 1 -48 1 -27 -29 -26 101 -50 150 -78 -2 -31 66 -31 41 -116 -80 -31 -50 -30 -21 -109 41 -35 25 11
7100 11 -50 -41 -61 -21 33 -35 58 -42 -15 -60 -109 27 -96 -13 -54 10 14 31 -9 186 45 -52 -45 -19 -6 91 86 26 -82
7129 -82 10 -33 37 102 -20 -70 -14 4 -2 11 63 10 -45 52 -86 15 -120 46 127 87 -18 -45 -49 -5 -30 -34 -42 110 56
7158 56 106 54 -22 4 7 -96 -94 27 18 -21 -63 -11 -11 -73 -25 -32 -44 -7 -119 -81 -102 63 45 150 -51 -6 107 78 12
7187 12 10 29 72 -41 -100 -19 37 -77 25 -23 -62 43 -52 7 -55 -60 -10 72 110 42 -2 -49 19 91 -69 5 -79 -128 -41
7216 -41 15 31 -54 -2 -116 -15 -102 -69 28 -67 -161 -60 50 -192 30 45 80 -34 38 -63 58 -56 32 131 -43
7241 -43 34 -70 -125 2 39 26 -80 50 -124 11 -95 70 -40 -38 -11 -143 41 35 23 99 17 69 26 88 -28
7266 -28 25 71 1 2 -29 -4 -43 -107 -31 85 15 109 -56 64 62 -26 156 -73 -41 -28 79 -74 -92 -8 142 47 -73
7293 -73 -44 148 -9 126 58 -15 50 -47 9 50 21 -5 33 -1 -54 -48 -21 -86 -106 -56 -82 -101 66 31 7 18 -4 11 57
7322 57 -64 110 4 -45 -69 -88 40 -39 -152 134 58 -78 -109 31 -37 -39 -29 3 -14 19 -18 -50 85 111 24 -93
7348 -93 110 -56 -64 -21 70 86 41 -77 -12 -120 75 -68 -7 -113 186 138 -53 -13 -61 -126 -76 0 47 -24 12 -8
7374 -8 -75 0 9 -22 -60 -1 127 -14 24 -84 33 122 -67 4 11 86 70 85 -9 -10 -45 29 18 91 71 8 25 -29 22 47
7404 47 -100 -58 -38 49 36 -84 -138 27 79 59 110 29 15 0 -58 -4 -17 18 0 9 -56 -60 -120 18 83 -3 -64 -68 48
7433 48 167 -15 30 1 104 -169 -36 4 -40 114 -54 -133 -27 31 19 -75 -35 89 -56 -86 92 -23 31 -52
7457 -52 -87 27 59 -73 8 63 -4 19 113 47 29 147 -99 -79 11 82 -40 3 -81 104 -50 22 14 71 39 -70 -3
7484 -3 -36 67 -7 5 -99 108 -147 22 -163 26 94 72 -56 -33 -100 -50 43 -109 -61 -136 69 56 70 -46 10
7509 10 -9 -38 0 -29 -15 20 62 112 1 -118 -80 79 146 -25 -80 -10 -58 27 -39 2 4 -130 -12 -61 -85 3 105
7536 105 35 -31 -69 -78 -4 -37 -5 58 -72 50 -17 -43 -29 76 40 59 68 10 -103 55 122 -107 78 -98 -25 51 -65
7563 -65 99 25 94 -59 -2 -74 -37 -42 1 -108 76 -12 -8 22 63 10 -142 -1 -163 -68 82 -55 110 -1 -145
7588 -145 -101 73 -86 0 -13 32 40 67 188 25 47 46 64 -28 -14 -60 69 -30 -71 76 153 -9 -14 -16 -68 -29 -50 36
7616 36 -72 -39 -83 27 21 -3 68 -42 83 -2 -38 -1 -85 -31 91 90 -61 -67 -21 -5 12 -46 72 -36 -77 -72 137 -79
7644 -79 -51 28 46 52 -6 68 65 -56 -34 -53 39 -62 -84 51 -110 30 -35 -21 -46 98 18 25 82 -26 61 92 -62 -153
7672 -153 -118 -55 59 -43 -120 14 -73 46 -79 72 -21 52 -85 -19 -12 -66 -57 4 -5 -57 -106 56 -43 -47 41 51 -18 -33
7700 -33 57 0 -4 35 -70 -30 -73 -22 -63 154 52 -64 49 54 14 11 -28 17 -27 -103 -3 110 16 -55 -157 104 79
7727 79 -49 -21 31 58 -40 51 39 -32 -62 -141 65 1 -44 150 -120 -9 14 79 1 -70 -84 -46 -14 -42 20 54 48 -20
7755 -20 51 -9 -33 20 41 26 77 -115 -4 82 24 78 -67 31 51 32 -93 1 -102 -37 -163 24 40 -143 -99 79
7781 79 70 61 -68 -63 -26 19 199 -54 119 20 161 -111 91 -97 -62 169 -20 79 10 77 27 47 -25 19 34 40 103
7808 103 -52 81 13 1 0 -34 141 -49 0 12 0 72 -47 72 23 9 -56 -19 41 -20 -26 -45 27 -29 -29 -70 -87 96
7836 96 19 35 -81 20 103 -62 26 78 74 -24 -106 43 -79 -165 -45 49 -89 -87 -6 101 107 -116 12 5 -151 -41
7862 -41 -55 -50 39 -77 60 73 -48 -16 52 55 -68 10 -29 61 -119 -65 -40 -8 -11 -39 37 147 -168 -35 -58 32 -86
7889 -86 10 109 -67 42 -2 -64 -19 2 171 25 -94 31 10 20 -55 -54 105 -25 -19 -17 -45 29 30 0 -47 43 49 51 12
7918 12 -42 7 -156 -56 -80 -36 -31 100 -112 -107 43 27 -2 -72 -46 -88 -90 -115 -23 -147 19 -74 -28 -33 -138 95 137 126
7946 126 -7 28 80 -105 1 108 101 74 -41 41 -73 38 82 -19 -46 -42 64 45 98 -101 67 -137 29 27 -43
7971 -43 55 5 -88 -34 54 -57 -43 7 36 -2 12 -41 70 95 19 92 89 83 -29 -196 -3 -70 -89 -64 -161 -75 82 20
7999 20 -78 7 -52 57 22 28 55 -107 9 -17 -1 65 52 -50 -10 101 17 -95 58 6 50 28 -47 186 -63 54
8025 54 -104 9 66 98 49 -47 38 4 -19 -21 0 -30 82 237 -74 -95 73 -117 17 -95 -2 46 -12 74 175 -36
8051 -36 54 -15 -10 0 -44 -52 -29 -67 15 4 13 99 -126 36 65 -18 -41 -93 -5 -38 -4 -130 -28 10 3 -18 -19 75 -43 -96
8081 -96 -124 -28 -46 -48 -22 -59 -41 -20 18 37 47 -5 69 -57 -61 -27 41 139 23 -19 -42 -141 -129 -31 -100 19 -64 -24 -15 -34
8111 -34 13 -35 15 -69 36 -21 -5 -155 -36 52 -190 -113 -28 129 -56 -16 -46 62 -53 55 167 -24 -85 10 -27
8136 -27 115 -44 -11 -40 -91 -52 -5 16 71 89 -54 -7 -65 20 60 -16 -4 51 65 6 -105 90 -50 -71 48 4 -130
8163 -130 28 -55 0 -43 -38 -15 -50 -39 56 12 73 6 20 18 32 38 -71 76 6 -131 -128 -56 -58 -80 9 2 20 -29
8191b9
$$ Imaginary data points
##PAGE= N=2
##DATA TABLE= (X++(I..I)), XYDATA
0 0 0 0 0 0 0 0 0 0 0 0 0 0 0 0 0 0 0 -16 32 -32 32 -32 32 -32 64 -64 64 -84 96 -96 128 -129 160 -178 193 -224
36 -224 256 -288 320 -353 386 -428 481 -532 580 -643 709 -787 868 -953 1053 -1157 1273
53 1273 -1408 1560 -1724 1920 -2144 2408 -2721 3097 -3565 4165 -4965 6079 -7754 10538 -15997
68 -15997 30663 -147513 -397086 92187 315709 -64083 -376034 -40525 327052 135774
78 135774 -242111 -132280 229960 228202 -113308 -208453 43378 193004 3406 -191232 -100030
89 -100030 116733 122621 -72890 -162609 10204 179042 60346 -171276 -114170 153664 165272
100 165272 -123202 -202530 85988 237212 -29090 -238279 -7732 249387 59826 -240395
110 -240395 -109539 209553 131350 -197038 -173410 153723 189747 -110269 -189507 81669 203806
121 203806 -24655 -183811 -14054 159899 42370 -145285 -90671 92258 100201 -57059
131 -57059 -112544 16361 123064 45718 -93977 -75878 80698 122578 -43509 -155903 -5385
142 -5385 167259 44337 -180973 -98942 169141 143440 -147140 -183075 112734 212659 -70825
153 -70825 -233767 18194 235471 31022 -225143 -75846 206338 122621 -163240 -144520
163 -144520 124763 165272 -73235 -168547 19247 152550 22945 -134272 -68141 97747
173 97747 97731 -55856 -114442 12580 121740 34216 -114448 -78962 92366 113280 -66692
184 -66692 -144928 29708 164460 11921 -168703 -47573 169977 90057 -151410 -119689 129293
195 129293 145697 -99331 -164820 61824 170354 -27515 -171352 -10914 158730 41310
205 41310 -142018 -70244 114046 88110 -84306 -100723 49541 104900 -11349 -96123 -19138
216 -19138 86720 54164 -61936 -75770 37329 94094 -6784 -104100 -28349 101140 58209
227 58209 -94865 -91195 75502 115458 -53298 -136109 24414 147539 6374 -150623 -37577
238 -37577 144749 67969 -128821 -92704 107751 114862 -77173 -125770 46763 131869 -12176
249 -12176 -126454 -18941 113597 46477 -93372 -69584 64646 82229 -35154 -90742 -319
260 -319 86000 30583 -77551 -61220 58786 84710 -34929 -100314 8935 111112 23807
271 23807 -108092 -50640 102858 80627 -85108 -102635 64038 119336 -39560 -130691 9826
282 9826 129991 15055 -126140 -43189 110188 63392 -91544 -81314 67188 92532 -39571
293 -39571 -95450 13387 94256 14299 -83086 -35983 68756 55979 -46948 -68616 23003
304 23003 76190 3561 -76952 -30148 70593 53725 -59749 -75425 41313 89405 -21702
315 -21702 -100379 -3673 101650 27257 -98374 -51320 88309 73337 -71446 -88774 53537
326 53537 102712 -28002 -105063 5992 105008 19361 -95263 -41273 79783 58551 -61314
337 -61314 -73985 35353 78868 -12812 -81598 -13986 74035 35852 -61614 -54680 44433 69887
349 69887 -21187 -76624 -865 80599 26867 -75028 -48169 66216 68123 -50907 -82731 31612
361 31612 91168 -10876 -94915 -12727 90631 33432 -83031 -53932 68022 68155 -51497
372 -51497 -79697 30573 84041 -9718 -82839 -10808 76796 31238 -63210 -45835 49060 60211
384 60211 -28095 -66149 9111 69431 11996 -66245 -32280 56324 47534 -44799 -63468 25178
396 25178 70548 -7342 -76101 -14498 74378 34684 -67202 -51750 57186 67890 -39724
407 -39724 -76073 22961 82561 -1195 -81013 -18580 75647 37619 -65500 -54484 49710 65297
419 65297 -32932 -73321 12149 73406 7043 -69811 -27022 59678 43306 -45847 -56702 28651
431 28651 65264 -9283 -67916 -9267 66534 28891 -57578 -43501 46796 57594 -30211 -65309
443 -65309 12750 69409 5597 -69507 -24924 62375 39236 -54293 -54431 38713 62036 -23683
455 -23683 -67580 5459 68088 13380 -62491 -28751 55851 44920 -41927 -54082 28784 62030
467 62030 -11415 -63759 -5688 60754 21384 -54926 -37704 43016 48705 -30728 -58670 14106
479 14106 62254 1811 -62277 -18246 57449 33673 -47732 -45772 35568 56118 -19260 -60657
491 -60657 3455 62810 14426 -58509 -29129 51571 43225 -39719 -53210 24880 58887 -9350
503 -9350 -62072 -9147 58254 23712 -53305 -39562 41968 49946 -29637 -57664 14674 61653
515 61653 2668 -58572 -16776 54908 33088 -43865 -43519 32717 52581 -17919 -57356 2234
527 2234 56231 11551 -53403 -27085 43658 37488 -33388 -47463 18974 52456 -4000 -53864
539 -53864 -10465 52080 25512 -44878 -36879 36114 47390 -22679 -52772 9151 56022 6431
551 6431 -54564 -20677 49713 33396 -41955 -44329 30507 50656 -18846 -55358 3845 54078
563 54078 8864 -51336 -22847 43687 33910 -33665 -42001 22796 48484 -7997 -48234 -3913
575 -3913 47493 18425 -40323 -29256 31582 38675 -20432 -46129 5890 47832 6197 -48716
587 -48716 -20901 43055 31906 -36165 -42144 25457 49364 -12454 -52560 -264 54101 15148
599 15148 -49752 -26600 44174 38090 -34116 -45426 22569 49806 -9672 -50767 -4321 47575
611 47575 16646 -41958 -28730 31955 36373 -21613 -42705 8328 43624 4158 -42183 -16795
623 -16795 36777 28395 -27894 -36745 18508 44478 -5041 -46166 -6111 46996 19263 -42903
635 -42903 -30029 35736 38516 -27225 -46301 14510 48276 -4056 -50250 -9140 46688 19640
647 19640 -41477 -28659 33895 36357 -23022 -39293 13134 41897 -127 -39069 -10240 35263
659 35263 20892 -28118 -29228 18762 34532 -8910 -37957 -3160 36713 13612 -34033 -24884
671 -24884 27168 33321 -19259 -40682 9070 44842 1862 -45601 -12506 44221 23696 -38249
683 -38249 -31841 31693 40041 -20980 -43863 10783 46404 876 -45202 -12327 40269 21047
695 21047 -34545 -29880 23867 33539 -14498 -36831 2006 35430 9117 -31400 -18838 26189
707 26189 28257 -16505 -32793 8065 37171 3520 -36479 -13809 33938 23676 -28804 -32854
719 -32854 20571 38664 -12340 -43558 1469 43942 7916 -42738 -17740 37979 25900 -31052
731 -31052 -32382 22757 36912 -12440 -38256 3157 38209 7367 -34115 -15213 29284 22979
743 22979 -20929 -27329 12001 30148 -2052 -30833 -8882 27680 17210 -24161 -26562 16430
755 16430 31759 -8835 -35959 -879 36976 11163 -34615 -19695 31709 29497 -24204 -34917
767 -34917 17387 40230 -7711 -41698 -1514 40512 10060 -37809 -19326 30818 24915 -24082
779 -24082 -30781 14178 32694 -4892 -32843 -4491 30377 13403 -24821 -19808 18293 25663 -8958
792 -8958 -27750 174 28749 9529 -26573 -17946 22673 25503 -16870 -31100 9242 33926 -1494
805 -1494 -35912 -7948 33657 15426 -31268 -23837 25195 29357 -18796 -33421 11340 35910 -2350
818 -2350 -34454 -4772 32747 13342 -26877 -18646 20865 23823 -13181 -26765 4544 26804 2763
831 2763 -26430 -11617 21496 17268 -16718 -23231 9186 26476 -1144 -27774 -6799 27731 15578
844 15578 -24202 -21941 20583 28428 -13755 -32008 6744 34110 1539 -33576 -9615 31023
856 31023 16800 -27006 -23424 20712 27459 -14289 -30704 5896 30260 1348 -28857 -9278
868 -9278 24461 15851 -18516 -20607 12155 24648 -3414 -24933 -3394 24892 11859 -20864 -17834
881 -17834 16105 23069 -9885 -27002 1649 27756 4885 -28644 -13609 25340 19362 -21800
893 -21800 -25048 16117 28864 -9006 -30204 2457 30968 6019 -28032 -11864 25099 18309
905 18309 -19484 -22429 13348 24903 -6595 -25618 -789 23724 7044 -21091 -13621 15861
917 15861 18046 -10465 -21781 3447 23003 2824 -22999 -9599 20963 15803 -16756 -20361 12057
930 12057 24895 -4937 -26252 -1006 27348 8432 -25535 -14484 22293 19430 -18360 -24199
942 -24199 11566 25471 -5768 -27087 -2114 25301 8223 -22929 -14108 18934 19363 -12685 -21548
955 -21548 7312 23717 381 -22277 -6476 20298 12985 -16075 -18317 10593 21662 -5015
967 -5015 -24161 -2312 23650 8203 -22290 -14544 18415 19319 -13463 -23151 7541 25415 -1007
980 -1007 -25735 -5164 24855 11607 -21419 -15927 17820 20446 -11685 -22085 5920 23382 701
993 701 -22432 -7025 19757 11987 -16802 -17041 11159 19062 -6351 -21041 -92 20353 5802
1006 5802 -18394 -11144 15819 16649 -10689 -19120 6583 22184 -347 -22280 -5004 21214 10392
1019 10392 -18806 -15590 14253 18939 -10014 -22370 3671 22731 1785 -22880 -7756 20615
1031 20615 12685 -16859 -16689 12453 19708 -6514 -20799 835 21234 5576 -19230 -10641 16656
1044 16656 15653 -12130 -18586 7204 20412 -1510 -20902 -4694 19140 9799 -16902 -15296 12310
1057 12310 18460 -7942 -21032 2376 21695 3532 -20231 -8069 18522 13592 -13695 -16456
1069 -16456 9755 19576 -3983 -20523 -1254 20105 6286 -18790 -11538 14906 14466 -11491 -17988
1082 -17988 5772 18921 -723 -19200 -4624 18174 9822 -15366 -13374 12343 16896 -7454
1094 -7454 -18225 2946 19137 2668 -18005 -7405 16261 11771 -12887 -15466 8901 17704 -4418
1107 -4418 -19239 -819 18456 5342 -17341 -10367 13805 14049 -10125 -17148 5537 19166 93
1120 93 -18964 -4198 18492 9605 -15416 -12985 12072 16453 -7506 -18377 2127 18690 2399
1133 2399 -18826 -7924 15994 11397 -13603 -15119 8978 17063 -4353 -17748 -432 17743 6106
1146 6106 -15287 -9926 12795 14002 -8530 -16089 4553 17282 433 -17096 -5082 15378 9317
1159 9317 -13047 -13322 8861 15869 -5178 -17970 313 18061 3892 -17485 -8275 15179 12039
1172 12039 -11848 -14674 8154 17083 -3149 -17266 -818 17337 5725 -15397 -9151 12944
1184 12944 12155 -9612 -14478 4861 14885 -1095 -15445 -4196 13580 7816 -11799 -11632 8678
1197 8678 14200 -4487 -15214 959 16193 4159 -14600 -7728 13000 12131 -9816 -14873 6266
1210 6266 16866 -2478 -18018 -2199 16958 5812 -15863 -10046 12916 12607 -9554 -15033 5202
1223 5202 16182 -971 -16147 -3236 15113 7310 -12712 -10131 9823 12863 -5272 -13664 1287
1236 1287 14205 3611 -13072 -7670 11096 10913 -8492 -14025 4380 14912 -1100 -15983 -3723
1249 -3723 14688 7415 -13320 -11050 10849 14393 -6965 -15783 4100 17242 427 -16340 -3662
1262 -3662 15389 7521 -12826 -10399 9421 12267 -6200 -13950 1645 13476 1616 -13069 -5468
1275 -5468 10930 8271 -8240 -10535 4914 12016 -885 -12254 -2837 12204 7032 -10620 -9897
1288 -9897 8786 13042 -5400 -14603 2123 15292 1939 -15289 -5863 13920 8886 -12126 -12478
1301 -12478 8618 14149 -5857 -15741 2012 15454 1653 -14540 -4786 12876 8472 -9405 -10302
1314 -10302 6679 12437 -2291 -12494 -1127 12139 4851 -10678 -8209 7569 10249 -4847 -12556
1327 -12556 456 12662 3064 -12765 -7082 11372 10408 -9096 -12660 6710 14680 -3087 -15084
1340 -15084 -298 15160 4161 -13818 -7377 12096 10271 -9502 -12197 6410 13214 -3267 -13493
1353 -13493 -422 12182 3100 -10930 -6511 8169 8520 -5491 -10190 1999 10870 1430 -10319
1366 -10319 -4324 9610 7796 -6997 -9526 4822 11866 -1230 -12597 -2138 12795 5344 -12422
1379 -12422 -8889 10271 10842 -8677 -13294 5214 13960 -1927 -14405 -1488 14028 4996 -12122
1392 -12122 -7443 10388 10226 -7229 -11165 4265 12032 -615 -11250 -2524 9808 5579 -7781
1405 -7781 -8293 4762 9852 -1757 -11175 -1908 10590 4672 -9977 -8167 7714 10300 -5170 -12018
1419 -12018 2116 13270 1486 -13002 -4261 12964 7727 -10798 -9583 9085 11620 -6261 -12564
1432 -12564 2863 12561 52 -12521 -3663 10624 5588 -9186 -8153 6344 9434 -3572 -9681
1445 -9681 613 9689 2771 -8157 -5071 6799 7832 -4109 -9308 1652 10532 1207 -10851
1458 -10851 -4265 9822 6715 -8800 -9444 6331 11014 -4143 -12473 947 12874 1931 -12809
1471 -12809 -4731 11654 7150 -9627 -9019 7419 10598 -4322 -10809 1452 10934 1945 -9556
1484 -9556 -4421 8180 6695 -6199 -8505 3258 8744 -815 -9440 -2841 8063 5192 -7132 -8166
1498 -8166 4658 10024 -2126 -10918 -364 11653 3590 -10491 -5827 9680 8620 -7526 -10308
1511 -10308 5034 11348 -2413 -12281 -688 11706 3080 -11055 -5659 8958 7172 -6901 -8697
1524 -8697 4223 9201 -1290 -9086 -1592 8689 4232 -7100 -6219 5268 8004 -2607 -8491 42
1538 42 8910 2615 -8294 -5320 6844 7315 -5393 -9360 2926 10155 -1188 -11178 -1883 10476
1552 10476 3980 -9679 -6241 8433 8520 -5863 -9423 3982 10673 -880 -10273 -1161 9940 3775
1566 3775 -8497 -5725 6304 7019 -4395 -8384 1122 8256 940 -8263 -3815 6902 6000 -5297
1580 -5297 -7518 3282 8765 -622 -9112 -1663 9007 4700 -7948 -6779 6545 9008 -4366 -10173
1594 -10173 2339 10756 199 -10552 -2905 9623 4817 -8269 -7048 5921 8186 -4144 -9322
1607 -9322 1502 9266 921 -8625 -2956 7796 5429 -5380 -6328 3743 7696 -865 -7773 -1512
1621 -1512 7562 3718 -6930 -6115 5093 7011 -3594 -8519 1047 8652 1101 -8613 -3512 7906
1635 7906 5660 -6669 -7201 5330 8752 -2961 -9076 1228 9524 1348 -8634 -3323 7631 5343
1649 5343 -6067 -6836 3980 7846 -2058 -8419 -438 8012 2321 -7425 -4701 5551 5875 -3817 -7179
1664 -7179 1568 7930 859 -7863 -2792 7620 5322 -6001 -6505 4612 8184 -2361 -8547 -5
1678 -5 8616 2190 -8473 -4850 6867 6128 -5895 -8061 3360 8340 -1683 -8612 -659 8126 3135
1693 3135 -6829 -4648 5775 6588 -3530 -7136 1868 7783 429 -7596 -2473 6694 4179 -5527 -5867
1708 -5867 3457 6798 -1810 -7711 -538 7506 2339 -7310 -4306 6180 5810 -4701 -6835 2862 7685
1723 7685 -687 -7568 -971 7676 3509 -6480 -4739 5590 6393 -3929 -7277 2002 7312 -219 -7654
1738 -7654 -2351 6375 3750 -5721 -5739 3894 6556 -2141 -7298 349 7539 1884 -6629 -3244 6082
1753 6082 5287 -4227 -6243 2594 7233 -626 -7577 -1621 7065 3131 -6581 -4971 4958 6000 -3436
1768 -3436 -7121 1094 7351 686 -7086 -2818 6553 4524 -5288 -5765 3839 6850 -1869 -7084 118
1783 118 7064 1983 -6298 -3607 5400 5059 -3962 -6478 2255 6799 -979 -7329 -1245 6387 2662
1798 2662 -5729 -4355 4372 5601 -2664 -6241 1292 6975 926 -6504 -2084 6096 4077 -4650 -5018
1813 -5018 3253 5853 -1608 -6529 -371 6275 1857 -6331 -3714 5233 4918 -4057 -6008 2449 6600
1828 6600 -627 -6724 -1088 6397 2929 -5619 -4411 4618 5741 -2974 -6231 1568 6702 173 -6326
1843 -6326 -1937 5579 3340 -4553 -4865 2883 5582 -1659 -6368 -299 6049 1768 -5708 -3386 4857
1858 4857 4883 -3214 -5608 1765 6509 312 -6180 -1802 6324 3575 -5372 -4986 3983 5607 -2851 -6509
1874 -6509 764 6244 514 -6370 -2395 5514 3674 -4523 -4733 3252 5412 -1696 -5749 149 5730
1889 5730 1438 -4956 -2826 4123 4110 -2722 -4996 1329 5425 -23 -5744 -1670 5137 2917 -4406
1904 -4406 -4346 3168 5030 -1929 -5984 310 6253 1136 -6104 -2454 5795 3975 -4323 -4712 3517 5742
1920 5742 -1692 -5696 271 5817 1355 -5457 -2830 4449 3787 -3647 -5088 1948 5038 -739 -5325
1935 -5325 -1012 4737 2557 -3805 -3689 3059 4943 -1508 -5364 349 5774 1451 -5434 -2800 4789
1950 4789 4055 -3576 -5187 2218 5650 -849 -6258 -743 6033 1791 -5624 -3214 4519 4177 -3460
1965 -3460 -4931 2159 5236 -628 -5077 -693 4918 2329 -3889 -3128 3091 4196 -1790 -4508 397
1980 397 4613 937 -4486 -2612 3333 3400 -2879 -4642 1480 5149 -409 -5487 -1013 5364 2290 -4572
1996 -4572 -3189 4023 4543 -2725 -5065 1890 5714 -486 -5621 -1137 5272 2079 -4713 -3201 3587
2011 3587 3766 -2559 -4273 1062 4426 298 -4284 -1733 3948 2802 -2963 -3577 1916 4310 -541
2026 -541 -4421 -668 4514 2308 -3842 -3238 3260 4423 -2044 -5272 934 5400 201 -5685 -1860
2041 -1860 4808 2748 -4344 -3911 3116 4639 -2075 -4979 870 5138 680 -4651 -1480 4378 2664
2056 2664 -3135 -3056 2221 3817 -861 -4071 -628 3846 1623 -3524 -2729 2581 3518 -1767 -4105 428
2072 428 4318 882 -4201 -1975 3907 3161 -3106 -3956 2448 4729 -1336 -4921 365 5012 799 -4741
2088 -4741 -1791 4224 2859 -3467 -3763 2095 4172 -1317 -4594 -33 4056 714 -3738 -2088 2911
2103 2911 2815 -1916 -3150 949 3812 586 -3513 -1378 3499 2699 -2692 -3296 2049 4024 -1010 -4555
2119 -4555 -488 4327 1396 -4226 -2694 3572 3535 -2993 -4225 2110 4763 -724 -4754 -191 4648
2134 4648 1442 -3811 -2192 3106 3291 -2120 -3645 1237 3938 -63 -3781 -988 3146 1854 -2525
2149 -2525 -2704 1555 3080 -750 -3654 -610 3651 1394 -3400 -2354 2981 3409 -1945 -3647 1414
2164 1414 4257 39 -4097 -808 4084 2016 -3645 -2770 3057 3367 -2335 -3962 1165 3920 -272
2179 -272 -4067 -881 3413 1592 -2855 -2438 2194 3135 -1069 -3218 367 3464 901 -3020 -1654 2518
2195 2518 2521 -1710 -3155 808 3655 230 -3784 -1299 3456 1961 -3282 -2827 2566 3334 -1692 -4045
2211 -4045 740 4029 337 -3935 -1297 3838 2363 -2891 -2860 2461 3394 -1322 -3424 605 3493 512
2227 512 -3239 -1541 2446 2146 -1969 -3022 948 3102 -317 -3253 -773 2985 1728 -2351 -2340 1901
2243 1901 3183 -774 -3320 211 3720 788 -3518 -1645 3267 2358 -2614 -3033 1849 3267 -961
2258 -961 -3517 -113 3376 808 -3405 -1743 2745 2331 -2169 -2915 1516 3114 -376 -2842 -262 2883
2274 2883 1462 -2412 -1857 1997 2707 -1178 -2954 345 3173 384 -3062 -1527 2618 1900 -2312 -2897
2290 -2897 1270 3292 -700 -3620 -246 3621 1169 -3165 -1831 2934 2578 -2077 -2910 1334 3243
2305 3243 -401 -3294 -606 3070 1304 -2769 -2115 2019 2492 -1375 -2874 356 2779 524 -2696
2320 -2696 -1320 2419 2036 -1850 -2544 1358 3136 -364 -2996 -269 3071 1214 -2627 -1796 2246 2587
2336 2587 -1566 -2845 785 3159 -66 -3308 -916 3020 1292 -2753 -2102 1850 2481 -1234 -2717
2351 -2717 455 3054 470 -2712 -1099 2724 1808 -2024 -2272 1392 2449 -626 -2697 -288 2537
2366 2537 778 -2527 -1707 2021 2257 -1418 -2808 894 2925 90 -3002 -662 2803 1462 -2338
2381 -2338 -2026 1839 2650 -1100 -2848 360 3129 394 -2934 -1142 2499 1695 -1934 -2408 1178 2525
2397 2525 -669 -2808 -436 2681 889 -2610 -1792 1955 2155 -1339 -2436 780 2799 357 -2366
2412 -2366 -716 2502 1654 -1881 -2105 1493 2460 -965 -2606 20 2696 366 -2639 -1317 2078 1677
2428 1677 -1575 -2280 1104 2714 -182 -2569 -106 2655 1090 -2036 -1523 1828 2035 -1294 -2262 708
2444 708 2493 126 -2602 -745 2420 1316 -2102 -1889 1442 2182 -1002 -2408 129 2499 526 -2213
2460 -2213 -1165 2119 1846 -1480 -1940 1122 2461 -250 -2413 -137 2529 937 -2006 -1509 1630 2031
2476 2031 -1177 -2539 493 2540 107 -2638 -776 2292 1402 -1786 -1815 1526 2269 -619 -2406 102
2492 102 2603 676 -2405 -1126 2145 1649 -1644 -2166 779 2152 -405 -2381 -573 2053 904 -2242
2508 -2242 -1505 1376 1944 -1211 -2230 500 2140 259 -2039 -795 2069 1452 -1576 -1742 1321 2308
2524 2308 -509 -2273 234 2510 503 -2101 -1143 1789 1483 -1601 -2181 859 2228 -395 -2380 -265
2540 -265 2303 859 -1950 -1043 1651 1525 -901 -1714 658 2096 238 -1907 -855 1804 1165 -1645
2556 -1645 -1846 980 1872 -518 -2235 -113 2115 655 -2018 -1204 1699 1677 -1327 -2210 888 2336
2572 2336 -288 -2362 -261 2298 994 -1903 -1357 1623 1796 -916 -2043 575 2207 20 -2105
2587 -2105 -588 1774 981 -1616 -1538 899 1667 -365 -1819 -77 1840 591 -1618 -1116 1555 1758
2603 1758 -1054 -1705 663 1953 -6 -1991 -664 1897 1151 -1776 -1662 1213 1832 -1071 -2187 392
2619 392 2057 -104 -2074 -487 1770 1156 -1449 -1294 1100 1728 -548 -1776 334 1980 467 -1620
2635 -1620 -745 1339 1174 -951 -1506 398 1840 18 -1923 -548 1736 900 -1536 -1665 1244 1756
2651 1756 -775 -2053 186 2087 446 -1936 -700 1892 1457 -1322 -1550 1265 1945 -832 -2037 71
2667 71 1753 297 -1738 -962 1203 1202 -1139 -1544 663 1613 -152 -1798 -205 1535 921 -1158 -1206 843
2685 843 1565 -290 -1671 18 1864 633 -1730 -838 1633 1331 -1295 -1533 816 1799 -388 -1847
2701 -1847 -158 1859 499 -1794 -980 1511 1279 -1185 -1497 730 1491 -237 -1461 -54 1525 748
2717 748 -1265 -1051 998 1342 -575 -1576 51 1461 101 -1581 -787 1186 1153 -935 -1405 566 1663
2734 1663 -12 -1686 -312 1886 661 -1475 -1010 1607 1409 -966 -1591 612 1699 -86 -1765 -412
2750 -412 1717 647 -1604 -1101 1080 1207 -907 -1522 233 1403 17 -1362 -747 1092 1067 -789 -1248
2767 -1248 582 1514 -63 -1533 -268 1542 661 -1099 -1058 945 1228 -771 -1619 275 1627 -15
2783 -15 -1750 -528 1617 957 -1261 -1059 1062 1398 -589 -1361 360 1692 229 -1396 -488 1271 766
2800 766 -1080 -1030 582 1199 -394 -1248 -162 1066 615 -1143 -879 720 1182 -679 -1479 211 1475
2817 1475 31 -1629 -486 1317 919 -1101 -1203 862 1576 -455 -1663 165 1631 244 -1590 -564
2833 -564 1398 856 -1216 -1295 632 1220 -470 -1488 -105 1411 473 -1161 -655 1060 1162 -645 -945
2850 -945 430 1194 80 -1132 -482 1068 849 -1104 -1347 564 1273 -551 -1440 -72 1279 262 -1309
2867 -1309 -764 1042 1146 -857 -1276 510 1618 -213 -1497 -107 1386 440 -1130 -670 1043 878
2883 878 -681 -1094 377 1073 -11 -1155 -554 1137 635 -886 -892 688 1090 -259 -1071 -122 1168 423
2901 423 -1003 -673 925 1199 -653 -1182 433 1333 -139 -1353 -243 1376 439 -1328 -1009 830 928
2918 928 -804 -1330 410 1334 -42 -1416 -253 1192 637 -800 -841 768 1078 -249 -1103 138 1141
2935 1141 391 -1052 -596 829 868 -706 -1070 352 1083 -68 -1290 -366 1128 686 -1056 -999 775
2952 775 1040 -564 -1149 236 1296 191 -1201 -310 1147 769 -800 -847 677 1098 -387 -1355 -119
2969 -119 1050 189 -1050 -598 842 584 -706 -928 223 997 38 -1127 -109 1162 583 -786 -590
2986 -590 882 1011 -395 -1023 28 1090 282 -1072 -531 971 719 -812 -953 611 1182 -285 -1161
3003 -1161 34 971 294 -1050 -663 913 757 -575 -870 519 1214 -70 -1109 -73 1030 426 -812
3020 -812 -649 660 898 -358 -1138 91 1011 171 -1191 -612 871 606 -752 -861 411 999 -137
3037 -137 -1081 -130 993 508 -905 -500 850 835 -597 -927 401 823 -70 -1084 -275 922 396 -932
3055 -932 -787 608 857 -458 -998 102 835 69 -873 -251 756 543 -566 -837 386 874 -120 -969
3073 -969 25 999 373 -822 -693 819 708 -554 -855 179 855 -178 -971 -264 833 437 -864 -664
3091 -664 504 908 -335 -949 225 880 274 -825 -333 857 664 -550 -854 451 894 -338 -979
3108 -979 -68 838 351 -930 -520 509 745 -522 -838 283 978 52 -861 -181 754 337 -654 -572 333
3127 333 861 -160 -854 51 847 157 -986 -549 876 623 -631 -817 385 791 -228 -931 -53 800
3145 800 370 -844 -566 655 772 -301 -710 366 963 118 -818 -212 827 399 -615 -517 440 658
3163 658 -293 -879 197 717 36 -877 -428 658 507 -465 -692 307 813 -18 -824 -92 901 273 -714
3182 -714 -675 661 682 -504 -743 145 877 -70 -823 -169 806 325 -749 -669 529 711 -424 -757 183
3201 183 793 54 -587 -238 462 574 -344 -641 424 752 -131 -812 -76 699 299 -709 -361 392 565
3220 565 -170 -729 206 793 10 -786 -297 719 475 -731 -507 500 791 -248 -605 108 717 60 -810
3239 -810 -473 653 474 -373 -731 221 464 -261 -667 -44 556 283 -428 -352 495 714 -294 -600 142 776
3259 776 75 -762 -324 786 434 -441 -404 255 738 -137 -758 -117 836 108 -748 -399 591 575 -487 -631
3279 -631 261 608 -176 -735 19 783 384 -576 -216 620 579 -241 -628 92 715 -181 -577 -259 543 392
3299 392 -415 -704 292 665 -193 -710 40 746 330 -561 -380 491 550 -316 -664 363 692 -8 -764 -144
3319 -144 733 332 -508 -466 519 444 -373 -636 74 605 -68 -552 -137 526 295 -526 -365 389 580 -216 -480
3340 -480 26 628 253 -432 -363 562 464 -327 -707 227 665 -97 -695 -45 459 349 -515 -451 469 451 -316
3361 -316 -663 81 728 -44 -617 -38 598 369 -409 -362 398 520 -247 -533 133 616 140 -606 -436 410
3381 410 354 -440 -471 105 383 -98 -514 -231 398 274 -503 -553 522 623 -107 -644 79 603 113 -511 -212
3402 -212 579 424 -502 -654 320 576 -242 -619 -105 519 8 -551 -182 386 331 -370 -302 88 507 -26 -490
3423 -490 -57 493 230 -392 -273 436 433 -181 -438 111 520 64 -525 -251 516 239 -559 -629 239 457 -268
3444 -268 -686 -52 543 166 -433 -189 427 445 -181 -437 277 554 -85 -582 -79 466 171 -414 -337 327 349
3465 349 -213 -491 -11 516 -42 -511 -251 326 204 -398 -412 100 448 -66 -523 10 549 306 -338 -343 400
3486 400 295 -248 -480 68 582 -58 -597 -68 521 240 -450 -354 305 370 -177 -324 233 391 24 -330 25
3507 25 475 227 -113 -320 210 422 -62 -506 -119 402 129 -495 -332 162 275 -254 -467 74 516 -145
3527 -145 -523 -54 541 125 -351 -334 302 427 -287 -440 132 337 -16 -329 -221 382 344 -304 -345 189 312
3548 312 -225 -424 -90 391 94 -336 -259 224 276 -294 -302 125 320 36 -391 -206 369 188 -244 -233 181 408
3570 408 -152 -507 52 411 96 -408 -262 254 305 -416 -386 174 376 -182 -518 -81 409 184 -330 -352 278
3591 278 343 -251 -361 58 274 -45 -370 -98 203 234 -161 -366 156 423 -79 -450 59 406 49 -338 -171
3612 -171 373 294 -199 -243 231 399 28 -438 17 455 128 -308 -196 353 293 -269 -430 -28 420 73 -376
3633 -376 -241 271 243 -322 -357 228 359 -239 -470 81 429 92 -230 -231 426 331 -154 -367 90 520 -72 -462
3655 -462 -11 404 119 -262 -321 275 298 -183 -354 50 379 143 -380 -280 317 277 -324 -194 157 142 -73
3676 -73 -319 19 296 76 -365 -235 166 272 -290 -232 22 283 -34 -350 -223 310 169 -292 -307 187 364
3697 364 -217 -308 163 315 -62 -281 -34 356 120 -295 -328 260 122 8 -474 -37 159 92 -311 -272 241
3718 241 274 -181 -309 213 307 -118 -281 -97 389 222 -218 -263 256 222 -101 -353 -37 357 66 -303 -189
3739 -189 325 178 -334 -272 104 378 -59 -400 -8 295 83 -257 -62 149 405 -85 -385 103 368 46
3759 46 -262 -87 270 114 -287 -311 248 289 -184 -259 11 308 113 -257 -139 370 207 -186 -321 237 335 -97
3781 -97 -215 -44 294 30 -329 -141 177 119 -158 -314 93 282 -42 -366 35 160 66 -250 -204 222 271 -118
3803 -118 -404 64 332 21 -337 -38 445 225 -139 -135 133 285 -83 -315 -90 271 -19 -303 -257 173 188
3824 188 -290 -371 103 288 -102 -314 -176 354 201 -202 -324 233 282 -113 -282 61 249 19 -168 -187 232
3845 232 81 -155 -283 150 364 14 -291 -28 124 158 -253 -215 113 147 -91 -248 30 287 -37 -140 107
3866 107 170 210 -204 -135 188 360 -91 -305 37 287 29 -283 -155 219 199 -137 -353 49 388 -140 -150 123
3888 123 280 139 -306 -181 155 338 -53 -336 -13 318 12 -338 -117 270 65 -235 -98 211 47 -101
3908 -101 -174 -49 272 68 -233 -224 142 158 -248 -154 199 220 74 -274 18 189 160 -173 -159 301 237 -176 -189
3931 -189 9 198 -24 -307 -119 239 147 -137 -304 72 307 -93 -196 42 179 -61 -246 -137 179 87 -126
3952 -126 -178 -149 191 103 -288 -101 177 59 -267 -79 102 38 -62 -187 -2 223 54 -204 -92 192 177 -140
3974 -140 -155 219 279 -99 -258 56 286 -53 -302 -103 117 285 -231 -243 109 210 -69 -157 -30 147 81 -167
3996 -167 -145 4 244 27 -150 -103 232 59 -243 -4 105 201 -136 -91 81 229 46 -211 -25 393 152
4017 152 -191 -206 188 17 -195 -140 92 227 -21 19 -132 150 169 -62 -161 88 218 -250 -133 3 148 -106
4039 -106 -193 -27 116 185 -27 -150 -72 159 28 -221 -58 162 -19 -345 -113 91 105 -80 -183 62 170
4060 170 61 -206 26 218 62 -52 -105 113 163 -162 -185 130 38 44 -179 6 265 121 -199 -95 178 208
4082 208 -6 -160 -65 318 98 -275 -158 127 169 -84 -307 -19 222 -28 -229 -63 275 -12 -125 -196 24
4103 24 176 -81 -224 93 259 6 -56 -65 163 82 -90 -96 285 211 10 -110 -87 184 80 -217 -163 57 148 -180
4127 -180 -215 36 196 20 -224 25 132 75 -136 -54 45 146 -48 -87 16 166 59 -179 19 48 60 -107
4149 -107 -202 41 97 -15 -173 64 91 65 -53 -49 178 132 23 -203 102 94 -43 -170 -112 200 168 -95 -183 144
4173 144 242 -133 -154 -141 213 -37 -196 -215 126 104 -117 -87 -6 170 -71 -244 87 93 101 -168 -200 18 65 -126
4197 -126 -86 108 136 19 -215 -158 98 5 -141 -58 32 181 -101 -211 -61 143 113 -196 18 78 105 -94 -77
4220 -77 117 62 82 -138 -9 154 91 -175 -24 173 209 -103 -228 90 144 34 -152 12 23 45 -148 -129 1
4243 1 191 -147 -40 -17 135 16 -135 -80 172 -4 -207 -81 -60 79 -11 -241 -51 90 24 -113 -96 190 136
4266 136 -60 -75 154 193 35 -62 -14 163 51 -85 -60 159 281 25 -69 -72 120 182 -93 -28 172 98 -86 -125
4290 -125 -87 62 -45 -144 -54 20 72 -163 -169 26 87 -20 -223 -22 66 4 -119 20 118 158 -166 -118 50 125 74
4315 74 -13 49 120 -26 -63 50 153 -86 -108 -152 144 189 -130 8 -71 83 126 -41 -26 170 149 -80 -127 -13
4339 -13 81 19 -141 -32 -6 43 -19 -23 101 148 31 -160 -232 65 -59 -186 -30 76 40 -76 1 73 50 -93 -171
4364 -171 -192 206 23 -87 -107 -59 77 -29 -161 3 209 15 -207 -18 159 101 -90 -133 40 167 -62 25
4386 25 70 85 113 -122 -15 50 113 -67 -24 -33 137 125 35 -61 149 101 8 25 95 -57 -158 -254 -120 206 -58 -61
4412 -61 41 123 82 20 -137 57 104 62 -101 63 42 -38 18 -61 62 -85 -113 -122 -34 120 31 -115 116 77 149 -106
4438 -106 13 206 70 -41 -61 94 151 -54 -27 -116 74 -100 -26 -22 104 5 -120 -16 -33 128 -33 -62 -145 26
4462 26 -56 -26 -140 55 5 -109 18 -20 52 22 -10 -31 -53 133 -6 -105 -55 104 52 -92 -213 98 6 10 -135
4487 -135 109 161 -21 -166 -18 137 96 -104 -170 131 -31 -34 -131 24 62 -45 -153 -73 123 84 -111 5 139
4510 139 69 32 -192 35 217 -185 -60 -52 46 155 66 -190 47 81 -123 -89 131 74 132 9 19 4 36 1 -188
4535 -188 126 96 4 26 -66 230 73 -44 -40 -40 185 -53 -103 -2 41 62 -63 -40 -51 24 3 -129 26 -1 19 -265
4561 -265 -8 -54 59 -114 30 -75 65 -72 -116 -14 130 74 -39 5 -90 109 80 53 101 117 -15 28 -13 6
4585 6 -72 -117 -83 158 -90 -87 -24 -13 129 16 -54 45 -24 -60 -85 -81 36 91 -166 -68 32 166 -15 -64 -63 100 50
4612 50 -72 -129 5 -94 -112 -143 -36 34 24 -26 -78 101 -24 -102 -27 -12 185 -62 -58 71 134 35 -158 -57 4 133
4638 133 -37 -185 107 151 -149 -102 -34 93 126 -9 -79 59 159 -15 -43 11 11 40 -85 3 149 165 -57 9
4662 9 -1 146 41 -73 -15 27 18 -6 -125 -19 -96 19 -183 -79 111 -81 -135 -52 40 19 -81 119 49 25 -68
4687 -68 -50 63 209 20 -106 -82 145 49 -35 -137 54 -23 -66 -95 27 -21 -74 -54 3 31 17 82 -41 108 -1
4712 -1 85 -54 -12 -52 129 92 -55 -31 66 -63 -28 107 68 53 -63 -48 93 111 -66 -153 -73 91 77 -27 -28 93
4738 93 -27 -155 48 41 88 -87 -45 61 18 199 13 -47 42 84 -9 -89 -73 146 -122 24 60 -44 -26 23 -72
4763 -72 56 53 -68 -69 -15 43 35 -161 -43 1 -111 3 -16 5 123 109 9 85 43 -121 -46 -17 83 3 -45 44 12
4790 12 -9 60 -130 57 60 70 -29 -41 150 24 3 -100 76 -68 -74 -96 -46 102 70 -6 33 103 142 -74 -102 -107 45
4817 45 -102 -190 -84 37 -13 -228 -176 -54 86 38 -65 -71 44 45 -117 -150 17 132 -1 -37 34 109 154 -19 30
4842 30 42 59 -16 -99 -17 48 -107 17 -9 19 -7 -42 22 2 17 -26 -35 26 -32 64 18 -79 -63 -73 -51 -92 -79 -40 20 -116
4872 -116 56 25 -30 -35 49 90 -18 36 -103 -62 122 -66 27 -82 104 5 -20 -30 -5 3 -74 27 -91 83 -118
4897 -118 54 94 65 76 37 -92 -14 -80 -143 17 110 98 -10 13 112 -116 -57 35 -54 80 107 -166 -13 -53 -120 2
4923 2 -107 9 -46 39 -83 -20 -75 38 62 -278 127 90 67 13 -52 152 -77 -116 40 7 -192 18 -78 32 122
4948 122 29 -55 22 28 -39 5 72 80 84 15 -94 -88 18 140 126 45 51 26 -69 -108 -20 121 -65 -46 50 -54 -49 -29 19 -144
4978 -144 -6 60 -42 -118 -7 50 -182 82 169 166 65 -82 74 26 42 -27 -110 117 100 -62 96 -34 66 85
5002 85 -173 1 147 21 23 -21 -11 29 -28 -118 82 77 23 -84 -167 67 -29 -27 -55 -80 -33 -71 -54 -42 -29 -28 -88 26
5030 26 -182 -9 -84 -30 26 -47 -15 -33 155 42 -35 -3 12 166 45 -16 6 -66 -80 -41 3 11 32 94 -71 43 8
5057 8 83 -89 -14 -124 55 12 -82 51 53 12 -23 42 105 218 -49 -102 20 33 -66 -112 -67 56 19 81 -8 -52 91
5084 91 34 68 -4 41 1 -90 39 5 74 26 -114 -83 33 -7 5 95 48 21 6 10 35 48 60 -21 -97 -73 -28 -36 -46 -4
5114 -4 -35 42 -74 72 156 -42 -42 1 -1 5 -161 23 -85 -79 5 -4 88 -63 47 -13 -96 -70 -71 -92 23 -66 -6 -9 34 -76
5144 -76 -9 -116 -31 -55 112 85 58 77 97 44 51 -72 23 120 56 104 61 53 42 -70 25 -151 59 59 -23 -29 4 12 -99
5173 -99 -69 66 -11 -111 -166 77 -55 -15 0 38 49 93 54 -51 54 -87 130 37 19 -7 50 12 -40 -44 102 43
5199 43 -65 -14 23 -40 -30 -62 -1 59 -47 -20 -4 46 58 -19 55 -79 -46 -64 -86 -49 -23 -89 -7 -40 -72 9 61 -95
5227 -95 41 -43 -44 -104 42 8 4 -21 -81 89 75 -50 -138 50 107 31 -185 52 46 -77 -33 -107 20 34 83 -68 -9
5254 -9 -56 -78 69 -16 -41 0 -156 -29 -42 -40 142 -17 67 -5 117 37 47 47 -31 -45 28 12 -7 111 -64 20 -71 -64
5282 -64 -63 -42 -7 -130 -75 -69 -24 191 44 -33 17 -75 -67 67 63 74 -56 59 82 113 -74 -98 -92 11 -25 67 87 -24
5310 -24 26 -1 24 -12 57 39 -98 146 -52 -27 -26 -159 -29 -8 -128 -15 49 53 -47 -64 15 -19 74 111 39 44 30 -71
5338 -71 -42 -55 -72 99 53 -68 -165 25 54 -38 -1 21 27 -93 -71 -88 42 68 140 26 84 85 43 -96 -62 -8 -93 -119
5366 -119 -46 70 -75 -21 -128 151 74 28 -70 69 39 -77 58 -107 -118 16 1 -2 -45 -63 46 95 -15 28 -21
5391 -21 -86 102 -60 15 30 73 6 -3 -101 26 57 91 64 3 3 -47 -49 -41 -50 2 42 -59 -97 147 -46 -80 9 -26 -163
5420 -163 -91 51 -158 -59 35 47 -86 -5 66 12 56 -128 -149 -90 -143 29 -101 -39 10 -3 -53 103 23 49 -2 71
5446 71 34 -47 -25 -27 40 -27 -5 -67 -9 81 62 77 65 23 17 76 -39 17 -45 2 -6 -67 -34 34 19 -21 16 -119 -47 1 -2
5477 -2 8 41 36 20 70 -35 44 48 -43 23 -82 -100 106 -53 -51 13 -39 12 -21 130 -33 -110 -45 27 73 -97 -81 -74 -34
5506 -34 -92 55 -9 196 14 42 -48 -49 155 42 40 45 33 13 -32 69 -20 -18 6 39 134 36 -60 62 58 -85 56 -104
5534 -104 48 -12 -66 43 -24 12 -14 -138 113 -33 -51 -40 -33 -149 -141 101 -82 43 -27 26 88 -4 60 52 65 -13 -20
5561 -20 -69 -21 6 46 67 103 -62 127 -71 48 38 5 -78 5 58 -50 -239 108 7 -69 -52 -26 73 -7 40 -6
5587 -6 67 22 0 50 -62 -40 9 -17 22 -56 -7 73 66 40 2 28 -85 78 -7 -2 -57 10 -1 41 31 14 -19 44 48 128 98
5618 98 -45 49 70 -3 16 60 -66 -72 100 -107 -137 162 -77 24 -17 -100 39 73 -82 -56 82 23 -5 27 -48 44
5644 44 -54 -15 -107 -157 -112 -10 0 20 23 58 -109 -83 22 120 -13 -7 86 -45 39 -28 -82 -26 60 -82 27 104 -5
5671 -5 5 -75 81 -31 105 -24 -95 47 -28 42 9 -43 -100 52 -93 12 -34 133 8 -79 15 -35 -109 0 59
5696 59 37 19 -129 8 -101 -26 42 -17 2 -90 -2 65 129 70 -32 17 51 103 56 17 52 -14 22 -98 15 37 -29
5723 -29 -17 52 37 -4 -2 -173 114 -133 0 59 31 -5 20 -89 -122 4 22 -133 157 20 18 -11 -7 49 20 -59 -31
5750 -31 34 87 -90 -66 133 101 11 63 -16 65 -20 -17 -146 31 157 80 -67 -29 -18 11 22 16 -19 17 59 -69 34
5777 34 -38 -9 24 127 -59 29 -8 -47 -2 -184 8 -86 37 -69 -4 -122 -76 -118 -42 -142 -74 -56 34 7 3 96 -21
5804 -21 77 -53 -9 -47 25 -35 3 23 -43 -99 46 -25 78 -129 -20 -35 -9 -13 -88 -63 83 131 36 40 62 -62 -80 -82
5832 -82 -2 30 60 -106 77 104 107 33 5 -38 -4 -30 -67 36 -119 -42 -43 37 81 17 -3 37 -83 -79 -231 193 -53 28
5860 28 -54 64 43 -96 159 14 -62 -55 42 -56 79 36 45 4 -31 -89 77 158 104 -40 17 -83 75 -68 -22 -39
5886 -39 28 -45 82 41 -128 65 -93 -10 -7 -137 42 70 41 -47 -28 31 -42 96 -112 -13 7 -7 -61 92 69 7
5912 7 68 -93 -64 20 22 116 74 81 -85 69 -67 -30 20 127 -29 -22 39 8 46 -1 2 -139 65 -6 29 -76 -34 -33 -29
5941 -29 85 -86 -73 -1 -26 94 179 13 70 -24 -11 61 116 27 -14 22 -39 -21 -12 -50 72 -3 50 -33 56 189 100 -30
5969 -30 19 98 -34 96 45 -66 86 -24 5 -35 85 49 21 46 67 -66 -61 65 100 16 6 -124 7 -51 -30 -75
5995 -75 -11 -33 -13 -49 -119 -54 -24 -55 66 79 1 8 66 -16 66 -104 4 -149 74 -14 -68 -84 -115 -27 60 -38 -77 83
6023 83 39 80 -87 -21 -12 -23 -39 59 44 14 53 -11 196 16 -2 -129 69 17 -6 118 -62 -32 13 -145 -83 -10 -134
6050 -134 -22 -74 -23 -89 13 -41 -123 -12 -77 48 18 29 96 36 -13 17 54 23 74 -45 64 65 59 53 53 9 -30 12 -24
6079 -24 -127 -62 -64 186 15 12 -127 17 -56 -21 -49 -50 -32 -209 -58 58 4 -14 23 -189 -17 -3 61 -10 94 142
6105 142 -50 58 -137 -84 24 119 12 -64 -29 98 -41 -23 -65 11 31 -22 135 -19 53 31 -8 -33 51 21 -44
6130 -44 -77 12 46 82 -57 9 -3 86 91 53 14 3 -158 -58 11 -56 -44 44 -81 19 7 -29 56 -105 -23 17 13 -111
6158 -111 -50 1 -22 77 -51 -87 70 51 86 -47 -81 -61 -4 -59 33 -53 -63 -26 -24 52 40 -43 -60 -46 47 71 16 31 115
6187 115 38 -10 -19 1 78 66 -48 12 -34 -67 146 115 -132 24 -44 62 17 24 -131 -26 79 29 11 -27 15 54 -71
6214 -71 -56 44 16 34 -121 -11 12 46 79 -106 0 48 -79 7 125 58 -174 -96 -99 -100 42 -53 -30 48 -40 1 -99
6241 -99 -17 -29 -73 1 -5 107 81 -69 -22 -17 61 -63 -69 -16 -160 7 12 -183 41 35 -15 5 -184 -41 -51 112 -93
6268 -93 -78 30 -70 -60 49 60 208 -189 -5 55 9 13 -30 -9 -140 24 88 0 -19 61 49 -22 -41 19 0 -23 41
6295 41 -17 -61 -109 -66 -44 -72 -110 -7 14 -2 131 53 1 74 -46 -79 50 -15 16 -25 -74 166 -69 79 43 119 77
6322 77 -23 11 -63 35 161 -35 54 -38 -12 -101 61 17 -1 61 -75 121 -18 -102 6 21 -51 30 -42 -86 14 48
6348 48 -32 -173 49 -31 -60 -95 -76 160 -83 39 -33 -84 -33 -51 59 -54 -78 202 -125 70 66 9 131 -57 -10
6373 -10 36 -15 15 -67 21 -75 13 -110 31 46 -191 72 -31 100 -87 62 85 33 35 115 -31 -59 150 -17 -39
6398 -39 -79 26 -7 85 -105 -61 -5 -94 36 38 -19 24 -145 -68 -49 -60 -49 50 -11 -1 -24 -101 47 -114 1 -57 -49 29
6426 29 109 -54 -27 24 64 -93 65 101 68 -81 57 111 61 39 -59 81 -36 -66 27 41 80 -45 81 -98 -25
6451 -25 83 165 96 36 57 -3 76 -96 -26 8 -108 22 16 -19 181 -154 105 76 62 36 32 34 -1 -40 -28 -46 31 6
6479 6 25 80 -32 128 -13 23 -23 33 -8 35 57 37 115 -75 -42 -85 67 -31 -9 -10 104 37 -14 -130 98 52 81
6506 81 65 -14 -17 68 42 13 -87 -39 -47 -84 25 -139 -49 -22 -35 -10 39 1 31 60 73 27 -61 31 -184 40 85 52 -6
6535 -6 -15 26 80 158 34 34 10 -67 14 -79 4 -24 -52 32 22 -26 -39 92 -63 12 -35 10 -59 -21 50 30 -37 35 -42 0
6565 0 -37 -86 -23 24 49 -2 19 31 33 -35 -48 -48 -110 40 58 53 -29 -29 3 -2 -36 -66 132 10 56 -36 -78 43 -68 -6 -42
6596 -42 49 26 6 19 -5 115 -13 2 -167 -24 98 -6 -67 -80 65 -23 -55 -98 -132 -82 -59 -31 75 6 3 -150
6622 -150 26 24 -112 -123 -39 73 -54 -47 32 -72 88 -10 9 61 5 20 96 -60 -62 32 23 126 29 -27 94 -73 75
6649 75 121 148 29 31 105 80 -84 14 -64 17 18 -58 -8 31 34 33 -37 -95 -90 15 8 14 -51 -124 -7 -82 30 -39 -83 31 7
6680 7 109 30 -59 -51 55 31 -112 26 -42 -91 -1 -64 88 10 92 1 -36 -8 -29 -7 15 -121 57 -100 -62 70 17
6707 17 -29 -27 -85 -27 57 3 52 -10 91 0 -23 -20 -14 -60 -13 63 -8 -31 89 135 38 9 -69 9 5 23 33 122 -13 51 46
6738 46 18 73 47 -74 2 6 14 18 46 79 -11 -50 -49 -89 124 41 23 -80 4 -74 13 -111 -41 34 21 17 -54 -13 -73 -52 -27
6769 -27 -135 45 71 54 -9 -23 20 -5 -32 -13 -29 48 17 -3 -26 16 -50 -17 -105 59 -1 40 100 66 45 48 45 4 12 33
6799 33 8 -78 -30 26 22 82 7 42 -78 80 -92 3 14 -11 35 -19 -34 -42 17 -99 98 26 63 -129 -2 30 -55 -48
6827 -48 242 49 -15 -17 8 -12 -15 47 -4 -75 105 20 13 65 87 -42 -110 88 -74 -2 53 35 -4 -4 49 29 0 -126 82
6856 82 125 -129 57 69 -88 -9 -17 25 -148 43 -102 -9 -147 96 -63 -47 -36 19 10 53 -21 -59 -44 -99 60 78
6882 78 -16 -13 19 53 26 -63 2 82 -4 -1 73 -20 77 -138 1 49 25 -81 -87 127 13 -93 233 44 -130 65 -28
6909 -28 -32 51 30 -10 46 -6 2 140 -143 -50 -45 -97 5 -41 -38 11 -94 -81 -19 -4 60 -123 -26 -28 -65 63 -76 154 142
6938 142 -69 -132 8 50 -141 134 68 64 34 48 -52 -91 74 5 -15 64 107 116 132 11 31 -107 32 -48 60 -142
6964 -142 -48 -134 -46 87 42 -55 -111 -57 -16 -26 -143 -85 72 -43 -153 55 77 -19 -5 5 94 1 -63 -99 -65 -10 86
6991 86 5 -1 -46 -111 -7 75 78 33 -9 236 -45 120 11 -192 98 -38 -1 -11 66 2 -20 -96 -51 -64 18 4 -4 106
7019 106 -97 51 16 64 85 -44 31 -47 -70 33 21 -3 127 -124 40 -7 72 -71 11 -151 48 -19 23 -26 -3
7044 -3 -5 -19 -81 -101 -20 96 -1 77 -34 38 79 -16 -15 -87 -109 63 6 55 6 15 197 -14 56 -92 66 -171 -42 3
7072 3 -133 5 -40 -61 51 -2 -24 -62 -33 -57 -23 -2 -56 7 93 -71 1 -11 103 -53 34 28 -45 -71 58 37 63 117
7100 117 36 53 -34 41 63 18 17 45 72 -73 -68 -45 -28 27 14 7 -86 10 -20 -55 -107 121 -15 5 2 -61 37 13 62 -53
7130 -53 -46 30 21 -114 -76 28 17 -19 -79 -18 29 1 -3 -26 -128 76 -54 23 -101 -116 15 68 10 15 32 32 54 -122 22
7159 22 -28 120 -150 -95 -12 -23 -57 -69 69 -105 -47 116 -100 -8 3 -42 -37 -70 -127 -37 -231 -23 -20 30 18 60 28
7186 28 -21 -44 -69 66 107 -10 2 -101 61 59 87 8 -140 13 45 9 59 -19 -52 45 -10 28 39 -67 88 71 86
7213 86 -24 61 -14 -91 -38 -68 -42 44 11 -16 25 -89 96 45 4 5 -107 -9 -35 -148 -90 -71 -43 34 17 -19 63 -30
7241 -30 -165 115 88 50 22 -97 135 108 -123 -33 19 -4 -8 78 85 187 -45 -105 100 -9 13 86 -51 21 85 100
7267 100 50 -60 -43 -59 -45 34 42 -28 46 -133 9 34 66 -129 -81 43 -19 -97 -41 87 -30 -39 -8 -121 -5 34
7293 34 -57 48 44 142 -73 58 -29 -10 25 98 53 28 110 -135 -17 138 33 142 -59 -80 159 41 -37 -92 -3
7318 -3 20 -103 -62 70 19 116 -67 -181 97 81 -33 -127 53 87 36 -13 -19 -76 113 14 -28 -11 50 -41 27 120 -116
7345 -116 72 -91 143 43 47 -79 -21 3 0 -17 3 -88 -34 128 -72 1 -35 71 -50 -61 42 -26 39 -109 -68
7370 -68 -1 -29 14 -3 -39 -155 -9 -120 -8 -33 61 -16 66 125 -32 7 -127 58 8 -65 24 61 51 -99 -9 -119
7396 -119 -99 -62 -17 -47 3 125 -46 -66 54 41 12 -118 127 -98 -29 -3 6 -117 76 114 -84 22 41 110 -118
7421 -118 19 68 -20 40 -141 25 51 -164 -46 -86 -90 -8 108 -44 -54 129 12 -7 -31 -10 -103 50 33 -65 -10
7446 -10 38 43 44 -38 120 -40 40 49 -91 -27 -29 -75 39 -1 31 118 -41 58 2 5 34 106 72 38 -47 87 -7 21 -6 19
7476 19 26 22 16 -12 0 -42 31 10 50 9 -1 -75 32 -55 -117 161 -21 7 -84 2 121 -15 55 -37 -54 -18 -74 -2 76
7505 76 -142 -52 97 35 104 -32 18 29 131 34 49 81 122 24 -45 -20 80 23 45 -7 46 -25 122 -16 24 -52 -34
7532 -34 81 -74 52 -83 5 -120 2 33 25 30 78 27 25 -6 -105 -16 -71 -12 -49 28 52 -91 -1 81 50 64 -16 -20 -1
7561 -1 -46 117 94 12 135 -11 44 113 -40 41 -46 8 112 20 -29 -63 -125 33 101 -36 -87 60 -3 23 -36 85
7587 85 -135 5 35 -16 64 -8 33 -4 28 -99 74 -32 11 52 58 -24 15 -25 13 -41 71 13 -21 13 84 117 48 -48
7615 -48 -65 76 38 43 -62 23 85 -147 -31 159 26 -5 76 133 95 -116 15 25 36 -1 -32 11 -12 52 68 12 86
7642 86 36 3 -61 101 -31 -86 -77 -26 49 52 18 67 -32 53 41 -45 -45 -22 -5 15 -84 141 -52 86 83 31 -52 17 20 4
7672 4 -86 -15 -113 -31 -77 67 22 90 -38 83 48 27 -59 100 126 -21 41 111 72 -48 -21 -7 52 58 -16 3 104 -70
7700 -70 -59 17 90 -12 -79 -91 53 106 48 -12 -35 25 131 -91 64 -42 3 68 27 -83 -82 147 -9 -95 90 -209
7726 -209 74 -37 -107 56 -19 -58 3 -57 -48 5 -68 57 174 -74 -155 78 -18 -31 -1 -43 -134 54 -13 -125 23
7751 23 -50 -108 -99 -97 14 63 35 -62 -47 -53 -2 -16 -39 52 -33 -20 -159 108 2 -14 4 132 71 -96 12 -12 25 -117
7779 -117 -6 -138 -19 31 77 -39 -101 69 105 131 38 72 7 -51 -29 22 -11 -90 124 126 -53 -34 -53 -58 -1 73 191
7806 191 41 -41 -50 -77 0 -71 -130 -16 -53 -53 -29 110 37 48 20 57 -52 49 -101 -60 143 -187 12 -108 -28 -51
7832 -51 -35 -11 90 -24 -190 15 -29 -148 37 -40 -20 31 -87 36 -101 -50 -27 -48 116 -15 -4 84 -36 -107
7856 -107 40 16 -149 83 50 61 33 12 75 25 9 -62 50 7 24 -52 -17 2 -109 -16 -3 -24 6 -47 71 -45
7882 -45 -2 28 105 19 124 -20 -123 -51 -20 -189 -31 -193 -4 -41 42 -114 79 39 -18 19 -131 -12 48 145 -76
7907 -76 -86 -27 75 24 -54 82 25 55 44 20 -10 -36 37 12 -114 -43 -21 -42 4 30 -138 -1 -76 -62 116 -136 3
7934 3 -105 8 -149 50 114 -80 -73 -145 -45 -107 -97 -6 -50 -107 -20 -121 4 -26 16 12 -70 11 -3 51 -41 34 22 1
7962 1 -96 -40 -51 123 64 -3 4 -33 -58 -43 47 -59 12 -61 -28 8 13 69 -48 -2 3 53 14 -70 3 50 -97 -46 13 -126
7992 -126 -43 -66 -47 -19 -36 -31 8 -50 5 94 -154 11 -95 38 -39 -108 5 16 26 17 -42 -26 -13 -16 -124 -17 -40 83
8020 83 22 -16 -28 33 -96 -115 -65 57 54 -39 -3 -28 50 17 15 -52 -119 -156 45 69 -81 84 -36 -39 84 -140 -84 -117
8048 -117 -32 56 -36 14 -13 -78 -35 -50 49 -105 -41 -86 105 118 -37 -32 -72 -20 119 115 -19 -43 83 36 21 70 -73
8075 -73 -33 72 80 -27 57 -13 19 13 -78 83 25 -123 4 -6 35 100 0 -38 -59 -57 28 -7 -23 11 -89 -48 32 -2
8103 -2 -13 -48 -14 -36 4 -29 -31 -70 -107 -102 -73 -28 12 15 -43 14 -38 24 -143 -63 55 4 46 -102 -20 -95 -8 -54 90 -13
8133 -13 -65 -57 4 14 17 -125 13 -6 -32 -96 -2 -40 83 -89 -29 -35 -59 59 -20 14 -4 10 -74 -5 22 -70 -88 14 -54
8162 -54 22 147 -10 -139 -31 48 11 -34 41 30 -97 75 127 -4 1 -35 -36 -54 83 66 -28 -1 73 84 45 -79 1
8189 1 98 -163
8191a63
##END NTUPLES=NMR FID
##END=
