##TITLE=1H ikalashn
B1b 1311
14.11.2024
##JCAMPDX= 6.0         $$ Bruker NMR JCAMP-DX V2.0
##DATA TYPE= NMR FID
##DATA CLASS= NTUPLES
##ORIGIN= UXNMR, Bruker Analytische Messtechnik GmbH
##OWNER= root
$$ TOPSPIN		Version 1.3
$$ 2024-11-14 14:24:28.406 +0400  Irina@DPX200
$$ Compression mode = diff/dup
##.OBSERVE FREQUENCY= 200.131300845
##.OBSERVE NUCLEUS= ^1H
##.DELAY= (6, 6)
##.ACQUISITION MODE= SIMULTANEOUS
##.ACQUISITION SCHEME= undefined
##.AVERAGES= 32
##.DIGITISER RES= 18
##SPECTROMETER/DATA SYSTEM= spect
##.PULSE SEQUENCE= zg
##.SOLVENT NAME= CDCl3
##.SHIFT REFERENCE= INTERNAL, CDCl3, 1, 17.49637
##AUDIT TRAIL= $$ (NUMBER, WHEN, WHO, WHERE, WHAT)
$$ ##TITLE= Audit trail, TOPSPIN		Version 1.3
$$ ##JCAMPDX= 5.01
$$ ##ORIGIN= Bruker BioSpin GmbH
$$ ##OWNER= Irina
$$ $$ F:/spectra/data/iren/nmr/1H/4/audita.txt
$$ ##AUDIT TRAIL=  $$ (NUMBER, WHEN, WHO, WHERE, VERSION, WHAT)
(   1,<2024-11-14 14:24:13.859 +0400>,<Irina>,<DPX200>,<TOPSPIN 1.3>,
      <created by zg
	started at 2024-11-14 14:22:06.031 +0400,
	POWCHK disabled, PULCHK disabled
       configuration hash MD5:
       BE 6D 3F 07 2A EA 11 49 91 17 2B D3 AF B3 58 0D
       data hash MD5: 16K
       82 43 63 1E 6C 5C 17 71 D7 AE B1 2A EB 57 37 4D>)
$$ ##END=
$$ 
$$ $$ hash MD5
$$ $$ 26 2F 0A BA E8 6A 8C F3 B3 3A 43 B7 D6 0A CB 06
##$RELAX= 
##$RELAX= 
##$RELAX= 
##$RELAX= 
##$RELAX= 
##$RELAX= 
##$RELAX= 
##$RELAX= 
##$RELAX= 
$$ Bruker specific parameters
$$ --------------------------
##$DU= <F:/spectra>
##$EXPNO= 4
##$NAME= <1H>
##$PROCNO= 1
##$TYPE= <nmr>
##$USER= <iren>
##$AMP= (0..31)
100 100 100 100 100 100 100 100 100 100 100 100 100 100 100 100 100 100 
100 100 100 100 100 100 100 100 100 100 100 100 100 100 
##$ANAVPT= -1
##$AQSEQ= 0
##$AQ_mod= 1
##$AUNM= <au_zg>
##$AUTOPOS= <>
##$BF1= 200.13
##$BF2= 200.13
##$BF3= 200.13
##$BF4= 200.13
##$BF5= 200.13
##$BF6= 200.13
##$BF7= 200.13
##$BF8= 200.13
##$BYTORDA= 1
##$CFDGTYP= 0
##$CFRGTYP= 5
##$CHEMSTR= <none>
##$CNST= (0..63)
1 1 145 1 1 1 1 1 1 1 1 1 1 1 1 1 1 1 1 1 1 1 1 1 1 1 1 1 1 1 1 1 1 1 
1 1 1 1 1 1 1 1 1 1 1 1 1 1 1 1 1 1 1 1 1 1 1 1 1 1 1 1 1 1 
##$CPDPRG= <>
##$CPDPRG1= <>
##$CPDPRG2= <>
##$CPDPRG3= <>
##$CPDPRG4= <mlev>
##$CPDPRG5= <mlev>
##$CPDPRG6= <mlev>
##$CPDPRG7= <mlev>
##$CPDPRG8= <mlev>
##$CPDPRGB= <>
##$CPDPRGT= <>
##$D= (0..63)
0 2 0 0 0 0 0 0 0 0.06 0 0.03 0 0 0 0 0.0002 0 0 0 0 0 0 0 0 0 0 0 0 0 
0 0 0 0 0 0 0 0 0 0 0 0 0 0 0 0 0 0 0 0 0 0 0 0 0 0 0 0 0 0 0 0 0 0 
##$DATE= 1731579853
##$DBL= (0..7)
120 120 120 120 120 120 120 120 
##$DBP= (0..7)
150 150 150 150 150 150 150 150 
##$DBP07= 0
##$DBPNAM0= <>
##$DBPNAM1= <>
##$DBPNAM2= <>
##$DBPNAM3= <>
##$DBPNAM4= <>
##$DBPNAM5= <>
##$DBPNAM6= <>
##$DBPNAM7= <>
##$DBPOAL= (0..7)
0.5 0.5 0.5 0.5 0.5 0.5 0.5 0.5 
##$DBPOFFS= (0..7)
0 0 0 0 0 0 0 0 
##$DE= 6
##$DECBNUC= <off>
##$DECIM= 32
##$DECNUC= <off>
##$DECSTAT= 4
##$DIGMOD= 1
##$DIGTYP= 9
##$DL= (0..7)
0 120 120 120 120 120 120 120 
##$DP= (0..7)
150 150 150 150 150 150 150 150 
##$DP07= 0
##$DPNAME0= <>
$$ [...]
##$SW= 21.9926040160658
##$SWIBOX= (0..15)
0 0 2 0 0 0 0 0 0 0 0 0 0 0 0 0 
##$SW_h= 4401.40845070422
##$TD= 16384
##$TD0= 1
##$TE= 300
##$TE2= 300
##$TE3= 300
##$TEG= 300
##$TL= (0..7)
0 120 120 120 120 120 120 120 
##$TP= (0..7)
150 150 150 150 150 150 150 150 
##$TP07= 0
##$TPNAME0= <>
##$TPNAME1= <>
##$TPNAME2= <>
##$TPNAME3= <>
##$TPNAME4= <>
##$TPNAME5= <>
##$TPNAME6= <>
##$TPNAME7= <>
##$TPOAL= (0..7)
0.5 0.5 0.5 0.5 0.5 0.5 0.5 0.5 
##$TPOFFS= (0..7)
0 0 0 0 0 0 0 0 
##$TUNHIN= 0
##$TUNHOUT= 0
##$TUNXOUT= 0
##$USERA1= <user>
##$USERA2= <user>
##$USERA3= <user>
##$USERA4= <user>
##$USERA5= <user>
##$V9= 5
##$VALIST= <valist>
##$VCLIST= <CCCCCCCCCCCCCCC>
##$VD= 0
##$VDLIST= <DDDDDDDDDDDDDDD>
##$VPLIST= <PPPPPPPPPPPPPPP>
##$VTLIST= <TTTTTTTTTTTTTTT>
##$WBST= 1024
##$WBSW= 25
##$XGAIN= (0..3)
0 0 0 0 
##$XL= 0
##$YL= 0
##$YMAX_a= 1773699
##$YMIN_a= -1631092
##$ZGOPTNS= <>
##$ZL1= 120
##$ZL2= 120
##$ZL3= 120
##$ZL4= 120
##$ABSF1= 10
##$ABSF2= 0
##$ABSG= 5
##$ABSL= 3
##$ALPHA= 0
##$AQORDER= 0
##$ASSFAC= 0
##$ASSFACI= 0
##$ASSFACX= 0
##$ASSWID= 0
##$AUNMP= <proc_1d>
##$AXLEFT= 0
##$AXRIGHT= 0
##$AXTYPE= 0
##$AXUNIT= <>
##$AZFE= 0.1
##$AZFW= 0.1
##$BCFW= 1
##$BC_mod= 2
##$BYTORDP= 1
##$COROFFS= 0
##$CY= 7568.61572265625
##$DATMOD= 1
##$DC= 2
##$DFILT= <>
##$DTYPP= 0
##$F1P= 17.9538593292236
##$F2P= -4.03888763876832
##$FCOR= 0.5
##$FTSIZE= 32768
##$FT_mod= 4
##$GAMMA= 1
##$GB= 1
##$INTBC= 1
##$INTSCL= 1
##$ISEN= 128
##$LB= 0.05
##$LEV0= 0
##$LPBIN= 0
##$MAXI= 945.577
##$MC2= 0
##$MEAN= 0
##$ME_mod= 0
##$MI= -402.1523
##$NCOEF= 0
##$NC_proc= 0
##$NLEV= 6
##$NOISF1= 8.587773
##$NOISF2= 6.764455
##$NSP= 1
##$NTH_PI= 0
##$NZP= 0
##$OFFSET= 17.49637
##$PC= 1
##$PHC0= 115.83
##$PHC1= 10.21802
##$PH_mod= 0
##$PKNL= yes
##$PPARMOD= 0
##$PPDIAG= 0
##$PPIPTYP= 0
##$PPMPNUM= 100
##$PPRESOL= 1
##$PSCAL= 0
##$PSIGN= 0
##$REVERSE= no
##$SF= 200.13
##$SI= 32768
##$SIGF1= 18.5376
##$SIGF2= -6.396296
##$SINO= 400
##$SIOLD= 32768
##$SREGLST= <1H.CDCl3>
##$SSB= 3
##$STSI= 0
##$STSR= 0
##$SW_p= 4401.40845070422
##$SYMM= 0
##$S_DEV= 0
##$TDeff= 0
##$TDoff= 0
##$TI= <>
##$TILT= no
##$TM1= 0
##$TM2= 0
##$TOPLEV= 0
##$USERP1= <user>
##$USERP2= <user>
##$USERP3= <user>
##$USERP4= <user>
##$USERP5= <user>
##$WDW= 1
##$XDIM= 8192
##$YMAX_p= 0
##$YMIN_p= 0
$$ End of Bruker specific parameters
$$ ---------------------------------
##NTUPLES= NMR FID
##VAR_NAME=  TIME,          FID/REAL,        FID/IMAG
##SYMBOL=    X,             R,               I
##VAR_TYPE=  INDEPENDENT,   DEPENDENT,       DEPENDENT
##VAR_FORM=  AFFN,          ASDF,            ASDF
##VAR_DIM=   8192,          8192,            8192
##UNITS=     SECONDS,       ARBITRARY UNITS, ARBITRARY UNITS
##FACTOR=    0.0002272,     1,               1
##FIRST=     0,             0,               0
##LAST=      1.8609952,     -43,             265
##MIN=       0,             -1631092,        -1631092
##MAX=       1.8609952,     1773699,         1773699
$$ Real data points
##PAGE= N=1
##DATA TABLE= (X++(R..R)), XYDATA
$$ [...]
2719f247J0012L585r709n491Q183P658n981r054L325J0060q79j0091j874R478
$$ -6247 3765 7350 -2359 -7850 333 7991 2010 -7044 -3719 6341 5462 -4629 -6503 2975
2733B975M137q337o620O684Q811m817r585K019R922P39r363l846Q948N532o886
$$ 2975 7112 -1225 -7845 -1161 7650 2833 -6752 -4733 5189 5928 -3435 -7281 1667 7199 313
2748C13p744N270Q987k694r973M22R662K085q858m951Q047O850o099q187L632
$$ 313 -7431 -2161 6826 4132 -5841 -5419 4243 6328 -2530 -7481 566 7416 1317 -6870 -3238
2763c238R235j501r381j160Q847M000q466n497O609P487m195q702J904R173M27
$$ -3238 5997 4496 -4885 -6045 2802 6802 -1664 -7161 -552 6935 2740 -5962 -4058 5115 5542
2778E542q847l308Q689N301p666p077N831Q511l770q788O38Q961J843q480m407
$$ 5542 -3305 -6613 2076 7377 -289 -7366 -1535 6976 3206 -5582 -4944 4017 5860 -2620 -7027
2793g027P844O350o472p550L856Q786j668q765o48Q745K816q000n043O582P004
$$ -7027 817 7167 695 -6855 -2999 5787 4119 -4646 -5294 3451 6267 -1733 -6776 -194 6810
2808F810m724p895K416Q762K1r402k238Q435M464p365o143N370P813l527q334
$$ 6810 2086 -5809 -3393 5369 5390 -4012 -6250 2185 6649 -716 -6859 -1489 6324 2797 -5537
2823e537J204Q877J217q908l041P914M975n828p209M265P807j934q489j40Q397
$$ -5537 -4333 4544 5761 -3147 -6188 1726 6701 873 -6336 -2071 5736 3802 -4687 -4827 3570
2838C570K396p819m843O927O163m711q055K936Q736m02r210j032P838L415o543
$$ 3570 5966 -1853 -6696 231 6394 1683 -6372 -3436 5300 4898 -4312 -5344 2494 5909 -634
2853f34o050N727P255l602q273J991P827O93p882k293O730M881o383n925M281
$$ -634 -6684 -957 6298 2696 -5577 -3586 4241 4934 -2948 -5241 1489 6370 -13 -5938 -1657
2868a657P094k170q001L67P661J962p298l890O493M987m451o636K912P629j132
$$ -1657 5437 3267 -4734 -4367 3294 5256 -2042 -5932 561 5548 1097 -5539 -2627 5002 3870
2883C870p616j357P954L042o965m861N292O557l922p285J942P583mp451k284P017
$$ 3870 -3746 -5103 2851 5893 -1072 -5933 -641 5916 1994 -5291 -3349 4234 4230 -3221 -5505 1512
2899A512M106n807n618M458O607k842p278N19P886J509p256l156N850N137n122
$$ 1512 5618 -189 -5807 -1349 5258 2416 -4862 -4343 3543 5052 -2204 -5360 490 5627 505
2914E05n686L260P005j348p640k60P099K077o405m088N225N586l510o988K269
$$ 505 -5181 -1921 5084 3736 -3904 -4164 2935 5012 -1393 -5481 -256 5330 1820 -5168 -2899
2929b899P376l12p438j895P109L118n740m406M128N951k671o766J440O342J299
$$ -2899 4477 4165 -3273 -5168 1941 5059 -681 -5087 -959 4992 2321 -4445 -3005 3337 4636
2944D636p153k718O422M254m985n840L866O571k513o687k51O744K068o166l470
$$ 4636 -2517 -5235 1187 5441 456 -5384 -1518 5053 2540 -4147 -4398 2346 4414 -1752 -5222
2959e222N118N452l965o347K554O591p17o874j115O848K698n869l661L945N305
$$ -5222 -104 5348 1383 -4964 -2410 4181 3464 -3410 -4525 2323 5021 -848 -4509 -564 4741
2974D741k605o489J450O437K31o169k332N997L605m975m827L767N576k233o345
$$ 4741 2136 -4353 -2903 3534 3765 -2404 -4736 1261 4866 -109 -4936 -1169 4407 2174 -4171
2989d171M23O715J222o041k713N434L738l886n825L044O315j359o062q05O210
$$ -4171 -3748 2967 4189 -1852 -4565 869 4607 721 -5104 -2060 4255 2896 -3166 -3971 2239
3004B239K149n582l554M464M980l482n939J960O256J93o414j135N356L001n041
$$ 2239 4388 -1194 -4748 -284 4696 1214 -4725 -2765 3491 3684 -2730 -3865 1491 4492 -549
3019e49l810L501N414k539n632P11N858Q75o060k162N449L461m275m761L202N351
$$ -549 -4359 -858 4556 2017 -3615 -2904 2954 3829 -2231 -4393 1056 4517 242 -4519 -1317 4034
3035D034j369o081j07N833J670n438k785M359M351l662n145K629N148o21n762
$$ 4034 2665 -3416 -3523 2310 3980 -1458 -4243 116 4467 805 -4340 -1711 3437 2816 -2946
3050b946m87N183K458n258l082L758M813k939n656J712N419O79n992j494N101
$$ -2946 -3433 1750 4208 -1050 -4132 -374 4439 1500 -4156 -2444 2975 3654 -2338 -3832 1269
3065A269K798m000m298L086N035j806n894M24N873J160n506k252M674L538l296
$$ 1269 4067 67 -4231 -1145 3890 2084 -3810 -3386 2487 3647 -1859 -4111 563 4101 805
3080H05m690K469N389j547n448l92N582J504m709l562M807L892k657n220J503
$$ 805 -3885 -1416 3973 2426 -3022 -3414 2168 3672 -1037 -4599 208 4100 1443 -3777 -2274
3095b274N540m65n299j077N162K513m621l921L837M847k359n480J077N584M25
$$ -2274 3266 2801 -2498 -3575 1587 4100 -521 -4442 -605 4242 1883 -3597 -2520 3064 3489
3110C489n201j934M559K915l595m309K739N238j565n106k79N112J488m941k660
$$ 3489 -1712 -3646 913 3828 233 -4076 -1337 3901 2336 -2770 -3049 2063 3551 -1390 -4050
3125d050M203M081l549m440J835M994n05n295p07N189K255m445l176L876L419
$$ -4050 153 4234 685 -3755 -1920 3074 2569 -2726 -3433 1756 4011 -434 -3610 266 3685
3140C685k366m706R00N378M82n182j553M427K701l810l652K915M129j387n146
$$ 3685 1319 -3387 -2487 2891 3373 -1809 -3362 1065 3766 -44 -3696 -781 3348 1961 -3185
3155c185M68N301R17m798k278M081L235l039m303K011M872r44m804l91M879J128
$$ -3185 -2717 2584 3501 -1297 -3575 506 3741 702 -3601 -1590 3282 2338 -2466 -2857 2022 3150
3171C150l777l083L564L415j953m568J256N096m49m651j237M320K520l830l292
$$ 3150 -627 -3710 -146 3269 1316 -3252 -1996 3100 2651 -2000 -3237 1083 3603 -227 -3519
3186c519K969M319j886m757N52M872O22m883j560M258K424l273l338K126L985
$$ -3519 -550 3769 1883 -2874 -2322 2550 3172 -1711 -3271 987 3411 138 -3200 -1074 2911
3201B911r06m369n45M701J239m094k587L669L477l148l900K002M474p58m309n19
$$ 2911 2005 -2364 -2909 1792 3031 -1063 -3650 19 3496 348 -3552 -1550 2924 2166 -2143 -2662
3217b662M135J762l576l372L448L482j864l988O85M300J45m006j320L832K105
$$ -2662 1473 3235 -341 -3713 -265 3217 1353 -2635 -1950 2350 2495 -1511 -2831 1001 3106
3232C106k900l778K728L845j339m369K87M623O42m303j647L700K716k815l480
$$ 3106 206 -3572 -844 3001 1662 -2707 -2420 2203 2845 -1458 -3105 595 3311 496 -2984
3247b984K060M057q55m500k63L911J706l751k474K983K981k094l824J394M085
$$ -2984 -924 3133 2278 -2222 -2485 1426 3132 -619 -3093 -110 2871 777 -3047 -1653 2432
3262B432l12l549j663M030K256l410k910K304L964j871l659P15L684N72l588j839
$$ 2432 2120 -1429 -3092 938 3194 -216 -3126 -822 3142 1271 -2388 -1673 2011 2583 -1005 -2844
3278b844L640K294k636l294J901L713j191l841q5M114J251l928k364L233K862
$$ -2844 796 3090 454 -2840 -939 2774 1583 -2258 -2343 1771 3022 -906 -3270 -37 2825
3293B825k206l091J488L286k27m010p79L834J774l107k510K312L140j627m014
$$ 2825 619 -2472 -984 2302 2075 -1935 -2714 1120 2894 -213 -2723 -411 2729 1102 -2912
3308b912J221L955l6m096p92L354K255l182k575K146L462j423l633L31L869N51
$$ -2912 -1691 2264 2228 -1868 -2660 694 2949 -233 -2808 -662 2800 1377 -2256 -1925 1944 2495
3324B495l556j647K890K805k660l123J938L402k91m418k46L965J401l429k254
$$ 2495 -1061 -2708 182 2987 327 -2796 -858 2544 2253 -2165 -2411 1554 2955 -474 -2728
3339b728K851K514j940l532J356L961n26l824n90L733J223k476k931K641K634
$$ -2728 123 2637 697 -2835 -1479 2482 1956 -1868 -2458 1275 2498 22 -2909 -268 2366
3354B366j172l546N61L845O21l876j394L209K140k313l441K200L059p00l732J07
$$ 2366 1194 -2352 -1791 2054 2675 -1201 -2595 614 2754 441 -3000 -800 2259 1559 -2173 -2066
3370b066L893P73l514j889K737K917k138l369J361L872r50l627n39L831J108k835
$$ -2066 1827 2600 -914 -2803 -66 2851 713 -2656 -1295 2577 1627 -2000 -2539 1292 2400 -435
3386d35k082K391K959k135l128P57L505K89l677j078L520J803k699k468J705L034
$$ -435 -2517 -126 2833 698 -2430 -1673 1832 2121 -1556 -2634 886 2689 -10 -2478 -773 2261
3402B261r15l575M81L330O15l566j282K861K588k469k395J077L141m05m041j40
$$ 2261 1346 -2229 -1748 1582 2197 -1369 -2651 210 2798 329 -2066 -989 2152 1747 -2294 -2434
3418b434L856R76k736k229K778K670k156l022R79L816o47l100r57L271J713l087
$$ -2434 1422 2398 -338 -2567 211 2881 725 -2297 -1318 2498 1851 -1249 -2206 1065 2778 -309
3434c09k259K042L068j359l544Q98L155J5k675j070K662J823k211k535J221L311
$$ -309 -2568 -526 2542 1183 -2361 -1463 1692 1707 -968 -2038 624 2447 236 -2299 -1078 2233
3450B233r15l425J60L254P93k973j741K516K433j862k922J096L557r03k623p73
$$ 2233 1318 -2107 -1947 1307 2100 -873 -2614 -98 2335 473 -2449 -1353 2204 1301 -1322 -2095
3466b095L102J601l261j685K155K652j234l617Q63L361k8l059j454L060J838k196
$$ -2095 1007 2608 -653 -2338 -183 2469 1235 -2382 -1519 1842 1814 -1245 -2699 361 2199 3
3482Ck638J832K828j003k822N1L388L77l042j125K423K363k163k645J176K944
$$ 3 -2635 -803 2025 1022 -1800 -1749 1639 2016 -1026 -2151 272 2635 472 -2173 -997 1947
3498A947k95k984l21K802R83k601j901K087K646j563k987J009K940j69k977o83
$$ 1947 1652 -1332 -1653 1149 2132 -469 -2370 -283 2363 800 -2187 -1178 1762 1593 -1384 -2067
3514b067K834J498k661k225K171K590j192k642K90L156P8k663j341K650J600k086
$$ -2067 767 2265 -396 -2621 -450 2140 948 -1694 -1404 1752 1830 -833 -2174 476 2076 -10
3530a0k546K076K528q96k672n00L176Q66k661j539K331K392k008k724J196L006
$$ -10 -2556 -480 2048 1152 -1520 -2020 1156 2022 -639 -2178 153 2545 537 -2187 -991 2015
3546B015o17k947q5K593J348k623j728K021J975j113k623L73K817L75k828r49
$$ 2015 1398 -1549 -1634 959 2307 -316 -2044 -23 1952 839 -1784 -1411 1406 1781 -1047 -1996
3562a996K593J356j766j820J209K512q71l230L65K991M30k692j169K245K194k111
$$ -1996 597 1953 187 -1633 -424 2088 1217 -2013 -1648 1343 1773 -919 -2088 157 2351 240
3578B40k014J220K536r71k643R3K657M77k431j101K155J640j684j859N47L067
$$ 240 -1774 -554 1982 1011 -1632 -1539 1118 1595 -836 -1937 218 1858 174 -1685 -1138 1929
3594A929p54k503k78K530R69k259j659J548K379q89k647N49K436L10k820o40K198
$$ 1929 1175 -1328 -1606 924 1893 -366 -2025 -477 1902 1013 -1634 -1085 1351 1661 -1159 -1799 399
3611C99J365j509j922J108K127l77k830R2K715O15k755j171K388J597j414k056
$$ 399 1764 255 -1667 -559 1568 1191 -1639 -1547 1168 1783 -972 -2143 245 1842 428 -1628
3627a628N07K703m85k056p33K432R63j905j821J854K065j453j963M14K382M12
$$ -1628 -1121 1582 1097 -959 -1692 740 1703 -202 -2023 -169 1896 443 -1520 -1106 1276 1688
3643A688k512p86K138R15j793j474J408J720m43k907Q23K379L31k199q82K134
$$ 1688 -824 -1610 528 1443 -350 -1824 -416 1304 861 -2046 -1223 1156 1487 -712 -1594 540
3659E40Q19j266j837J470J965n80k436O0K250N93k166p95J598J622j537j778M16
$$ 540 1359 93 -1744 -274 1691 1111 -1325 -1265 985 1578 -588 -1383 215 1837 300 -1478 -1062
3676a062K067j71j840o44K406R28j700k032J751J929j013j723J55K330j5k134
$$ -1062 1005 834 -1006 -1650 756 1684 -16 -2048 -297 1632 619 -1104 -949 1381 1366 -768
3692g68r74K389J036j390k007J500J774r46j996R1K407J74j880p63J490J562j276
$$ -768 -1742 647 1683 293 -1714 -214 1560 614 -1382 -1291 1116 1290 -590 -1353 137 1699 423
3709D23j997O95K476r29j517o66K330Q90j998j396J554J828j452k075J120K030
$$ 423 -1574 -879 1597 668 -849 -1515 815 1705 -293 -1689 -135 1693 241 -1834 -714 1316
3725A316J68k642o80K215J485k041j071Q62J847p38k100K06K309N51k224j286
$$ 1316 1484 -1158 -1838 377 1862 -179 -1250 -388 1459 721 -1379 -1173 1136 1687 -537 -1823
3741a823K041J725k141j472R72K322o98k250K09K046P87k175j443K076J437j128
$$ -1823 218 1943 -198 -1670 -698 1624 926 -1324 -1115 931 1718 -457 -1900 176 1613 485
3757D85j888Q42J740r0j817p06K085O79j384j359J586J331j038j677J56J888M69
$$ 485 -1403 -561 1179 1089 -728 -1434 651 1330 -54 -1413 173 1504 466 -1211 -1055 833 1302
3774A302k127o09J763J456j812j250O94J765l35k162K51K256N32k426j032J817
$$ 1302 -825 -1434 329 1785 -27 -1277 -583 1182 847 -1315 -1064 1192 1724 -702 -1734 83
3790H3J455j487j424N07J904l34j926j90K240P56j760j119J259J426r19j765N33
$$ 83 1538 51 -1373 -866 1038 704 -1222 -1412 828 1584 -176 -1295 -36 1390 471 -1294 -761
3807g61J735k43j932q7J531J062j408j125R30J862j108j774L59K222j02k201o13
$$ -761 974 731 -1201 -1288 243 1305 -103 -1228 -298 1564 456 -1318 -959 1263 1161 -1040 -1653
3824a653K091R68j132j489P52J823q66j449j78K158K07j685j078K058P85j148
$$ -1653 438 1406 274 -1215 -463 1360 494 -955 -1133 1025 1232 -453 -1531 527 1312 164
3840A64j325N20J523o1j719n08J811R76j714r14J096J500r01j748O51J682K3j830
$$ 164 -1161 -641 882 821 -898 -1406 405 1381 -333 -1247 -151 1349 448 -1300 -649 1033 1056 -774
3858g74n00J730Q36j144j311J122J010k12k053P59J243L99k043m77K046P98j188
$$ -774 -1274 456 1292 148 -1163 -41 969 757 -1296 -537 706 1105 -938 -1415 631 1429 241
3875B41j482R68J715m96j683k79J920N34k059p59J839P12p81j465M45J121K66
$$ 241 -1241 -273 1442 946 -737 -1016 904 1438 -621 -1380 459 1171 390 -1075 -630 491 757
3892G57j392j89J449L56j164j093J050J339p95j106K64J546k18j411m03J473J057
$$ 757 -635 -824 625 981 -183 -1276 -226 1113 318 -788 -524 1022 804 -607 -1010 463 1520
3909A520j287j062M90J608p66j500J35J510K95j272q17J201J004p29j690Q57J338
$$ 1520 233 -829 -339 1269 503 -997 -862 648 943 -329 -1146 55 1059 330 -1360 -503 835
3926H35k19j521k39J961R4j181q30Q68J482j338j020N16J787o1j573n57J751M37
$$ 835 616 -905 -1144 817 911 -270 -1100 -232 1250 -88 -1108 -592 1195 1134 -439 -996 755 1192
3944A192j076j277J002J040n25j532K63J607N15j638n96J389P98r74j439R82J586
$$ 1192 116 -1161 -159 881 356 -1176 -913 694 1209 -429 -1025 364 1162 188 -1251 -269 1317
3961A317o28j597J5J604J70r98j022J199J131r04j417N22J306j6j548l2J431N07
$$ 1317 689 -908 -893 711 881 -117 -1139 60 1191 287 -1130 -608 698 682 -866 -898 533 1040
3979A040j354o74Q52J267r17j355N34J005O42j934j28J577P80j276j011N88J435
$$ 1040 -314 -988 -136 1131 214 -1141 -607 398 1040 -894 -1022 555 1335 59 -952 -364 1071
3996A071m42j189m60J886Pj396n70J287K54l87j022P31J478m32j699J14J573L26
$$ 1071 629 -560 -1020 866 873 -523 -1093 194 448 61 -961 -230 1248 816 -883 -769 804 1130
4014A130j423q48R31J336n74j400K32J429K9j477J3J033P11j256r82Q23J278q13
$$ 1130 -293 -1141 -210 1126 552 -848 -616 813 842 -635 -622 411 1122 -134 -1116 -293 985 172
4032A72p51K7R00P15j378n28J172P48p40j468Q42J316n11j382K0J385M66j372
$$ 172 -579 -552 348 1063 -315 -843 329 1077 337 -1131 -289 1027 516 -866 -846 539 1005 -367
4050c67o35J141J037j038j072N65J105r4j380k08J106R29j010j208J127J034p64
$$ -367 -1002 139 1176 138 -934 -369 736 642 -738 -946 160 1089 79 -1129 -2 1032 268
4067B68j219K43J254Kr96n27J338N30j090p95N91J554n87j167k27J429L86j369
$$ 268 -951 -708 546 548 -448 -975 363 893 -197 -992 -401 1153 566 -601 -828 601 987 -382
4085c82p86J324P04n46j009L43J292m04j114j36R44N91r52r83J237Q91o04j234
$$ -382 -1168 156 860 314 -695 -352 940 536 -578 -714 230 821 -131 -1114 123 1014 410 -824
4103h24M67Q77L12j327m65J520M77j017q90N66J254q64q92N81R91m2j522l9R92
$$ -824 -357 520 832 -495 -960 560 1037 20 -870 -304 950 86 -806 -225 766 724 -798 -837 155
4122A55P64j164p69P29J042j71j517K55J265M10j474m29J163Q67p96j312R20R83
$$ 155 919 -245 -1014 -285 757 586 -931 -676 589 999 -475 -904 259 1126 330 -982 -62 921
4140I21j70j549J37Q96M80n99j112Q27J344p60j380O05J461l8j754K07P31Q26
$$ 921 751 -798 -661 235 715 116 -996 -169 1175 415 -965 -360 1101 1063 -691 -484 247 1073
4158A073j093r29R72J133o46j515L85J260K00r30p74J181P38r18j215M46J299
$$ 1073 -20 -949 23 1156 510 -1005 -620 640 840 -90 -864 317 1055 137 -1078 -632 667
4175F67k31j272O4J076O32q37r86R38Q74r12j104O77J377n10j320J18J092M19
$$ 667 436 -836 -772 304 936 99 -887 51 925 13 -1091 -414 963 453 -867 -749 343 762
4193G62r13q27Q58P34j62j238L65Q85J13j301j44J095Q54j164q54P33J491q68
$$ 762 -151 -978 -120 614 452 -786 -421 464 577 -724 -868 227 1081 -83 -937 -204 1287 419
4211D19p95k65J024M08j087m33Q09J053p68j221L41J154J24j194k48J247J51j143
$$ 419 -376 -641 383 791 -296 -729 80 1133 365 -856 -515 639 763 -431 -679 568 719 -424
4229d24n40J064O36l60j432O42J264k35r27l54R83L66o70q32P69R05k57j463M3
$$ -424 -964 100 736 376 -1056 -414 850 615 -312 -666 317 683 13 -819 -50 855 598 -865 -822
4248h22J368pj067j38J021N55q22o09J44J059l64q25n97J790K97j282p3L13J022
$$ -822 546 539 -528 -666 355 910 88 -521 -377 682 318 -507 -1104 686 983 -299 -372 -59 963
4267I63n57j322M68J352l64q27l37J142N79j363m44M60O66J0j164N20P79n1j381
$$ 963 406 -916 -448 904 540 -287 -624 518 1097 -266 -710 -250 416 426 -738 -218 561 510 -871
4286h71j02J140N88o67q92O60J065o08j461P85J101J44j518q5P11J046j100r92
$$ -871 -973 167 755 88 -804 -144 921 313 -1148 -363 738 882 -636 -721 -10 1036 -64 -1056
4304a056P00J284m59j209M5J459j68j035o43J087Q50o12q11qJ127K99j124l64
$$ -1056 -356 928 469 -740 -695 764 596 -439 -1082 5 855 243 -568 -576 551 850 -274 -638
4322f38J027K50l26j280P98R53m01q70K11J034P2j373Q3M94N86q69m35L91J305
$$ -638 389 639 313 -967 -169 784 383 -487 -276 758 830 -543 -460 34 620 -249 -684 -293 1012
4341A012p64q16j8J311K31j216l98Q74M06m62r89L03J250k90j047j82J135N10
$$ 1012 248 -568 -586 725 956 -260 -658 216 622 160 -829 -526 724 434 -613 -795 340 850
4359H50j085m06P70O90m25j079N0J091J85j157m25J427M23r40j155J104N44j16
$$ 850 -235 -641 129 819 394 -685 -635 456 641 -516 -941 486 909 -31 -1186 -82 462 346
4377C46j219L49J079N33j390m57Q57Q72r26r58N76J135k39j308P7J002M91j333
$$ 346 -873 -524 555 1088 -302 -759 98 970 44 -914 -338 797 558 -750 -673 329 820 -513
4395e13l24O83R17o70j088M50J548N9j494j04J249M8q56o64O71J137o98q26P6
$$ -513 -837 -154 763 93 -995 -545 1003 1062 -432 -536 713 761 -95 -759 -88 1049 351 -475 -399
4414c99Q73L79j301l57Q73Q50q67q50O81O95L09j804L91Q96M21p25r24J014O07
$$ -399 474 853 -448 -805 68 918 51 -799 -118 577 886 -918 -527 369 790 65 -859 155 762
4433G62n39r23K57J318j69j280j63P54P05j066q52J024P92l01j149K43J499l72
$$ 762 223 -700 -443 875 706 -574 -737 17 722 -344 -1196 -172 620 319 -830 -587 912 540
4451E40r10o51R89Q85q11j220J300J104p80j130L66Q87R9j069l80J074N02o19
$$ 540 -370 -1021 -32 853 42 -1178 122 1226 446 -684 -318 569 668 -401 -781 293 795 176
4469A76p56L72R90oj498Q3J086L07j174p48J171M75l28j268N76R54l1r50l24J181
$$ 176 -580 -208 782 776 -722 -639 447 754 -420 -1168 3 478 150 -1118 -542 412 381 -569 -893 288
4489B88M62r23n54N77J141p47p49J02J103m1r35n67R72Q89r26q43M55R35l6j248
$$ 288 750 -173 -727 -150 991 244 -505 -403 700 659 -276 -843 129 1018 92 -751 -296 639 603 -645
4509f45l5J138J15p89q73J300N28m79j362N44J183Qj161j8P57Q66j088r70Q73
$$ -645 -680 458 573 -216 -1089 211 739 260 -1102 -558 625 633 -528 -546 211 1077 -11 -981 -108
4528a08J002o17j062K73Q71K56j170k58J015R32j251r08J152N53m82p68j34R60
$$ -108 894 277 -785 -512 359 615 -555 -813 202 1134 -117 -1025 127 680 198 -570 -704 256
4546B56O75j182q24J094J029p20r87K09J329m26j111n7J375j7r71o80J128N28
$$ 256 931 -251 -1075 19 1048 328 -659 -450 879 453 -658 -715 660 643 -328 -1008 120 648
4564F48l34r99N78J018m09q73j72O77K88k32j055Q09N75j91j088K56Q57L00r25
$$ 648 314 -685 -107 911 502 -371 -543 134 422 190 -865 -56 519 328 -760 -504 353 653 -272
4583b72p48J386N11o11j137M11R01K50j297J06R15R0p12l78O78R77j143n07L38
$$ -272 -1020 366 877 266 -871 -460 441 691 -606 -500 415 505 -207 -585 93 1070 -73 -580 -242
4602b42J118k54j094O0P95L10r60k70M13P05j49j217L83J028r9o95n44J196K55
$$ -242 876 622 -472 -412 383 693 -267 -537 -124 581 432 -785 -402 626 527 -168 -712 484 739
4621G39p69r80N78J193m25j227M74P19L44j146l86R37N32n32n60O14M88L17j570
$$ 739 -30 -1010 -432 761 336 -891 -417 302 646 -500 -886 51 583 51 -509 105 593 910 -660
4640f60k03J116L11p51q74R28P55k16j011K21J398n96q36m81R48P27q85o82N91
$$ -660 -863 253 564 -187 -1061 -133 622 406 -605 -384 1014 418 -418 -899 49 776 -109 -791 -200
4659b00P64j09j129n5J034K55q61l21Q80P23o80r98K35J275k96r60j40P11R56
$$ -200 564 455 -674 -729 305 560 -301 -622 258 981 301 -697 -462 813 517 -443 -583 128 1084
4678A084j526m38P49R01m50p65n1J314m89p19k08R98N43q26q23N27R78o08o68
$$ 1084 -442 -880 -131 770 320 -445 -496 818 329 -390 -598 400 943 117 -706 -179 799 191 -477
4697d77M2R55K40r94l54Q27K77l14r32O38P14k32q85J13P54R0o96m15P52O12m75
$$ -477 -435 520 760 -234 -588 239 516 202 -730 -92 622 390 -495 -382 372 462 -234 -649 103 715 240
4718B40r63L04R63J17j023l87R11Q13j282k33L38Q81j23j027k07J388n2n80o50
$$ 240 -723 -419 544 661 -362 -749 162 975 -307 -540 -202 679 556 -471 -678 710 658 78 -572
4737e72P75M63r46n97O41Q59l51r19QJ258j59m57o71O14Q86q32r35P25O10P1q28
$$ -572 203 666 -280 -877 -236 623 272 -647 -639 619 460 3 -668 -54 832 0 -935 -210 400 471 -357
4758c57k80J056P50j514j88O74O84m93j036K30R96k25r29k48Q15M92o44m36P94
$$ -357 -637 419 1169 -345 -533 141 825 332 -704 -474 522 297 -632 -880 -65 427 -217 -653 141
4777A41N69m85r92L97J088l2r69n06M33J088m75o62J41N32K75r21p6J024j42o01
$$ 141 710 225 -767 -370 718 686 -283 -789 -356 732 257 -405 -264 268 543 -378 -454 570 428 -173
4797a73n47P14Q71o68j096L94R51L80j155j78J100j51n26p24N99P77k76j124J94
$$ -173 -720 -6 865 197 -899 -505 446 826 -329 -507 593 442 -84 -808 -209 568 292 -832 -638
4816f38J069m2j107k6Q68Q70q25q77N64J038m54j227K92Q21M37r88k01K99Q44
$$ -638 431 389 -718 -744 124 994 169 -708 -144 894 440 -787 -495 326 763 -225 -426 -127 717
4835G17n31p94R5J221l02r66n5Q96O9k42p88O47L22l24n17J05J083j07o65n11
$$ 717 186 -608 -513 708 406 -560 -615 281 350 108 -680 -33 289 -35 -552 -447 636 529 -136 -647
4855f47J099L38m00j187P93O68m99p58r4J000O62j271n44P45N53l79o73N71K28
$$ -647 452 790 390 -797 -4 664 165 -593 -687 313 975 -296 -840 -95 458 79 -594 -23 205
4874B05K2o60k97J290M1n56o09M72R08n63j071L49R19P1j019J44M73P92m95j122
$$ 205 227 -433 -730 560 601 45 -564 -92 816 253 -818 -469 450 521 -498 -354 119 911 416 -706
4894g06O75P41m00j194K40J157J95j133p0P26K61k81j126R53K75Q9j190K38O85
$$ -706 -31 710 310 -884 -644 513 708 -425 -495 231 492 211 -915 38 313 402 -788 -550 135
4913A35M75o13n25M40R21n77r03O01O12k46n77o53R58O97p81n82L62J151m46j108
$$ 135 610 -3 -528 -88 833 256 -647 -46 566 320 -257 -910 48 745 -36 -618 -256 895 449 -659
4933f59N12Q84l43n27l52O90O03o35p75j2J463n60o90j78R64K58p50l38O80K85
$$ -659 -147 737 394 -133 -485 205 808 173 -602 -614 849 289 -401 -579 385 643 -107 -445 235 520
4953E20p3j361N94Q09j49j014N0O61M71n52j070R52J189n09j075r7J012j28p12
$$ 520 447 -914 -320 489 340 -674 -624 37 508 -44 -1114 -162 1027 518 -557 -654 358 230 -482
4972d82j11R69L55p24n31L86Q07k78r83L7R24j50m99o8L12O04N0j056K59Q51o59
$$ -482 -593 376 731 7 -524 -138 669 391 -592 -555 369 219 -280 -348 -36 568 618 -438 -179 672 13
4993A3n93j31R96K40o13m80M75O07l76n27m48J273p0j061L00N49O36p46p66O32
$$ 13 -580 -711 285 525 -88 -568 -93 514 138 -389 -837 436 366 -695 -395 154 790 44 -722 -90
5013i0O34k22p65P1O06K11n12n77L80J105l99j432O41P43L9p73K60K16M27n23
$$ -90 544 322 -443 -372 234 445 -67 -644 -264 841 442 -990 -349 394 433 -340 -80 136 563 40
5033D0q72Q20R52n42o49k62R55L98j107l24P81N10o95m83O70M46o45n93j22R63
$$ 40 -832 -12 940 398 -251 -513 442 840 -267 -591 190 700 5 -478 192 638 -7 -600 -722 241
5053B41K20o39l32N60N45n92o63Q2J169j74o86m0Q37k4p11n31O76J053p11r56
$$ 241 461 -178 -510 50 595 3 -660 -578 591 417 -269 -309 528 504 -207 -738 -62 991 280 -676
5073f76O12Q74l11q44l68P14R06j003n23J57J088j72r25M1Q36q2o39l24J022M28
$$ -676 -64 810 499 -345 -713 1 907 -96 -619 -462 626 454 -471 -430 406 324 -315 -639 383 811
5093H11o88o50N45M83J62j410K57J331k88p90l53Q02Q57j110r40Q27N58j88k48
$$ 811 123 -527 18 501 663 -747 -490 841 553 -237 -590 212 1069 -41 -981 -154 404 216 -32
5112c2o83R50L38n94l86M66O03l75p07K09O93L18j231n95J326K65n91m20M42N34
$$ -32 -715 235 573 -21 -407 59 662 287 -420 -211 482 800 -431 -1026 300 565 -26 -446 -4 530
5132E30J00j246K05Q10M28j044m55R74L11l55j181Q45M97j76m72l11P46J06j78
$$ 530 630 -616 -411 399 827 -217 -672 302 613 258 -923 -78 419 243 -229 -540 206 312 134
5151A34m46L53M05l67q68N73O78O0p83j07O55ko78Q7j30J258n60p76L53O64l47
$$ 134 -312 41 446 79 -789 -216 462 522 -261 -368 287 285 -393 -306 -436 822 262 -514 -161 503 156
5172A56m47m14Q16Q10p66n08p0Q35l00m22n53J167M12m96r69R08N26o45n14P8
$$ 156 -291 -705 111 921 155 -353 -423 412 112 -310 -863 304 716 220 -749 159 685 40 -474 -396
5192c96J124j86q23l77Q88J84o57l59P25O92q60m92M0J230l82o65l38O72O33o19
$$ -396 728 542 -281 -658 230 414 -243 -602 123 815 -45 -537 -497 733 351 -314 -652 20 653 34
5212C4n23N05N82l40m15o56J091J65p40l93P32P54p61m75M77N51l57p57J78N71
$$ 34 -489 16 598 258 -157 -813 278 443 -297 -690 42 796 35 -440 37 588 231 -526 -348 223
5232B23K62l09q89P50O95q37o83K65R08P2n65M9J26L89k54n94N09M22k04o32J98
$$ 223 485 176 -713 37 732 -105 -788 -523 385 457 -108 -59 67 456 202 -392 117 539 335 -297 -99
5253i9L67Rm58r5K67N53q7j057L93O52k33m06j11M88L46n43n16O78M45o52j70
$$ -99 268 277 -181 -276 -9 544 457 -600 -207 445 212 -194 -305 183 529 -14 -530 148 593 -59 -229
5274b29j28O44M3n17j88N01N26j046l29N01Q01j35p68k81Q78J49n78k24K90O05
$$ -229 -357 287 330 -187 -375 126 652 -394 -723 -222 579 444 -324 -605 273 422 -156 -380 -90 515
5294E15l64o02j72J085o5o82l06Q27K16o15l90O70M80o41j07k68P82k88k80m1
$$ 515 151 -451 -623 462 397 -285 -591 236 452 -163 -553 117 597 -44 -151 -419 363 75 -205 -246
5314b46N40K98m84o79M48O23j20m85q0O70j08n42k83M23P65n93p74L11R92m2j150
$$ -246 294 592 108 -571 -123 500 380 -105 -185 485 377 -165 -448 -25 740 147 -627 -316 676 634 -516
5335e16M53K81L58o80n65Q44M78p12p77K62R72o0n79k79N82J37k89m52P39N04
$$ -516 -63 218 576 -104 -669 175 653 -59 -836 -574 398 338 -241 -520 62 199 -90 -542 197 701
5355G01n15r59M40L53O25q50j95N49J82m8r22N98O04l52n33oO64R3p76rK86N58
$$ 701 186 -773 -333 20 645 -205 -400 149 331 283 -639 -41 563 211 -322 -328 336 429 -347 -356 -70 488
5377D88l24o52K83M99l13l79K35R7M74m45m40N34O29n84o29K76O31M2p62m3M41
$$ 488 164 -488 -205 294 -19 -398 -163 -66 408 -37 -477 57 686 102 -527 -251 380 422 -340 -383 58
5398E8K05m42m02L15M26L29q06r4O31M67n56o25O88K93j41q78M07N43n3p60j11
$$ 58 263 -179 -581 -266 160 489 -317 -411 220 687 131 -494 194 487 346 -532 -125 418 365 -395 -506
5419e06P88K80n96m42N75N13l66n93k8R14j42p30M1N12K30p06l49M98N38k7r21
$$ -506 282 562 -34 -476 99 612 246 -347 -375 539 397 -333 -292 220 450 -256 -605 -107 431 404 -517
5440e17J15O56Ql15o42Q23P27q35m11L65L86Q0q69j3M61N82q65m46N26R65p47
$$ -517 -402 254 262 -53 -695 128 855 20 -391 -26 360 440 -429 -442 19 601 -264 -710 -184 781 34
5461C4k14J3M51j36m76K8M33L93m45o83N04Q64m75l90j18M63K87r29J60N11L81
$$ 34 -180 -167 284 148 -328 -300 133 526 81 -602 -98 766 291 -99 -217 246 533 -396 -236 275 656
5482F56m08q80J59N44M55r98K36P18J64o83m96N29M06k32n75j57Q61K09q53j32
$$ 656 248 -632 -473 71 526 -472 -236 482 646 -37 -533 -4 402 170 -405 -562 299 508 -345 -477
5502d77P24K66l08q01L98O99l12o79N16K18L64r19L5J89M86n70k28M27K33J62
$$ -477 247 513 205 -596 -198 501 189 -490 26 244 608 -311 -276 -87 399 -171 -399 28 261 423
5522D23p18j38Q56lo65j69M06K85Rq07J39J019n39l64j72O18M24l83o69J10O74
$$ 423 -295 -433 423 420 -245 -414 -8 277 286 -521 -382 637 98 -266 -438 180 604 221 -448 -338 336
5543C36l24l46J8N89J54m02j62J58O03p74m91N25L58O7n67J00O53J36p47m30O31
$$ 336 12 -334 -316 273 427 25 -137 21 624 -150 -641 -116 242 309 -258 -158 495 631 -116 -546 85
5564H5J47j31l91k4L73J92n96L6K35L41k35n53N09M48k23q44M06Q12l83k21l63
$$ 85 232 101 -290 -314 59 251 -345 -309 -74 267 32 -521 -12 436 213 -631 -225 587 204 -17 -380
5585c80N44M96p47j68L70N42n79l78j79P49j27j88l34N19L31n77l22L48L54j94
$$ -380 164 660 -87 -255 115 657 78 -300 -479 270 143 -45 -379 140 471 -106 -428 -80 274 80
5605H0k94l60O13N88p43k77N35O03j011l59L76Q97k19o85J14M36L2j46n89J54
$$ 80 -214 -574 39 627 -116 -393 142 745 -266 -625 -249 648 429 -256 -142 294 326 180 -409 -255
5625b55O74l12n93K36P73n2p70k88O19L20k14n70L99J90J94o87K41K28L32j87
$$ -255 419 107 -486 -250 523 471 -299 -587 32 352 138 -432 -33 157 351 -336 -95 133 465 278
5645B78r22N35O20J3j108K50O51O1m68m97N76P12o18n62M18M35n44j78M2O91j53
$$ 278 -644 -109 511 524 -584 -334 317 378 -90 -587 -11 701 83 -479 -61 374 -170 -348 -306 385 232
5666B32P4q57N38M26n10l60N85L9P5l25j65O12J59p92j97P14Q5j65m90J91R5N61
$$ 232 306 -551 -13 413 -97 -457 128 167 242 -83 -248 364 523 -269 -466 248 333 168 -322 -131 -36 525
5688E25m96p29P77J84k81k63j8M19J08l32P2K35J68o33l63Q15M58o27n37L35J52
$$ 525 29 -700 77 261 -20 -283 -301 118 226 -106 -34 201 369 -264 -627 188 646 19 -518 -183 -31
5709c1L01n72J1P03k19o9n07K17O40k76n89M5M26N72o63l03L83K42l80l59K41
$$ -31 270 -302 -291 412 193 124 -383 -166 474 198 -391 -346 80 652 -11 -314 69 311 -69 -428 -187
5730a87O28m1n88l47R40q4n12k4L70K62m58n57K66P84j66n68K40M17L2o78lJ16
$$ -187 441 400 -188 -535 405 321 -191 -215 155 417 -41 -598 -332 452 286 -282 -42 375 407 -271 -274 -158
5752a58O03k0o18k17R22l91n80K80M73J56n65j31N16J06j55o34O9R64l99n34k88
$$ -158 445 425 -193 -410 512 121 -459 -179 294 450 -115 -246 270 376 221 -413 -344 620 221 -313 -601
5773f01M56N56m09q4J14K02K80o71p4Q37r8o41n10M67R28q38J35K17j8j9m61j77
$$ -601 -145 411 2 -82 32 234 514 -157 -231 606 508 -133 -643 -176 752 -86 49 266 248 229 -232 -409
5795d09P35R2p01J52N17L57o73n65L25J57M50o46k24J11P47o95q0K59J83J69p91
$$ -409 326 418 -283 -131 386 743 70 -495 -170 -13 437 -209 -433 -322 425 -270 -350 -91 92 261 -530
5816e30J4P56j31J12m90K52L45j66m31j51Q06P3r04j21O02O8l40k43K95K61Qm20
$$ -530 -516 240 109 221 -269 -17 328 162 -269 -420 386 459 -445 -566 36 104 -236 -479 -184 77 85 -335
5838c35k40R93l65k00l41N58M20m89m25L32O33m93m54J16M64j42j64m7l8K77j86
$$ -335 -575 418 53 -147 -488 70 490 1 -424 -92 541 48 -406 -290 174 32 -132 -179 -217 60 -126
5859a26j39j41Q42l39n71L29J54L03m99n0n5Q57o33o99P47N08j71k72l52O74L9
$$ -126 -265 -406 436 97 -474 -145 9 312 -187 -237 -292 565 -68 -767 -20 488 317 45 -307 367 406
5880D06l19o04N24L06j46l67k3M10K21l87m40M40O8o9k24k3M77m6m94J93J88M25
$$ 406 87 -517 7 313 167 -200 -223 187 408 21 -419 21 89 20 -204 -227 250 204 -290 -97 91 516
5902E16p52j99L99L92kp55j58P36J04l26m59M52L76n20k82L33M39j42n26K4O54
$$ 516 -236 -435 -36 356 354 -401 -559 177 281 -45 -504 -52 324 -196 -478 -145 294 152 -374 -350 304
5923C04K14p02k03N44nm5n41J50N69L53r73l13R08j17j50l92L49M49l75j89J92
$$ 304 518 -184 -387 157 152 107 -434 -284 285 638 -335 -648 260 143 -7 -399 -50 399 24 -165 27
5944B7L67m34k63p4N67L32m21k46r5R68l83n78K57K55P9p77J89J98K10M93q33
$$ 27 394 -40 -303 -377 190 522 101 -145 -240 728 345 -233 24 279 358 -419 -230 -32 178 671 -162
5965a62r7R97n16n06K81J78M1l38j75L88K72l23j56l9N84J68q49j87O78on78n7
$$ -162 -259 738 222 -284 -3 175 216 -122 -297 91 363 40 -116 -155 429 597 -252 -439 239 233 -345 -402
5987d02M43K64k00n68L0P48j69j74m24M66K71k16j27M3K84Q6p51j02Q51K33j43
$$ -402 41 305 105 -463 -433 315 146 -28 -452 14 285 69 -58 -15 269 355 -396 -498 353 586 443
6008D43o89j0J148r83j90L47J64j97m01J47O74k42l60j54L06J05J19m74j81M62
$$ 443 -246 -256 892 -91 -281 66 230 33 -368 -221 453 211 -149 -303 3 108 227 -247 -428 34
6028C4L41m98q6K00N99l17n29KL30K16l49q0J73K12n62M1K51N67o10k31J18M62
$$ 34 375 -123 -209 -9 590 273 -256 -254 76 292 -57 -137 36 248 -314 -273 -22 545 -65 -296 -178 284
6050B84J14j033K29O56J82n23m94N35M07l50m55Q8O26k28K8n45P28J4l99k14M05
$$ 284 398 -635 -406 250 432 -91 -585 -50 357 7 -448 -360 266 38 66 -479 249 263 -136 -350 55
6071E5K87j81m28j30R20j03p92j96N63J67m95L28j71O31k32l72J67J70Q2m45r5
$$ 55 342 161 -267 -397 523 420 -372 -568 -5 162 -333 -5 -176 455 223 -149 18 188 270 -175 -270
6092b70L90N39p97k39M34M88j79n27l66P54J85n66k78J35O70m18o8j32M35K38
$$ -270 120 659 -138 -377 57 545 366 -161 -527 227 412 -154 -432 -297 373 -45 -113 -245 190 428
6112D28n11l92O71J83K0p07L05J72l48O0J29K71j14m03k85O04L48m74j25j9L18
$$ 428 -83 -475 196 379 399 -308 -3 169 -179 -119 10 281 167 -236 -521 83 431 -43 -168 -187 131
6133A31M9m87j36N94M50m61m05L54R8M9k73j81M80Kn82n7K97J21K01p39L78O33
$$ 131 180 -307 -443 151 601 140 -265 89 187 236 -37 -218 262 264 -318 -375 -78 43 244 -495 -117 516
6155E16o58k2j18K16Q66m66q92O37K03r0j95m93O95k5l70j5P09k00j75l60L47
$$ 516 -142 -164 -282 -66 800 334 -558 79 282 192 -3 -496 199 174 -196 -211 498 298 123 -237 110
6176A10K21j55n52L71L28J80m82m16M93L04q5q00K11L59k61K4j47N27j9j99n44
$$ 110 331 176 -376 -5 323 503 21 -395 98 402 317 -483 -272 87 -174 -150 -297 230 211 12 -532
6197e32P72K9j63m16O7N56k32l12o1M14L03n65n74P03K79j59l86K54K69M6o63
$$ -532 240 269 106 -310 -243 313 81 -231 -292 122 425 -140 -714 -11 268 109 -277 -23 246 292 -371
6218c71j1Q22J99p91k16P0P32p7l91J50J18J01l08m14M34l6j82j08K18L02K1p07
$$ -371 -382 440 639 -152 -368 -298 434 357 -34 116 234 335 27 -387 47 11 -171 -279 -61 241 262 -445
6240d45m2O19M42p42m01O34kJ48n48J9N27M4k58k77L28M97p84l85L81O22j01l02
$$ -445 -487 132 574 -168 -569 65 63 211 -337 -318 209 253 -5 -282 46 543 -241 -626 -245 377 276 -26
6262b6n86Q05j06o5l77M23K78m14j1J17K34R5n83K3N20L17o85l33N47J50k73m14
$$ -26 -612 193 87 22 -355 68 346 -68 -79 38 272 367 -216 -193 327 644 -41 -374 173 323 50 -364
6284c64N99k40O16j169L47K73J32O3k89n5L18K9n14l83Q99m0l57k94M53P69m81
$$ -364 235 -5 611 -558 -211 62 194 257 -32 -87 231 260 -254 -637 262 222 -135 -429 24 793 312
6305C12o79K55K93K1n17q4O10J62o35k66M52L36o8n89J40O15l1o23k37Q02K37
$$ 312 -367 -112 181 202 -315 -399 211 373 -262 -528 -76 260 192 -397 -257 358 327 -296 -533 269 506
6326E06m23m36J30R16l79l20J07J04Q7j58m03K38L94l81l83K84J61J23k45J9J22
$$ 506 83 -353 -223 693 314 -6 101 205 292 134 -269 -31 363 -18 -401 -117 44 167 -78 -59 63
6347F3P8k14m79O56L67l29k44j4L84J25m77R0J22J80k93n74P86J04o07j80J47
$$ 63 141 -73 -552 104 471 142 -102 -116 268 393 -84 6 128 308 15 -559 227 331 -276 -456 -309
6368c09N79k32Om26M59J79Q0o68Q8N26j69k62l34P31R6k07m51O28r9K5o49J44
$$ -309 270 38 44 -382 77 256 336 -332 -244 282 113 -149 -483 248 344 137 -314 314 215 240 -409 -265
6390b65N60J1m28j32J48N33m18o63N70K22l36j8j11Q72m47m17j06L72N62n65m26
$$ -265 295 306 -122 -254 -106 427 9 -654 -84 138 -198 -216 -327 545 98 -319 -425 -53 509 -56 -482
6411d82K89P51j94l78j49M99K44k40j136J077RJ49n18l70J060m47o98K60M25j7
$$ -482 -193 558 364 -14 -163 336 580 340 -796 281 290 439 -79 -449 611 164 -534 -274 151 134
6431A34o04J78K88L54L78j201L43L83q4l11o1J98N99k90p89N91j77J73n98J20
$$ 134 -470 -292 -4 350 728 -473 -130 253 169 -142 -203 -5 594 304 -485 106 -71 102 -496 -376
6451c76O01M92o97k4o8L00J6m36p1J0O71q06P8N22J08k93m43O9M47M8n18K94L93
$$ -376 225 717 20 -4 -72 228 244 -192 -263 -253 418 -388 -310 212 320 27 -416 -347 100 148 -370 -76 317
6474C17M8l94k77L89K60l06n20M30L25j08l86j05K62K22n36M0O30k98J18m79l6
$$ 317 365 -29 -306 83 343 37 -483 -53 272 164 -222 -327 -65 157 -379 -339 291 -7 111 -368 -404
6495d04P00J34n59o3K91M11n82o42P91M78k00r22N05O0L83q89p5M52M01l57o90
$$ -404 296 430 -129 -192 99 510 -72 -714 77 555 355 -567 -62 -2 381 -508 -583 -131 270 -87 -777
6516g77O52N94q1n68kP88j87n55J4L72Q5k47n45L71l6J83k71k09N98M5j90m21
$$ -777 -125 469 388 -180 -182 606 419 -136 -122 250 335 88 -457 -86 -122 61 -210 -419 179 224 34 -387
6538c87L16q5K61l44J01M11j03O7m53L76J31j55n38M39O09l97j98m23P21k56k34
$$ -387 -71 -156 105 -239 -138 273 170 237 -216 160 291 136 -402 37 646 249 51 -372 349 93 -141
6559a41j45N51J3k37k70n6N42k64k69L25j13K52m67l31P41j10J1j12n4K66J85
$$ -141 -286 265 278 41 -229 -285 257 -7 -276 49 -64 188 -279 -610 131 21 32 -80 -134 132 317
6580C17p00K20L92L34k42l97k49M89K82q08J29M96N4l70k86O36k46J96o40J83
$$ 317 -383 -163 229 563 321 -76 -325 164 446 -362 -233 263 317 -53 -339 297 51 247 -393 -210
6600b10L27J13k84j44M38k32j00l08M53L59n18n79M59N89j37l90l05Q46l15k37
$$ -210 117 230 -54 -198 240 8 -92 -400 53 412 -106 -685 -226 363 226 -164 -469 377 62 -175
6620a75L02k71L58j36l41l20Q42k92k51j2O15L97o57p9NM40k84m52J06O11P8m68
$$ -175 127 -144 214 78 -263 -583 259 -33 -284 -296 319 716 59 -20 -15 425 141 -311 -205 406 484 16
6642A6k13J54J72R4n89M90k5K7k78k9K83M31q94l65N76M26j71m60r6P71q4m10
$$ 16 -197 -43 129 223 -366 124 99 126 -152 -181 102 533 -361 -726 -150 276 105 -355 -451 320 236 -174
6664a74j94R44j72j49m51J15M74q3n11K26L39N9p95j35N51L31l0r59M21N02J19
$$ -174 -368 576 404 255 -196 -81 393 310 -201 25 364 423 -372 -507 44 375 345 -614 -193 309 428
6685D28o68J36L78j39l54q5K61N60l54o35J0R75k09m76j22Q0K44K50o47J78M06
$$ 428 -240 -104 274 135 -219 -304 -43 517 163 -472 -462 513 304 -172 -294 -214 30 280 -367 -189 217
6706B17n5j64k28L38N13o78k81L44K87n39l39K92O82n4n83m0K12L33l45m06M28
$$ 217 162 -2 -230 108 621 -57 -338 6 293 -246 -585 -293 389 335 -248 -288 -76 257 -88 -494 -66
6727f6P87l82o78K08O43k72o88K73M65j71j32m80L57O65m19l28p2K53N3p9k28
$$ -66 721 339 -339 -131 512 240 -448 -175 290 119 -13 -493 -136 529 110 -218 -290 -37 16 -63 -291
6748b91N96J2m96Q5J39K31kq00M3L84K74p9o00M16N13j93q24R1R74r5n72M1K02
$$ -291 305 317 -179 -94 45 276 274 -526 -483 -99 175 96 -504 -88 425 232 -592 -501 473 378 -194 -153 49
6771D9L19k71k39L9L61m12l52L58L33P1m12k71N91j10L41p14L3M49K1n82J52L44
$$ 49 368 97 -142 -103 258 -154 -506 -148 185 256 -156 -427 164 54 395 -319 -286 163 184 -398 -246 98
6793I8L68n16j31J85M34l74o07M72L63Q1o33j5L09J56l91P6j00O90k28p96P89
$$ 98 466 -50 -181 4 438 64 -543 -71 292 373 -260 -275 34 190 -201 -125 -225 465 237 -559 230
6814B30L1q7m47j32K00K77j81o28O18K85J07l11K21j22M18n58p24J161j37k45
$$ 230 261 174 -273 -405 -205 72 -109 -737 -119 166 273 -38 183 61 479 -79 -803 358 221 -24
6834b4l58J24L88K73p06k54N65J24j24l15L38L14k35l77O5P71k85l36j65L54L14
$$ -24 -382 -258 130 403 -303 -557 8 132 8 -307 31 345 110 -267 -202 569 284 -52 -217 137 451
6855D51k23m93J3N48j54k42l00L99R3m36j05L96M49o19j45j7O92k9p16N35K50
$$ 451 228 -265 -252 296 142 -100 -400 -1 92 -344 -449 -53 396 -223 -368 -385 307 278 -438 97 347
6876C47K18n84l05J73M85q4p14J69P60P8o22q2K85K60k93n22J44N70k29l22k30
$$ 347 565 -19 -324 -151 334 250 -464 -295 465 543 -79 -161 124 384 91 -431 -287 283 54 -268 -498
6897d98M75J63p29M53J35L63k89j86m4O16O0q49L11r7M45l58l41L06R6L69o48
$$ -498 -23 140 -589 -136 -1 362 73 -113 -157 459 519 -330 -19 -116 329 -29 -370 -64 32 401 -247
6918b47J8J63M8k71PJ75O38l89l76P5N75l09o80M62M93J64q02k01M97J55j38n83
$$ -247 -229 -66 -18 -289 -282 -107 531 142 -234 -159 416 107 -573 -111 382 546 -256 -457 40 195 57 -526
6940e26K82K99J98l25o0J35J63l33o3R6O56o95J81l78N65L4m89Q7K44L39l70n32
$$ -526 -244 55 253 -72 -132 3 166 -167 -230 -134 522 -173 8 -370 195 229 -260 -173 71 410 40 -492
6962d92L59M21m58k56J32M12N58n77l08L61K2k7n59K44M83k78l53j41R12n0o78
$$ -492 -133 288 -170 -426 -294 118 676 99 -209 152 174 147 -412 -168 315 37 -316 -457 455 405 -273
6983b73K75l45R76p88k05K47m3M11k84l60M64M27n66q6P0Q11n00p30M02L04J56
$$ -273 2 -343 633 -155 -360 -113 -156 255 -29 -389 75 502 -64 -150 -80 731 231 -499 -97 207 363
7004C63m06m07P65j45m34k59K00N12N5l77n3P3M59k85l83J9N39O6k52j16N06n27
$$ 363 -43 -450 315 170 -264 -523 -323 189 244 -133 -186 -113 346 61 -322 -303 236 302 50 -66 440 -87
7026h7k90J76L88J27k03n32L92L11N8p68J83Q20n36p7n13P60j56j22j27L6K94
$$ -87 -377 -201 187 314 111 -421 -29 282 340 -428 -245 575 39 -38 -551 209 53 -69 -196 -160 134
7047A34j49k24j55Q07k75l83L09o11R87j38n59J02L39J78p56K38K60K20j59k94
$$ 134 -15 -239 -394 413 138 -245 64 -547 440 302 -257 -155 184 362 -394 -156 104 324 165 -129
7067a29J28O37o34K29n09J041n79p42K65J71K78o3j74J50N5K9n75Q0M75O9k52
$$ -129 -1 636 2 231 -278 763 184 -558 -293 -122 156 93 -81 69 124 153 -422 -342 133 202 -50
7088e0k53M86O70n90p35K23N76k69m5K64m02N09p15L13o4K41o2l35k36O95P3m90
$$ -50 -303 183 853 263 -472 -249 327 58 13 277 -125 384 -331 -18 -82 159 97 -238 -474 221 294 -196
7110a96J17L00N9o30R9j7O14m00j17k71Q00nl79k19J63L10r8l52K07M61o16R1
$$ -196 -79 221 280 -350 -251 -268 346 -54 -171 -442 358 353 -26 -245 -82 228 130 -222 -15 446 -170 -79
7132g9m71Q24j64ln27j63J037n51j63k52M79L98m53l65P51J23l67m23j75P76j36
$$ -79 -550 274 110 107 -420 -583 454 -97 -260 -512 -33 365 -88 -453 298 421 54 -369 -544 232 96
7153I6m76M04J69N4o80k65M82P92m40n00J61M48j29l66p6L05K35o55L8J06O47
$$ 96 -380 24 193 247 -433 -698 -216 576 136 -364 -203 245 116 -250 -326 -21 214 -441 -403 -297 350
7174C50k96n65L56M4K91j74K10j59J11j4q60O83K61l02q4J29L63n33L48o01J84
$$ 350 54 -511 -155 -111 180 6 216 57 168 154 -706 -23 238 -64 -148 -19 344 -189 159 -442 -258
7195b58M49j92n10N47L19k05l50m1M36J38k02m30L37L94m57k3r0J92M50l68l10
$$ -258 191 -1 -511 36 355 150 -200 -241 195 333 131 -299 38 432 -25 -48 -138 54 504 136 -174
7216a74J22L22k83l15M15M00n13o28Q32j8k30j60j25L05J47n0l63M05o0K11k22
$$ -174 -52 270 -13 -328 87 487 -26 -654 178 160 -70 -230 -355 -50 97 47 -316 89 29 240 18
7237A8k54L84R7l07m37N84L18m62J25k61L86j19k27o6J60J80j81J75m7J35q6j90
$$ 18 -236 148 245 -62 -499 85 403 -59 66 -195 191 72 -155 -221 -61 119 -62 113 66 201 115 -75
7259g5k3J78K9m48N37l88N57l12j08l34N99j89l87k4N85J32l71J39k0M63o67r7
$$ -75 -98 80 109 -339 198 -190 367 55 -53 -387 212 23 -364 -388 197 329 -42 97 77 540 -127 -224
7281b24Q2L23K02l88k07M54L47q18m8L11K13j83m04L02pM05n38j14Q41j02n80
$$ -224 -142 181 383 -5 -212 242 589 -229 -277 34 247 64 -340 -38 -45 360 -178 -292 549 447 -133
7302a33q5J60J69q0k94J02M41P8m02l40K88M67p94L9M55J77P4o45mN79k28j17
$$ -133 -218 -58 111 31 -263 -161 280 358 -44 -384 -96 371 -423 -384 71 248 322 -323 -327 252 24 -93
7324i3m77O16j16l7j45k8N66k32k43k90N62L13m40p47M88O83j58k95j7Q3M38n96
$$ -93 -570 46 -70 -107 -252 -280 286 54 -189 -479 83 396 -44 -791 -303 380 222 -73 -90 -7 431 -165
7346a65Q9N65l97R6j77m8K70J17o09p6M06L92m95l82O21L2l77m77N65N5M25o92
$$ -165 -76 489 92 188 11 -37 233 350 -259 -335 71 463 -32 -414 207 239 -138 -615 -50 5 430 -262
7368b62j65N37ok58k01j10O49K0j82l10N52l07l0J9r1M61m01j61l0L26J94l93
$$ -262 -427 110 104 -154 -355 -465 184 204 22 -288 264 -43 -73 -54 -145 316 -85 -246 -276 50 244 -149
7390a49L9L25k79M48o85M31J0L44p38Q8N97j32q95K05O64L7j32o76J76J50M99
$$ -149 -110 215 -64 384 -301 130 140 484 -254 -166 431 299 -596 -391 273 310 178 -498 -322 -172 327
7411C27l43k57L87M29l95l36L19k3m89J34l55P60M7k69j06K14M56o46P0p1L40
$$ 327 -16 -273 114 543 148 -188 131 108 -381 -247 -602 158 205 -64 -170 44 500 -146 -76 -147 193
7432A93J25l95J83L5J06j51m66L41Q5P7l12M72K61n17j93k8L08R2k28k0K7L64
$$ 193 318 -77 106 141 247 96 -370 -29 56 133 -179 293 554 37 -156 -184 124 216 -12 -32 -5 359
7454C59l92J33j26P3K35n70K05K85mp0l94L30K17l36m25M45J70j13k02k2K86K70
$$ 359 -33 100 -26 47 282 -288 -83 202 198 128 -266 64 281 -55 -480 -35 135 22 -180 -202 84 354
7476C54p44j63P92K27l60j78l70R19j71m99j20L31K62k45m77N38J6j22k54k24
$$ 354 -390 -553 239 466 106 -72 -442 477 306 -193 -313 18 280 35 -442 96 112 -10 -264 -488
7496d88O24L13q04J16M66k94M21o37L03L98O4q33j03M43L22o42J55J73M76k62
$$ -488 136 449 -355 -239 227 -67 354 -283 20 418 482 -351 -454 -11 311 -331 -176 -3 473 211
7516B11l66l8K82M35m87k26K37J29l6j30k47O63J3l43n0M2Q7m05n7K62J63k9o47
$$ 211 -155 -193 89 524 37 -189 48 177 141 11 -236 427 440 97 47 89 176 -229 -286 -24 139 110 -537
7539e37O65K58l81N8n35O81K23m83j57N27k93k5k53J80M54l44l34J67K42J7j9
$$ -537 128 386 5 63 -472 209 432 -51 -208 319 26 1 -252 -72 382 38 -296 -129 113 130 111
7560A11l61q9Q55p8p97L64K47j6l48j38j10L71k42jj3K93k5M7k79L91j97K68l01
$$ 111 -250 -339 516 438 -359 5 252 236 -112 -250 -360 11 -231 -232 -245 48 23 70 -209 182 -15 253 -48
7583d8k00N39k6n11R3N84j14o30J63K11k5N2p32R76K4m89k88j5N42j56l5k00L18
$$ -48 -248 291 265 -246 -153 431 317 -313 -150 61 36 88 -644 332 356 -133 -421 -436 106 -50 -85 -285 33
7606C3J85k84j20r4P14l90mm0K51k07J58j49m44N58k2j92k63N74k12k12J58J27
$$ 33 218 -66 -186 -280 434 44 40 0 251 44 202 53 -391 167 145 -47 -310 264 52 -160 -2 125
7628A25r6r2k85N66j2k73r6L03m8L8n39n8O36Q1p72n8M41L51M1k55l74M78J08
$$ 125 29 -63 -348 218 206 -67 -163 140 92 130 -409 -467 169 250 -522 -580 -139 212 253 -2 -376 102 210
7651B10l39j70K97J25k64k35M59K47j96j88K4M95k46m88K7L23P3Q8o07K81L97
$$ 210 -129 -299 -2 123 -141 -376 83 330 134 -54 -30 465 219 -269 -242 81 154 242 -365 -84 313
7672C13Kl74j40L76Q8J00l02r0J84m3k98J20K49k92r6O3J28J84r0j00j95N45n81
$$ 313 315 -59 -199 177 265 365 63 -27 157 114 -184 -64 185 -107 -203 -140 -12 172 82 -18 -213 332 -249
7695b49k88M58N6J14m84K35K97O5q2l96J88L26L1k64p2r3N65m89l05M93K27j02
$$ -249 -537 -79 -23 91 -393 -158 139 204 122 -274 -86 240 271 7 -65 -158 407 -82 -387 106 333 231
7717B31k51q5J77J29o80M22K26m31L14l25pO82j36l11J35M3q1j90k75O54j31j52
$$ 231 -20 -105 72 201 -479 -57 169 -262 52 -273 -280 402 266 -45 90 133 52 -138 -413 241 110 -42
7739d2j55mM88L2l84k74N88k61J11m13O38o0j69k90j8K56j10J35k52K69N7k55
$$ -42 -197 -201 287 319 -65 -339 249 -12 99 -314 324 264 95 -195 -213 43 -67 68 -184 85 142 -113
7761a13l1L63J17k85k7k45O69k74m36m9K12J00j39K44m08M97j30k01M46r7l84
$$ -113 -144 219 336 51 24 -221 448 174 -262 -311 -99 1 -138 106 -302 195 65 -136 310 213 -171
7782a71K61n67O71k6L18p21J85J79r2j61p9O52m82R1l02L24M3k11J42n20L43L99
$$ -171 90 -477 194 168 486 -235 -50 129 37 -124 -203 449 -33 58 -244 80 123 -88 54 -466 -123 276
7804B76k62m09M00P42m01o29j0O32j83j72j44M2L81l64M9L70R2k75l58j52K85
$$ 276 14 -395 5 747 346 -283 -293 339 156 -16 -160 -118 263 -101 -52 318 410 135 -223 -375 -90
7825i0K20k10k7M93l15l58r0L05L28j77l20J57K75k59j22k3L61K08m85L9j34O03
$$ -90 130 -80 -107 386 71 -287 -377 -72 256 79 -241 -84 191 -68 -190 -213 148 356 -129 -90 -224 379
7847C79j30m37J78K14K7l98M7K35l05K88j82PM03l52k25R5L45J38m02k48K84J44
$$ 379 249 -188 -10 204 231 -167 -120 115 -190 98 -84 -77 326 -26 -251 -156 189 327 -75 -323 -39 105
7869A05k82J13j27J50k8J21j92m5M10l27p4K38NR6m16o4L80K65o90K37J20K07
$$ 105 -177 -64 -191 -41 -69 52 -140 -185 225 -102 -176 62 67 163 -253 -317 63 328 -362 -125 -5 202
7891B02j98k81L02J45m2k87M29j55k3Q0l9l04L80j51l06M29l8J23r13L40J59M66
$$ 202 4 -277 25 170 128 -159 270 115 92 172 133 -171 209 58 -248 181 143 266 -647 -307 -148 318
7913C18j45n23J99K33j03m73K93L41K64l84Q5m10K06K44k05J14R4o1j70m79P88
$$ 318 173 -350 -151 82 -21 -494 -201 140 404 20 105 -305 -99 145 -60 54 148 87 -83 -562 226
7934B26J80l13k50j43O06j17k30N3kj30J8P9K30j07k19l4J45J13N66o24J52l48
$$ 226 406 93 -157 -300 306 189 -41 12 10 -120 -102 -23 207 100 -119 -153 -8 105 671 47 199 -149
7956a49M62o58K43O9J93j10J33j91J99l7oj11O9L50m54K12p8Q1j64j00K63J40
$$ -149 313 -345 -102 -33 160 50 183 -8 191 154 148 37 106 456 2 214 136 217 53 -47 216 356
7978C56j31l86j27O52p2j54m58J13L21O4j13j40L00l72j25p1M71J3l83K50j46
$$ 356 225 -161 -288 364 292 138 -320 -207 114 178 65 -75 225 -147 -272 -343 128 141 -242 8 -138
7999a38L05o1j67j11L6L35O9m69J31M46m08M8o5N18m71o6m1J2L82n49J17J62L72
$$ -138 167 106 -61 -172 -136 199 268 -201 -70 376 -32 16 -49 469 -2 -68 -109 -97 285 -264 -147 15 387
8022C87k83k35K20J41j69q4m28O38M0j79P8j00N0j92r7l50P35k65J57r9l9K19
$$ 387 104 -131 89 230 61 -23 -451 187 227 48 126 26 76 -116 -213 -563 172 -93 64 -35 -74 145
8044A45m89J82K55j81j15m6J71K08J14k97j50KP35l41ok26L15m7l28q2L4M13k23
$$ 145 -344 -162 93 -88 -203 -249 -78 130 244 -53 -203 -201 534 193 187 -39 276 229 -99 -181 -147 266 43
8067D3k95M50J9r0k62k54L99J45m98j61K04J99M62o69k05L79K33m23K16%K31J45
$$ 43 -252 198 217 127 -135 -389 10 155 -343 -504 -300 -101 361 -308 -513 -134 99 -324 -108 -108 123 268
8089B68m29rK17l4k68M89J13J14m37Q4Q7k91L8o0L40j27k85N0R5Q2J54m16N2j50
$$ 268 -161 -170 47 13 -255 234 347 461 24 108 195 -96 -58 -118 222 95 -190 -140 -45 37 191 -225 -173 -323
8113c23L54o2j5k45K61n2j02J55L8k05K40p9J45K23k70j38K19j42k56N32K3l62
$$ -323 31 -31 -46 -291 -30 -82 -184 -29 9 -196 44 -35 110 333 63 -75 144 2 -254 278 301 -61
8135f1K54k55J34j60K58J27k22j16ML53o74M65M6J83m06j49j41K25L18j59k2k25
$$ -61 193 -62 72 -88 170 297 75 -41 -37 316 -358 107 153 336 -70 -219 -360 -135 183 24 2 -223
8157b23M60j76k99L26l84K00j0Q0L5K61n06M7P40m51q4l47M62l72K00O9j34J85
$$ -223 237 61 -238 88 -296 -96 -106 -26 9 270 -236 -189 551 100 16 -331 131 -241 -41 28 -106 79
8179G9j78N9KP0J20l2j56J90M4l7l56J52
$$ 79 -99 -40 -38 32 152 120 -36 154 198 161 -195 -43
8191d3
$$ Imaginary data points
##PAGE= N=2
##DATA TABLE= (X++(I..I)), XYDATA
0@%%%%%%%%%%l2O4o4O4r6J28j28J60k19K51k88L52m16M81n77O94p91Q98j058J221
$$ 0 0 0 0 0 0 0 0 0 0 0 -32 32 -32 32 -64 64 -64 96 -123 128 -160 192 -224 257 -320 374 -417 481 -577 644
30F44j381J575j799K048k306K596k928L277l659M093m560N060n614O229o889P603
$$ 644 -737 838 -961 1087 -1219 1377 -1551 1726 -1933 2160 -2400 2660 -2954 3275 -3614 3989
46C989q393R261j0205J1240j2389J3648j5037J6594j8334K0288k2505K5056k8019
$$ 3989 -4404 4857 -5348 5892 -6497 7151 -7886 8708 -9626 10662 -11843 13213 -14806
59a4806L1490l5644M0733m7110N5370o6567Q2694j08014J53702k61537R54275
$$ -14806 16684 -18960 21773 -25337 30033 -36534 46160 -61854 91848 -169689 784586
70G84586O92235k316046l23897J833528R56249j840095j417652J212036J746500
$$ 784586 1476821 -839225 -1163122 670406 1626655 -213440 -1631092 -419056 1327444
79A327444q68268j903952L07353K090810K83208j849042p19267J750903J185244
$$ 1327444 459176 -1444776 -1137423 953387 1236595 -612447 -1331714 419189 1604433
88A604433j360631j569403R07769J706768m83018j902128p2858J806950N53696
$$ 1604433 243802 -1325601 -417832 1288936 805918 -1096210 -1169068 637882 1191578
97A191578j652269r48890J415711J369417j004222j572122N95846J725619j40549
$$ 1191578 -460691 -1409581 6130 1375547 371325 -1200797 -604951 1120668 980119
106I80119j755979l63045J616216P62526j420912j156865J103212J449266o99094
$$ 980119 -775860 -1138905 477311 1239837 -181075 -1337940 -234728 1214538 515444
115E15444j610485K86290J689828J75477j623384o07870J439797R87538j168271
$$ 515444 -1095041 -808751 881077 1056554 -566830 -1174700 265097 1252635 84364
124H4364j303740Q04706J518622l86862j610823m2868J591619M66822j458667
$$ 84364 -1219376 -414670 1103952 717090 -893733 -936601 655018 1121840 -336827
133c36827q60382J198559J159291q82745j392718M91954J515291o6141j504318
$$ -336827 -1197209 1350 1160641 277896 -1114822 -622868 892423 826282 -678036
142f78036l21233J423988P14963j208625j021447R20857J239877n94531j397565
$$ -678036 -999269 424719 1139682 -68943 -1090390 -169533 1070344 475813 -921752
151i21752J93854J411935J76641j351114n35322J203097Q66482r44366j091433
$$ -921752 -727898 684037 860678 -490436 -1025758 177339 1043821 99455 -991978
160i91978O61509J263067l19987j336639m6889J290983L73178j191143p01547
$$ -991978 -330469 932598 612611 -724028 -770917 520066 893244 -297899 -999446
169i99446R83444R59703p12238j134255M20285J258481o7778j256164k58274J180128
$$ -999446 -16002 943701 231463 -902792 -482507 775974 708196 -547968 -806242 373886
179C73886N64292j027643q47575P74877J036636m99507j172749J74892J217729
$$ 373886 938178 -89465 -937040 -162163 874473 374966 -797783 -622891 594838
188E94838J60527j160721m59878J040764P40991q30317r53137N65463J088739
$$ 594838 755365 -405356 -865234 175530 916521 86204 -866933 -301470 787269
197G87269k72636j155652m8573J128965L51375j024653o19783Q57202Q47965o21551
$$ 787269 514633 -641019 -689592 439373 790748 -233905 -853688 3514 851479 229928
207B29928r98654L54635J079377o8632j086891k25913J006805M86868q69203p17080
$$ 229928 -768726 -414091 665286 596654 -490237 -716150 290655 777523 -91680 -808760
217h08760O69448Q90594m26189r92358J66469J030744J06362r88091l63277Q80815
$$ -808760 -139312 751282 325093 -667265 -500796 529948 636310 -351781 -715058 165757
227A65757N89839p14222p75272M99264R02166k55027r65019j542R61140K54942
$$ 165757 755596 41374 -733898 -234634 667532 412505 -552514 -554056 407084 662026
237F62026q87553m87026P51786O78926n66827q25282L38122R07637r1741r27217
$$ 662026 -225527 -712553 39233 718159 151332 -673950 -335828 571809 480068 -447149
247d47149j59271Q82566L97069p71919n98066O10853P57263m04920q55763J73784
$$ -447149 -606420 276146 673215 -98704 -696770 -85917 671346 266426 -589337 -415553
257d15553Q94055O6031q67877k98767P79673N06346o41139o75579M59106P92210
$$ -415553 478502 544533 -323344 -622111 157562 663908 22769 -652810 -193704 598506
267E98506k49695q53269K4915Q49795J96966p89929m03595O74795N79764n14546
$$ 598506 348811 -504458 -479543 370252 567218 -222711 -626306 48489 628253 113707
277A13707p11564L24126P95847j11978q19397j00613P88487L05369p02113m85173
$$ 113707 -597857 -273731 522116 410138 -409259 -509872 278615 583984 -118129 -603302
287f03302N67182O28302l96058p29206J98345P75783R072p71514k13929P11887
$$ -603302 -36120 592182 196124 -533082 -334737 441046 450118 -321396 -535325 176562
297A76562L99591o03764n55560M53621O69385k72078p35273P3218P49774J29913
$$ 176562 576153 -27611 -583171 -129550 539835 267757 -467516 -394298 355476 485389
307D85389p09475l19798O22271M86210m89786o12508L25884O95049j40124p25637
$$ 485389 -224086 -543884 78387 564597 74811 -537697 -211813 483236 343112 -382525
317c82525n4004P03403K39877o34342m09148N18185N45413l72017o43141K00542
$$ -382525 -436529 266874 506751 -127591 -536739 -18554 526859 154842 -488299 -287757
327b87757O92742j8336o93919j60898O47092L30116n54175m71582M26097N82641
$$ -287757 404985 386649 -307270 -468168 178924 509040 -45135 -516717 -90620 492021
337D92021k67979o50861R4870O74840Q2908o52595k52959N84124M02127m76425
$$ 492021 224042 -426819 -331949 342891 425799 -226796 -479755 104369 506496 30071
347C0071n24483L35003O07162j72464o49619k894O46929J74786n99594l33287
$$ 30071 -494412 -159409 447753 275289 -374330 -377224 269705 444491 -155103 -488390
357d88390N10708M67267l85970n65215K35511O24118o8071o35754j02023O04333
$$ -488390 22318 489585 103615 -461600 -226089 398029 329958 -305796 -407819 196514
367A96514K65069n28892m05809M17394N16741k79436n88577J21301O15639M0613
$$ 196514 461583 -67309 -473118 -55724 461017 181581 -406996 -285695 329944 370557
377C70557o00218j99889N39953L40962m44457m57484L18330N40891j72167n84355
$$ 370557 -229661 -429550 110403 451365 6908 -450576 -132246 408645 236478 -347877
387c47877J7998N88378J37104n48864k77643M72941M00157l63571m92405K30336
$$ -347877 -329879 258499 395603 -153261 -430904 42037 442194 78623 -413782 -183446
397a83446N50953q3584n72453o8819N52934K14157m98602l44062M06803M48394
$$ -183446 367507 283923 -288530 -357349 195585 409742 -88860 -432922 -26119 422275
407D22275k88775n22241J50514N58974j669n56998j47026N17850K85826m40859
$$ 422275 133500 -388741 -238227 320747 319078 -237920 -384946 132904 418730 -22129
417b2129m03008L35431M91950k05096n43445O1311N57355Q6569n30063k27584
$$ -22129 -425137 -89706 402244 197148 -346297 -284986 272369 358938 -171125 -398709
427c98709M64210L51469l67226m50629K44128N13521j06847n41236l7033N26600
$$ -398709 65501 416970 49744 -400885 -156757 356764 249917 -291319 -328352 198248
437A98248J75678m75808k99191L91477M00681k79405m71206J51563N10458j3296
$$ 198248 373926 -101882 -401073 -9596 391085 111680 -359526 -207963 302495 289199
447B89199n11332j20951M77953K46092m11317l51861L16132M31081k01007m81112
$$ 289199 -222133 -343084 134869 380961 -30356 -382217 -66085 364996 163989 -317123
457c17123P0320M96638O1038m79736j89373M29286L02700l50553l94014K47884
$$ -317123 -246803 249835 310873 -168863 -358236 71050 373750 23197 -370817 -122933
467a22933M57860j27302m88515q38M87084J30675m50400k50834L84170L54227
$$ -122933 334927 207625 -280890 -281728 205356 336031 -114369 -365203 18967 373194
477C73194k89782m32572J76172M79504m9759m92439q0305M68535K03799m12109
$$ 373194 83412 -349160 -172988 306516 256757 -235682 -315987 152548 356347 -55762
487e5762l14181L24209L99973k15316m58039R0729M81700L7970m69591j61683
$$ -55762 -369943 -45734 354239 138923 -319116 -228387 253313 291283 -178308 -339991
497c39991M24948K73183l47595l61716K48311M25776j31630m56412P620M56266
$$ -339991 84957 358140 10545 -351171 -102860 322916 191286 -265126 -257506 198760
507A98760J14363m24539k27004L61969L20383k76812l91132J71807M31784n6672
$$ 198760 313123 -111416 -338420 23549 343932 67120 -324012 -152205 279579 222907
517B22907m43613o2344M24295J75087l76073k75228L03452L55999k08816m10281
$$ 222907 -220706 -283050 141245 316332 -59741 -334969 -31517 324482 115666 -294615
527b94615J02818M36761J2164m31205j24955L96167K30352l34005l20305K48041
$$ -294615 -191797 244964 257128 -174077 -299032 97135 327487 -6518 -326823 -78782
537g8782L87172j46147m28042L2319M37226Q2385m15405j92321L63451K87673
$$ -78782 308390 162243 -265799 -233480 203746 286131 -129274 -321595 41856 329529
547C29529k84640l63024J85408M11815p3528m31408m2220M20034J55849l77360
$$ 329529 44889 -318135 -132727 279088 205560 -225848 -268068 151966 307815 -69545
557f9545k54355L09468L35606k18583l88844J12707M15369j101m13615j11522
$$ -69545 -323900 -14432 321174 102591 -286253 -173546 241823 240722 -172893 -284415
567b84415L80483K11625l23850k98050K43821L59728j47052l95527M3497M03893
$$ -284415 96068 307693 -16157 -314207 -70386 289342 142290 -253237 -209740 194153
577A94153O4260l83041j64911L36103K54498k66822l25118J79613L73312q1427
$$ 194153 258413 -124628 -289539 46564 301062 34240 -290878 -111265 262047 180620
587A80620l93093k1516L87249J23112l52583k15880K93740K92343k14911l51473
$$ 180620 -212473 -233989 153260 276372 -76211 -292091 1649 293992 79081 -272392
597b72392J19005L83130j8070l89206q6272L67603J84088l17747k67126K47244
$$ -272392 -153387 229743 211673 -177533 -263805 103798 287886 -29861 -296987 -49743
607d9743L32782j56180l73323N4663L86863N0231l73574j51221L32749K40932
$$ -49743 283039 126859 -246464 -191801 195062 245293 -128281 -279502 53247 294179
617B94179k68070l10677J85960L58902q9713l79897j3248L72274J11873l41293
$$ 294179 26109 -284568 -98608 260294 170581 -209316 -222564 149710 261583 -79710
627g9710k05379K83665K79466k07727l34825J20540L65830k2045l67577p2961
$$ -79710 -285089 -1424 278042 70315 -264510 -143970 221860 199815 -167762 -240723
637b40723L46485J64977k99597k43207K30963L03665j50271l43905N7783L57816
$$ -240723 105762 270739 -28858 -272065 -41102 262563 112292 -231613 -173830 183986
647A83986L7683l47793j27700L12929K09942k55381k76293J79484L22593r3223
$$ 183986 221669 -126124 -253824 59105 269047 13666 -262627 -83143 239450 146227
657A46227l48301j983L47038R5152l21916j80492K75459K55065k05827l07294
$$ 146227 -202074 -204057 142981 238133 -83783 -264275 11184 266249 60422 -246872
667b46872J24130L39844l1777l46840o3114L27081J51242k87426k29791K25462
$$ -246872 -122742 217102 185325 -161515 -224629 102452 253694 -33732 -263523 -38061
677c8061K89158j47746l28000O1469L42709L0214l32679j18450K97966J97011
$$ -38061 251097 103351 -224649 -163180 179529 209743 -122936 -241386 56580 253591
687B53591k43565k62695J71559L08707q8861l30828K550L31923Q5992l05909j65013
$$ 253591 10026 -252669 -81110 227597 138736 -192092 -189542 142381 228373 -77536 -242549
698b42549K60565K32355j97048k84590J18301L13074l5052l23344n1622L08705
$$ -242549 18016 250371 53323 -231267 -112966 200108 165056 -158288 -209910 98795
708I8795J33148k72107k03914K19270K60034j47627k97405O7104L13656J6723
$$ 98795 231943 -40164 -244078 -24808 235226 87599 -209806 -142702 170954 187677
718A87677l08082j01280K80728J77001k32763k38504J70020K84198r3040l06655
$$ 187677 -120405 -221685 59043 236044 3281 -235223 -65203 218995 125955 -180700
728a80700J1278L07738P0881k87457j49781K43874K14477j86861k64841J14292
$$ -180700 -169422 138316 209197 -78260 -228041 15833 230310 43449 -221392 -107100
738a07100K95936l5341l03929m3669K90834J21538k55967j88105K03776K41805
$$ -107100 188836 153495 -150434 -194103 96731 218269 -37698 -225803 -22027 219778
748B19778j37608k78118O2373K94812J5878k89710r2200K65332J61103k21196
$$ 219778 82170 -195948 -133575 161237 177115 -112595 -204795 60537 221640 444
758D44k18755J62027K59223r3063k82772J5530K85177O0610k69219j31764K33985
$$ 444 -218311 -56284 202939 109876 -172896 -157366 127811 188421 -80798 -212562 21423
769B1423J93863j81956k40066J19297K70474m6321k80318k8921K71179J01621
$$ 21423 215286 33330 -206736 -87439 183035 136714 -143604 -172525 98654 200275
779B00275k43214j67181J97315K20189j38174k57095O9500K75205K672k71401
$$ 200275 -42939 -210120 -12805 207384 69210 -187885 -118385 156820 159492 -111909
789a11909p6057K48927J41332k08763j98380J53449K38506q8180k61985J8201
$$ -111909 -187966 60961 202293 -6470 -204850 -51401 187105 98925 -163060 -144859
799a44859K66805N3305k50537j18260K18809J75202j69419k18964J09531K46805
$$ -144859 121946 175251 -75286 -193546 25263 200465 31046 -187918 -78387 168418
809A68418m3083k57662k6674K49238R2678k25191j52067J84513J99205j31842
$$ 168418 125335 -132327 -159001 90237 182915 -42276 -194343 -9830 189375 57533
819E7533k32290O9814K48819k894k48616o2968K30918J25140j97315j77132J51099
$$ 57533 -174757 -104943 143876 140982 -107634 -170602 60316 185456 -11859 -188991 -37892
830c7892K17342r3966k40850L1020K47815L4851k37293r7488K09377J53045j67614
$$ -37892 179450 85484 -155366 -124346 123469 158320 -78973 -176461 32916 185961 18347
841A8347j98754J13332K29022n2140k43451j2259K39059P4869k17407j32721J80622
$$ 18347 -180407 -67075 161947 109807 -133644 -145903 93156 168025 -49382 -182103 -1481
852a481J79926j30266k13691P2385K31886p834k33561n3897K18456J11867j87806
$$ -1481 178445 48179 -165512 -93127 138759 130925 -102636 -156533 61923 173790 -14016
863a4016j60078J43834J96734r0796k19315L1351K24936K9174k16716q7852J92554
$$ -14016 -174094 -30260 166474 75678 -143637 -112286 112650 141824 -74892 -162744 29810
874B9810J38647j56246j79303J08872K07325n4153k19049l598K17201O1326j99316
$$ 29810 168457 12211 -167092 -58220 149105 94952 -124097 -127695 89506 150832 -48484
885d8484j13706J68432J59163j26400j92678P5710K12946k0620k17796l7110K07583
$$ -48484 -162190 6242 165405 39005 -153673 -77963 134983 114363 -103433 -140543 67040
896F7040R0806j82934j38837J44766J76632r6248k03893M1597K15267J5272k10580
$$ 67040 157846 -25088 -163925 -19159 157473 61225 -142668 -101071 114196 129468 -81112
907h1112p1569J91904J21881j57985j62717J14023J92234o1233k06050L909K06995
$$ -81112 -152681 39223 161104 3119 -159598 -45575 146659 85426 -120624 -116715 90280
918I0280N2191j92470j03700J64665J46109j25812j78436P7243J96564k4633k01458
$$ 90280 142471 -49999 -153699 10966 157075 31263 -147173 -69930 126634 102001 -99457
929i9457k9930J91301Q1691j68956j25987J34754J62087r1382j85514M3315J96403
$$ -99457 -129387 61914 143605 -25351 -151338 -16584 145503 54121 -131393 -88078 108325
940A08325P994j91884n8560J75363J04528j46193j43608J07817J71539o1925j88626
$$ 108325 116319 -75565 -134125 41238 145766 -427 -144035 -36218 135321 73396 -115230
951a15230J1735J92081L7865j82693q5391J59642J26766j25159j60244Q2517J81486
$$ -115230 -103495 88586 126451 -56242 -141633 18009 144775 19616 -140628 -58111 123375
962A23375l3173j90208j8054J86347O8528j69163j12036J38993J48600r8251j73856
$$ 123375 90202 -100006 -118060 68287 136815 -32348 -144384 -5391 143209 44958 -128898
973a28898N1846J86047j256j85559m9267J70790R5289j45339j34656J09284J62559
$$ -128898 -77052 108995 107739 -77820 -127087 43703 138992 -6347 -141003 -31719 130840
984A30840o6307j79125J8618J82267K9638j71845p5211J50730J15727j18338j46763
$$ 130840 64533 -114592 -95974 86293 115931 -55914 -131125 19605 135332 16994 -129769
995a29769P8933J67765l4042j76029j1844J71977N6235j56216r6804J28840J30258
$$ -129769 -50836 116929 82887 -93142 -104986 66991 123226 -32990 -129794 -954 129304
1006A29304r3466j55365N1612J68540p049j71106l7645J61086Q0071j39994j16311
$$ 129304 35838 -119527 -67915 100625 93576 -77530 -115175 45911 125982 -14012 -130323
1017a30323J09334J44563o9932j62885K6155J69717K0378j64354o4285J48198
$$ -130323 -20989 123574 53642 -109243 -83088 86629 107007 -57347 -121632 26566
1027B6566J03351j20508j35424Q4814J57181m3029j68182k386J66400M5802j52554
$$ 26566 129917 9409 -126015 -41201 115980 72951 -95231 -97617 68783 114585 -37969
1038c7969q7527J27990J22333r5924j47395N6537J62294j3542j64592k9201J55808
$$ -37969 -125496 2494 124827 28903 -118492 -61955 100339 86797 -77795 -106996 48812
1049D8812P0542j34960j05847J05595J33855o9222j51466K7829J58973J3426j54929
$$ 48812 119354 -15606 -121453 -15858 117997 48775 -102691 -74862 84111 97537 -57392
1060e7392n4589J39879R0181j15319j19957Q2718J40586m4402j52242L660J52654
$$ -57392 -111981 27898 118079 2760 -117197 -34479 106107 61705 -90537 -86877 65777
1071F5777L7392j42439p5217J23396J07969r5301j31870O0891J46848k0817j52062
$$ 65777 103169 -39270 -114487 8909 116878 21577 -110293 -49402 97446 76629 -75433
1082g5433j9936J46043N9744j30006r5319J04754J23160p2545j43024L4651J50956
$$ -75433 -95369 50674 110418 -19588 -114907 -10153 113007 40462 -102562 -67911 83045
1093H3045N157j48407m4962J35836Q0815j13009j11614Q2955J34362m6876j46109
$$ 83045 88202 -60205 -105167 30669 111484 -1525 -113139 -30184 104178 57302 -88807
1104h8807Q737J48366L0408j39780o6284J20805R8027r3933j22077O0188J37473
$$ -88807 -80070 68296 98704 -41076 -107360 13445 111472 17539 -104538 -44350 93123
1115I3123k3218j44017j5298J39283N1474j25245q4728J03234J10344p3282j29014
$$ 93123 69905 -74112 -89410 49873 101347 -23898 -108626 -5392 104952 31670 -97344
1126i7344L9254J38483k171j37325l5395J28581O9525j09386r9066Q4215J20806
$$ -97344 -58090 80393 78222 -59103 -94498 34083 103608 -5778 -104844 -20629 100177
1137A00177n2404j33791J6729J37438J9640j31465n5383J16257Q6380r3156j11672
$$ 100177 47773 -86018 -69289 68149 87789 -43676 -99059 17198 103578 10422 -101250
1148a01250O2438J28934k8805j36975o937J34652M2754j21934p5003J01728J01344
$$ -101250 -38812 90122 61317 -75658 -82595 52057 94811 -27123 -102126 -398 100946
1159A00946p2791j20832M0503J32192n395j33204k9909J25519O2166j08720r0344
$$ 100946 28155 -92677 -52174 80018 74623 -58581 -88490 37029 99195 -9525 -99869
1170i9869Q3686J11807n4271j25577J9822J30156J4736j25785m8856J13504P8575
$$ -99869 -16183 95624 41353 -84224 -64402 65754 80490 -45295 -94151 19353 97928
1181I7928r2754j02390O6214J19145l4325j26620Q23J26095L2877j16451o4719
$$ 97928 5174 -97216 -31002 88143 53818 -72802 -71979 54116 86993 -29458 -94177
1192i4177R9638R0999p5498j11431M6240J23157j3878j26743j9756J20858N1608
$$ -94177 5461 96460 20962 -90469 -44229 78928 65050 -61693 -81449 39409 91017
1203I1017j06677p9909Q3984J02709n6160j17854K4776J24470Q719j22405m0539
$$ 91017 -15660 -95569 -11585 91124 34964 -82890 -58114 66356 75075 -47330 -87869
1214h7869J11741P0041r1997r3449O6246J11010l5744j20409K982J20834K9297
$$ -87869 23872 93913 1916 -91533 -25287 85723 49979 -70430 -67448 53386 82683
1225H2683j13655n9429R7236Q4653p5064j04232M7357J15625j6453j18987j5600
$$ 82683 -30972 -90401 6835 91488 16424 -87808 -40451 75174 58721 -60266 -75866
1236g5866J14811M6250j01546p3520Q2577R5554n7847j09707K8742J17069J950
$$ -75866 38945 85195 -16351 -89871 -7294 88260 30413 -79294 -50552 66517 68467
1247F8467j15626l2219J06400O0279r0028q4925O7356J02712m0269j14337J0633
$$ 68467 -47159 -79378 27022 87301 -2727 -87652 -20296 82416 42147 -72190 -61557
1258f1557J16488J9929j11022m9004R7479P4824p6369r5398N0743J08743k0535
$$ -61557 54931 74860 -36162 -85166 12313 87137 10768 -84630 -33887 74856 54321
1269E4321j14328j0259J11910M0375j01318o6514Q3383Q7907n9170j03580L1201
$$ 54321 -60007 -70266 41644 82019 -19299 -85813 -2430 85477 26307 -77273 -46072
1280d6072J10597n63j10980k9528J02277N6637q7166q0059O6128R6806m0024j06983
$$ -46072 64525 63962 -47018 -76546 25731 82368 -4798 -84857 -18729 78077 38053 -68930
1292f8930J2255J09436J7313j03605m5014R1511O9382p2359q9018M9275J01844
$$ -68930 -56675 52761 70074 -33531 -78545 12966 82348 9989 -79029 -29754 72090
1303G2090k2243j08244n828J06217L2607r6772n8169Q0538P9690n9318r5956L3996
$$ 72090 49847 -58397 -64225 41992 74599 -22173 -80342 196 79886 20568 -75388 -41392
1315d1392J04703n906j06647k1930J01030M8531q7899p1172O8423Q9694m4146
$$ -41392 63311 57405 -49242 -71172 29858 78389 -9510 -80682 -12259 77435 33289
1326C3289j00580J5976J05378J2515j02274l9590R1591O3888p4753q3197N1465
$$ 33289 -67291 -51315 54063 66578 -35696 -75286 16305 80193 5440 -77757 -26292
1337b6292R7018k6582j02613j678J00840K9321r2544n4630P7943P5472n7392r0567
$$ -26292 70726 44144 -58469 -60147 40693 70014 -22530 -77160 783 76255 18863 -71704
1349g1704L3766R9286p471j00273j8848R4670M3909q2184o5080O3430Q2673m1917
$$ -71704 -37938 61348 53877 -46396 -65244 29426 73335 -8849 -73929 -10499 72174 30257
1361C0257r4082J6745R8396Q508r6095l3225Q6432N5918p1658p4396N1377Q8238
$$ 30257 -63825 -47080 51316 59824 -36271 -69496 16936 72854 1196 -73200 -21823 66415
1373F6415k7597r5385K042R6537K3814r0385m7434P8008O7980n9880q3335L7519
$$ 66415 38818 -56567 -54525 42012 65826 -24559 -71993 6015 73995 14115 -69220 -31701
1385c1701R3220j2392r6448j3447R1829L8614q1738o0959O5230P7963m4644q9588
$$ -31701 61519 49127 -47321 -60768 31061 69675 -12063 -73022 -7792 70171 25527 -64061
1397f4061K0859R4321M559r2403k9489Q4441N1866o9575p0279N0461Q4256k7870
$$ -64061 -43202 51119 55678 -36725 -66214 18227 70093 518 -69761 -19300 64956 37086
1409C7086r1184L833R1742K0184q5456m3000P3826O1362n6681p6542L5170Q6043
$$ 37086 -54098 -50265 41477 61661 -23795 -66795 7031 68393 11712 -64830 -29660 56383
1421E6383j2042q9561j1207Q6075L3627p7127n3604O3196O9625m3921q1162K2598
$$ 56383 44341 -45220 -56427 29648 63275 -13852 -67456 -4260 65365 21444 -59718 -37120
1433c7120Q7140M00q6331k3831Q0281M5673o8685o3673N2116P7169l1876q5250
$$ -37120 50020 50420 -35911 -59742 20539 66212 -2473 -66146 -14030 63139 31263 -53987
1445e3987Q960Q7267J4011q3055l6700P2413N6579n7433p2234L8519Q2208j6810
$$ -53987 -45027 42240 56251 -26804 -63504 8909 65488 8055 -64179 -25660 56548 39738
1457C9738q6197o048Q4590K8322p6604m7693O2783O4843m4599p6681K3935Q3329
$$ 39738 -46459 -52507 32083 60405 -16199 -63892 -1109 63734 19135 -57546 -33611 49718
1469D9718j969q3906k0411P8386L9915o6578n8125N0943P0857l1797p8724J0030
$$ 49718 47749 -36157 -56568 21818 61733 -4845 -62970 -12027 58830 27033 -51691 -41661
1481d1661Q1079J2202p8334l2219O9437N0931n5885o4831L8896P4592j8987p9201
$$ -41661 39418 51620 -26714 -58933 10504 61435 5550 -59281 -20385 54207 35220 -43981
1493d3981j859P8002K3687p2488m2985O1007N9348m5898p1440K7027P7969o152
$$ -43981 -45840 32162 55849 -16639 -59624 1383 60731 14833 -56607 -29580 48389 42237
1505D2237p9609j4951P4716L5290o5342n2768N0860O6751l2809p5016J2660P9074
$$ 42237 -37372 -52323 22393 57683 -7659 -60427 -9567 57184 24375 -50641 -37981 41093
1517D1093P969p6505k7748O8656M5692n5773o0687L9359P0865k0095p6119q43
$$ 41093 49062 -27443 -55191 13465 59157 3384 -57303 -17944 52921 32826 -43293 -44136
1529d4136P5883K0269p0591l9163O0081N4837m5496o6042K7694P2661p640p4018
$$ -44136 31747 52016 -18575 -57738 2343 57180 11684 -54358 -26664 45997 38357 -35661
1541c5661j2471P0877L1407o2026m8093M9912O0988l4163o9304J5344P3233L873
$$ -35661 -48132 22745 54152 -7874 -55967 -6055 54933 20770 -48534 -33190 40043 43916
1553D3916p1433k3487O5235M0390n4204n5636L9856O5871k2254p1742L238P2718
$$ 43916 -27517 -51004 14231 54621 417 -55219 -15363 50508 28254 -43488 -40250 32468
1565C2468J5175o7547l3260N8625M8973m5137o1233K8995O8526r445p1606r025
$$ 32468 47643 -19904 -53164 5461 54434 9297 -51936 -22941 45585 36140 -35466 -44491
1577d4491O9237K7141o2272m3316N0209N5775l4539o5222J6626O9669J715o9121
$$ -44491 24746 51887 -10385 -53701 -3492 52283 17744 -47478 -30852 38817 40532 -28589
1589b8589k0488O3606L7643n3893n1240M0439O0954k3435o6438N820O7677J2663
$$ -28589 -49077 14529 52172 -1721 -52961 -12522 48432 24997 -41441 -35621 32056 44719
1601D4719o4145k9719N5868M5105m4214n7210K9766O3994j2674o7486m747O5324
$$ 44719 -19426 -49145 6723 51828 7614 -49596 -19830 44164 31490 -35996 -40743 24581
1613B4581K2012n8921l7983M8736N0751l4747o0230J8373O6081j284o6243j6050
$$ 24581 46593 -12328 -50311 -1575 49176 14429 -45801 -27428 38653 37369 -28874 -44924
1625d4924O1953L2329n2869m5983M0159N6588k4780o2876P362O5053J0204o2437
$$ -44924 17029 49358 -3511 -49494 -9335 47253 22473 -40403 -33041 32012 42216 -20221
1637b0221k7274N5485M1273m4368n3051L0309N9793j3533o3652l502O2612K0295
$$ -20221 -47495 7990 49263 4895 -48156 -17847 41946 28413 -35239 -38741 23871 44166
1649D4166n6806l5554M7728M8377l4360n7286J9819O1781l516o2030j3116N7932
$$ 44166 -12640 -48194 -466 47911 13551 -43735 -23916 37865 34349 -27681 -40797 17135
1661A7135K8676n0134m2401L9123N1996k5078n8917R693O1118O359n9551k1845
$$ 17135 45811 -4323 -46724 -7601 44395 19317 -39600 -29907 31211 37570 -21981 -43826
1673d3826N3562L5849m3934m7077L1148N5562j6189n9119k09N9718J6096n5699
$$ -43826 9736 45585 1651 -45426 -14278 41284 25095 -34024 -34233 25485 41581 -14118
1685a4118l0720M7908M2899l6293n1822K1741N7268n906n9166j0012N5535K5690
$$ -14118 -44838 3070 45969 9676 -42146 -20405 36863 30957 -28209 -38221 17314 43004
1697D3004m9849l8428L9756M8197k6497n5113J1986N7641M022n6322j8875N0935
$$ 43004 -6845 -45273 -5517 42680 16183 -38930 -26944 30697 34719 -21603 -40478 10457
1709A0457L2877m1988m3866L0499N1748j6421n6428J686N6710J2564n2686k6603
$$ 10457 43334 1346 -42520 -12021 39727 23306 -33122 -31436 25274 37838 -14848 -41451
1721d1451M5129L8183l4727m7469K1903N3339p846n5227o653N3596K0491m8084
$$ -41451 3678 41861 7134 -40335 -18432 34907 27061 -28166 -34819 18777 39268 -8816
1733h816l2755L9243M3065k7721m9655J3652N4049O14n3931j5055N0218K8474
$$ -8816 -41571 -2328 40737 13016 -36639 -22987 31062 31676 -22255 -37310 12908 41382
1745D1382m2942l9665L1791M7918j9264n2125M608N3231R520n0700k3291M4801
$$ 41382 -1560 -41225 -9434 38484 19220 -32905 -28297 24934 34454 -16246 -39537 5264
1757E264L4917l5103m4189K3405N0207r794n2535l882N1404J7499m5837l0211
$$ 5264 40181 5078 -39111 -15706 34501 24707 -27828 -31710 19694 37193 -8644 -38855
1769c8855L7890L9607k6772m6898J3835N0739p44n1352j2624M7664K4801m0859
$$ -38855 -965 38642 11870 -35028 -21193 29546 28802 -22550 -35174 12490 37291 -3568
1781c568l4725L1128M2782j9215m8162O470M9977O728m7798j9701M3671L0588
$$ -3568 -38293 -7165 35617 16402 -31760 -25290 24687 31415 -16383 -36084 7587 38175
1793C8175l5528l8945K4411M5830j2445m8904r40M8580J4084m5247k6036L7828
$$ 38175 2647 -36298 -11887 33943 21498 -27406 -28346 20234 34318 -10929 -36965 863
1805H63L6008k8137m3802J7259M7691m327m9076q555M6617K0904m0439l2078L2111
$$ 863 36871 8734 -35068 -17809 29882 25555 -23521 -32076 14541 35445 -4994 -37072 -4961
1818d961M0246k0505m6103Q762M8245M158m7030j6079M2018K7138l4730l6054
$$ -4961 35285 14780 -31323 -22561 25684 29842 -17188 -33267 8751 35889 1159 -34895
1830c4895K4306M2613j2658m6353K8M6281J1981m3151k3102L7463L2175k7922
$$ -34895 -10589 32024 19366 -26987 -26959 19322 31303 -11848 -34950 2513 34688 6766
1842F766l9789J7803M3921n777m5194o615M3841J8436l9049k8982L2210L5956
$$ 6766 -33023 -15220 28701 22924 -22270 -28885 14956 33392 -5657 -34639 -2429 33527
1854C3527k1850m2272J1149M4981O32m4005j3321M0498K3773l4040l3297K5560
$$ 33527 11677 -30595 -19446 25535 26167 -17838 -31159 9339 33112 -928 -34225 -8665
1866h665M0080j4903m4017L394M5055Q322m2435j9345L6787K9749k8673l7326
$$ -8665 31415 16512 -27505 -24111 20944 29266 -13169 -32514 4273 34022 5349 -31977
1878c1977J8676M2025p144m4455m118M2949J5127l8437k5807L1457L3697k2025
$$ -31977 -13301 28724 21580 -22875 -26993 15956 31083 -7354 -33161 -1704 31993 9968
1890I968l9527J1163M2152J22m1876j1441L9041K1913l2949l0440K5369L6675
$$ 9968 -29559 -18396 23756 23878 -17998 -29439 9602 31515 -1434 -31874 -6505 30170
1902C0170j5629m0094M375M1190O850l9724j7018L5078K6354k8038l4068J9171
$$ 30170 14541 -25553 -21178 20012 26862 -12862 -29880 5198 31552 3514 -30554 -11383
1914a1383L8641r029m0822j962M0307J2444l6568k2590L0700L0969k2318l6748
$$ -11383 27258 18229 -22593 -24555 15752 28196 -8372 -30962 -262 30707 8389 -28359
1926b8359J2062M0552j846m0429r220L8439J8924l3137k7260K5478L4036j6224
$$ -28359 -16297 24255 22409 -18020 -27240 11199 30123 -3014 -30274 -4796 29240 13016
1938A3016l8412N632L9805M898l8545j5253L4320K4314k8006l1401J9167L6345
$$ 13016 -25396 -19764 20041 24939 -13606 -28859 5461 29775 1769 -29632 -10465 25880
1950B5880r276l8487q37L8158J1518l4947k0772K9795K7940k1580l4014J2931
$$ 25880 16604 -21883 -22720 15438 26956 -7991 -28763 1032 28972 7392 -26622 -13691
1962a3691L6883l129l8072o312L5148J6645l1185k4397K4003L0897j5665l5834
$$ -13691 23192 20063 -18009 -24321 10827 27472 -3713 -28110 -4107 26790 11125 -24709
1974b4709O865L7226L114l6211j2414L2476K1151k6431k8451J8949L3697j0029
$$ -24709 -17844 19382 22496 -13715 -26129 6347 27498 1067 -27384 -8435 25262 15233
1986A5233l6293M10L6848Q643l3532j8483K9524K5420k2018l1478J3122L4937
$$ 15233 -21060 -20650 16198 24841 -8691 -27174 2350 27770 5752 -25726 -12604 22333
1998B2333m025l5661o355L4616J4737l0442k2526K4412K9174j6636l3304P669
$$ 22333 18308 -17353 -23708 10908 25645 -4797 -27323 -2911 26263 9627 -23677 -16008
2010a6008L5119K031l4304j0583L0578J9451k6054k5853J8698L0969j0747l3933
$$ -16008 19111 21142 -13162 -23745 6833 26284 230 -25623 -6925 24044 13297 -20636
2022b0636J796L4102O989l1734j5136K7126K2620k1238k8356J3681L2396n467
$$ -20636 -18840 15262 22251 -9483 -24619 2507 25127 3889 -24467 -10786 21610 16143
2034A6143l3262l579L2657J1791k9407j9240K3822K5458j6522k9931Q545L2472
$$ 16143 -17119 -20698 11959 23750 -5657 -24897 -1075 24383 7861 -22070 -13525 18947
2046A8947J05l2500q916K9922J6968k5811k3533J9479K8335j2089l0750K718L2414
$$ 18947 19052 -13448 -22364 7558 24526 -1285 -24818 -5339 22996 10907 -19843 -17125 15289
2059A5289N222l0062j3691K6673K0935k1699k5954J4283L0153o313l1610j915
$$ 15289 20511 -9551 -23242 3431 24366 2667 -23287 -9004 21149 14836 -16774 -18689
2071a8689L0736R938k7572j7567K2584K3732j6625k8009Q913L0488j072l0359
$$ -18689 12047 21985 -5587 -23154 -570 23162 6537 -21472 -12559 17929 16857 -13502
2083a3502o952K8455J3875k4315k0018J8155K5690j1575k8551M162K9646L968
$$ -13502 -20454 8001 21876 -2439 -22457 -4302 21388 9813 -18738 -14576 15070 19038
2095A9038k8716j1903K6231J8119k1064k3788J4895K7246p230k9096m57K8499
$$ 19038 -9678 -21581 4650 22769 1705 -22083 -7188 20058 12828 -16268 -16725 11774
2107A1774Q428k6342j6334K3254K0854j6454k6151J0259K7990k212k8516n432
$$ 11774 20202 -6140 -22474 780 21634 5180 -20971 -10712 17278 15066 -13450 -18882
2119a8882K7043J2788k3397j9235J8994K3452j1672k7584N199K8415K365k7693
$$ -18882 8161 20949 -2448 -21683 -2689 20763 9091 -18493 -13294 15121 17486 -10207
2131a0207r651K4651J6050k0145k0995J3428K5436p501k7462P81K7359O862k5869
$$ -10207 -19858 4793 20843 698 -20297 -6869 18567 11066 -16396 -15615 11744 18606 -7263
2144g263j3069K1873J8907j6761k2994J0671K5642l254k6744l916K5813J0939
$$ -7263 -20332 1541 20448 3687 -19307 -8636 17006 13752 -12992 -16908 8905 19844
2156A9844k3608j6667J8795K1218j2828k4748O491K6188P95k6206p886K3972J4322
$$ 19844 -3764 -20431 -1636 19582 6754 -17994 -11503 14685 15480 -10726 -18612 5360 19682
2169A9682k0251j9760J5293K3338q163k6029J808K6509N012k4597j1309K0813
$$ 19682 -569 -20329 -5036 18302 10139 -15890 -14082 12427 17439 -7158 -18467 2346
2181B346J7519j6765k1708J0626K4836m363k5857k569K5050R147k2267j5188J8139
$$ 2346 19865 3100 -18608 -7982 16854 12491 -13366 -15935 9115 18262 -4005 -19193 -1054
2194a054J9679j2584k3401O620K4950J94k4633o757K2907J2961j9752j7787J5020
$$ -1054 18625 6041 -17360 -10740 14210 14404 -10229 -16986 5921 18882 -870 -18657 -3637
2207c637K1685r297k4135L008K4016M362k3619j0506K0921J5790j7125j9669J1193
$$ -3637 18048 8751 -15384 -12376 11640 16002 -7617 -18123 2798 18588 1463 -18206 -7013
2220g013K2942n230k4262r94K3473P549k1479j2940J7767J8015j3035k1744P941
$$ -7013 15929 10699 -13563 -14557 8916 16465 -5014 -17954 -187 17828 4793 -16951 -9010
2233i010K3174q48k3755n409K2465J0944j9335j5955J5066J9255q957k2291K808
$$ -9010 14164 13316 -10439 -15848 6617 17561 -1774 -17729 -2663 16592 7635 -14656 -11848
2246a1848K3216L313k2713q949K0587J3754j6492j8187J1731K1321n818k2161
$$ -11848 11368 14681 -8032 -16981 3606 17360 868 -17319 -5588 15733 9915 -12246
2258a2246j078K2430O572j9813j2805J7900J6283j3407j9655Q119K1334k012k1895
$$ -12246 -13324 9106 15678 -4135 -16940 960 17243 3836 -15819 -7700 13634 11622 -10273
2271a0273m367K1314R358j8617j4291J4703J8001r659k0714L946K2150J744k1908
$$ -10273 -14640 6674 16032 -2585 -16876 -2173 15828 6169 -14545 -10599 11551 13295 -8613
2284h613o936J9577J2473j6025j6380J1057K0016o033k1370L47K1782M498k0000
$$ -8613 -15549 4028 16501 476 -15904 -4847 15169 9136 -12234 -11887 9895 14393 -5607
2297e607j0116J6788J5394j3423j8473Q063K0860l084k0923l007K0179Q577j8397
$$ -5607 -15723 1065 16459 3036 -15437 -7374 13486 10402 -10521 -13528 6651 15228 -3169
2310c169j2792J4594J6690j0101j9037M909J9953J313j9825o593J8514J1108j5631
$$ -3169 -15961 -1367 15323 5222 -13815 -8906 11047 12360 -7465 -14058 4456 15564 -67
2323f7j5110J0958J8482o833j9531J280J9623M054j8709r103J6376J3872j2833
$$ -67 -15177 -4219 14263 7430 -12101 -10821 8802 12856 -5853 -14956 1420 15292 2459
2336B459j6445P829J8957l559j9513k230J9419P102j7263j1489J4579J4825r967
$$ 2459 -13986 -6157 12800 9241 -10272 -12502 6917 14019 -3244 -14733 -154 14671 4704
2349D704j7911M846J9913p72j8989m905J7854R279j4767j3845J1321J6935p165
$$ 4704 -13207 -8361 11552 10780 -8209 -13114 4740 14019 -748 -14593 -3272 13663 6498
2362F498j8394K047J8814L165j7877q065J5969J2321j2897j5088Q510J7640l989
$$ 6498 -11896 -9849 8965 12130 -5747 -13812 2157 14478 1581 -13507 -4997 12643 8654
2375H654j8669p96J7837N790j6595r987J3979J3478j0220j6457N935J7735r46
$$ 8654 -10015 -10811 7026 12816 -3779 -13766 213 13691 3471 -12986 -7051 10684 9738
2388I738j7859l971J7013Q494j5079j1649J1448J4816p136j7172K784J8602J279
$$ 9738 -8121 -12092 4921 13415 -1664 -13313 -1865 12951 5815 -11357 -8573 10029 11308
2401A1308j7524o572J5881J0305j2969j3731Q927J6348m700j7411l6J7532M131
$$ 11308 -6216 -12788 3093 13398 429 -13302 -4375 11973 7273 -10138 -10174 7358 11489
2414A1489j5820r025J4280J2159j0565j5064O380J6734j853j6929k795J6366P363
$$ 11489 -4331 -13356 924 13083 2518 -12546 -6166 10568 8715 -8214 -11009 5357 12720
2427A2720j4742j0664J1210J4224p732j6525L864J6602R29j6005n509J4447R796
$$ 12720 -2022 -12686 -1476 12748 5016 -11509 -7645 8957 9886 -6119 -11628 2819 12615
2440A2615j2403j2593Q722J4828m699j6608R37J6762L464j5388p557J3304J1344
$$ 12615 212 -12381 -3659 11169 6470 -10138 -9201 7561 11025 -4363 -11920 1384 12728
2453A2728j0365j3882O531J5551k463j6167j967J6016N502j4309r788J2141J2028
$$ 12728 2363 -11519 -4988 10563 8100 -8067 -10034 5982 11484 -2825 -12613 -472 11556
2466A1556p925j4534M293J5630j03j5664m486J4791Q436j2814j1354R482J3983
$$ 11556 3631 -10903 -6610 9020 8917 -6747 -11233 3558 11994 -820 -12174 -2692 11291
2479A1291n248j5910J937J5611K531j5293o117J2810J0415j0665j2668O904J4910
$$ 11291 6043 -9867 -7930 7681 10212 -5081 -11198 1612 12027 1362 -11306 -4402 10508
2492A0508l305j5848p90J4870N216j3493q692J1586J1134p971j3783M585J5117
$$ 10508 7203 -8645 -9435 5435 10651 -2842 -11534 52 11186 3215 -10568 -5983 9134
2505I134o99j4993l362J4156P048j2192j0289R584J2392o230j3661J755J4494
$$ 9134 8435 -6558 -9920 4236 11284 -908 -11197 -1613 10779 4549 -9112 -7357 7137
2518G137K053j4364n626J3002Q877j0272j2057P760J3469l901j4523O1J4092M458
$$ 7137 9190 -5174 -10800 2202 11079 807 -11250 -3490 9979 6078 -8445 -8384 5708 10166
2532A0166j2991p915J1387J0564q470j2681M859J4229j482j4529j987J3145O246
$$ 10166 -2825 -10740 647 11211 2741 -9940 -5081 9148 7666 -6863 -8850 4295 10541
2545A0541j1889r511R257J1666n938j3251K276J3847J578j3672m830J2159Q211
$$ 10541 -1348 -10859 -1602 10064 4126 -9125 -6849 6998 8576 -5096 -9926 2233 10444
2558A0444j0030j0668P289J2354l931j2873J7J3364L298j2253o775J0619R277
$$ 10444 414 -10254 -2965 9389 5458 -7415 -7398 5966 9264 -2989 -9764 855 10132
2571A0132q269j1350M740J3184j463j3643j829J2578N495j1571q118R285J0301
$$ 10132 1863 -9487 -4747 8437 6974 -6669 -8498 4080 9575 -1996 -10114 -829 9472
2584I472o074j2330L465J2485P86j3059l588J1334P213r667r734P234J1541m084
$$ 9472 3398 -8932 -5467 7018 7804 -5255 -8843 2491 9704 37 -9697 -2463 9078 4994
2598D994j3084J061J3072K184j2426n312J0752Q344p647j1257N156J2078k099
$$ 4994 -8090 -7029 6043 8227 -4199 -9511 1241 9585 1938 -9319 -4163 7915 5816
2611E816j2130j432J2275M810j1127p496R366R038o565j0631L074J2175j75j2019
$$ 5816 -6314 -7746 4529 9339 -1788 -9284 82 9120 2555 -8076 -5002 7173 6998 -5021
2625e021l149J0975O314r704q723P596J0284m591j1950J998J1766J665j1095m478
$$ -5021 -8170 2805 9119 -585 -9308 -1712 8572 3981 -7969 -5971 5795 7460 -3635 -8113
2639h113R449P439p656r916N889J0754k472j2054k72J1752K878j0118o030Q653
$$ -8113 1336 8775 1119 -8797 -2908 7846 5374 -6680 -6952 4800 7678 -2440 -8470 183
2653A83Q611o509j0468L814J1056n83j1865j907J0958N252r752p353P351R350
$$ 183 8794 2285 -8183 -4369 6687 6104 -5761 -7668 3290 8542 -1210 -8563 -1212 8138
2667H138m766j0531J423J1693Q26j0691m004R851O901q412q536N712J0100l166
$$ 8138 3372 -7159 -5736 5957 6783 -3908 -7912 1939 8840 428 -8108 -2396 7704 4538
2681D538j0858K4J0682K990j0128n368Q357P589o548r283M653J0203j326j0911
$$ 4538 -6320 -6296 4386 7376 -2752 -8120 237 7826 1278 -8005 -3352 6851 5525 -5386
2695e386j016J0288L454q716o669P210Q810n349r702K564J0538K23j0697k454
$$ -5386 -6402 3886 7340 -1376 -8045 -835 7975 2626 -7076 -4512 6026 6249 -4448 -6902
2709f902R328N200q184p336O252R031l633j0130O92J0889J570r835m553Q737O915
$$ -6902 2426 7626 -558 -7894 -1642 7389 3756 -6374 -5682 5207 6777 -3058 -7611 1126 8041
2724H041p163q479M749R552j984j0095o48J0054K985q621n961P825P332n499r249
$$ 8041 878 -7601 -2852 6700 4716 -5379 -6027 4027 7012 -1609 -7570 255 7587 2088 -7161
2739g161L357R603n25r667k147R085M574q108o616O559Q335m049r536J505J0229
$$ -7161 -3804 5799 5274 -4393 -6540 2545 7119 -989 -7605 -1046 7289 3240 -6296 -4791 5438
2754E438Q17r499l844Q812N655o805p396M241R195k321r954J02R584K583r156
$$ 5438 6255 -3244 -7088 1724 7379 574 -6822 -2581 6614 4293 -5661 -5559 4025 6608 -2548
2769b548m842P383P064n635q533L863R008o71r839j320R133L845q028o124O868
$$ -2548 -7390 -7 7057 1422 -7111 -3248 5760 5089 -4750 -6070 3063 6908 -1120 -7244 -376
2784c76P563m596r192K640R455K0r035l102Q202N022o371p178N118Q030k770q949
$$ -376 7187 2591 -6601 -3961 5494 5514 -3521 -6623 1579 6601 230 -6948 -1830 6200 3430 -5519
2800e519R99Q681J921q656l979P256O278n950p154L192Q879j684r139l36Q703
$$ -5519 -4520 4161 6082 -2574 -6553 703 6981 1031 -6123 -2931 5948 4264 -4875 -5211 3492
2815C492K563p382n318O346O858m520q110K508Q481J53q963k312Q335M431p045
$$ 3492 6055 -1327 -6645 -299 6559 2039 -6071 -3563 4918 5071 -3892 -6204 2131 6562 -483
2830d83o158N273P148l107q104J082Q762P39p997l537P622N496o107p077M124
$$ -483 -6641 -1368 5780 2673 -5431 -4349 4413 5152 -2845 -6382 1240 6736 629 -6448 -2324
2845b324Q051k120q193j36P968K796p595m474O074O462m809p353K474P939j43
$$ -2324 5727 3607 -4586 -4722 3246 6042 -1553 -6027 47 6509 1700 -5653 -3179 4760 4617
2860D617q263j713P493M355p338n129N278O729l225p909J076Q475O09p930l007
$$ 4617 -3646 -5359 2134 6489 -849 -5978 -700 6029 2804 -5105 -4029 4446 5055 -2875 -5882
2875e882P217M880o176n885M084P045j976p884j62P916J954p060l904N991N618
$$ -5882 1335 6215 39 -5846 -1762 5283 3307 -4577 -4739 3177 5131 -1929 -5833 158 5776
2890E776m689o393K651P027l55p718j161P249L290o696m494M649O495l498p406
$$ 5776 1087 -5306 -2655 4372 4017 -3701 -4862 2387 5677 -1019 -5513 -864 5631 2133 -5273
2905e273K035P393J60p292k418O800M338n848n306M274O197k016p245O1P416J875
$$ -5273 -3238 4155 4315 -2977 -5395 1405 5743 -105 -5411 -1137 5060 3044 -4201 -4140 3276 5151
2921E151p043l246O177M663m896o082L083O689j112p195n71O715K708o175m395
$$ 5151 -1892 -5138 1039 5702 806 -5276 -2193 4496 3384 -3811 -4382 2333 5041 -1134 -5529
2936e529N183N763l866o577K425O653k51o719j521N932L807n828m275M086N894
$$ -5529 -346 5417 1551 -5026 -2601 4052 3801 -2918 -4439 1493 5300 -528 -4803 -717 5177
2951E177k970o527J178O583Q10o859k416N962M390m978n272L245N969j384o670
$$ 5177 2207 -4320 -3142 3441 4251 -2608 -5024 938 5328 350 -4922 -1677 4292 2908 -3762
2966c762n48O812K239o218l710N620M523l566n846K280O261n31o513r37O157K771
$$ -3762 -4310 2502 4741 -1477 -5187 433 4956 1390 -4456 -2176 4085 3554 -2959 -3896 2261 5032
2982E032n983m074M738M674k661n923J369O323R17p128j668N634L292m573n215
$$ 5032 -951 -5025 -287 4387 1726 -4197 -2828 3495 4412 -2716 -4384 1250 4542 -31 -5246
2997e246M047N596k382n961R21N773J408o025k554N068M392m197n225K519O289
$$ -5246 -1199 4397 2015 -3946 -3025 2748 4156 -1869 -4423 645 5037 840 -4385 -1866 4423
3012D423j583o039l69N720K178n458l957N032M423l188n229J598N864Pn983j560
$$ 4423 2840 -3199 -3568 2152 4330 -1128 -5085 -53 4370 1182 -4047 -2449 3415 3422 -2561 -4121
3028d121N771L008m759m662M424M858k832n291R08N417J063n603k466N302L531
$$ -4121 1650 4658 -101 -4763 -339 4519 1687 -3604 -2696 2721 3784 -1819 -4285 1017 4548
3043D548m295m524K684N489j317n935k32N981J322n061l087M682M291l279m988
$$ 4548 253 -4271 -1587 3902 2585 -3350 -3582 2399 3721 -1340 -4427 255 4546 1267 -3721
3058c721J895N642j170n253q76N122K210m412l800L701M785k486n192N58N951
$$ -3721 -1826 3816 2646 -2607 -3483 1639 3849 -563 -4363 -662 4123 1637 -3555 -2997 2954
3073B954L24n763j799N193L533m091m486L119N122k202n454P08N474R15m763k933
$$ 2954 3278 -2485 -4284 909 4442 351 -4135 -1016 4106 1904 -3550 -2842 2632 3547 -1216 -4149
3089d149M606L808l723m324J962N322j107n383o49N452K058m598l516M183M027
$$ -4149 457 4265 542 -3782 -1820 3502 2395 -2988 -3637 1815 3873 -725 -4241 -58 3969
3104C969k841m850J616N230K6n778j011N016K786m516l879L488M681k233n337
$$ 3969 1128 -3722 -2106 3124 3150 -2628 -3639 1377 4163 -353 -4232 -744 3937 1704 -3633
3119c633J065N187Q58n050k523M850L236l508m516K828M697j147n392k63N634
$$ -3633 -2568 2619 3477 -1573 -4096 754 3990 482 -4034 -1206 3491 2344 -3048 -3311 2323
3134B323J193m674k701L978L647k691m546J568N123m90m827j497N290K060m321
$$ 2323 3516 -1158 -3859 119 3766 1075 -3471 -1903 3220 2730 -2097 -3594 1696 3756 -565
3149e65l241L107M461k359m864R33M906R08n173j488M233L033l743l858K660M419
$$ -565 -3806 -699 3762 1403 -3461 -2528 2378 3286 -1887 -3375 858 3891 148 -3710 -1050 3369
3165C369j271m862L70M539J341m554k599M029L235k847l975J514N005o94m828
$$ 3369 2098 -2764 -2394 2145 3486 -1068 -3667 362 3597 750 -3225 -1711 3294 2600 -2228
3180b228j034M801K157m759k851L879L477k268m503J359M295N77m904j189M283
$$ -2228 -3262 1539 3696 -1063 -3914 -35 3442 1174 -3329 -1970 2325 2902 -2002 -3191 1092
3195A092K509m089l320L259L870j621m645N33M964O83m492k071L876L168l281
$$ 1092 3601 -488 -3808 -549 3321 1700 -2945 -2412 2552 3235 -1257 -3328 548 3716 435
3210D35l796K222M288j450m254L1M427J179l961k364L380L437k717l812J720M002
$$ 435 -3361 -1139 3149 1699 -2555 -2524 1903 3082 -879 -3243 137 3574 857 -2955 -1235 2767
3226B767k63m712q39M132K110l950k552K984L869k462l897P04M378K02m264j473
$$ 2767 2504 -2208 -3047 1085 3195 -755 -3307 -323 3546 1084 -2813 -2109 2269 2471 -1793 -3266
3242c266M014K578l358l191K384M148j597m292J35M436J141m315k103L794K772
$$ -3266 748 3326 -32 -3223 -839 3309 1712 -2580 -2445 1991 3132 -1183 -3286 508 3280
3257C280k546l909J814M161r56l883m87L702J545l241k484K708L350j929m004
$$ 3280 734 -3175 -1361 2800 1844 -2039 -2526 1176 2721 -520 -3004 -296 3054 1125 -2879
3272b879J195M029k63l824r12L789J970l051k543K105L175j477l573J03M050O83
$$ -2879 -1684 2345 2082 -1742 -2654 1135 3105 54 -2489 -384 2791 1314 -2259 -2156 1894 2577
3288B577m176j605L955K383k797l320J595M156j179l805L2L446J383l745k258
$$ 2577 -1599 -3204 751 3134 337 -2983 -1388 2768 1589 -2216 -2184 1262 2645 -1100 -3358
3303c358L399K895j981l772J308L937k68l876r09L982J708l662k220K556K841
$$ -3358 41 2936 955 -2817 -1509 2428 2160 -1716 -2625 1357 3065 -597 -2817 -261 2580
3318B580j651l741J002L878K60m096p21L135K504l400k562K044L378j112l984
$$ 2580 929 -2812 -1810 2068 2328 -1768 -2489 646 3150 -250 -2812 -768 2610 1498 -2486
3333b486M70M161M61l463k019L141K624k430l253J563L387m59l815J6L664R27
$$ -2486 -2016 2145 2606 -857 -2876 265 2889 459 -2794 -1231 2156 1697 -2118 -2102 1562 2489
3349B489l202j972K789K621k147l421J449L650Q9m091o75L549J649l069k378K036
$$ 2489 -713 -2685 104 2725 578 -2843 -1394 2256 2345 -1746 -2421 1128 2777 -292 -2670 -634
3365f34L332j503l312K67L681P32l534j611K917K559k500l274J849L485q98l737
$$ -634 2698 1195 -2117 -1850 1831 2563 -971 -2582 335 2894 394 -2880 -1031 2454 1556 -2181
3381b181K13L150J452l427j953L024K585k543k745J319L289m38l514n52L550J356
$$ -2181 -1968 1182 2634 -793 -2746 278 2863 320 -2425 -1106 2183 1745 -1769 -2321 1229 2585
3397B585l186k099K568K874j907k930R3L837K20l553j180L169K064k999k486K289
$$ 2585 -601 -2700 -132 2742 835 -2095 -2002 1835 2055 -1498 -2678 491 2555 -444 -2930 -641
3413f41K714r17l338K97L449P62l294j824L007K688k290l022J248L407o81l364
$$ -641 2073 1156 -2182 -1885 1564 2326 -968 -2792 215 2903 613 -2409 -1161 2246 1565 -1799
3429a799k12L418J045l046j851K205L095k424k884P52L909k52l612n50K635J780
$$ -1799 -2011 1407 2452 -594 -2445 -240 2855 431 -2453 -1701 2208 1956 -1656 -2206 429 2209
3445B209k389k005J767K922j329l505J157K821L60l336j484L484J900k504k887
$$ 2209 -180 -2185 -418 2504 1175 -2330 -1173 1648 2008 -1328 -2812 672 2572 68 -2819
3460b819J994K777k86l486K72K795Q07k917j846K471K702j954k750J268L389q64
$$ -2819 -825 1952 1666 -1820 -1548 1247 2054 -863 -2709 -238 2464 510 -2240 -972 2417 1553
3476A553l114o43L288J417l014k177K594K029r90l185P23L328P6k933j175K658
$$ 1553 -1561 -2204 1084 2501 -513 -2690 -96 1933 943 -2242 -1519 1809 1885 -1048 -2223 435
3492D35J888k559k254K142K598j051l035M5L463K07k870j351K747J399j450k590
$$ 435 2323 -236 -2490 -348 2250 1199 -1836 -1791 1672 1879 -991 -2342 405 1804 354 -2236
3508b236J384K832m06l343k65L214P32k209j724J816K323j422k747R88K689p5
$$ -2236 -852 1980 1574 -1769 -2034 1180 1912 -297 -2021 -205 2118 696 -2051 -1063 1626 1551
3524A551l110m00K298J798k553j912J858K549j042l046O75L063K0k951j050K751
$$ 1551 -1559 -1959 339 2137 -416 -2328 -470 2079 1037 -2009 -1334 1729 1749 -1202 -2252 499
3540D99J822k385k106J462K638p63k823L07K762P0k423j137K532J677j746k150
$$ 499 2321 -64 -2170 -708 1930 1167 -1656 -1349 1413 1483 -940 -2077 455 2132 386 -1764
3556a764O98K806j70k601r46K911J046k195j657J600K335j318k435N04K765k91
$$ -1764 -1066 1740 1570 -1031 -1977 934 1980 -215 -1872 -272 2063 745 -1690 -1186 1579 1288
3572A288k347j017K737J576k352j918J400K589r96k648K40K677P43k931j029K109
$$ 1288 -1059 -2076 661 2237 -115 -2033 -633 1956 960 -1688 -1448 1229 1972 -959 -1988 121
3588A21J833j583k420J312K532o85k463k28K494Q34k109j236J373K420j795k670
$$ 121 1954 371 -2049 -737 1795 1110 -1353 -1581 913 1747 -362 -1598 -225 2195 400 -2270
3604b270J020K627k45k271q39K645J347j898k033J623K370j075k552L53K817K
$$ -2270 -1250 1377 1132 -1139 -1978 667 2014 116 -1917 -294 2076 1001 -1551 -1198 1619 1621
3620A621k663q34K426J648k708j531J521K139m85k621O2K419Q08k684j304K258
$$ 1621 -1042 -1876 550 2198 -510 -2041 -520 1619 1134 -1487 -1425 994 1802 -882 -2186 72
3636G2J590j314k180Q54L007o21k543p03K554R89j718j660J557K202j742k049
$$ 72 1662 348 -1832 -978 2029 1408 -1135 -1838 716 1705 -13 -1673 -116 2086 344 -1705
3652a705Q64K459m06k468m93K372J039j631j696J556J926r56k492L88K721k1j900
$$ -1705 -841 1618 1212 -1256 -1749 623 1662 31 -1665 -109 1817 861 -1631 -1243 1478 1457 -443
3669d43r06J506J639j608j860R52K282l41k376l61K245Q38j940j609J898K000
$$ -443 -1349 157 1796 188 -1672 -720 1562 1221 -1155 -1516 729 1567 -373 -1982 -84 1916
3685A916j372k207O85K737o46k424m45K567J252k484j539J946J798q99k505P53
$$ 1916 544 -1663 -978 1759 1113 -1311 -1756 811 2063 -421 -1960 -14 1784 885 -1620 -867
3701h67K181M04k490o50J813J242j400k015J204K188q38k391L20K218O60k447
$$ -867 1314 1718 -772 -1422 391 1633 233 -1782 -578 1610 772 -1619 -1299 919 1579 -868
3717h68o51J704J526j329j746L82K603p79j979k5J975L61j904r09J661J284r89
$$ -868 -1519 185 1711 382 -1364 -982 1621 842 -1137 -1162 813 1174 -730 -1639 22 1306 317
$$ [...]
8191B65
##END NTUPLES=NMR FID
##END=
