##TITLE=1H ikalashn
B1a 1511-3
15.11.2024
##JCAMPDX= 6.0         $$ Bruker NMR JCAMP-DX V2.0
##DATA TYPE= NMR FID
##DATA CLASS= NTUPLES
##ORIGIN= UXNMR, Bruker Analytische Messtechnik GmbH
##OWNER= root
$$ TOPSPIN		Version 1.3
$$ 2024-11-15 14:35:23.203 +0400  Irina@DPX200
$$ Compression mode = diff/dup
##.OBSERVE FREQUENCY= 200.131300845
##.OBSERVE NUCLEUS= ^1H
##.DELAY= (6, 6)
##.ACQUISITION MODE= SIMULTANEOUS
##.ACQUISITION SCHEME= undefined
##.AVERAGES= 32
##.DIGITISER RES= 18
##SPECTROMETER/DATA SYSTEM= spect
##.PULSE SEQUENCE= zg
##.SOLVENT NAME= CDCl3
##.SHIFT REFERENCE= INTERNAL, CDCl3, 1, 17.49637
##AUDIT TRAIL= $$ (NUMBER, WHEN, WHO, WHERE, WHAT)
$$ ##TITLE= Audit trail, TOPSPIN		Version 1.3
$$ ##JCAMPDX= 5.01
$$ ##ORIGIN= Bruker BioSpin GmbH
$$ ##OWNER= Irina
$$ $$ F:/spectra/data/iren/nmr/1H/4/audita.txt
$$ ##AUDIT TRAIL=  $$ (NUMBER, WHEN, WHO, WHERE, VERSION, WHAT)
(   1,<2024-11-15 14:33:59.390 +0400>,<Irina>,<DPX200>,<TOPSPIN 1.3>,
      <created by zg
	started at 2024-11-15 14:31:51.140 +0400,
	POWCHK disabled, PULCHK disabled
       configuration hash MD5:
       BE 6D 3F 07 2A EA 11 49 91 17 2B D3 AF B3 58 0D
       data hash MD5: 16K
       07 FB D9 C8 B1 6E C0 67 B7 99 FB 16 76 D6 D9 21>)
$$ ##END=
$$ 
$$ $$ hash MD5
$$ $$ 24 E7 10 51 81 D5 1C 7E D6 16 4E 0A B4 0A 45 D6
##$RELAX= 
##$RELAX= 
##$RELAX= 
##$RELAX= 
##$RELAX= 
##$RELAX= 
##$RELAX= 
##$RELAX= 
##$RELAX= 
$$ Bruker specific parameters
$$ --------------------------
##$DU= <F:/spectra>
##$EXPNO= 4
##$NAME= <1H>
##$PROCNO= 1
##$TYPE= <nmr>
##$USER= <iren>
##$AMP= (0..31)
100 100 100 100 100 100 100 100 100 100 100 100 100 100 100 100 100 100 
100 100 100 100 100 100 100 100 100 100 100 100 100 100 
##$ANAVPT= -1
##$AQSEQ= 0
##$AQ_mod= 1
##$AUNM= <au_zg>
##$AUTOPOS= <>
##$BF1= 200.13
##$BF2= 200.13
##$BF3= 200.13
##$BF4= 200.13
##$BF5= 200.13
##$BF6= 200.13
##$BF7= 200.13
##$BF8= 200.13
##$BYTORDA= 1
##$CFDGTYP= 0
##$CFRGTYP= 5
##$CHEMSTR= <none>
##$CNST= (0..63)
1 1 145 1 1 1 1 1 1 1 1 1 1 1 1 1 1 1 1 1 1 1 1 1 1 1 1 1 1 1 1 1 1 1 
1 1 1 1 1 1 1 1 1 1 1 1 1 1 1 1 1 1 1 1 1 1 1 1 1 1 1 1 1 1 
##$CPDPRG= <>
##$CPDPRG1= <>
##$CPDPRG2= <>
##$CPDPRG3= <>
##$CPDPRG4= <mlev>
##$CPDPRG5= <mlev>
##$CPDPRG6= <mlev>
##$CPDPRG7= <mlev>
##$CPDPRG8= <mlev>
##$CPDPRGB= <>
##$CPDPRGT= <>
##$D= (0..63)
0 2 0 0 0 0 0 0 0 0.06 0 0.03 0 0 0 0 0.0002 0 0 0 0 0 0 0 0 0 0 0 0 0 
0 0 0 0 0 0 0 0 0 0 0 0 0 0 0 0 0 0 0 0 0 0 0 0 0 0 0 0 0 0 0 0 0 0 
##$DATE= 1731666838
##$DBL= (0..7)
120 120 120 120 120 120 120 120 
##$DBP= (0..7)
150 150 150 150 150 150 150 150 
##$DBP07= 0
##$DBPNAM0= <>
##$DBPNAM1= <>
##$DBPNAM2= <>
##$DBPNAM3= <>
##$DBPNAM4= <>
##$DBPNAM5= <>
##$DBPNAM6= <>
##$DBPNAM7= <>
##$DBPOAL= (0..7)
0.5 0.5 0.5 0.5 0.5 0.5 0.5 0.5 
##$DBPOFFS= (0..7)
0 0 0 0 0 0 0 0 
##$DE= 6
##$DECBNUC= <off>
##$DECIM= 32
##$DECNUC= <off>
##$DECSTAT= 4
##$DIGMOD= 1
##$DIGTYP= 9
##$DL= (0..7)
0 120 120 120 120 120 120 120 
##$DP= (0..7)
150 150 150 150 150 150 150 150 
##$DP07= 0
##$DPNAME0= <>
$$ [...]
##$SW= 21.9926040160658
##$SWIBOX= (0..15)
0 0 2 0 0 0 0 0 0 0 0 0 0 0 0 0 
##$SW_h= 4401.40845070422
##$TD= 16384
##$TD0= 1
##$TE= 300
##$TE2= 300
##$TE3= 300
##$TEG= 300
##$TL= (0..7)
0 120 120 120 120 120 120 120 
##$TP= (0..7)
150 150 150 150 150 150 150 150 
##$TP07= 0
##$TPNAME0= <>
##$TPNAME1= <>
##$TPNAME2= <>
##$TPNAME3= <>
##$TPNAME4= <>
##$TPNAME5= <>
##$TPNAME6= <>
##$TPNAME7= <>
##$TPOAL= (0..7)
0.5 0.5 0.5 0.5 0.5 0.5 0.5 0.5 
##$TPOFFS= (0..7)
0 0 0 0 0 0 0 0 
##$TUNHIN= 0
##$TUNHOUT= 0
##$TUNXOUT= 0
##$USERA1= <user>
##$USERA2= <user>
##$USERA3= <user>
##$USERA4= <user>
##$USERA5= <user>
##$V9= 5
##$VALIST= <valist>
##$VCLIST= <CCCCCCCCCCCCCCC>
##$VD= 0
##$VDLIST= <DDDDDDDDDDDDDDD>
##$VPLIST= <PPPPPPPPPPPPPPP>
##$VTLIST= <TTTTTTTTTTTTTTT>
##$WBST= 1024
##$WBSW= 25
##$XGAIN= (0..3)
0 0 0 0 
##$XL= 0
##$YL= 0
##$YMAX_a= 562504
##$YMIN_a= -567292
##$ZGOPTNS= <>
##$ZL1= 120
##$ZL2= 120
##$ZL3= 120
##$ZL4= 120
##$ABSF1= 10
##$ABSF2= 0
##$ABSG= 5
##$ABSL= 3
##$ALPHA= 0
##$AQORDER= 0
##$ASSFAC= 0
##$ASSFACI= 0
##$ASSFACX= 0
##$ASSWID= 0
##$AUNMP= <proc_1d>
##$AXLEFT= 0
##$AXRIGHT= 0
##$AXTYPE= 0
##$AXUNIT= <>
##$AZFE= 0.1
##$AZFW= 0.1
##$BCFW= 1
##$BC_mod= 2
##$BYTORDP= 1
##$COROFFS= 0
##$CY= 7568.61572265625
##$DATMOD= 1
##$DC= 2
##$DFILT= <>
##$DTYPP= 0
##$F1P= 17.9538593292236
##$F2P= -4.03888763876832
##$FCOR= 0.5
##$FTSIZE= 32768
##$FT_mod= 4
##$GAMMA= 1
##$GB= 1
##$INTBC= 1
##$INTSCL= 1
##$ISEN= 128
##$LB= 0.02
##$LEV0= 0
##$LPBIN= 0
##$MAXI= 945.577
##$MC2= 0
##$MEAN= 0
##$ME_mod= 0
##$MI= -402.1523
##$NCOEF= 0
##$NC_proc= 0
##$NLEV= 6
##$NOISF1= 8.587773
##$NOISF2= 6.764455
##$NSP= 1
##$NTH_PI= 0
##$NZP= 0
##$OFFSET= 17.49637
##$PC= 1
##$PHC0= 112.3206
##$PHC1= 14.86436
##$PH_mod= 0
##$PKNL= yes
##$PPARMOD= 0
##$PPDIAG= 0
##$PPIPTYP= 0
##$PPMPNUM= 100
##$PPRESOL= 1
##$PSCAL= 0
##$PSIGN= 0
##$REVERSE= no
##$SF= 200.13
##$SI= 32768
##$SIGF1= 18.5376
##$SIGF2= -6.396296
##$SINO= 400
##$SIOLD= 32768
##$SREGLST= <1H.CDCl3>
##$SSB= 3
##$STSI= 0
##$STSR= 0
##$SW_p= 4401.40845070422
##$SYMM= 0
##$S_DEV= 0
##$TDeff= 0
##$TDoff= 0
##$TI= <>
##$TILT= no
##$TM1= 0
##$TM2= 0
##$TOPLEV= 0
##$USERP1= <user>
##$USERP2= <user>
##$USERP3= <user>
##$USERP4= <user>
##$USERP5= <user>
##$WDW= 1
##$XDIM= 8192
##$YMAX_p= 0
##$YMIN_p= 0
$$ End of Bruker specific parameters
$$ ---------------------------------
##NTUPLES= NMR FID
##VAR_NAME=  TIME,          FID/REAL,        FID/IMAG
##SYMBOL=    X,             R,               I
##VAR_TYPE=  INDEPENDENT,   DEPENDENT,       DEPENDENT
##VAR_FORM=  AFFN,          ASDF,            ASDF
##VAR_DIM=   8192,          8192,            8192
##UNITS=     SECONDS,       ARBITRARY UNITS, ARBITRARY UNITS
##FACTOR=    0.0002272,     1,               1
##FIRST=     0,             0,               0
##LAST=      1.8609952,     -373,            -343
##MIN=       0,             -567292,         -567292
##MAX=       1.8609952,     562504,          562504
$$ Real data points
##PAGE= N=1
##DATA TABLE= (X++(R..R)), XYDATA
$$ [...]
2266I15N07k189j067K096J797j931j855R73K224o11k353n33K784J221j910k075
2282b007J766K842j507k193j06K371K13k196j177J606K005j397k306J381K510
2297A805r3l079j67K092O99j319k114J319K364k90k380j14K710R68k642j551K158
2314C66J757j731k449Q06K240Qk495m51K138J516j674j996J333K384o84k862J60
2331a634K774R06k024j395J357K233r89k804L69K733J38l124p95K005J581j226
2347A05k016J226K484k36k744j49K056J539k401j706J466K186q75k645L27K709
2363A326L44k431j277K237K071j986k780J497K969k31l111j42K405J413k795j196
2379a687J405J977m69l313J58K514J026k997n51K239J822j720j912R42K684k90
$$ plain form
2266 915 1422 -767 -1834 262 2059 128 -1727 -754 1470 859 -1494 -2027 757 1978 68 -2007
2282 -2007 -241 2601 1094 -1099 -1205 1166 1379 -817 -1994 -388 1617 220 -2086 -705 1805
2297 1805 1712 -1367 -1534 558 1257 -62 -2176 -857 1507 1217 -1163 -1277 1433 2401 -241 -1792 366
2314 366 2123 392 -2057 -1251 989 997 -1498 -1949 189 1705 31 -1965 -632 1752 1068 -1794 -1634
2331 -1634 1140 2046 22 -1373 -16 2217 1228 -1576 -1207 1526 1664 -1460 -2255 -250 1331 105
2347 105 -1911 -685 1799 1563 -1181 -1330 726 2265 -136 -1842 -376 1810 935 -1710 -1383 1326
2363 1326 1670 -761 -2038 199 2270 284 -2496 -999 1970 1739 -1372 -1514 891 2304 -491 -1687
2379 -1687 -282 1695 1226 -2087 -1929 585 1611 -1386 -1937 302 2124 404 -1508 -566 2118 1828
2395A828k555r93K365J594k474j753J298K517j062k769O13K536M78k267j656K174
2411a26J928j401k423R10L063K8k638r28K745J406k867j803J374K095p21k322
2427a680l26L232O36k509j579K458K367j941k699J278K338k05k364o03K360J550
2443B313k265k056J785K465j217k687J72K685L59k344j225K323J696j252k333
2458a581N12L059k84l204l59K378J244k210k161K063K240j021k277L77K702M96
2474A974k664j298K426J988j795k904J258K698l59k081n44J999J265k051k270
2489b358J890K050q80k510j62L013N84k353j094K140K306j952k056P73K068K04
2505A663k960q94K921J323j980j943J331K503r67k764jK430J190k551j898J943
$$ plain form
2395 1828 -727 -1720 645 2239 -235 -1988 -690 1827 765 -2004 -1391 1145 1623 -644 -2300 -126
2411 -126 1802 401 -2022 -1112 1951 1979 -659 -1587 1158 2564 -303 -2106 -732 1363 642 -1680
2427 -1680 -2006 1226 1862 -647 -2226 232 2599 658 -2041 -763 1575 1370 -994 -1597 763 2313
2443 2313 48 -2008 -223 2242 1025 -1662 -1490 1195 1554 -790 -2015 308 2004 752 -1581
2458 -1581 -1069 1990 1706 -1498 -1857 521 1765 -445 -2606 -543 1697 676 -1601 -1224 1478 1974
2474 1974 -690 -1988 438 2426 631 -2273 -1015 1683 1324 -757 -1301 698 1963 -88 -2358
2489 -2358 -468 1582 702 -1808 -1970 1043 1627 -726 -1820 320 2626 674 -1382 -609 1459 1663
2505 1663 -1297 -2191 730 2053 73 -1870 -539 1964 997 -1767 -1768 662 1852 -699 -2597 -654
2521f54K726j493k448J373K598n84j976j230K375J302k164j819P89L464j201k796
2537a738R4K755O57k332j300J912J854j697j974N73K671K65k824p81K629J597
2553B361j912k119J149K173m86k977j15K443R47j934j696K303K193j401k756Q83
2569i44K438m16k446o14K292J433j559k300J555K532m47k830l24K273Q92k139
2585f04j281J760K097j094k366O24K185N25k295j355K432J130k014k064J266K384
2601A330p71k076K25K238P44k065j100J436J824p91k651M54K474O45k630p03J958
2618E41J348j078k118O51K225n86k578n40K559Q22j858j216J734K269j286j993
2634a104K77K324l38j770j141J681J765j540j750Q44J905J42k399l0J913O46j767
$$ plain form
2521 -654 2072 579 -1869 -496 2102 1518 -458 -1688 687 1989 -175 -1994 -1205 2259 1058 -1738
2537 -1738 -1644 1111 1768 -564 -1864 48 1902 205 -1769 -1196 1475 1740 -1084 -1865 764 2361
2553 2361 449 -1670 -521 1652 1166 -1811 -1926 517 1464 -470 -2166 137 2330 929 -1827 -944
2569 -944 1494 1078 -1368 -1982 310 1743 184 -2116 -561 1971 1524 -1306 -1630 643 1535 -604
2585 -604 -1885 -125 1972 878 -1488 -864 1321 1846 -449 -1804 628 1758 -256 -2320 -1054 1330
2601 1330 559 -1517 -1292 946 1690 -375 -1475 -39 1785 994 -1657 -1203 1271 1916 -714 -1417 541
2618 541 1889 811 -1307 -656 1569 983 -1595 -2135 424 1246 -612 -1828 -94 2175 889 -1104
2634 -1104 -827 1497 1159 -611 -1752 -71 1694 154 -1596 -752 1153 1295 -1104 -1134 779 1425 -342
2651c42j481R90K845j711k205J022K319K47k118r97J830R33j045j524K59K022
2667A044j17j890p41K610Q39j896j502J422J579r60k121N67J665M96j545j064
2683a614J675J341r05k100J062K026p25j886j1J519Q02j635j143J761J382m62
2699A087j768J24J840R7k173q15J596J017p70j655O03K057k54k069k99J632J334
2716A584k122j130J493J925j283j600Q63J241N44j474r81J255J351j374j871P01
2732h78J403l6j798J53J483N59o43j362Q79J536l24j992J71J889K78j825n09J277
2750B61J376j200j131K77J259r5j672p03J586P05j011p27P80J634n35j496j11
2767h03J579L82j708l56N28J253p21j243N40J221N45j808k74J433O90j720q30
$$ plain form
2651 -342 -1823 -833 2012 301 -1904 -882 1437 1684 -434 -1431 399 1332 287 -1237 -978 1044
2667 1044 927 -963 -1704 906 1745 -151 -1653 -231 1348 388 -1733 -1166 499 995 -550 -1614
2683 -1614 61 1402 497 -1603 -541 1485 760 -1126 -1137 382 1184 -451 -1594 167 1549 1087
2699 1087 -681 -557 1283 1380 -793 -1608 -12 1005 235 -1420 -817 1240 986 -1083 -1382 250 1584
2716 1584 -538 -1668 -175 1750 467 -1133 -270 971 1515 41 -940 315 1666 292 -1579 -878
2732 -878 525 489 -1309 -1156 327 886 243 -1119 -240 1296 972 -1020 -849 1040 1318 -507 -1016 261
2750 261 1637 437 -694 -417 842 747 -925 -1628 -42 663 -348 -1075 -295 1339 804 -692 -803
2767 -803 776 1158 -550 -906 -378 875 154 -1089 -549 672 1217 -591 -865 568 1258 -462 -1292
2784a292P58J459n77j300K8J549P27j638o51J063N76p45j245M74J475j50j166
2801f55j94J424J074j407r40L36J896q90j709NJ741J25j009q10Q43J485p03j788
2819a176N34J279r8j101o66J746N17j129q64R13J215n55q66o47J186P01j098q43
2837i52J023R79q64j269L58J529L35j570l54Q43J067j126j335J202J115j16j588
2854g23P3J161N64j052j017Q18R52m62j073l67J810R9j226p55J399O65p78j011
2872i23O46J122j02j304o3Q30O10q39r91N96J593o37j451O14O99L6r34j35M48
2891a85J185p16r94q6J419j51j326L35R20Q7o94p82P28J051k43j346J42J108O61
2910A113j489l85O24J024q93q67P90R02l12j112l12J001P52r33p86L33J209m82
$$ plain form
2784 -1292 -534 925 348 -952 -924 625 1352 -286 -937 126 702 -43 -1288 -814 661 511 -655
2801 -655 -849 575 1649 242 -698 -362 1534 644 -1065 -1060 681 806 -203 -1013 -170 1315 612 -1176
2819 -1176 -642 637 539 -562 -1228 518 1035 -94 -958 -45 1170 615 -251 -898 288 989 -109 -952
2837 -952 71 1050 186 -1083 -725 804 1139 -431 -785 58 1125 -1 -1336 -134 981 865 -723
2854 -723 -650 511 1075 23 -994 -176 776 314 -759 -1126 684 783 -443 -1198 201 866 88 -923
2872 -923 -277 845 743 -561 -624 206 816 -23 -1014 -418 1175 538 -913 -299 400 436 -498 -633 -185
2891 -185 1000 284 -710 -796 623 472 -854 -519 401 488 -206 -988 -260 791 548 -798 -656 452 1113
2910 1113 -376 -761 -137 887 -6 -873 -83 819 507 -605 -917 84 836 -97 -883 -550 659 177
2928A77r28L22O76K88o09q12P15R99r02n19M80P87J67j004l40J011O85j414m69
2947f90K89Q91k13q06l88J036O73p99o91Q87N06J08j550J38J141j25n55k87Q80
2966D45K6P8j173K18Q44Q1q18k47Q91J63m12m08N4J046n14o75m46J200M26q74
2986i5p34L57J028n32o51K13P31J12m40n50R23N27o42r84N84P66k9j012J08M38
3006A18M58m80p61K5R08l57n02k0J033N0n98o14J006O52o12q74N91M15j31q83
3026e76k96J279k57m36j005R88N89l09k34J0K11P74p31q70P37L89j6p31K25Q19
3046E60j65p95k27Q12On1o61k8J210l64o96j87J072M37j038J9N75K61q05j46l76
3067e87R13l91o31k45Q80L89j65q17O98L47J18r36J31P35l0l52o31L12P04k37
$$ plain form
2928 177 -751 -429 247 535 -74 -886 -171 828 -74 -593 -113 674 841 -163 -503 508 1193 -221 -690
2947 -690 -401 490 277 -529 -917 119 792 -7 -698 189 695 803 -747 -609 532 407 -148 -435 445
2966 445 471 549 -624 -406 438 519 -299 -546 345 508 96 -312 -258 788 274 -401 -847 353 779 -95
2986 -95 -829 -472 556 24 -627 -414 317 429 -11 -561 362 889 247 -737 -153 613 584 -428 -320 118
3006 118 576 96 -665 -640 268 -89 -591 -611 422 472 -126 -740 266 918 306 -568 23 438 307 -576
3026 -576 -872 407 150 -286 -1291 -303 286 -23 -257 -247 -36 738 7 -863 -126 263 247 -484 -259 560
3046 560 395 -400 -627 185 191 140 -521 -549 661 297 -399 -586 486 923 -115 -96 479 740 -65 -211 -587
3067 -587 326 -65 -696 -941 -61 328 163 -654 44 391 509 -427 -296 439 409 57 -574 -262 442 205
3087B05n73K04L85K70j016k21Q60K77q36l27N04O55Ro79l31J256k28m15l10K91
3107b0P12r4q53r6R62l80k07l46L52P24p13n70M12L72J20q68nM47K04J34l52l3
3129i8N84Oq21L4O79J47n69p23R87K23o24k86K4J068k39o71L9m0N61n22n50O63
3151a28M31L37q09K01L84K78n03o95L92L11l85m58L1O42K26k47k68M33P00o00
3171B73q58J81J130n01m40m04Q08K19o12l87O11N70l54n58l50R75j70n22k28L48
3191b69Q79m24o94L70N93k10o21j75P67%m42n16M51O94j29m74k31J202m19n28
3211a76m48R29J70k81o09P1O28L84o95m26N86M23n57q32O92N15j23r40j20J081
3231B72K46j007n7O41Q41p08n84Q6R68m48r23L30J84O11m93j96n1R84j89o99l79
$$ plain form
3087 205 -368 -164 221 491 -525 -746 114 391 -445 -772 -268 387 396 -283 -614 642 414 -1 -311 -20
3107 -20 692 598 -255 -351 611 231 24 -322 30 754 41 -529 -117 255 375 -493 -498 -51 153 287 -65 -98
3129 -98 486 492 -329 -295 384 531 -38 -761 226 449 -175 -461 -437 631 392 -279 -240 -280 281 -241 -791 -128
3151 -128 303 640 -169 32 416 694 191 -504 -112 199 -186 -644 -613 29 255 8 -260 173 873 273
3171 273 -585 -404 726 225 -215 -619 189 408 -204 -591 20 590 236 -322 -672 303 133 -389 -617 -269
3191 -269 610 186 -508 -138 455 245 -376 -551 216 216 -226 -742 -291 403 274 -200 -431 771 352 -176
3211 -176 -624 305 475 194 -415 -344 284 668 -27 -453 133 556 -1 -833 -141 374 251 -689 -809 272
3231 272 518 -489 -546 95 936 228 -356 -270 698 250 -673 -343 -159 452 -41 -237 -288 696 507 -192 -571
3252e71N48M44o46r31J164O41k03j232L96R17j75m95m30Q14L78q31m38P35K33
3271C18K02q87P8P60J56o25m69N65L91kj287N21O13J32q92J35K39K5Q6m52K81
3292a12K28K57n30l44L85J105j156l75K90Q30l82o10J45M25O9n46k33N38L45l45
3312a6n07M85M02j66o19m16J181K70r38k34N70O17j61p17o8M93L17o54l70P09
3332A78J9n50J82l05J018l56o16k77R83K63n23o05N28Q98j031l03L84M90J7o30
3352b36k33O30N44q08l07J82O00j80q59k4N23M55l63k73J72N37K45q56m1P05l0
3373C83k45o33P48L24l13n01k86Q81m0n35o7K65L45n78l81N85M41J40j167M77
3393a57Q0Q59j015l43P46O7k09o50M70N76j50q55J60P30M06o57k38J23O43m33
$$ plain form
3252 -571 -23 421 -225 -1156 8 649 446 -786 -390 527 352 -143 -573 241 619 -212 -650 85 318
3271 318 520 -367 -289 471 627 2 -467 98 489 487 -800 -279 334 466 -426 -291 -52 -27 59 -393 -112
3292 -112 116 373 -157 -501 -116 989 -167 -542 -252 578 196 -414 -269 156 225 -321 -554 -16 329 -16
3312 -16 -523 -38 364 198 -421 -837 344 614 -324 -558 12 629 468 -249 -317 176 493 -161 -531 178
3332 178 197 -353 -171 -476 542 186 -430 -707 276 539 16 -589 -61 837 -194 -497 -113 377 394 -236
3352 -236 -469 161 705 -103 -410 -228 372 192 -667 -691 -168 287 -76 -349 -177 360 605 -251 -292 413 383
3373 383 138 -495 253 577 264 -237 -523 358 318 -217 -284 -19 326 -252 -633 -48 393 533 -634 -157
3393 -157 -77 782 -233 -576 170 237 28 -622 -152 424 274 -581 -421 309 715 58 -180 -57 586 153
3413A53m40j55O78K27q24o5M10N02L3p87j21R25Q6p23j04O16J18o63j79K03M80
3434C70j8o87K47M26J21m96l61K75L66k26p86N40N63L6o43k26P64n4k00k37K2
3455b04O24Mo45p1L90N59q33l08P77L35q04l55L87R33k30r07o4N08L88l98o08
3476e22K44P55k85l10J09K33M56n07n17O72L1Pn66PO83r4m08l27M94J41n17m75
3498f96O30L43N9r83J28N46K30n86j21M77M14m65p2K49qL49r35K88J63M73l90
3519I3o33L58K59L6m22J14M90l17m32J15L59J25K36o30K39L79q2m16j70L28N94
3540F23p79m3Q7L63J19m45j74M54L19q11J03j50N83r3n25L88J84n5l87l9J14N44
3562C80n10l93M98J59K71n29l75O92K82l38m01M26M8J03m21l14P96Ml55l85N11
$$ plain form
3413 153 -287 -442 236 463 -361 -426 -16 486 519 -268 -389 536 622 -101 -205 411 529 -134 -313 -110 370
3434 370 352 -335 -88 338 459 -37 -398 -123 243 17 -769 -229 334 370 -273 -499 265 211 11 -226 -204
3455 -204 420 424 -221 -292 98 657 -176 -484 293 628 -176 -531 -144 789 559 -348 -412 96 484 86 -522
3476 -522 -278 477 192 -118 -9 224 680 173 -344 328 359 366 -200 -193 490 396 -12 -339 155 296 -221 -696
3498 -696 -66 277 336 -647 -519 27 257 -329 -450 27 441 -24 -96 153 145 494 -441 -153 10 483 93
3519 93 -540 -182 77 113 -309 -195 295 -22 -454 -339 20 145 381 -249 -10 369 287 -129 -299 29 623
3540 623 -156 -199 -112 251 370 -75 -249 205 524 -287 -184 -334 249 156 -369 19 203 148 -239 -278 -164 380
3562 380 -130 -523 -25 134 405 -124 -499 193 475 137 -264 162 210 313 -108 -422 374 378 23 -362 149
3583A49L51n05o91N68M59j06p28P1O52j4l84j12J93N6L30n83O3N93J4q01O3L33
3605b9L6R4j18n68Q35lj35l33O30l37o03k5N89k5L18n65k53N92K56l79k65K16
3627g2P51m95l25J32l7J5k49o3K60L75l57j69J46O49m67k66k35L42N67n30l68
3648c96N39Q4K62n44l72L86K10m16k06J95L28k15n48M60N06M5k10j5K45J38o89
3669b13l05L55L34l48k50J19M61K85l65l95O22j79J08k84k28N29L87q71L4M25
3689B21j13k62K8j10L48M03j053N04J43K57p54J7K81L24j30m09J59L79k20l05
3709b92p4K79N79n55j93K4M21J37n69L21M4P6l70J97mM62m11k33M50k40P5k37
3731a13j60M63O9K2n40N54l68J11m25L19M46j59k79pJ37L22n68l46M34L26k28
$$ plain form
3583 149 500 -5 -696 -128 331 225 -503 -432 220 206 -178 -290 -97 -41 289 -294 -231 362 376 -425 -362 -29
3605 -29 7 101 -17 -585 250 247 112 -221 409 72 -531 -556 33 8 326 -239 -492 100 356 -23 -288 -72
3627 -72 679 184 -141 -9 -46 -31 -280 -343 -83 292 -65 -234 -88 561 94 -172 -407 -65 502 -28 -396
3648 -396 143 227 489 -55 -427 -41 169 -247 -453 -258 70 -145 -693 -233 273 318 108 93 338 476 -213
3669 -213 -518 -163 171 -177 -427 -308 153 438 73 -322 300 121 229 -55 -283 246 633 -238 -204 221
3689 221 108 -154 -126 -236 112 515 -538 -34 109 366 -388 -371 -90 234 104 -305 -146 233 13 -292
3709 -292 -366 -87 492 -63 -256 -232 189 326 -243 78 122 198 -172 25 21 483 72 -161 289 49 124 -113
3731 -113 -273 190 259 281 -259 295 -73 38 -387 -68 378 219 -60 -67 70 392 -176 -522 -88 238 10
3752A0k8m72O40m0L2j46j10Q9R2Rp41O34r1j83K46M0J22pl41L8L60K09m75K3J15
3777B5L71n84q5K62K17k24Q1k71L29K76m54j07K55R7l14l8N41J38n35q4M1L43
3799B80P0k37j60nK33j20n51j91P65N8m66j70M23M3J95j69l27L19J16R1l23P4
3821e2K76L7l52L44m38L11j74k19o2O99j84l80q5L51j41J8L49k47L18k67k88J85
3843aK13k58O2r0J20r9j67j62P90k33l9M1K4p0k0j56J67j82N7J46m77M54j95M05
3867C30m08J29o2k18J75O8M14m12%k75N3M76O5l03m1M30l60q9L58O0l86K63j016
3890g49N33J63M89o5m88M23j21m3k06m3J84j67K49l33J01J86l14p3K18K01M5l89
3912a99j01M76J00j34m18K26K87j16k98J98j53N55m09J53j52J07l28n3J27K46
$$ plain form
3752 10 -18 -490 150 110 142 -4 -114 -25 67 76 -665 -31 -122 -305 -59 -19 103 96 -245 -207 153 362 -113 -90 25
3777 25 396 -188 -273 -11 206 -18 63 -208 121 397 -57 -164 91 188 -126 -164 377 515 -20 -104 -63 280
3799 280 350 113 -47 -52 181 61 -490 -681 84 142 -324 -494 -71 -28 167 -2 -329 -10 106 197 -126 -52
3821 -52 224 261 -91 253 -185 126 -48 -267 -329 370 186 -194 -279 72 -69 -51 298 51 369 102 -186 -1
3843 -1 212 -46 16 -74 46 -53 -220 -382 408 175 136 177 201 131 111 -45 122 -60 -3 143 -334 120 -75 330
3867 330 -78 51 -11 -229 -54 14 428 16 16 -259 -206 270 335 32 -9 421 61 -28 330 390 4 267 -749
3890 -749 -216 -53 436 371 -117 306 185 142 -64 -107 77 -90 159 -174 -73 113 -201 -274 -56 145 190 -199
3912 -199 -300 176 276 142 -276 -50 237 121 -177 21 -132 423 14 167 15 122 -206 -259 -132 114
3932A14J30l9n03O08m08J22l97O75J16m85j77J16J24j82K14r5L00l21K64l02j07
3953b33L10J19j87j64M75j44o3n3k3l36J25j55M27k05n8R9j61J97K56l61j12J43
3975a04K40m67L70k42P9M04p12L90q0L84J8m41L49j26m26L26l20K53L98k29j11
3996d7j09M07j56n5k72K40l4P6k40L17N3j19j32j77J26K71m89J45p7N10m14N7
4018a19K57q4k79j12L83N7J92k87k16Q0J78K09k38l4j82K43p3k43J28L9J93j08
4040a6k84J58L78l6j4M3J05j15k60j59M84l98J54k76M99j72%Mo6k6K69o61L27
4063f2M7J12p9k87N66L7l70j57J69J45p0l5j59J91L9l77L95L8K66l61l85J69P47
4086E79p09j16K00m7K53j95l27K65J94k15o9K51j64O2L3j7L30n62J0j16M22M5
$$ plain form
3932 114 244 205 -298 310 -98 24 -373 302 418 -67 -244 -128 -4 -186 28 -67 233 -88 176 -126 -233
3953 -233 77 196 9 -155 320 176 113 60 37 -299 -174 -329 98 -107 -165 -66 -227 -30 226 -135 -247 -104
3975 -104 136 -331 39 -203 -124 280 -432 -42 -122 262 280 -161 188 62 -364 -38 -358 -105 293 64 -47
3996 -47 -156 251 95 40 -232 8 -26 50 -190 127 180 61 -71 -248 -122 149 -340 -195 -272 238 -176 -119
4018 -119 138 54 -225 -337 46 103 295 8 -208 -128 50 259 21 -13 -195 48 -25 -268 -140 -101 92 -16
4040 -16 -300 -142 236 200 186 229 334 219 -41 -200 284 -114 40 -236 263 91 91 95 29 3 272 -389 -62
4063 -62 -15 97 18 -269 297 334 -36 -193 -24 121 51 16 -143 48 87 -290 105 143 409 48 -337 -168 579
4086 579 -130 -246 -46 -93 160 -35 -362 -97 97 -118 -187 64 -100 -38 -5 -22 308 -254 -244 -360 62 107
4108A07k2JJ13k56K12l01L7J15K07o39N29j12k19J84J91K9o13J72M99m92j28L29
4130e7K23k77j74N29k28K07n62P11l36lK28m31L81J08n56J99J67k90N68l97R5
4151A05l71J40j86L52l0J24O1l74P19k54j13K30k41l04q1J59J65J70l31K70J55
4172C65j69L20n02k1Lj7R3l10J58j16K61J61k57P7q8N3K12J22j50m85J73K93k69
4195i3J12l5k66j35L64J99k90jJ7r1L55L5j40p3J11R4k62K95O6k06k01K6P4Q9
4219D4R3m01M61o4j54k43n3K54J30k5j70L11j24J54j50j61k1j01K05j99L75%k74
4242a13l2J76m2M81n49j13J56J98m4j59K48k09j31j3j13K38K32o82L26K04l17
4263b58J28l34M81K56q5R7K7P1m14J08m32K93K86k80j31K14J43j91n1J93l19Q5
$$ plain form
4108 107 85 86 199 -57 155 -146 -109 6 213 -426 103 -9 -228 -44 147 176 -437 -265 234 -258 -386 -57
4130 -57 166 -111 -285 244 16 223 -339 372 36 33 261 -170 211 319 -237 -38 129 -161 407 10 105
4151 105 -266 -126 -312 40 10 134 195 -179 540 286 173 403 162 -142 -223 -64 101 271 -60 210 365
4172 365 196 516 14 -7 -4 -21 72 -238 -80 -196 65 226 -31 46 -42 11 223 345 195 -290 -117 176 -93
4195 -93 19 -16 -282 -417 -53 146 -144 -145 -128 -219 136 171 31 -42 69 163 -99 196 262 56 -145 -119 -45 44
4219 44 137 -264 197 133 -21 -264 -317 -63 67 42 -128 183 59 213 63 -98 -119 -220 -15 -214 161 161 -113
4242 -113 -145 31 -11 470 -79 -192 -36 162 118 -41 207 -2 -133 -146 -259 -21 211 -471 -145 59 -258
4263 -258 -130 -464 17 273 188 285 312 383 -31 77 -355 -62 224 -56 -187 27 170 -21 -72 121 -198 -113
4285a13J66M7j48k7J50J42Jm06K26L2j54L58l26J73k9k41L47K2r9k72n1J32n4
4308a24j18K93J47J13k46j45j64k5R8j61n8M45m00K88j81Q2O2q7J31Q0L63m93
4330a00j90J79J61K89o81L49R8j6N02p72K06rj00J78k29K47k68R2K27Q7m87K10
4352b7P8k15K06l16K63J35l28M37j73j05J94k06R9O5q7n92K66L12M21m65k3K64
4374B03j35J49m34L72m02N38q9l27J48k91K16o0J74J88l61O6M5k95K1L95K44n37
4396a72J13K85j68j62J56j46J41k5j9n4k55K09L07k34k0k73J24Q8r5M07k16p8
4418h7J32k7P1n2j20Kj46J87L16L0l8K4j38k28k36J9M52J20m73K09o2J37j92J49
4442D9K9j21K87k42K52N4l50M4j13K60nN3k32j4K33L66m74j61L0M4j14N7O1K39
$$ plain form
4285 -113 53 100 -48 -75 75 217 218 -188 38 70 -84 274 -52 121 92 -149 198 220 121 -151 -202 -70 -124
4308 -124 -242 51 198 311 65 -80 -244 -269 -171 -332 -390 55 -345 -57 -238 -156 -94 -181 -50 30 393 -100
4330 -100 -290 -111 50 339 -342 7 105 89 591 -181 25 16 -84 94 -135 112 -156 -64 163 250 -237 -27
4352 -27 51 -164 42 -274 -11 124 -204 233 60 -45 149 -57 42 107 20 -572 -306 6 427 -38 -61 203
4374 203 68 217 -217 155 -247 291 202 -125 23 -268 -52 -112 62 250 -111 -45 0 -295 -274 121 365 -172
4396 -172 -59 226 58 -104 52 -94 47 22 3 -51 -306 -97 210 -24 -44 -317 -193 -105 -200 207 -9 -87
4418 -87 45 18 89 37 -83 -81 -227 -40 276 306 268 292 154 -74 -310 -291 161 281 -192 17 -45 92 -100 49
4442 49 78 -43 244 2 254 308 -42 2 -111 149 144 197 -35 -49 184 550 76 -85 -55 -11 -125 -68 -7 232
4466B32k50k0p8K5L99m79J12Q9P7j58L79j28l34L97j57K0l4m4N9J20n63L39L16
4489C19l65n8J15j42L6J2N9m8J62m35n1O82j69k43j27L49q5L79m82k39M35J10
4511B14l21J57q7J53l7J25k57m5k44K92k3j25J16K32l84L09o06K28K99n5R3M1
4533G5m7j46J22K64n15J7L49m15M60m47J0P04l45ok2j6p4J21l28RM02m7j04Rk92
4558b62L80l28R6N1J03r7m9N4k3R6J33K0l78K03j70q4J06q5J19J51m5n5j23m9
4582b36M00l28L95P0r03P37o7P5m31N49k80J41l2oo2j70J34K45l41j94M64O6l78
4605a52L23j49n10M26L40m79n9J67K88j82m07K69L72LJ19n00K90l70K50P4k24
4626a11J76L4m61K86j3N7O1j36J99k24O8Q3l2L68m58J07l27M46j94l1J55m7q3
$$ plain form
4466 232 -18 -38 -116 -91 308 -171 -59 30 107 -51 328 200 -134 263 106 126 92 48 107 227 -336 3 319
4489 319 -46 -104 11 -131 -95 -83 -24 -72 90 -345 -396 286 117 -126 -253 96 11 390 -92 -331 104 214
4511 214 -107 50 -37 116 79 204 -53 -98 -342 -50 -73 -198 -82 150 -234 75 -531 -303 -4 -59 34 75
4533 75 28 -118 4 268 -247 -230 119 -296 164 -283 -273 431 86 80 58 42 -32 89 -239 -230 172 125 21 30 -262
4558 -262 118 -210 -114 -63 40 -57 -106 -52 -75 21 154 174 -204 -1 -171 -255 -149 -234 -115 36 -9 -64 -187 -236
4582 -236 164 -164 231 301 -602 135 68 143 -288 261 -19 122 90 84 22 -148 -14 231 -110 -304 160 226 -152
4605 -152 171 22 -488 -62 278 -201 -260 -93 195 13 -394 -125 247 250 369 -131 159 -211 39 113 -111
4626 -111 65 99 -362 -76 -89 -32 29 -107 92 -132 -64 19 -13 355 -103 4 -323 123 -71 -102 53 6 -77
4649g7P9K1j10L0K11k29j99M04L11o15J54RL63m72p5L33j97j8k44K08M3K06j64
4672b8O9k48J06R1j8k68L60p8J56m32K91K58k19PM4l69L72j05q8K64r1J1j51l4
4696a00j99K74K94m92L02k29L08j60p0J83j38j10j06M04j73k59J23J32j96m0J78
4717g4Q7K31j22k8M4l89K12n9K79r0l6N8P5k25L03m08K90j26k20L70k88J21k4
4740a9J33j23l65J09L51J60j24m9k3L59k14m80K19lO91m97l46L53k26m0K17J23
4762B06k66KL01m67K61J3L37l68q9mj71L94n8l06j78M51j10j32L61l87NP0J08
4785b7j5l56K07J38L53k89O5k2L1J06q3p9J49l1k92m5O54k41k39j68J26L3J49
4808A24j58k78p3N68Q1l86J57R0j58K02m4l08K61J23k32j49L12J57k1n27K47K06
$$ plain form
4649 -77 2 23 -87 -57 154 -75 -274 130 441 -174 -20 -11 352 -120 -195 138 -59 -77 -321 -113 -70 136 -28
4672 -28 41 -207 -101 -10 -28 -296 64 -14 142 -290 1 259 40 47 91 -278 94 -11 -99 165 74 85 -66 -100
4696 -100 -299 -25 269 -223 79 -150 158 -2 -72 111 -27 -137 -243 161 -12 -271 -148 -16 -212 -252 -74
4717 -74 13 244 122 94 138 -251 -39 -98 181 91 55 113 188 -37 266 -142 148 22 -198 172 -116 5 -19
4740 -19 114 -9 -374 -265 86 246 122 73 50 409 195 -285 -66 -69 622 125 -221 132 -94 -134 83 206
4762 206 -60 -58 243 -224 37 50 387 19 -70 -74 -245 149 91 -215 -393 58 -52 -184 177 -210 -205 -135 -27
4785 -27 -42 -398 -191 -53 300 11 76 54 85 191 108 29 178 147 -145 -190 464 223 -16 -184 -58 -25 124
4808 124 -34 -312 -385 183 264 -122 35 125 -33 169 125 -183 78 201 -31 -180 132 289 268 -259 -12 194
4830A94k83L17k60L35l27j31K27r5k19J20n9J1L44m89K71P9m2j03K25L78m39L51
4852D05q24M60n73N47K06j35j03J92j80J32l06J35Q4q6lj76J96l17l4L44j21L52
4874A95m00j27J63J51j04R7m1r8P0j15K8RK09n6L2L8J70l00K4J86j86k4L46k49
4898A8l0j63K4K26j07J03K85j94j28k93N46n42K95k53j84L68q2j71L54L46j99
4919B19j11j70K21n2q5j4n8L1J78m32K19L45l81L3k9J27K56n74L15K04j55n61
4941d74M64kk2K07l19K42j75jr3L7l0R1j99J86j87K74N9j27j8L61M5q2l42N1O7
4966A3j61L89j83jj99R3l0m2K96j19j27K8J71k05K17k42m8P1o9J57j42m01Q17
4989B83m58K80m7J35k06k21r5M46j91J00k99J56L57k45j8J20r9J86k89K03j9j15
$$ plain form
4830 194 -89 228 -32 303 -24 -155 72 -23 -242 -122 -181 -170 174 -315 -44 35 -7 -110 115 493 54 405
4852 405 -419 41 -532 15 221 86 -17 175 -5 127 -179 -44 40 -46 -49 -225 -29 -346 -380 -36 -157 195
4874 195 -205 -332 -169 -18 -122 -25 -66 -164 -94 -209 -181 -172 37 -19 13 51 221 -79 -55 131 -55 -79 267 18
4898 18 -12 -175 -151 75 -32 71 356 162 34 -259 287 -255 40 -213 -397 -29 -111 -282 72 418 219
4919 219 108 -62 159 107 22 8 -50 -19 159 -273 -54 291 -90 -57 -86 41 297 -277 38 242 87 -474
4941 -474 -10 -12 -34 173 -146 96 -79 -80 -173 -136 -166 -75 -274 -88 -275 -1 58 -69 -87 274 319 237 -105 -54 13
4966 13 -148 241 58 57 -142 -49 -79 -121 175 56 -71 -43 128 -77 140 -102 -150 -79 -148 9 -133 -534 283
4989 283 -175 105 58 193 -13 -234 -329 117 -74 26 -273 -117 240 -5 -23 97 -2 184 -105 98 79 -36
5011c6Q4o3q6J85j18j61K84J48m4o19K21N03k71QQN2m1k62M41j08k40J04l05p9
5035c95O07k19J56m00L42j42R5J59m85K56J31j87k81M57Q1m01J00J50KO1P0k54
5057i7K04J70m47j2M0K26P2j12l18L19k7J08j91q0K28K84n55K02M03l00k19J53
5079E1j7N5p5j07R9j67L13n3k71K39K23l85%k2lL70J0p98Q86m74K62k85j36N50
5103B65k1k94o4K67l75L53l74R4M02j68l77J57J50j88L13l82K22L81m38J00K39
5124B62p0J2m99K06K08J77m46R3K6j5N77k49l89J13j44o8K65ML40k91m01K81K33
5147B25k91L80k59J53K14o28R1k2J01o0j50L3L92j09P3k06J30M4k51R4r8L88%
5170B44k09k0L16k49l1K03n25M10P0k39j53N60l37j8p6O7J62m02qJ04l3L3J11
$$ plain form
5011 -36 48 -15 -101 84 -34 -195 89 237 193 -426 -205 298 27 35 43 95 54 -208 233 125 -115 -11 -316 -395
5035 -395 212 -7 149 -251 91 -51 44 203 -282 -26 105 -82 -363 94 175 -226 -126 24 26 87 157 -97
5057 -97 107 277 -170 -182 -142 84 156 44 -274 45 18 126 -65 -145 83 367 -188 14 417 117 -102 51
5079 51 34 89 14 -93 6 -161 152 99 -172 67 290 -95 -95 -117 -120 250 260 -538 348 -126 136 -149 -285 265
5103 265 244 -50 -114 153 -222 131 -243 -149 253 85 -292 -135 15 -173 140 -242 -20 361 -77 23 262
5124 262 192 204 -295 -89 119 296 -150 -57 -31 -46 531 282 -107 6 -138 -206 59 63 403 112 -289 -8 225
5147 225 -66 314 55 208 422 -206 -115 -137 -36 -96 -246 -213 179 70 143 -63 67 111 -140 -46 -144 244 244
5170 244 35 15 331 82 51 254 -271 139 209 -30 -183 377 40 22 -54 13 175 -227 -235 -131 -164 -131 -20
5193b0k34K93k29k2P2r0M61j14m42L46j1J00o6l57L80J54j86m6k11L14L2k05j05
5216a86K13J92k52k43K64K27K67m84K00p8j74K17k59m4J89J47o13K35L35J1k62
5237i8P7n5K87o4k15J29J74l12J57j88M64j26n17J86K72N1Pkk83j25O70n44J71
5260A16Q8l88N85m52L6J41N7l1l45m4J04K75q0k08N59j41k85j87K59K71l39M2
5282C3J91l6l01Q7L94l12rk79J51p6J6J73n11M9J92L72Lm67M66J28l63O4j56Q5
5306a06k07n2N24R1N8n69p1J30P17q22N10o06L37r9J19j34M42j95l71L06J91L4
5328B27k73J7j06L83J50j46j30j40J96k60P5J47n1J40m90K59M9o8p1j4n9r2K80
5351B3n5j14J21J29M8j91j94K73R3j99M0K96j66j20N7q2J02j14o1K80J02j29J2
$$ plain form
5193 -20 -254 39 -190 -212 -140 -230 231 117 -325 21 10 110 44 -313 67 221 35 -11 -222 92 124 -81 -186
5216 -186 27 219 -33 -276 -12 215 482 -2 198 120 -54 163 -96 -140 49 196 -417 -182 153 164 -98
5237 -98 -21 -76 211 147 -68 61 235 -77 80 -108 356 230 -287 -101 171 222 229 227 -56 -181 489 -55 116
5260 116 204 -184 401 -51 -15 126 183 152 -193 -237 -133 142 62 -146 413 272 -13 -200 59 330 -9 33
5282 33 224 188 -113 -26 368 56 47 -232 -81 -157 -141 32 -479 -430 -238 134 137 -330 136 264 -99 -35 -191 -106
5306 -106 -313 -365 159 250 308 -261 -332 -202 515 -307 203 -403 -66 -165 -46 -180 262 67 -304 2 193 227
5328 227 -46 -29 -135 248 398 252 122 -18 178 -82 -7 140 89 229 -261 -2 47 -21 -92 -106 -165 -257 23
5351 23 -32 -146 -25 104 152 -39 -233 40 133 -66 -26 270 104 -16 41 -41 61 -53 -114 166 268 139 151
5374A51l51L86k53J79K19m98K29O6m8m5L81m56k78M76M4m12r0m6M60J03M9m6o04
5397c84M86k67K02k49K40J3J07M2k60N06k08m92l1K47K01j49r0J49p6J5l97L46
5419d9M91m34j01n49P58K6j95m2j45k19N00J21j51J36q2m8r4J96N7k78m0l7K60
5442H1J26n9k84j2K52l34L57l62K62J23o61J70J21R5J2M09j63P4k11K74l90N6
5464f4K10N7j07L9J7K60m91L0K58n1J80n57K80J66k21R3k60K36K72l35k05L2M42
5487B81l33j77M95nm29J72K51k4m89L01k50J00J46j26J8M6J15K1j39l04K53Pj3
5510h3k61K52L79k95r6k23M11J70l99j5L34j23o1q9J19K8J90k83L2K4L95l40j24
5533e8O02n57L12m37j61O74n9m16j18M53j48Q8n29M0N45l82J69l58N54r9Q8j94
$$ plain form
5374 151 -200 186 -67 112 331 -167 62 128 80 35 416 -40 -318 158 202 -210 -300 -346 114 217 266 220 -384
5397 -384 102 -165 37 -212 28 41 148 190 -70 436 228 -264 -295 -48 153 4 -86 63 -13 2 -395 -49
5419 -49 442 8 -93 -642 116 142 -53 -95 -240 -459 41 162 11 147 65 17 -77 119 176 -102 -142 -179 81
5442 81 207 148 -136 -148 104 -230 127 -235 27 150 -511 -341 -220 -125 -113 296 133 207 -4 270 -120 -64
5464 -64 146 203 96 135 152 412 -79 -49 209 158 338 -219 61 227 6 99 -161 75 347 12 -193 -161 281
5487 281 -52 -229 266 261 -168 4 255 231 -258 43 -207 -107 39 -87 -69 -23 92 113 -26 -330 -77 -70 -83
5510 -83 -344 -92 287 -8 -104 -327 84 254 -145 -160 174 51 -10 -99 20 48 238 -45 -13 11 406 66 -58
5533 -58 544 -13 299 -138 -299 375 316 -100 -218 235 87 175 -354 -314 231 -151 18 -340 214 115 203 9
5555Ij91L13o0j37q3L81r0n16J9K82Q3N9J07j05l03J86k00J55%p9O6j1n8N01k15
5580A13k37L58K32j14n33M2R8J28Q6j65M6K02r6rl27M14l23J67l06pRJ88L3m06
5604d07O8R0K87j41J9L48J33m15jM50ql78k32K68r7k47J33k6O6L61j38j47J28
5627A14n2l19k30N68J92l40K50j42j80J57O5l26K28K09m2l32K42j48N0j32K81
5648A13P7j01J25l08qL49m12J23k82L07J9l6L4k35M65j63k62n6M70k3l62j6R4
5671h8N7j78K83j05J01M70n21m34M16j03M22p02M88n0K18j75k01K90K19l31p6
5692@o8M92n06m2M8M1J64j9k67K53Q8l18j55L01M4m02K4K92L0L74o46K28l7L21
5716B40m58j77O5L56M29l96m58L52M79k21o8m40P51k70l69L65l01L28k21m61L35
$$ plain form
5555 9 -182 131 71 -66 -149 232 142 -374 -355 -73 10 69 176 71 -232 -46 -246 -91 -91 -170 -104 -115 -173 328 113
5580 113 -124 234 466 352 -181 -139 -41 87 173 8 54 256 160 151 -176 238 -85 82 -224 -231 -222 -34 -1 -407
5604 -407 -339 -249 38 -103 -84 264 397 -18 -19 431 423 45 -187 81 -16 -263 -130 -156 -90 271 133 -14 114
5627 114 62 -257 -487 81 273 -67 183 41 -139 18 83 -243 -15 194 152 -180 62 -86 -36 -168 113
5648 113 190 89 214 -94 -102 247 -165 -42 -324 -17 2 -34 0 -235 230 67 -195 -251 219 196 -166 -182 -88
5671 -88 -31 -209 74 -31 70 540 19 -415 1 -102 320 -382 106 56 274 99 -102 188 407 76 0
5692 0 -68 424 -82 -124 -76 -35 129 110 -157 96 184 -134 -289 12 56 -346 -322 -30 0 374 -272 -44 -81 240
5716 240 -218 -395 -330 26 455 59 -399 -47 432 211 143 -297 454 184 -185 180 -121 207 -14 -475 -140
5737a40L14j46J61n99J98K89J10j91PJ33j31m33M98j90K36J94o04P17k97l77J03
5758a48L16J20m09j16k8J79j54M86j83P8k44m5K82l23M24m76J73l04M43J43j54
5779F0j31K69J07j02j46j20K32K55l12j30K28j44M5l82J85K08J51k10j02L6L00
5800B97p0m88K30M7J27k24J95l6k4L62n21J26P0k22j93L89J47j99k01L9L39L24
5822E14k93l05n1L02j78n70M53L90k40k8j14K63o2O0l0q5K36J51l26j70K34J40
5844B91Q3p10M48O3j9j39l59K41K45R1m89PN24o9p6l11M85l72k49M07J27J81l29
5867G1k86k51P31l48J54j64J08q8K6J19r7N8k19l2p8O52j14l00q8N78m0j88l03
5890i9k00O68j3n01n4J32J14k84J80L36l56K8K7l93L61k6L33K8n59L70k82N4N6
$$ plain form
5737 -140 174 28 189 -410 -212 77 187 -4 3 136 5 -428 70 -120 116 310 -294 423 126 -251 -148
5758 -148 168 288 -121 -237 -265 -86 -240 246 63 141 -103 -148 134 -189 235 -241 -68 -372 71 214 60
5779 60 -71 198 305 203 57 -63 169 424 112 -18 210 66 111 -271 -86 122 273 63 -39 -3 297
5800 297 227 -261 -31 16 143 -81 114 78 54 416 -105 21 91 -131 -324 65 212 13 -188 -149 190 514
5822 514 221 -84 -135 167 -11 -581 -128 262 22 -6 -120 143 81 141 111 26 262 413 87 -83 151 291
5844 291 374 -336 112 175 156 17 -342 -101 144 235 -254 -247 277 208 132 -179 306 -66 -315 92 219 400 71
5867 71 -215 -466 265 -83 71 -93 15 -73 -47 72 -25 33 -186 -218 -296 356 242 -58 -146 432 392 204 -99
5890 -99 -299 369 356 -145 -199 -67 47 -237 -57 279 -77 -49 -22 -415 -54 -80 253 281 -278 92 -190 -136 -80
5913h0K0J40n4P1l56O92l39k96J11R3L56j48k93L33j15M0k52p7K43J67k39l05
5935b88M34k06j01pO30m1n58K58j99K20k4k53mL09P1q1P0l33K55R4n14q7J98M15
5959B58l30l01K13M94j99k00m5L26K70l34l54L15O5k71j02j23L97j30j45k2K16
5980bP2j45M7LJ55M4m86L09O1J70l84M0j2J37L62o04K03K0J66n04M25K60j64O3
6004B36m99L43J11k8K1m09K49p2j7m68N01R2o4l74L40Q5j25p3J5J44J37k3l08
6027a86L94n60K94k44L4M34N18o50l20N31J03j79o49K23M71J56j78r1q9J27o0
6048G9l0J2Q0l9K22m32O60o33O9k47J30K91j17j18J5K53k11p5P4j01N41n70K5
6071a22J83K18n4k18J0J28j04J03l87M17oo2n13Q1O46q2q7l15M81Q0k15l73J05
$$ plain form
5913 -80 -60 80 26 97 -259 433 94 -202 -91 2 358 210 -83 250 135 175 -77 -154 89 256 17 -288
5935 -288 146 -60 -161 -168 462 421 -137 121 -78 142 118 -135 -139 170 241 160 230 -103 152 246 -268 -355 -157 258
5959 258 -72 -373 -160 334 135 -65 -110 216 486 152 -202 113 178 -93 -195 -318 79 -51 -196 -218 -2
5980 -2 70 -75 -28 -25 130 174 -312 -3 58 228 -156 -116 -128 9 371 -233 -30 -10 156 -348 77 337 173 236
6004 236 -263 80 191 163 184 -225 24 -48 -65 -533 -32 60 -4 -378 -38 47 -78 -151 -136 8 145 122 -186
6027 -186 208 -352 -58 -302 -268 166 684 34 -286 245 348 169 -480 -257 214 370 192 101 12 139 79
6048 79 49 61 141 102 324 -108 552 -81 -12 -259 -129 162 45 -73 -58 195 -16 -91 -17 -118 423 -147 -122
6071 -122 61 279 225 7 17 145 41 144 -243 174 168 106 -407 -326 320 238 151 -164 317 397 182 -191 -86
6094h6P0M50n07q6K69M26m03o68P27n0j53o8J00J81j36Nj43R1J73j50m67N92o2
6117A05K66m18l42L83J16j53J33m54O89l49m2j44M05P7l95j93J73L98k08k45Q5
6138a13L46j6l40K20k93O0O8j06p1N27L03q33MM96J21m91j79K68M43l02m9j51
6160h8%K30j98r3L64j26j53m09L80K51j7l50N1j23K67J36m05J9K27K10l15k81
6182d23K69L58j28r3K12O8j7m03P9R7M7r1l6L98j87j9k64K84M85m28m11M37Mj09
6206A29j35k09L44j8k25j40J9N25k22m9k96M25Q3m1l50n7M62Lk78L4K60j36K6
6229A54l35J52j47j38K56k25L46J09m51J28J81J23k30l21L84j61J99l39M03K42
6249C30l92J29k03M17j01Mj68j14L29n9k9m30L55M75o46K51p1j04j55J90m6K42
$$ plain form
6094 -86 -16 434 -73 -159 110 536 133 -535 192 142 -11 -79 21 202 66 71 -72 19 192 42 -425 167 105
6117 105 371 -47 -389 -6 110 -43 90 -364 325 -24 -66 -210 195 272 -123 -316 -143 255 47 -198 -113
6138 -113 233 217 -123 97 -196 -136 -68 -174 -245 282 585 -248 -244 252 373 -118 -297 -29 414 112 63 -88
6160 -88 -88 142 -56 -149 215 89 -64 -473 -93 158 141 -209 -158 -281 -14 122 -283 -264 -37 173 -142 -423
6182 -423 -154 204 76 -17 195 263 246 -157 -78 19 66 -25 -61 337 150 131 -133 151 636 208 -203 234 238 129
6206 129 -6 -215 129 111 -114 -254 -235 290 68 19 -277 148 231 190 -160 -217 245 248 -30 4 264 128 154
6229 154 -181 -29 -176 -314 -58 -283 63 172 -279 -151 30 153 -77 -398 -14 -175 24 -315 88 330
6249 330 -62 67 -136 281 180 184 16 -98 231 172 143 -287 68 543 -103 148 77 -27 -182 8 -38 204
6271B04k3l84j27L75J05j37J29l01N0M29l96r4K67K08l59j43k76N54K00l19Q9
6292E1j72K18k08O3P1L22m78j47J98Q3K40q4j4R9R3q6m29J97j45J38k75K36K1
6315hO04o92o3J62K83N1p20N63l27O14m90j08R1J5N5j67J55L1K22o74K73L65n80
6338c45rM06l48P88o36K58k70M21q8on49J75L87j81N2j52J63L7j5l26K59J05k85
6361a59K01n71M98Qk55L14j78K34j43q7O60m74Ll5j89J21K52k73M0O05m23l40
6383a91L00o6K69l81j60J67n6j57J65r9k29O29J76n69L32J90l42J09n93N44L51
6404C89m56k19J9K72pk14P7L04L08m65l91M63J03M02q87N6l6N08L1m68M18q7j38
6427a8K01l13K52K2l93j7J26J84l90L25M3L90r8q13Q3L00K37j46l38M2L39l1j52
$$ plain form
6271 204 181 -203 -330 45 150 13 142 -159 -109 320 -76 -170 97 305 -54 -197 -473 81 281 -38 51
6292 51 -121 97 -111 -48 23 345 -133 -280 -82 1 241 157 143 242 335 249 -180 17 -128 10 -265 -29 -8
6315 -8 596 -96 -159 3 286 337 -383 180 -147 467 -23 -131 -40 -25 30 -137 18 49 271 -403 -130 235 -345
6338 -345 -354 52 -296 492 -144 114 -156 265 177 171 -378 -203 184 3 55 -97 66 103 88 -238 21 126 -159
6361 -159 42 -529 -31 -23 -278 36 -142 92 -51 -138 522 48 51 16 -173 -52 200 -73 -33 572 149 -191
6383 -191 109 43 312 -69 -229 -62 -118 -275 -110 -209 -438 191 367 -202 130 320 -22 87 -506 38 389
6404 389 -67 -286 -267 5 -2 -216 -139 165 473 8 -383 80 183 585 -302 -246 -282 226 257 -211 207 120 -18
6427 -18 183 -130 122 144 -249 -266 -140 44 -346 -21 22 412 314 -499 -416 -116 121 -25 -363 -321 18 -13 -165
6450a65m6O85o5o82K49J59l48M83m07L1K92q3l53M68k18R1n8k72M01j68J32n72
6472d46K25K46k7n1l9j59M31l89j9P1K73j51n9j0j03Q1m7j4l5N43m72M9j03M2
6496a63j92J24j66L57J59m99K32O6K66k2j51k29O43k18l24j08J11P43m00k94K36
6517A71j8J08k34k07M23%j86j35L60j84k14Q3j78K65K52L2k16k57L18n4k54p6
6539b01O70l2l33k15M69j32j63k02J51R1K67n1o99k3P63L3o07M20j99J66j61j87
6561a75K22k92L67m08R3N8q7j08L32K94L5l41l3J13rL36n32O9K8K22j78J23j20
6584IL39k89m34K01J78Q6l56O8J25M05m45p0L14m01M53n21P24m82K74n69L0M09
6606D8K05o62N70k46N39m29mk00L68K14o67l63P61j77J24k7k32K46K56k85l06
$$ plain form
6450 -165 -211 474 409 -273 -24 135 -213 270 -137 -106 186 103 -250 218 0 91 33 -239 162 -6 126 -446
6472 -446 -221 25 -2 -53 -92 -251 180 -209 -228 -157 116 -35 -94 -104 -207 -126 -173 -187 -222 321 -151 -102 -205 -163
6496 -163 -355 -231 -397 -40 119 -380 -148 -82 184 162 11 -218 425 207 -117 -225 -114 629 229 -65 171
6517 171 153 261 27 -180 243 243 57 -78 282 98 -116 -33 -211 54 306 338 122 -135 183 129 -125 -201
6539 -201 469 437 104 -111 358 226 63 -139 12 103 370 319 -380 -403 360 393 -214 206 7 173 12 -175
6561 -175 47 -245 122 -286 -193 -135 -222 -330 2 296 331 -10 -43 70 61 397 -135 -66 -38 184 6 129 9
6584 9 348 59 -375 -174 4 90 -266 -198 -73 332 -113 -183 131 -270 183 -338 386 -96 178 -391 -361 48
6606 48 253 -409 161 -85 454 25 21 -179 189 403 -264 -627 134 -43 81 54 -178 68 324 39 -267
6627b67L94K41k94l78N22J80m24m9J54m6J34J12m45k62M10J86q4o6J23k26M3K46
6649B04l97K19N3j03K8K23k36k33K21M7J65r6N6k33M16n08P2j05K63mk91q5M95
6672A71k39K25l02J92p1J21o3m60N20n9L0m01O13j50J56k33m41O32j20J06k63
6693c6K29n8r6j34nN31j03q42N08N8p4j48P3J9K83j15n07K71L84k5q7j72k7P6
6717CJ8lm0O0N32p55LJ20J22K32m56J44L73k26j53l47O39k72j6j66J89J63J4k24
6741d6J32J08k09kl55L96J85j7l76K48k39O83o09k11K66J19m53K51K86rQ0k82
6763e4j5K74J85m33l01M46L65o25J77o8K28j48ln52M87L54m37J56k38M11j83l58
6785c32L66J63R6k31k49M57r0p1j22p1K14J32l78j2J96k9Q4k91K50J64k87Q0j88
$$ plain form
6627 -267 127 368 74 -304 218 398 -26 -75 79 33 167 279 -166 -428 -18 168 84 18 141 -85 -42 204
6649 204 -193 26 79 -24 4 227 -9 -242 -21 26 191 95 151 -82 334 -174 -102 -207 56 52 -239 -324 171
6672 171 -68 157 -145 47 -24 97 34 -426 94 35 65 -336 277 127 283 50 -391 241 121 227 -36
6693 -36 193 135 39 -95 -100 431 328 -514 -6 52 -22 -170 -97 -78 205 90 -417 -146 238 213 126 -46 -73 3
6717 3 21 18 -22 38 570 -185 -182 -62 60 292 -164 -20 353 127 -26 -373 266 -6 -22 -188 1 164 178 -46
6741 -46 86 194 -15 -17 -372 24 209 192 -184 64 -175 508 -101 -312 -46 73 -380 -129 157 148 228 -54
6763 -54 -69 205 390 -43 -344 102 467 -158 19 -49 179 31 28 -524 -37 317 -120 36 -202 209 26 -332
6785 -332 34 197 293 62 -187 270 180 109 -13 -84 130 262 -116 -128 68 39 123 -168 82 246 -41 39 -149
6808a49M16j51j49k98K61J31O7j84k62N98k6n76J89j5M91p08k5M21J82J3m67J02
6830a39K35l16M48l38K76K0J88o84M91L23k42k17m34N88R5n46j38N89k26j03l66
6851d96O53p5J57l18l64M00M57k99l14J02K74J27m70K24J0K81j85j76Q7K62m09
6872g2k55M6P5L86n64K91J39K14qn72K71K77R0m49j68J62L90j59m55K36M2J87
6894A04k83O47n27L06m02j62L04K51k17m39K84L17L50o87m5L71j34j03k44K06
6914a03K46O2j39k20K37J1P5J31n13L56M42o13N8k48N73k74l53M71J53l48o16
6935f12N10K49k25k41J76J95K16l37j94M09J72k29n2k60O5n6J85l7J17K9L36p56
6957c40M00K38m75L8oL36j03j45J76q6R6K2k7j36M77m00J24m20R9L51k92J27l27
$$ plain form
6808 -149 267 116 -33 -331 -70 61 128 -56 -318 280 254 -322 -133 -148 343 -365 -390 31 213 226 -241 -139
6830 -139 96 -220 228 -110 166 186 374 -310 181 504 262 45 -389 199 294 -252 -390 199 -27 -130 -496
6851 -496 157 82 239 -79 -443 -43 414 115 -199 -97 177 304 -166 58 68 349 164 -12 75 337 -72
6872 -72 -327 -281 -206 180 -384 -93 46 260 252 -320 -49 228 318 -131 -299 -137 253 94 -361 -125 -83 104
6894 104 -179 468 -59 247 -155 -317 -13 238 21 -418 -134 183 533 -154 -199 172 38 -65 -309 -103
6914 -103 143 205 66 -154 83 94 169 300 -213 143 585 -28 30 -218 355 81 -272 199 352 4 -612
6935 -612 -102 147 -78 -319 -143 52 268 -69 -263 146 318 89 37 -223 -158 -214 -29 -66 51 80 416 -340
6957 -340 60 298 -177 -139 -145 191 88 -57 119 33 129 151 124 -12 465 65 189 -231 -132 219 -73 54 -273
6980b73N10m5j10m43L57K45m17j69M89Q8k46k55J76NJ41n8j20kK3J87j91j28q
7003b44N88k03l36J58q6K75k70q5M53p6l77j18P07l74j1k8r0P8n2O1j17L34%K18
7027D05o72N00J10k30l53J96P2j0O4j58M44k17k08L5K63J90r7l34K02J91j01o59
7049c67M94J22j19K11l51k09L12M7j3n82L47L45j66l45N21q0rm88K61L37M4m17
7071a05j08K92m61M84m93J50L76J30l23k88N66j85j62Qo8J5R3j17J21K25N9m22
7093b13Q5j02L64q0k9k8L39m15R0j63M12Pm84J30J25L15%q14M19mJ56J46o04M60
7117A12j51J50j58L8K47o81L55J83K6J12l60Ro8RM1K92o54M09K58n4K7j9j2j93
7141h2l42J61N49n0m07J78J15J69K6p15L19Q1L16n07J08j41N58k82k03J18K94
$$ plain form
6980 -273 237 192 82 -361 -4 241 -176 -345 144 232 -14 -269 -93 -88 53 -5 -125 -127 -104 83 -108 -236 -244
7003 -244 344 141 -195 -37 -123 152 -118 -203 250 174 -203 -321 386 12 1 -27 -117 -39 -91 -30 -147 187 187 405
7027 405 -267 233 343 113 -240 -44 28 18 82 -76 368 151 -57 -22 241 431 334 0 202 393 292 -367
7049 -367 127 249 130 341 -10 -219 93 140 127 -455 -108 237 71 -274 247 167 158 -330 -69 268 312 -105
7071 -105 -213 79 -382 102 -391 -241 135 265 -58 -346 220 35 -127 -119 -187 -172 -79 -196 -75 150 209 -213
7093 -213 -128 -230 134 54 25 -3 336 -79 11 -152 260 267 -217 -87 38 353 353 -461 -42 -46 110 256 -348 112
7117 112 -39 111 -47 -9 238 -443 -88 95 121 233 -127 -118 -186 -177 -136 156 -498 -89 169 115 142 123 111 -82
7141 -82 -424 -263 286 236 -171 7 122 291 317 -398 -79 2 318 -189 -81 -222 336 54 -149 -31 263
7162B63l76J11j41M70k34k08L04j55K0k09J18l06N12j19l44K29N10l55m45p6M57
7183B6K76r8o37N00q4M57n66J39j52K82j8q2j41J83P2k92l4K74K00m49L32k77
7205h9m9J7j19K23ml2O5l66L49K94l94K32m71L59J50j80l83P29j70p7q6J22L98
7228E18n89j42l6N79j88j15l59M30L69l33k44j17M92m12k40K63K94K21o75M4M1
7249a99L11J0J21k19j65J14P7l72N59m6j09l12lK96k70p0J82j85L49J52m61J19
7271a21J17K24m50J24K11J97o5o11M2M58J08n07R6O3P4J73l85N5N96j00r71O64
7293hK50n03L05k27J47L7j27N7q8J47Q0om5j51N47m31j64j02N24Q4m03%K80k14
7317a1L7k28j38P64n03m91N16L23m33r5R2K64M2q0k45K25K25j32j11n0M95m43
$$ plain form
7162 263 -113 -2 -143 327 93 -115 189 34 54 -155 -37 -343 169 50 -294 -65 445 90 -355 -431 26
7183 26 302 204 -433 67 -17 440 -126 13 -139 143 125 43 -98 85 157 -135 -169 105 305 -144 188 -89
7205 -89 -138 -121 -240 -17 -21 -53 12 -354 -5 289 -105 127 -344 15 165 -15 -398 331 161 84 -2 120 518
7228 518 -71 -213 -249 330 142 27 -332 98 467 134 -110 -227 265 -147 -387 -124 170 391 -284 -240 -199
7249 -199 112 122 243 24 -141 -27 50 -322 237 191 82 -230 -233 63 -207 -277 -95 -280 69 221 -240 -121
7271 -121 -4 220 -230 -106 105 302 237 -374 -332 126 234 -273 -177 -114 -40 133 -252 -197 399 299 -672 -8
7293 -8 242 -261 44 -183 -36 1 -126 -69 -157 -10 70 64 19 -132 415 -16 -180 -282 242 326 -77 -77 203 -11
7317 -11 26 -202 -340 424 -79 -570 -54 269 -164 -259 -167 97 139 59 -186 39 264 132 21 -29 466 23
7339B3jk07M8O18j31m95j56N65N8m92QR6L66n26ON35l31N6n5O2K49k90j47j34
7363b75M51l6j8l86L59l0R0k83j75M87K17n87k9R3N50j89o10NN12K5j85j64M99
7386C21j48j34j29J79M8m2m33k68N47M54k53j53m3K54k26K29l51K31J75k93R5
7407F0L9l9m05j35L89J41N6k45M10j44j2l0l55P52l72%m55O6M56n8J16n61L12
7430a4m3J64j95l5J67j56o9J47Q5K65n43J29N7M61l80k13L40j2p1j95k92L27Q8
7453A2r4l63L13L45p0N8l35J67J88k97l72M34J56K12l24k37K76M83n21k80N4K15
7475B0K85n07K19K99pm70M10m38J19Q8k44K46P8L4j19l38K60p9K89l20N3L08M4
7498B30n04K41J51j64O6l04K90q2K15l85K29M47n72k8K46N0o3J85n11RM80j35
$$ plain form
7339 23 22 -185 -137 481 350 -145 -301 264 322 -170 -162 -66 300 -226 -220 315 -16 40 -15 47 296 6 -141 -275
7363 -275 176 140 122 -264 95 65 155 -128 -303 184 401 -186 -215 -122 428 239 -371 -366 146 171 -14 -178 321
7386 321 173 39 -90 89 137 95 -338 -606 -59 395 142 -11 -54 200 -26 203 -148 83 258 -35 60
7407 60 99 60 -345 -480 -91 50 106 -139 271 127 115 85 -270 482 110 110 -345 -279 177 119 235 -326 -14
7430 -14 -57 107 -88 -123 44 -112 -181 -34 51 316 -227 -98 -41 420 40 -173 167 155 84 -111 -403 -76 12
7453 12 -82 -445 -132 213 143 201 -134 33 221 -76 -448 -14 142 354 30 -207 69 552 31 -249 -195 20
7475 20 305 -202 17 316 309 -161 249 -189 -70 18 -226 20 98 132 13 -325 -65 -144 145 -175 -122 186 230
7498 230 -274 -33 118 -46 20 -284 6 -76 139 -246 -17 430 -142 -170 76 126 63 248 -263 -254 226 91
7520I1l52j76M93p2J26l70M78k95K81j50j60m9L97m82P7M37M9j20l48N71l88J17
7542A55l46K22K9K5m01L6M03Mj45O2k60J46N30n53j51l1O18l87k53j7M58M7k76
7565h5N4N0J11j27J99k88l3j04L3M37Q8k0k90l24M19J04j15j00j20L30J6l17L75
7588B93k22M05n38j88L35M3j41n5k02N03K03r37L49J39M68m22J25l70K86J72l53
7609a07K9j71P99j56j80k36K08J55n80J50L1L17n51K22M0J82m1k48j0M47j78k99
7631a77J47j67P43k98l00k71K48k7J28k49K30K09J65n13K68k2j11l6J36J57j08
7652A52r7j68n2N97l68k34M37j66q0j16K06j11qJ5j54J52L30n10R8r0K0J30j59
7675a76K31j85k3r6J01J04Q7q9j67J89%R3L17m67j40L20k9k94J99K66Qm53J16
$$ plain form
7520 91 -261 -437 56 -16 110 -260 218 -77 204 54 -106 -155 242 -240 -163 274 323 203 -145 426 38 155
7542 155 -191 31 60 85 -316 -280 123 127 -18 44 -216 -70 460 -93 -244 -275 343 -44 -297 -314 144 191 -85
7565 -85 -31 19 130 3 202 -86 -119 -223 -190 247 335 315 25 -299 120 224 109 9 -111 219 235 -82 293
7588 293 71 476 -62 -250 85 128 -13 -68 -270 233 436 -501 -152 -13 455 33 158 -212 74 246 -107
7609 -107 -78 -249 550 394 214 -22 186 341 -239 -89 -58 259 -292 -70 -30 152 111 -137 -147 300 122 -177
7631 -177 -30 -197 546 248 -52 -323 -75 -102 26 -223 7 216 381 -132 136 114 3 -33 103 260 152
7652 152 55 -113 -165 432 64 -170 267 101 21 -95 111 0 -8 7 -147 5 335 -175 -77 -167 -147 -17 -176
7675 -176 55 -130 -153 -249 -148 -44 43 -46 -213 -24 -24 69 386 -81 -221 99 70 -224 -25 241 249 -204 -88
7698h8J13K39l64k10M19K33l88J79n5k13M91l26J04j01L23j8n91L59Q1J45j85
7719A47m58K73J77m38J99K63l1ol55N1M4M62p09M00k15L68j92l03J81K64N4m47
7741b71K64m9k9n4M2K02R5l03JL99l32j1j10j78M53K23m22K85m18J6M29n57k65
7764e90Q23k0K63n82P9o5M01o55L47J70r2J13m26N28j1ln14o0L07K21l24p4R0
7787g4k2q9K0k04M69J44j65j52J25qQ2m31K18K93m5j44l24O06j93J34l35M26k30
7810A01j22J3J81o0j17k35p9L51K93o36pK81PJ67j79k18K63K06p2l13N61j74j31
7833H1j63l29M56J05J10p59N02K86j92j53qM97k96m24L67l33L60j49NK7JJ02j75
7856h2j27L45J37m54k40M17N5J51l36l99M09L91o12J55M14J60m06k65K32L31l95
$$ plain form
7698 -88 25 264 -100 -310 109 342 -46 133 78 -135 356 30 134 33 356 338 -253 106 187 332 147
7719 147 -311 -38 139 -299 -100 163 132 126 -229 -178 -134 328 -381 19 -196 172 -20 -323 -142 122 176 -271
7741 -271 -7 -56 -85 -139 -97 105 200 -103 -102 297 -35 -46 -156 -334 119 342 -80 205 -213 -197 232 -325 -590
7764 -590 233 213 476 -106 -27 -92 309 -346 1 171 79 192 -234 294 283 280 -234 -294 13 234 -90 -164 -74
7787 -74 -96 -185 -165 -369 100 244 79 -73 52 44 126 -305 -87 206 161 17 -307 299 106 240 -95 331 101
7810 101 -21 -8 173 113 -4 -239 -318 33 326 -310 -317 -36 -29 138 -41 -259 4 210 138 -175 386 212 81
7833 81 -82 -411 45 150 260 -499 3 289 97 -56 -64 433 137 -287 80 -253 107 -42 -37 -10 -9 93 -82
7856 -82 -209 136 273 -181 -421 -4 51 202 -134 -533 -124 267 -345 -190 224 384 -22 -287 -55 276 -119
7877a19l16O98k78J90j26l09L22j19L52l74Q4J72j28J9k2K77l61j39l60O33M7
7898A43n02M07P3j06M1l10J43j78O33r6n59j04O01l15K9n02P45m1l10J52k83M62
7920A23j17j38L57o6j41R5l03Q4L01j51l06L22m08M93r2N1k56L19k81m51J97M38
7942G0l8r9k04K53J58k03J31N8N3n1Q1m7J51n45J60K23m0K04Kn51m51N06L13k19
7966h5l00K59K31J39k13j10Q5Q6l67L03P6l30M00l3j19Q8j09k45N5J61M90q03
7988c41J64J88J15m18K02M74j05j90k76K57K78l84O9L4j23N55l42j77k76K24j59
8009b31J63J86L9n1N8K0k47j51K62k97L0M20l8P0l98N32l27M5j1j49J16O3k4p
8033G3j98M91l34l56R3L2L25m19J20l06N22Q4j59j89K20L21m59o4M93k7n33L63
$$ plain form
7877 -119 -435 263 -15 175 49 -260 62 -57 295 -79 5 177 49 68 46 323 -38 -177 -537 96 143
7898 143 -359 48 121 15 56 -254 -111 -289 344 248 -311 -415 186 -129 -100 -602 143 102 -208 -56 -339 123
7920 123 6 -132 225 159 18 113 -190 -106 195 44 -262 60 -348 145 53 104 -152 167 -114 -565 -368 70
7942 70 32 -67 -271 -18 140 -63 68 126 179 128 209 162 313 -232 -72 151 111 315 317 -234 -685 -179 134 -85
7966 -85 -385 -126 105 244 31 -79 6 92 -275 28 104 -226 174 141 22 110 1 -244 -189 -28 462 -341
7988 -341 -177 11 126 -292 -90 384 279 89 -187 70 348 -36 33 67 -56 499 157 -20 -296 -72 -231
8009 -231 -68 118 157 106 164 184 -63 -214 48 -249 -219 201 163 233 -165 367 40 85 74 -75 41 104 80 73
8033 73 -125 366 32 -324 -231 -199 126 -293 -173 -479 43 127 -32 -221 -1 320 -139 -203 290 263 -270 93
8055I3L6k41J18m00L70L35k70j21j52J81l4q4J01P6K2K53o41K33K90j64N2k10
8077a57N36p3n72N0J8L46l58k59K03J58J35J04l02r4N60k37j58k76Q02m14k7n0
8099f5K4J6l1K15m19O60l45r1k32M7M98j44k92j26nK7l36M19K73M75q35K5K34
8122hRJ25n95N60J2j24k2l25M60Q2j1l75j58M04L44q04L69J15L83o60j10K42j7
8145a04r0J16J30K1j81J12j50J08P8p3J57J47n0k72J33j40k88O97n76L0L64M04
8167E73m57k19l5N09k03l47j11M68J2L92p21L00J80j60j47k55j23L80K98p98L83
8188h1K37j73l56
$$ plain form
8055 93 129 -112 6 -394 -24 311 41 -80 -232 -51 -85 -169 -68 8 30 283 -358 -125 165 1 53 -157
8077 -157 379 306 -266 -216 -198 148 -210 -469 -266 -108 27 131 -171 -265 295 58 -100 -376 426 12 -15 -65
8099 -65 -41 -25 -56 159 -260 400 55 -36 -268 -221 277 133 -159 -285 -290 -263 -599 -180 93 568 -267 -242 -8
8122 -8 1 126 -469 91 103 -21 -43 -368 92 174 163 -212 -370 34 378 -426 -57 58 441 -219 -329 -87 -104
8145 -104 -194 -78 52 73 -108 4 -146 -38 40 -33 124 271 221 -51 82 -58 -346 351 -225 -195 169 573
8167 573 116 -103 -138 371 168 -179 -290 178 190 582 -139 161 341 181 34 -221 -344 36 334 -464 -81
8188 -81 156 -17 -373
8191c73
$$ Imaginary data points
##PAGE= N=2
##DATA TABLE= (X++(I..I)), XYDATA
0@%%%%%%%%%%%%%L2o4O4o4O4o5R7j28J58j90J95k28K89l46L79m21M99n92O74p61
33d08Q58r64J092j223J379j543J714j916K135k369K625k905L209l544L909m308
49b259M746n228N759o346P003p735Q558r488J0556j1797J3249j4984J7103j9747
63a0610K3164k7778L4383m4685O3126j06261L84933K46232p27257j09285L68492
74I4454J77607m99252l40101K95838M69036j53752m13501Q0793N37004J07512
84C55638m36007k12129M04696L06591k91513l85272J95639M33971m4482m52192
94a25060j00654L78566J62618m10061l45469K43285L61779j74683l94299R8211
104c05767M74822J10548l51372j41321L57524K67972k82163l77106J34705L63333
$$ plain form
0 0 0 0 0 0 0 0 0 0 0 0 0 0 0 32 -32 32 -32 32 -33 64 -64 94 -96 99 -129 160 -186 193 -228 271 -321 353 -408
33 -408 450 -514 578 -645 734 -809 905 -1011 1124 -1245 1380 -1525 1684 -1860 2049 -2259
49 -2259 2487 -2741 3018 -3328 3675 -4060 4498 -4990 5566 -6231 7018 -7966 9137 -10610
63 -10610 12554 -15224 19159 -25526 37600 -68661 316272 562504 -164753 -274038 94454
74 94454 272061 -227191 -567292 -271454 197582 43830 -369671 -288878 248126 355638
84 355638 -80369 -292498 112198 418789 127276 -257996 -62357 371614 327132 -125060
94 -125060 -225714 152852 315470 -94591 -440060 -196775 165004 -9679 -403978 -305767
104 -305767 169055 279603 -71769 -213090 144434 412406 130243 -246863 -112158 251175
114B51175q4064m17868m2998L98033J62023l22031k26533K60138K99782j79704
124I7953l70217M4456L61714M6576l46881j21140L47640K56674k29544k77168
134a89937J68292L18810r0985l74610o5628L08272J18895k97643k06880K59348
144e2066L08810j37313l02838Q5825L33990M061l41367j29841K61910J73238k28157
155b3748k44808J66125L15267m9141k96402m531L02390P9788k91756j87297J95082
166c9031K05010j53682k56553Q0857L00176L8211k55248p7476K57398J55122k20835
177C3949k29950J27973K29997q5970k63372K895K67545R2741k18923j37209J95397
188A5073J97062j48731k50455O3403K44218j1364k44540m9046K41196J41428j68266
$$ plain form
114 251175 167111 -250757 -293755 104278 266301 -55730 -282263 -22125 277657 97953
124 97953 -272264 -227808 133906 180482 -166399 -287539 60101 316775 87231 -189937
134 -189937 -21645 297165 206180 -168430 -234058 74214 193109 -104534 -311414 -52066
144 -52066 256744 119431 -183407 -97582 236408 240469 -100898 -230739 31171 204409 -23748
155 -23748 -268556 -102431 212836 163695 -132707 -137238 165152 244940 -46816 -234113 -39031
166 -39031 165979 12297 -244256 -163399 136777 174988 -80260 -157736 99662 254784 33949
177 33949 -196001 -68028 161969 75999 -187373 -184478 83067 175808 -43115 -180324 15073
188 15073 212135 63404 -187051 -123648 120570 109206 -135334 -184380 56816 198244 29978
199B9978j66260J32858K09008q2273k53703j4129K18386M4805k21282j08108J91836
210a8884J75197j11732j75980Q0814K14162r330k19412o6649J85136R8039j75062
221b3701j52679J28851J87472o6154j88921J9919J93563L6657j86699j03755J43487
232a1960J34796j11961j63611P8872J98889n734j76138k5943J71169P0949j56908
243B420j33916R0423J35185p0485j70710J8652J82296M2682j51285o1034J50733
254C4961J13031j08077j38127O0067J44922k3632j59176k8658J50936P2965j28788
265i576j03914J02426J27497p3497j52107J9642J43821J4509j37675n2594J30085
276H617J04873q3976j13954O6798J39720k8842j50786k0143J27095L8668j24416
$$ plain form
199 29978 -136282 -3424 205584 123311 -130392 -144521 73865 118670 -102612 -210720 -18884
210 -18884 156313 44581 -131399 -50585 163577 154247 -65165 -131814 53322 151361 -23701
221 -23701 -176380 -47529 139943 73789 -115132 -95213 98350 135007 -51692 -155447 -11960
232 -11960 122836 10875 -152736 -73864 125025 119291 -56847 -82790 88379 159328 2420
243 2420 -131496 -41073 94112 23627 -147083 -128431 53865 96547 -54738 -115772 34961
254 34961 147992 39915 -98212 -38145 106777 83145 -76031 -104689 46247 119212 -9576
265 -9576 -113490 -11064 116433 42936 -109171 -89529 54292 68801 -68874 -121468 8617
276 8617 113490 29514 -84440 -17642 122078 93236 -57550 -77693 49402 88070 -36346
287c6346q1698R1934J07828n3402j16734K8314J32456J3447j26348m6312J10285
298B3424O9474r1527r3307O2815J09172k4429j10847n907J09148L8145j03125
309a6964p2613P8220Q5683o0652j02069L4102J10406L836r8006k4921R4098N7926
321H9046p5154q1696M8618R0722l1223j04323J92J00189K3114q8578m4303P4839
333A443O6550n0600p9945K5406Q8556j71r0019k2822Q5105M5491p0024n9485N3311
346g204P1566l0907p9055L993P6159J7351p4473m0995O2298N7339m8150o8402
358f0480L1478P5153r968p2261q943O6869K9861n5322m6470M1382N9041k5410
370B4930o7013Q446O9385Q471o3526k2591N4724L6504m1211m8475K2319N2228
$$ plain form
287 -36346 -118044 -26110 81718 28316 -88418 -60104 72352 85799 -40549 -86861 23424
298 23424 92898 1371 -91936 -29121 80051 55622 -55225 -61132 48016 86161 -16964
309 -16964 -89577 -11357 74326 13674 -88395 -54293 56113 59949 -38057 -62978 31120 89046
321 89046 13892 -67804 -19186 71536 40313 -64010 -63818 36371 59485 -29093 -73396 1443
333 1443 67993 17393 -62552 -37146 51410 51239 -38780 -61602 23503 68994 -1030 -60515 -7204
346 -7204 64362 33455 -45600 -41607 34552 51903 -22570 -63565 -1267 56072 7922 -60480
358 -60480 -29002 46151 36183 -36078 -45021 21848 51709 -3613 -50083 -8701 50340 24930
370 24930 -42083 -33637 35748 44219 -19307 -41898 12826 49330 8119 -40356 -18037 34191
382C4191r267o0085j0546N6134K3446m9221l1987M3590M5527k5613m5407J3136
394a6102M9284L093m8832j9989M1304L0056l5198l9862K6571M5826j5316m7564
406b6729Q39M1850O863m0580k3497L0109L2769j8973l4560J5698M6696J532l9485
419g468o420L6136J2855l4666k5919J8382K5372j2711l1258L297L5859R631l0528
432g438j3974K8420J8069k5609k5374J3787K4524n834k2829J094K7594J3253j9803
445E880j7091J6961J7826j8829k7031N697K0883m044j8790J949K2968J3653j0649
458I383j1681J0317J5726j1381k5152j756J6396k592j9178j026J9207J0235p939
471E59o714Q377J1872n029j6668k700J4360K081j3682j461J8403R176q726n797
$$ plain form
382 34191 24924 -35161 -45707 10427 33873 -15348 -47335 -3745 41782 16169 -29238 -16102
394 -16102 33182 36275 -12557 -32546 8758 38814 3616 -36246 -9675 36151 20835 -26729
406 -26729 -25890 15960 22823 -17757 -41254 -11145 21624 2651 -31909 -16211 30485 32017 -7468
419 -7468 -13888 22248 35103 437 -25482 -7100 18272 5561 -25697 -22400 13459 23090 -7438
432 -7438 -21412 7008 25077 -532 -25906 -12119 12405 6571 -16258 -15164 12430 25683 5880
445 5880 -11211 5750 23576 4747 -22284 -16587 4296 252 -18538 -16589 6379 20032 9383
458 9383 -2298 8019 23745 12364 -12788 -14544 1852 -740 -19918 -20944 -1737 8498 559
471 559 -6155 2222 14094 9065 -7603 -10303 4057 6138 -7544 -9005 9398 18574 9848 4051
485D051P225L911j0353j5454o333N703m30j0543j384J7442J3496m055p27J4272
499A6821Q285r043j1686l2K877n942j1928l036J1072P381p958n335J1878Q687
513A2041j2300j3230N076Q259n974r609M762J5623Q956n125l140J1273Q886j3984
527A1514j9949R16P672j1649j7718L402J8458P382n662Q56J7527J4792q759j7331
541A451K175J3765q832k4179k794J9294N281j5207n860J5851J4070j0464j9951
554a5400J160J8007j041k2552l334K7991J6546j3114q313J9738J8918j2695k6129
567b18m918J3194l433k9622j4915K1257K0064j3608j5001K0794L0454l863k3689
580c504j089K1857N199k4398j8136J8521K3946j1200k5790R438L0509k458l3518
$$ plain form
485 4051 11276 15187 4834 -10620 -16953 -11250 -11680 -22223 -23607 -6165 7331 3276 2549 16821
499 16821 25106 16063 4377 4345 7222 1280 -10648 -13684 -2612 4769 -3189 -8524 3354 12041
513 12041 -259 -13489 -8413 -154 -6128 -15737 -10975 4648 13604 8479 5339 16612 25498 11514
527 11514 -8435 -7519 153 -11496 -29214 -25812 -7354 28 -5634 -4778 12749 27541 18782 1451
541 1451 3626 17391 8559 -15620 -18414 880 6161 -9046 -14906 945 15015 4551 -15400
554 -15400 -14240 3767 2726 -19826 -23160 4831 21377 8263 -50 19688 38606 25911 -218
567 -218 -5136 8058 4625 -24997 -39912 -18655 1409 -12199 -27200 -6406 24048 20185 -3504
580 -3504 -4593 17264 22463 -1935 -20071 -1550 22396 11196 -14594 -5156 25353 22895 -10623
593a0623j1613K1212Q504k5606k2537J6559L1060j252k3162O818L8810J1817l0875
606I112j8327K3369J6799k6649l1739Q974L0007q28l0049m993L4065J8955k9588
619h92k7307J9505K8330j8381l5110P145L8183R809k6520q913L3697K7705k2499
632B4752l5823R248L0883j3201m6139r048L5746J3765k9654j8808K9841L5576
644B7138j2705l4591N696L9123N157m0796j6108L6991K6794k6540k9510K0684
656A333L6480j0962m3337j0555L2283Q992m1006k9072L0571L8276j5614l1707
668c4318J9538N0044O414l6572j3158L4020K0459l5144l9894J5558L7816j1965
680A2798m5790n64M5031J3073m0299k3804L1488L1964k2715l8545J2333M8937
$$ plain form
593 -10623 -22236 -1024 7480 -18126 -40663 -24104 6956 5704 -17458 -10640 28170 39987 9112
606 9112 -9215 14154 30953 4304 -27435 -18461 11546 10718 -19331 -24324 9741 28696 -892
619 -892 -28199 -8694 19636 1255 -33855 -26710 11473 21282 -5238 -14151 19546 47251 24752
632 24752 -11071 -1823 29060 15859 -30280 -39328 -3582 10183 -19471 -38279 -8438 27138
644 27138 14433 -20158 -14462 24661 29818 -10978 -27086 9905 36699 10159 -19351 1333
656 1333 37813 26851 -16486 -27041 5242 14234 -26772 -55844 -25273 13003 -2611 -34318
668 -34318 -14780 35264 41678 5106 -8052 25968 46427 11283 -28611 -13053 24763 12798
680 12798 -32992 -33556 11475 24548 -15751 -39555 -8067 23897 1182 -37363 -25030 23907
692B3907P176m0689r839M6023K7172l7266l8262K1004L4055k0921m9699l658M2790
705A793J4042l7686k0781M0613M0909k2675m0647J5601M4589m844m8387j2914
717c0387L9224K2475l4069l3121K5689M3931j2502m8066m82M5599J0331m5912
729a7290k3499L7597L5514k4001l6902J7491M7591J03m8774j4637M1221K0061
741C4475m3788l7646K8795M0741j5996m2386Q476N0325J3754m1432k2098L7825
753A1045L3393l1612m5799J6472M6585o193m8334p233M6151K0894l8310l3990
765c6931K7419M0116j9041m9249M471N1090J0577m5293j7219M5384L3954l0813
777A4465l9933J8361M3399q542n1272j1079M4680K0702m1226l1874L4882M2085
$$ plain form
692 23907 31083 -9606 -19445 26578 53750 16484 -21778 -774 33281 12360 -37339 -40997 1793
705 1793 15835 -21851 -42632 -2019 38890 16215 -24432 -8831 35758 30914 -17473 -30387
717 -30387 8837 31312 -2757 -35878 -10189 33742 21240 -26826 -27308 18291 28622 -17290
729 -17290 -40789 -3192 32322 8321 -28581 -11090 36501 36604 -12170 -26807 14414 34475
741 34475 -9313 -46959 -18164 22577 6581 -35805 -27329 22996 36750 -4682 -26780 11045
753 11045 44438 12826 -32973 -16501 30084 23891 -24443 -31676 14475 35369 -2941 -36931
765 -36931 -9512 30604 11563 -37686 -33215 17875 28452 -16841 -34060 11324 45278 14465
777 14465 -25468 -7107 36292 27750 -23522 -34601 10079 30781 -10445 -42319 -7437 34648
789C4648k0386m4748Q161M5975N007m5648k0023L9021L2672k9618l9555K1979
801a2515M9100p090m9046n511M4499J5995m2351l2364L0052L8810j9770m4531
813c4722Q249N0753P836m7435j7850M2850K8937l5045l9238K1516M4055q334m6147
826b4575m462M6622J9266m1288l1311L3162L8288k5009m6109J0055M7283L954
838B5876m4088j5147M1494L0717l0256l9423K1349M4437j1205m9542m314M5301
850A5199J4916m1250k6698L2914L6799k0263m2717Q745M7001M541m5931j6573
862c3317M2062K7612l3277l4889K3727M1393j0121m4283m468M2599J4709m0940
874i193k8941L2177L6274k2741m1559J1968M6070K315m2927j2621L8851K6036
$$ plain form
789 34648 14262 -30486 -22325 23650 28657 -16991 -37014 2007 34679 5061 -34494 -12515
801 -12515 36585 29495 -19551 -25062 19437 35432 -6919 -39283 -9231 29579 9809 -34722
813 -34722 -26473 24280 32116 -15319 -33169 9681 38618 3573 -35665 -14149 29906 21572 -24575
826 -24575 -29037 17585 36851 -4437 -35748 -2586 35702 10693 -35416 -25361 21922 25876
838 25876 -18212 -33359 8135 38852 8596 -30827 -9478 34959 23754 -25788 -30102 15199
850 15199 30115 -11135 -37833 -4919 31880 11617 -31100 -22355 24646 29187 -16744 -33317
862 -33317 8745 36357 3080 -31809 -8082 33311 23190 -21093 -25561 17038 31747 -9193
874 -9193 -38134 -5957 30317 7576 -33983 -22015 24055 26370 -16557 -29178 9673 35709
886C5709l1412l5700K0949M2357j0827m5278j741M4588J2707m0614k3975L2556
898f81L2215k2740l9805J0649M3083K099m3385j3472M0629K4266l2910l2590K4061
911h581L8570j2317m1338J62M0797J2586l7041k3628L1469L2206k3013l8590J2789
924a5929M0774j878m0805j0528L6590K0558l0446l0333K1656L6452j0841m0107
936b4837Q47M1401J0649l6965j8740L1140K8092k1740l4313J0948L6930q54l9004
949a6446j1013L5425K0386l1425k7934K3335L3563j3193l5961J765L7073R272
961B4847l4509j8360K8968K8624k1722l3674J3775L7070l600l7253p265L3168
973A0069J6134k8724k5597K0634L1742j1269l5088K752L6684P335l4157j6857
$$ plain form
886 35709 4297 -31403 -10454 31903 21076 -24202 -25943 18645 31352 -9262 -33237 -681
898 -681 31534 8794 -31011 -20362 22721 24820 -18565 -32037 8592 32858 -52 -32642 -8581
911 -8581 29989 17672 -23666 -23504 17293 29879 -7162 -30790 679 32885 9872 -28718 -15929
924 -15929 24845 22967 -17838 -28366 8224 28782 -1664 -31997 -10341 26111 15270 -24837
936 -24837 -23990 17411 28060 -8905 -27645 3495 31587 9847 -24466 -13518 23412 22558 -16446
949 -16446 -27459 7966 28352 -3073 -31007 -7672 25891 12698 -23263 -21498 15575 24847
961 24847 -9662 -28022 946 29570 7848 -25826 -12051 25019 21419 -15834 -23099 10069
973 10069 26203 -2521 -28118 -7484 24258 12989 -22099 -19347 17337 24672 -9485 -26342
985b6342K8868K3286k2055k9379J2139L2570j627l2836p111L2588J7062k7732
997e69k4464K1624K8169j3677l2014L708L2085O252k9777j4942K6132K2746j9745
1010E528k8891J0915L1671l759l2722n116L0452J3886k4962j9294J9264K6946
1022B3918j0751l0425K057L0571N220l0909j3646K6097K0060j9611k4560J3070
1034h909K8013k974k9123n578K6875J2986k5016k0534J9218K6004j2760k7172
1046a8970N591K8980L532k6145j2383K2048J7979j7441k4584J1058K7527l376
1058A3816k7695k663K7359J0982k3205j7271J6863K0333j0798k5840K476K5845
1070A0202N084k4724j0725K3306J7294j7977k0305J1276K2657m138k4483l550
$$ plain form
985 -26342 2526 25812 3757 -25622 -13483 19087 17460 -15376 -22487 10101 27163 -569
997 -569 -25033 -3409 24760 11083 -20931 -17223 14862 21114 -8663 -23605 2527 25273 5528
1010 5528 -23363 -12448 19223 15464 -17258 -22374 8078 21964 -2998 -22292 -3028 23918
1022 23918 13167 -17258 -15201 15370 20590 -10319 -23965 2132 22192 2581 -21979 -8909
1034 -8909 19104 16130 -12993 -18571 8304 21290 -3726 -24260 -5042 20962 8202 -18970
1046 -18970 -13379 15601 19133 -7012 -19395 2653 20632 3191 -21393 -10335 17192 13816
1058 13816 -13879 -16542 10817 21799 -1406 -18677 -1814 18519 7721 -18119 -15643 10202
1070 10202 15286 -9438 -20163 3143 20437 2460 -17845 -6569 16088 11950 -12533 -16083
1082a6083K3407J1356k0063j5743J6527K1426j1211k4520M156K2635J004k3614
1094a0723r193J9373J4783j3909j9025J0590K3889k507k3677k195K2923P941k0484
1107b214j3479J4955J7159q863k0249K713K1996K769k1855r620J8140J2875j5810
1120a483j7583J0678J9567k938j8672j015K0406Q644j6430j3301J2059J6370r836
1133F466k0715L677J8951J669j8696o091J6340J2329j1384j5560P364J7823j963
1146A0210j9863k398J8235P663j5625j0639J2353J3658p542j6772R41J6308K407
1159H936j7171p679J4919J2693j0635j3321R475J6670k880j5476k290J4161N768
1172A3170j3762j1980Q876J3348o709j5544K788J6003J613j4475m653J2178R579
$$ plain form
1082 -16083 7324 18680 -1383 -17126 -599 20827 9616 -14904 -10748 11887 12891 -10723
1094 -10723 -19916 -543 14240 331 -18694 -8104 15785 13278 -10399 -12594 10329 18270 -2214
1107 -2214 -15693 -738 16421 7558 -12691 -9978 12018 14787 -7068 -16688 1452 14327 -1483
1120 -1483 -19066 -8388 11179 8241 -10431 -11446 8960 17604 1174 -12127 -68 16302 6466
1133 6466 -14249 -10572 8379 10048 -8648 -14739 1601 13930 2546 -13014 -5650 12173 10210
1146 10210 -9653 -12051 6184 13847 -1778 -12417 -64 13594 6052 -10720 -9779 6529 8936
1159 8936 -8235 -15914 -995 11698 1063 -12258 -2783 13887 11007 -4469 -6759 7402 13170
1172 13170 -592 -12572 -3696 9652 2943 -12601 -9813 6190 7803 -6672 -11325 853 10432
1185A0432q952j1478N304J4724m54j3704k654J4263O007j2642r923Q199R580o422
1199B280j3028R83J2369K935j0849n993J1680R804p533j0602N134J1913j779j2529
1213e215j663J0313N157q616p861O374J0143l438j2056O28J0566J711j0854m921
1227i732Q942O819n079p678K935J0405O90r829l594Q934N181q251p415N492Q327
1242F147l190q411O39Q468K736p104n633N383P246m351q821K731Q876m20p291
1257b995j497O752M207m571o204K031O313r17p731j639P397L198o289l738N488
1272a95N553k551n509L16O210J353o198l296M679M981l985n763K356N917j806
1287B062n299j546M557K281l213l974K388N988l40m868J06O153J092m715k517
$$ plain form
1185 10432 1480 -9998 -4694 10030 9576 -4128 -6782 7481 13488 846 -9077 -878 8702 2280
1199 2280 -10748 -9765 2604 5539 -5310 -11303 377 10181 2648 -7954 -2820 9093 7314 -5215
1213 -5215 -6878 3435 8592 -24 -7885 -1511 8632 5194 -6862 -6234 4332 6043 -4811 -9732
1227 -9732 -790 6029 950 -6728 -3793 6612 7302 -2527 -6121 2813 7994 -257 -7672 -2180 6147
1242 6147 2957 -5454 -4815 3653 6389 -715 -6348 -965 6281 1930 -6891 -4160 4716 4296 -2995
1257 -2995 -4492 2260 6467 1896 -4308 -2277 4036 3119 -4612 -6251 1146 4344 -1945 -5683 -195
1272 -195 5358 2807 -2702 -2386 3824 5177 -1021 -4317 362 5343 1358 -4405 -2049 3868 2062
1287 2062 -3237 -4783 -226 2055 -1158 -5132 -2744 3244 2904 -1964 -1858 4295 5387 672 -1845
1302a845K787K617k641m104m23L940K188m866k184M038L491k647l864K358L843
1317B688k83l315q73L042K543k051m274J251M356j139n048j99L396J237l020j713
1333c402K510K952L29k824p80M045J629l901k694K387K509k641l519J25L125Q45
1349F95k161k175K480L925j339l824J146M611n0l878o48L389J638k340k728k21
1365a480L857n10m807j722L979K475l827k787L347L886p09l523OM058K211l285
1381A169m085L138M074k245m982J181M636O4m783j375L103L129k412m816J296
1396b908M867M49n749p28N557K547m197l419L073M301j183m871q62N423K284m584
1412@m149M487N020l567n620J915N349p84n330k238M379M112l900m979K445P066
$$ plain form
1302 -1845 942 3559 918 -3186 -3609 331 2519 -2347 -4531 -493 2998 351 -3513 -1155 2688
1317 2688 2405 -910 -1783 1259 3802 1751 -2523 -1272 3084 1945 -3103 -3302 94 1331 -1689 -3402
1333 -3402 -892 2060 2389 -435 -1215 2830 4459 558 -2136 251 2760 119 -3400 -3275 -150 695
1349 695 -1466 -3641 -1161 2764 1425 -2399 -1253 3358 3308 -570 -1218 2171 3809 1469 -1259 -1480
1365 -1480 2377 1867 -2940 -4662 -683 1792 -2035 -4822 -1475 2411 1702 -1821 -1815 2243 4454 1169
1381 1169 -2916 222 4296 2051 -2931 -1750 2886 2950 -1833 -3208 -105 3024 612 -4204 -2908
1396 -2908 1959 2408 -3341 -4069 1488 4035 -162 -3581 -508 3793 2610 -2261 -3123 2300 4584 0
1412 0 -4149 338 5358 1791 -3829 -1914 3435 2651 -2679 -4917 -538 3574 -326 -5305 -2860 4206
1428D206o61o519p57O755K380n965l461L991M708k359o197o8P189J491o836l738
1444e841O275M746m899o431L702O645m02o964j362O607M281n890o067M383P074
1459E857l193p848J097P482J216p171l049N586O110l813p611K456Q186k9q539
1474c263k239P773L886o527o158M724P243k575p687m87Q184L177q024m801O544
1489b30P322m908q166L133Q327J66q305l206P520M939n966p807M745Q645k033
1504D176r606N6R291K494q598m710O197O968m051q599J821R105J233r712k917
1519f852Q831N669p028p163M972Q578k223q900j058Q928L342q357o756O996Q229
1534G208n468r499K661R411N53r448k824Q512O356o115q095M661J0014j881j0769
$$ plain form
1428 4206 3545 -2974 -3731 3024 5404 -561 -4022 -31 4677 2318 -3879 -3947 3242 4733 -2103 -5841
1444 -5841 434 5180 281 -6150 -2448 4197 3795 -3169 -4531 2076 6357 467 -5600 -1217 5857
1459 5857 2664 -5184 -4087 3395 4611 -2560 -5609 -23 6087 2274 -5337 -2881 5305 5276 -3263
1474 -3263 -5502 2271 6157 -370 -6528 -1804 5439 2864 -4823 -5310 2874 6051 -1973 -6774 -230
1489 -230 7092 2184 -5982 -2849 5478 5644 -2661 -5867 1653 6592 626 -7181 -2436 6209 4176
1504 4176 -5430 -5374 3917 6411 -2187 -6897 -700 6268 2217 -6382 -4561 4544 5777 -3935 -6852
1519 -6852 1979 7648 620 -6543 -1571 7007 4784 -4116 -5174 3754 7096 -1261 -8017 -1021 7208
1534 7208 1740 -7759 -5098 4313 4866 -4582 -7406 1106 7462 1347 -6748 -2087 7927 6046 -4723
1549d723l15R973K917r495n949P018P484m853r424J815J0401Q95r955l550Q867
1564A106O599p271q125N604R094k328r850p20R850L649r300o275P464Q621m800
1579C318j0263K802J0480j85j0174l114R194N692p449q513M553J0004k177j1110
1593f942n08J0717L394r289n465P940Q063m434r672K993J0263P90j0853l617R100
1608B480O467q809q522N373R306l353j0034n14R953L999q607o171P718R449n165
1623C570j0011K935J0564L30j0910l320R701M988p129q672M748J0123k511j1043
1637f637r56J0853L833r825n885Q115Q514n329r133K304J0403O92j0454l883R327
1652A939O414q172q812O252J0072l498j0262L88J0242K804r293o251P800P947
$$ plain form
1549 -4723 -5038 4935 7852 -1643 -7592 -574 6910 2057 -7367 -5552 4849 5744 -4211 -7761 1106
1564 1106 7705 434 -7691 -2087 7007 4679 -5171 -5891 3959 7608 -1692 -7967 -503 8118 3318
1579 3318 -6945 -4143 6337 6152 -4022 -7136 2058 7750 301 -8212 -3659 6345 4168 -6942
1593 -6942 -7450 3267 6661 -2628 -8093 -153 7910 3476 -6196 -3203 7060 7850 -3003 -6620 2480
1608 2480 8947 138 -8384 -3011 6295 2942 -7092 -7606 2347 6346 -2261 -8432 -714 8735 3570
1623 3570 -6441 -3506 7058 7388 -3522 -6842 2859 7847 718 -7954 -3206 6917 4406 -6637
1637 -6637 -7593 3260 7093 -2732 -8617 -502 8012 2683 -6450 -4146 6257 6949 -3505 -7388 1939
1652 1939 8353 181 -8631 -2379 7693 4195 -6067 -5679 4563 7367 -1926 -8177 -377 7570
1666G570m864j0487K637J1187j7j0352l142R998N416p176q241M629R724k601j0306
1681f025m88J0630L578r556o134Q566P622n516r681K803R904R2r650l827R642
1696A960O466p964q564N890R925l761j0316k60J0178K975r167n695P507Q372m534
1711C012r374K398J1002L6j0662l230R589N137q526p327N201R301k446j0402m07
1726f698J0712L014r244o315Q583P448n304r556L239J0477P7r697l079Q811N647
1741H115p301q863N160R593l002j0834N25J0431L017q640n073P292P714n187r110
1756f163J734R864L54j0723k873R399N350p595o737N140R059k892r054m96R536
1771C903K957q915n265P747P697n463r086L244Q934m57r240l195P821N025o752
$$ plain form
1666 7570 2706 -7781 -5144 6043 6026 -4326 -7468 2530 7946 770 -7471 -2842 6882 4281 -6025
1681 -6025 -6513 4117 7695 -1861 -7995 571 8193 2677 -7004 -4201 5703 5795 -3855 -7682 1960
1696 1960 8426 462 -8102 -2212 7713 3952 -6364 -6624 3554 6529 -2638 -8333 -826 7546 3012
1711 3012 -6362 -3964 7038 7074 -3588 -6818 2771 7908 -618 -7945 -2744 6557 4111 -6291 -6698
1726 -6698 4014 7028 -2216 -8531 52 7500 2196 -7360 -4121 6356 6433 -3264 -6343 2468 8115
1741 8115 814 -8049 -2889 6704 3702 -7132 -6607 3824 6841 -1799 -6872 420 8134 2947 -6163
1756 -6163 -4429 5435 5789 -4934 -7807 1592 6942 -653 -7390 -2250 6809 3917 -5137 -5633 3903
1771 3903 6860 -2055 -7320 427 8124 2661 -6425 -3181 5753 5296 -3944 -7139 682 5707 -1045
1786a045p516N412R390k303r162K84J0088K424q609m872O725O635n159q934K498
1801d144R155K14r498k884R153M782p332o714M966Q001k752q420k48R355L156
1816F790q067m686O845O963m950q861K537Q279k41q843k418P402N655o171o996
1831f762M980Q768k897r099J50Q741J748q050m157O266O203m108p465K132Q517
1846D967N46q243l013P907M363o910o206M991P138k461p055j72P430K840p557
1861a435m807O100O324n170p513K532Q083J93p634j943P377M098n644o084L856
1876a667P667k521p839m06P929K055o986l962O471N166l700o971J897P068p7p636
1892c512k708O909M511n614n236M074P021j764p327O2O363K677o385m222M956
$$ plain form
1786 -1045 -8561 -3149 6241 3938 -5224 -4940 5148 7572 -1037 -5909 816 7451 2292 -6642 -4144
1801 -4144 5011 5225 -4273 -7157 1996 6778 -554 -7268 -2302 5699 2947 -5473 -5721 3634 6790
1816 6790 -1277 -5963 882 7845 2895 -5966 -3429 4850 4609 -4234 -6652 750 6405 234 -6762
1831 -6762 -1782 6986 4089 -5010 -4860 3881 5629 -2421 -6578 -312 5891 1783 -5682 -3550 4967
1846 4967 5513 -2730 -5743 2164 6527 -383 -6589 -1598 5540 3079 -3976 -4148 3282 6122 -1435
1861 -1435 -6242 -142 6182 1012 -6501 -3969 4114 4307 -3327 -5270 2107 6205 561 -5523 -1667
1876 -1667 6000 3479 -4360 -4766 3163 5218 -1768 -5730 741 5907 2207 -4764 -2867 4201 4124 -3512
1892 -3512 -6220 689 5200 -414 -5650 -1576 5445 3681 -3646 -3584 2779 5456 -929 -5151 -195
1907a95O042l863o696J987P380r8p159k297N703L334n013n003K833O912j152o630
1923c915k45P283K540n763m063N154M678l665o097R58O240O48o161k353N692L963
1939D894m450n360L539N383j475o334k22O075K155n023l885M655N065l128n437
1954c548N97O477J87o473j838N234L379l555m981L070N661o32n893p75N546J879
1970D335n317l700L818L974k155m775J226N248Q50m893k152M451L758l852m775
1985c959K118N265j116m910m04M774K454m317l688L595L743j726n340j25N784
2000B148K03m604j725M465K974k679l658J412M510k54n275j282M662K571m339
2015h71k714L506L657j539m071L26M339L89l889k644L065L438l286l614J987M407
$$ plain form
1907 -195 5847 1984 -4712 -2725 4655 4557 -2602 -4899 804 4138 -875 -5878 -3045 3867 2715 -3915
1923 -3915 -4160 3123 5663 -100 -4163 991 5669 2004 -4093 -3135 3105 3753 -2408 -4761 931 4894
1939 4894 444 -4916 -1377 4006 2531 -3803 -4025 2050 4205 -818 -4703 -48 5017 1889 -3548
1954 -3548 -2951 3526 3713 -2760 -4598 636 4015 460 -4521 -1451 4210 3578 -2315 -3090 2456 4335
1970 4335 -982 -4682 -864 3110 955 -3820 -2594 2654 3504 -1389 -3541 910 4668 816 -3959
1985 -3959 -1841 3424 2308 -2602 -3006 1768 4222 -95 -3783 -188 3555 1829 -3511 -3636 2148
2000 2148 2351 -2253 -3978 487 3461 782 -2876 -1464 3046 2792 -2483 -3765 897 3468 -871
2015 -871 -3585 -79 3578 2039 -2032 -1706 2633 3022 -867 -3511 -446 2992 -294 -3908 -1921 2486
2031B486P0m489o12M049J853l437k979K481L803j537l986M69L919J413l885k164
2047b546L351K120k421l789J182L384O3l531j052L442K954k626k817K162L509
2062C385j103m254l07L414J009l083k173K682L115j468l501J014L759n18l401
2077a430q66K706J824k590k000J278L344m46l064p51L414J400l345k380K026K706
2093A826j306k780M58L017J138k659j201K181K390k376k722O78K830k97l253j01
2109b177K061J684j782j965J463K394n40k797m51L874j17k133j509K063K304p81
2125A591k592O05K512k17k679j379K149J521k068k082J507K105j87k614N67K395
2141A134R78j878k127J590K238p56l059K10K854N18k284o58J980R59j614j788
$$ plain form
2031 2486 2556 -1933 -2545 1504 3357 -80 -3059 -578 3225 1688 -2298 -1829 2090 3503 -382 -2546
2047 -2546 805 2925 504 -3285 -2103 1281 1344 -2187 -3239 203 3157 531 -2286 -124 3385
2062 3385 2282 -1972 -2279 1135 2144 -939 -3112 -430 2685 1217 -2284 -1270 2489 1971 -1430
2077 -1430 -2296 410 2234 -356 -2356 -1078 2266 1820 -1244 -1995 1419 2819 -526 -2906 -880 1826
2093 1826 520 -2260 -1802 1215 2353 -306 -1507 674 3064 688 -2034 -1356 1474 1177 -2076 -2177
2109 -2177 -116 1568 -214 -2179 -716 1678 1138 -1659 -2110 1764 1647 -486 -1995 68 2372 1591
2125 1591 -1001 -396 2116 1899 -780 -2159 -10 1511 -557 -2639 -1132 973 786 -1828 -1261 1134
2141 1134 2112 234 -1893 -303 1935 1179 -1880 -1670 1184 1702 -582 -1240 740 1699 85 -1703
2157a703K79K649Ok426j049K813J527k263j128J532J738m95k563l60K043O87k309
2174a022j385J449K654r32k531P95K473k68k275l61J958J133j442j621O21K521
2190A767l24k245l03K222P34k423j746J664J442q19j817l70K864Q81k004q79K076
2207G20J940j583k279Q18K116m06k099m99J547J362j794j990J611K078n31k361
2223a350o44K559O12k183n43J146K066q22j780N45K605L7k290j481J754J762k389
2240c96j759P03K404l49j839l60K217Q61j695j872J680K172r19k806Q21K341J67
2257A371j838j095K214J361j283j998L27K244N1k588p83K635J173k145j596J535
2273d15K079l68k411l30J992J118k310j714K304K012j246k474J015K423j61k167
$$ plain form
2157 -1703 -1424 1225 1231 -1195 -2244 569 2096 -167 -1295 237 1975 1480 -1083 -1443 600 1287 -1022
2174 -1022 -2407 -958 1696 764 -1767 -972 1501 1233 -1042 -1403 555 1688 246 -1375 -754 1767
2190 1767 1443 -802 -1105 1117 1851 -572 -2318 -654 788 -31 -1848 -2218 646 1527 -477 -1356 720
2207 720 2660 1077 -1202 -384 1732 1326 -773 -1272 275 1637 -157 -2147 -536 1542 1011 -1350
2223 -1350 -1994 565 1177 -1006 -1549 -403 1663 841 -939 -394 2211 2248 -42 -1523 231 1993 -396
2240 -396 -2155 -1452 952 603 -1236 -1596 621 1482 -213 -2085 -405 1767 848 -1958 -1137 1204 1371
2257 1371 -467 -1562 652 2013 730 -1268 -941 1303 1354 -1234 -2017 618 1791 -354 -1950 -415
2273 -415 1664 1296 -1115 -1445 547 1665 -645 -2359 -55 1957 711 -1763 -748 1675 1514 -653
2289f53o95J534J446j394j975P25K574l89k412k59K548O21k395j467J804J765
2305A378q03k579J44K964N27k465j006K282J862j326k542J220K237j78l074o48
2321b007K617R99j899j963J496K679q22l020O53K351M78k471j220K204J715r98
2337G92k310P56K519J20k427q74K364J273k265j949J290K298j141k029j18K914
2353A213O99k257j437J893K295j841k260J63K877k03k514o34K854J433k170k137
2369b026J433K592j084k815M19K532O43k133j364K009K072j173k494L32K928q
2385A863l495j038L169J348k428j649J064K868n32k361Q1K547J078k591j849K144
2401B19K144j399k528N42K715N1l036n92K367J326j932k124J018K892l82k983
$$ plain form
2289 -653 -1348 186 1632 238 -1737 -1012 1562 1173 -1239 -1498 1050 1671 -724 -2191 -387 1378
2305 1378 575 -2004 -1860 1104 1631 -834 -1840 442 2304 978 -1564 -344 1893 1715 -1359 -2007
2321 -2007 610 1609 -290 -2253 -757 1922 1100 -1920 -1267 1084 1562 -909 -2129 75 1790 792
2337 792 -1518 -762 1757 1877 -550 -1424 940 2213 -52 -2001 -711 1587 446 -1583 -1701 1213
2353 1213 1912 -345 -1782 111 2406 565 -1695 -1532 1345 1142 -1372 -2006 848 2281 111 -2026
2369 -2026 -593 1999 915 -1900 -1481 1051 1694 -439 -1803 206 2278 1105 -1389 -1057 1871 1863
2385 1863 -1632 -2670 499 1847 -581 -2230 -1166 1702 1170 -1191 -1110 1437 2515 -76 -1925 219
2401 219 2363 964 -1564 -1022 1693 1744 -1292 -1884 483 1809 -123 -2247 -1229 1663 1281 -1702
2417a702r2K904J218k544j702K211J956j161k483N8K563M15k947j176K698J539
2433A755j635k348J593K672j009k455r2K512J220k423k158K314K296j420k529
2448a707M54K983l8k794q75K133J884j792k319J015K945k29l029L6K482J317k727
2465b61j921J918J995j590k214j44L381K91k692m88K029K311k496j630R12K582
2481A983m79k881j23K424R47k115j862K210K295j175l155L78K863J65k931n85
2497b041K308J749k097j350L04L261o12k367n31K223J175k558j785K203K183j279
2513G86k253M23K744K72k269k238K506J795j966k537J402K735l85k454J3K128
2529G02J504j871j889J812J984r34l284L32L192J86k423j005K422J419j871k417
$$ plain form
2417 -1702 -1794 1110 2328 -216 -1918 293 2249 1088 -1395 -1337 1226 1641 -1306 -2482 216 1755
2433 1755 120 -2228 -635 2037 1028 -1427 -1519 993 2213 -210 -2368 -54 2242 822 -1707
2448 -1707 -1253 1730 1692 -1102 -1977 156 2040 248 -2071 -1056 1889 1660 -1369 -1333 1149 2466 -261
2465 -261 -2182 -264 1731 141 -2073 -2217 1164 1455 -1237 -1725 304 2615 119 -1511 -599 1983
2481 1983 1504 -1377 -1500 924 1871 -244 -2106 104 2399 1224 -1931 -1553 1310 1475 -1456 -2041
2497 -2041 267 2016 -81 -1431 -1127 2134 1522 -845 -1376 847 2022 -536 -2321 -118 2065 786
2513 786 -1467 -1044 1700 1972 -297 -2535 -29 1766 -200 -2737 -1335 1400 1015 -1439 -1426 702
2529 702 2206 335 -1554 258 2242 1308 -1976 -1644 1548 1734 -689 -1694 728 2147 276 -2141
2545b141J183K543m18k398p89K570J412k271j518J769K374j643k100K61K844J50
2561A828k875j332K123K061j461k425J375K917r11k378n40K611Q36k038j536Q26
2577i19K526q52k546J76L054N42k852j021K020J698j634k226R41K471P9k479n26
2594a548K698J222k086k079J559J722j007k281M49J944P76k063j065J620K011
2609A872j147k608J114K475l99k519l56K430J058j871j883J553K132k82l037M43
2625a025K110M01k693j100J966J750j294j812R66K024K10k211o75K035J338k110
2641a20j717J122K365p30k012K87J625R36j850j426J301K034j213k516O23K379
2657A088J00k429k44K131R56j502j402J025J662m48k059m14K099J098k068r83
$$ plain form
2545 -2141 -958 1585 1167 -1231 -2020 550 1962 -309 -1827 -58 2316 673 -1427 -1166 1678 1828
2561 1828 -1047 -2379 -256 1805 344 -2081 -706 2211 1300 -1078 -1618 993 1829 -209 -1745 -919
2577 -919 1607 755 -1791 -1615 1439 1981 -871 -1892 128 1826 192 -2034 -1093 1378 1457 -1022 -1548
2594 -1548 1150 2372 286 -1793 -234 1488 481 -1800 -1351 593 1369 -694 -1759 -139 1872
2609 1872 725 -1883 -769 1706 1307 -1212 -1568 862 1920 49 -1834 -281 1851 1569 -1468 -1025
2625 -1025 1085 1486 -1207 -2307 -341 1409 115 -1697 -731 1293 1503 -708 -1383 652 1990 -120
2641 -120 -1837 -715 1650 920 -1092 -805 820 1756 -94 -1520 -219 1815 602 -1914 -1291 1088
2657 1088 1188 -1241 -1485 646 1602 100 -1302 -277 1385 937 -1122 -1536 563 1661 -407 -1390
2673a390J606J460j251j757O53J697j75j788q23J566J854j648j891J331K376p71
2689A049j669j71J697L65j832j191J596J125o85j851P00K302J68k147p03K078
2705H31P16j487j356Q21J705o35j687QJ485R19j966q25J333J242j012j827N20
2722a215J918j63j030o80J782R03r77j430P01J590k04k357j39J820R2q95j095
2739a379J243J466r25j472LJ804N94j765q91J669J335j636q07O87J755q93j207
2756d19k42J381L96j259j498J235J352o53j350J73J729L20j601k86J046R70j004
2773B90j434K23J831l52j510k15J594M54j099q51J145R12n59j316j58J719N53
2790A227j357r91J810M73j000r39Q3J666j66j701j9J257J99r11o85R62J591r71
$$ plain form
2673 -1390 216 1676 425 -1332 -679 1018 843 -945 -1768 -202 1652 4 -1887 -556 1820 1049
2689 1049 -620 -791 906 1271 -561 -1752 -156 969 284 -1567 -867 1435 1603 -544 -1247 831
2705 831 1547 60 -1296 -475 1230 595 -1092 -1084 401 1320 -646 -1471 -138 1104 92 -1735 -1215
2722 -1215 703 540 -490 -1170 612 1515 538 -892 -191 1399 1195 -1162 -1301 519 611 -284 -1379
2739 -1379 -136 1330 405 -1067 -1064 740 1334 -431 -1322 347 1682 46 -761 -74 1681 788 -419
2756 -419 -661 720 1116 -143 -1641 -406 946 293 -1057 -884 845 1165 -436 -722 324 1294 290
2773 290 -1144 -921 910 558 -952 -1167 427 881 -218 -1069 76 988 429 -887 -1045 674 1227
2790 1227 -130 -1121 689 1162 162 -777 -694 972 806 -895 -914 343 542 -369 -1054 -92 1499 528
2808E28j029j3J369K07j465k37Q61O69n68j437N96J404N8k186K94Q96J186j377
2826b44r97P31J157j74j517N73J382N0j308p08J148J218r59j320L53J760m51j084
2844c90j24O44P73j018p20O50J191m44j516N25P99N66j501l51R79N91j22j328
2862g96L24J218Q5j196n17J592K20r54r05M92J416p17j122L73J046K67j132m90
2880g96P32J181q83j581P86J122J68j346k05R87R41q26q85K46R87j68j453K97
2898f96J567n3j254m99Q91P89l37r16k51J098N4p52p27J215O83n54j056N61Q23
2917E86l0o23l84J018L39q46p49N64R07k16j508P9J170K93r63m62P52N47nj063
2937e94J09J166K00j138l23Q51N10n63j322J056R00m86j023M92O79K09p69o27
$$ plain form
2808 528 -501 -514 855 1062 -403 -640 221 890 322 -1115 -519 885 943 -1243 -949 -53 1133 -244
2826 -244 -1241 -510 647 473 -1044 -471 911 961 -347 -1055 93 1311 352 -968 -615 1145 694 -390
2844 -390 -514 130 903 -115 -835 -185 1006 562 -954 -429 370 936 -565 -916 63 654 532 -796
2862 -796 -472 746 831 -365 -882 710 930 -24 -929 -437 979 262 -860 -487 559 826 -306 -796
2880 -796 -64 1117 234 -1347 -561 561 729 -617 -822 165 1106 280 -605 -359 628 460 -993 -696
2898 -696 871 818 -436 -935 -44 745 408 -508 -759 339 393 -359 -1086 129 812 258 -798 -237 586
2917 586 556 -67 -451 567 906 60 -689 -125 782 566 -942 -863 307 600 -363 -825 -73 474 469 -594
2937 -594 -485 681 881 -257 -580 271 781 218 -1104 -48 852 366 -657 -165 514 723 -46 -673
2955f73K96J231k99j280L12J168j19q77l61K77J153p34r60O59Q27q1j013l65J161
2974C22P5m67q28J115M53l32q83R8R91J37p54p15J095M68p76q55L45Q57j32r32
2994g18J15L80R52r51j37K98Q83j73q04LN69L19r08p8J24K43K54q56J8Q99o5r81
3016f14J12L48L70m52m66L49Q75o7n94j28Q93N2m02m29K42L56k00j287O77N75
3036B10j07n95j42N97J120r55p00J60J323p70q71M79N64N21j170k59L22P81k82
3055B26o73k7R80Q5p63l99O46J041q81p90O28Q39m63p55j78L94N94o55m44M32
3075a63P58m18p66K6O94N71p62k33K11P25l55q51K22Q76N1j173K57O71K24m45
3095A20o42L32N12l00p70j13J034M39n02m46Q63j41j29r90L16J122k10n84p52
$$ plain form
2955 -673 -377 854 555 -725 -413 755 636 -241 -602 -325 828 94 -866 -207 620 539 -474 -839 322
2974 322 397 -70 -898 217 670 338 -545 -447 544 681 -73 -788 307 775 -1 -856 -511 346 214 -718
2994 -718 -603 -223 729 -222 -359 -61 822 649 -155 -152 417 736 -172 -250 -126 117 371 -485 -467 432 367 -614
3016 -614 -502 -154 216 -236 -702 -353 522 455 -139 -267 626 678 276 -153 89 445 245 -1042 -365 210
3036 210 103 -492 -634 -37 1083 128 -572 -412 911 141 -730 -251 313 834 -336 -595 -273 508 226
3055 226 -447 -474 506 591 -172 -571 75 1116 235 -555 73 912 449 -306 -484 -90 504 -151 -595 -163
3075 -163 595 177 -589 -563 131 702 -60 -293 -82 643 288 -563 -341 535 586 -587 -330 341 565 120
3095 120 -522 -190 322 22 -748 -861 173 612 110 -336 527 386 257 -733 -417 705 495 -89 -841
3114h41J238K60n22l25L38K95L71j419k7P99P4o00k94O08M32j31o87l7J101j14
3134E19m96m86O48L16n60l29N2O11L82q50k70M37O75n53m61M86L20k82r20N58
3154b03N71L3o49l6K76N84k36n30l47R01r5p05k91J121j64q8p45M06R14k07q47
3175c37Q1M65J76p25l76N12J094q77n17j19J240J41j117m5J6J186p58o55J26J317
3195H28n54l80J43M21L22o33m10P83J92o86o14J1J050k35p01J20L34J127q60n85
3215c27j52R63r5n07l21Q22L64p28l88M42N04m33n55N3M72R7o72l22Q31O37n63
3236A22n28K37R97m57m51n0M15K88p10n44K94R16m86k83m11J422r5p34o38N11
3256a85O49o80n31N90O06m67m71J06P04P21j338j98K77K65L11j146M19P8Q90p02
$$ plain form
3114 -841 397 657 135 -190 148 443 814 -605 -632 167 241 -359 -653 -45 387 256 -431 -468 633 519
3134 519 23 -463 185 501 -59 -388 -336 275 657 -193 -463 -26 649 96 -365 121 441 159 -761 -203
3154 -203 368 401 -248 -284 -8 576 340 -190 -537 364 269 -436 -727 394 230 142 -603 -197 717 510 -337
3175 -337 -256 209 385 -340 -716 -204 890 13 -504 -623 617 758 -359 -404 -388 798 40 -615 -489 828
3195 828 274 -106 37 458 780 147 -263 520 712 26 -588 -577 473 238 -463 -343 -9 1118 258 -327
3215 -327 -479 484 389 -118 -439 383 747 19 -369 73 577 144 -411 -358 114 211 -461 -783 48 685 122
3236 122 -406 -169 828 371 -80 -130 285 573 -137 -681 -387 529 43 -240 -651 771 676 -58 -696 -185
3256 -185 464 -216 -747 -157 449 -18 -489 -383 321 1042 -296 -494 -217 48 359 -787 -368 -290 600 -102
3276a02k35L51O75n79o03L85M00J38q80q0N41K77l29q25P38M78N0p67o5O26M64
3297F58o91p89R28O84r72k53P31K73O0j132L12K16M00R7p61o7N65k5n72P4P35
3318D71k9p82o3L48O99o97m08L5O70K30o64k15Q30Lj91n54K5P65k39m60j5N17
3340B76O24j512j58Q81K72Pj001N29L52K34j064j23O94N19j23p10L36O12q0q01
3360b36j76J062J17j004j12p2Q15k35o71m4O59N39r09j83K58O69m38o30K75O04
3380B88j94k65J4O60J32p72m81N45N97k46r52J18Q70P9k23l71L16L25J13p89k0
3401b56N48K40p11m0J43K91l56l77L4J072j36p59k00Q05M87j043l30P43L65n23
3421cm52K38N80Pj025J73M76R8l65k54O57R0r2m53j77Q95l0l80m12R34Km92o16
$$ plain form
3276 -102 -337 14 689 110 -493 -108 292 430 -450 -530 11 288 -41 -866 -128 350 400 -367 -432 194 658
3297 658 -33 -822 106 790 -182 -435 296 569 629 -503 -191 25 425 522 -239 -306 259 234 -338 -264 471
3318 471 442 -340 -403 -55 644 -53 -461 -426 244 474 -190 -405 425 428 237 -317 -292 473 234 -226 -241 276
3340 276 900 -612 -770 111 383 390 -611 -82 270 504 -560 -683 11 530 407 -303 33 645 565 -236
3360 -236 -412 650 767 -237 -349 -421 394 159 -512 -556 103 642 -267 -450 -192 477 39 -591 -316 288
3380 288 94 -171 -157 503 635 -137 -618 -73 524 278 -674 -556 314 393 170 -201 115 440 553 -236 -256
3401 -256 292 532 -179 -219 -76 215 -141 -518 -484 588 452 -307 -507 298 785 -258 -588 155 520 -3
3421 -3 -455 -217 363 370 -655 -482 -6 92 -273 -527 130 220 128 -325 -502 393 363 -17 -429 505 507 15 -601
3444f01R29K54J82q85j15L51N91r35n26L79P35o5q14L81K68M18q75j39O33M73
3464F39o88j36o3M17r3P8p40N43O45p54n6l6O44j52o40J14O72ol34n81N04J95
3486A72j97n17M20M61J27o99r4P40k3l17n23L68N17m20n81L60M86k64k38m7j04
3507c73P69K5o97P4L31K8l73j0N14o7l59j8J99L39j31r19M28K18L67n87l97J167
3529E28j32m17j88P1P05J6q60R3J74P01q97j89N24J79j51j21k66M03q5l84p5O13
3551B42O27o64p09MP51J58n93K7O05j15l27n28K77Q72m16r9l87M68J08j49n90
3572d38L72K03q3j36K38J36l3k98m86N40L13k80k06j12N83n11K13l99M93K43o37
3593b85l1J16M92n57j13L64J33K18k67j31K55M31p70j98N9N06L98p47j11N94M43
$$ plain form
3444 -601 328 582 764 -121 -236 115 706 -229 -755 -376 359 294 -520 -139 129 547 -328 -467 166 639
3464 639 -49 -185 -248 169 76 154 -586 -43 602 -152 -208 -244 400 248 -392 -278 394 388 54 -527 -23 172
3486 172 -25 -542 -122 339 466 -233 -327 413 390 73 -450 -82 435 15 -566 -206 280 16 -222 -269 -373
3507 -373 396 421 -276 -202 129 157 -216 -226 288 221 -138 -156 43 382 251 -668 -240 -22 345 -242 -639 528
3529 528 396 -21 -209 -138 567 583 -277 -184 -10 691 -206 -395 129 308 157 36 -230 173 88 -296 -371 242
3551 242 869 205 -504 -500 251 409 -184 -157 448 333 6 -522 -245 627 211 112 -275 193 301 152 -438
3572 -438 -66 137 54 -82 156 292 259 -39 -525 15 328 48 -158 -270 313 -198 15 -384 109 352 -285
3593 -285 -316 -200 292 -265 -378 -14 119 337 70 -61 194 625 -145 -343 -284 222 620 -127 -238 356 799
3614G99q54j52L77pj13m16J32J32M88p06l6P32r6k19m91O21M08k69m52q2P71n3
3636E14m37n7M98j80q4n55n8J04M94o03l2J98J16M5m70M34N53j05m32j38K52L68
3658D25k90k50l22N50J15k55k91J48K74L0m63M83L37l27l85m0O68k8o20J83K04
3679A46j26l6k44L39K16k03j85k96O96pl30n6K10K73l47j13R7M05l15k69k99M91
3701D7Q2n99k32L29Q87j63m64M33L70rn98k77J92j10J20j01M3K86j77kK9k01K31
3724A16j30k15mM42M7m63J79K64J49m19J0j86M05J2l96J82j07jL7oK2M03n03j59
3748c21Q4m8O36k29l76J37O9M9l13j2L84q4m9J35j31L16N5n41M15j17K1l41M03
3771A42r2K47m31J01L66p3m30q1M62j66j08j06j18M93j15Ol31j6M35P2n39J39
$$ plain form
3614 799 -55 -207 170 163 50 -366 -234 -102 386 -320 -356 376 280 61 -430 191 599 330 -122 -204 567 514
3636 514 77 20 518 338 254 -301 -359 -255 239 -364 -396 -198 -82 -37 -507 -73 480 375 -57 -195 57 425
3658 425 135 -115 -437 113 228 -27 -318 -170 104 134 -329 154 491 164 -221 -261 407 379 -241 -58 146
3679 146 20 -16 -260 79 295 92 -93 -389 307 300 -30 -86 124 397 50 -63 34 439 124 -145 -444 47
3701 47 129 -470 -702 -373 514 351 -113 320 690 681 83 -194 -2 -112 8 -93 -50 236 59 57 86 -115 116
3724 116 -14 -229 -233 209 256 -207 -28 236 385 -34 -24 -210 195 207 -189 -7 -114 -115 -78 -84 -62 341 -162 -321
3748 -321 -237 -285 351 122 -254 -117 -48 1 -312 -324 60 -24 -73 62 -69 247 302 -239 176 59 80 -261 142
3771 142 50 297 -134 -33 333 260 -170 -251 211 45 -63 -169 -287 206 91 97 -234 -250 185 257 -282 -143
3793a43N53o5l43k32K13J87j25J5j95J33K25n14R4P5K12o4k9k34O00n73J27j50
3815b33J54K67l55N0R8l5M36o64L10L10k53J74l95J73K3q9k98J86J99m0p3j15
3837a70M56k51n46L89j94M85m2k97L32m28M88p6n08M48j6j02j58J26M47l12j05
3858c4L4Q8k8j04QJ28K10k90j72k97M92J26l13L92k05J38l15J12j22K58k21M5
3880g0K51q0J2l64MK1J19o7OJ15Q6j30L16m56P4K40k56J8l9K72Ll56J81K30K51
3905C81l01m6J2K11k88J92j15j33O74q75L59l60P62n08j68K08Q6O0k81L7R5P7
3927G9j03n4J51K54k00j33j36M7m4L7k85L97K24k79k70L91o6j32j5Q9K58j41k66
3950a97j68J99M6M3m26L61K13L2l35J09%K52j37j04j3L84P3l44o9K60K6j61m04
$$ plain form
3793 -143 410 345 2 -230 -17 170 45 60 -135 -2 223 -291 -197 -122 90 26 -3 -237 363 -210 -83 -233
3815 -233 -79 188 -167 -117 -19 -54 382 -282 28 338 85 259 -136 37 60 -29 -327 -141 58 18 -55 -170
3837 -170 286 35 -511 -122 -316 169 127 -170 162 -266 222 146 -362 86 70 -32 -190 -64 383 71 -34
3858 -34 0 88 60 -44 -36 92 302 12 -160 -457 35 161 -152 240 35 173 -142 -30 -152 106 -115 -70
3880 -70 181 101 113 -251 -247 -226 -107 -174 -168 -53 33 -97 219 -237 -163 77 -179 -161 -200 72 75 -281 -100 130 381
3905 381 80 34 46 257 -31 161 46 -87 587 -288 71 -289 473 -35 -203 5 91 151 -130 -93 2 79
3927 79 -24 -78 73 327 127 -6 -142 -95 -139 -102 -387 10 234 -45 -315 76 10 -122 -137 -48 210 69 -197
3950 -197 -365 -166 -120 -77 -503 -142 71 103 -232 -123 -123 129 -8 -112 -125 259 332 -12 -81 179 205 44 -360
3973c60N08j50j62J52j85M99l47K32k47k7M55k10l02K24j14K05L7o64P12J17m32
3994e9l55L95Q6J50m48R7K46J69k4o61O86Q1m08J01l71N81K7l67j70L59l83J69
4016i9J44j16J49L8j14j38J50K40k2n3k8l41M28l52L66k59J30l23l60M54K31J57
4038B82m03K75k45J62j50k64M58q1K13p04M23J84r9j33j24J98L8j36j37L65J58
4059B80k75j48k54J31N45j42m07L11L04m10k71K38M7K99m55K67k5m2L83o82K86
4080b0j24M25k58j20oqK18o25O83K37l67l13l5N38n9j79J00l17K01l26M68n24
4102d11N96l03N9J41j96J23l1l1nL09o08L26K23k17J65k91JK49L2m42K26K31k23
4125g7k77K98j32M4K75k24k96O70n61M08m79K01L22l17K21k79L43j10p8o1K02
$$ plain form
3973 -360 148 -2 -164 -12 -197 302 -45 187 -60 -87 368 158 -144 80 -34 171 208 -456 256 373 -59
3994 -59 -414 -19 67 217 -231 -134 112 281 257 -404 282 363 -45 56 -315 266 293 -74 -244 115 -268 -99
4016 -99 45 -71 78 116 2 -136 14 254 232 179 151 -190 238 -114 252 -7 123 -200 -560 -106 125 282
4038 282 -121 154 -91 71 -79 -343 115 34 247 -457 -34 150 51 -82 -206 -8 30 -106 -243 122 280
4059 280 5 -143 -397 -266 279 137 -270 41 345 -65 -336 -98 -51 248 -207 60 35 -7 376 -306 -20
4080 -20 -144 281 23 -97 -103 -111 107 -518 165 402 35 -278 -313 225 166 -13 87 -230 -29 -355 113 -411
4102 -411 185 -118 -59 82 -114 9 -22 -53 -58 251 -357 -31 192 -25 140 -151 -150 99 131 -311 -85 146 -77
4125 -77 -354 -56 -188 -144 131 -93 -389 281 -280 128 -351 -150 172 -145 76 -203 140 30 -48 -109 93
4146I3K51l68J41n37K49K47m18J53N06j40j04j02L0r5L63j96KN7p8j40j55O36
4168C95l15k97j7L23N8j56L89q55P94m07K06j39n1J32J58k07m0K47j11M3l03p1
4190b24M40l48J29L09l03K13j20l27J23N0L44j90J01j48l7k03j02M81j5j41k6
4211Fl30M05m0J59P9j9j38j12n4K01O2k17k60J92N53l56j75j65N38n40K49q0K11
4234A69m49j0N5L46l04K83l28J70m5J81p4K46n52L27J74l01j43j04N35l26M07
4255B57l11K90p1m00Q4J96l8l00K83j18L60l19j39L39l86J33O7K7j04L94PJ45
4277C96r8m77L26j61O1r3N52p14L20n91O68J51m73p6P6N38m80k0k96L82K69q9
4299A71n42N29k26O3j12K70k46o4L5N9P5j31M9j50N18k58m9J57l61M51l03Q8L30
$$ plain form
4146 93 344 -24 117 -420 -171 76 -342 -189 317 177 73 -29 1 -94 269 73 75 132 54 -86 -241 395
4168 395 80 -217 -234 89 147 -9 380 -475 319 -88 118 -21 -72 60 218 11 -29 218 107 150 -153 -224
4190 -224 216 -132 -3 306 3 216 96 -231 -108 -58 286 96 197 49 12 -191 -293 188 173 32 6
4211 6 -324 81 41 200 279 260 122 10 -44 157 219 2 -258 -66 487 131 -44 -209 329 -211 38 -42 169
4234 169 -280 -290 -235 111 -193 90 -238 -68 -113 68 -6 240 -312 15 189 -112 -255 -359 176 -150 257
4255 257 -54 236 165 -235 -151 45 7 -293 -10 -128 232 -87 -226 113 -273 -140 -73 -46 -150 244 251 396
4277 396 298 -179 147 -14 47 -46 506 -208 112 -479 189 340 -133 -209 -133 405 -75 -95 -391 -9 260 171
4299 171 -371 158 -68 -5 -117 153 -93 -157 -122 -63 12 -119 -70 -220 298 40 -9 148 -213 238 -65 23 353
4322C53m83m4L67J8m08Nj2K8m2K59j83k5Q7K60p3j15k88P9N0J93J74r4l6m5q6
4347f1J19R5l45J24k24K86m45M05K16k20j12K18Q1J15l26M44k84J34k25J85p7
4368A03k57KK53k3J73n7m3K9k21j79J20J70M6J15n54O2M16nO1n00M43n74M12O1
4392E3k50j63L64K11k75K66m2qj56p7M48k67l21M46j20l3k05N1K2j15K46J52m86
4415b59L71j83l33P8P64m19n22M75n61O19k09L19p9j27J26l31n1L18J75j92k43
4436b64m3O13j15n7j74K03L37m59j58k61L53k4o7j07J4K46j14o4J34J2M5J88j06
4459A32J29r9k89k78M8K30K2q6M05N6j49k60Q3n9L29L1m30J98q8O5J42j70o0L97
4483B99k89k73L51J4p3R7J62j32K25l36r1J69q1j08K91J44m57o5J25J46l02M8
$$ plain form
4322 353 -130 -174 193 211 -197 -192 -204 -176 -218 41 -142 -167 -80 180 107 -8 -296 -217 -167 26 200 106 70 25 -61
4347 -61 58 153 -192 -68 -292 -6 -451 -46 170 -50 -162 56 137 252 -74 370 86 220 -5 180 103
4368 103 -154 -152 101 78 251 194 151 180 -41 -220 -100 70 116 231 -323 -261 155 150 211 -289 154 -420 -8 53
4392 53 -197 -360 4 215 -60 206 164 156 0 -77 371 104 -217 229 109 76 -129 -78 -56 -171 75 227 -259
4415 -259 112 -71 -404 -326 438 19 -503 -28 -589 30 -179 140 61 -66 60 -271 -322 -4 171 -21 -264
4436 -264 -307 306 191 134 -40 163 500 41 -117 -378 -25 -49 -116 -223 -209 37 -77 -141 -7 5 50 238 132
4459 132 261 162 -127 -405 -357 -127 -105 -191 214 270 121 -139 -56 -115 214 245 -185 13 -75 -10 132 -38 -98 299
4483 299 10 -263 88 102 29 126 288 156 381 45 -46 123 42 -66 225 369 -88 -153 -28 118 -184 -136
4505a36J71j63LJ13J52J79k76Jm0Q6k67K10K70m64P5k5J74o1k22J61K25l40N73
4528C99l35J56m0o0m2m68K97J57P9j52k68m9L14L89l23K87l53p7j14K93J78l73
4550a05J16k44J66K09l39OL78j75O5J08l15n7J87J16k19r1J59k9K19j84P5j49
4572a03r0M58k39M3q5J64o1J33k33L6J40l10J62j08%r3j47L22OO5j65J80j29L4
4596b0K88k13j9k51K01K2J36k62j22K6N61k60j1l78L93K64l10l64L29N0L13n69
4618a96K88n16O40l63K52J3j73j2k46N65j47j08J58o4M41l86k50M4L08k3r9L21
4640D47r4k82m9O5l6L82m27J51M4k94k17L96k39K65k15r7N47j64j54j81O7L74
4662B89k04K7k82L66k56j96m9L22j28p2p5J03K20k09J72n4J10j52N7n6J87l07
$$ plain form
4505 -136 35 -128 -125 -12 140 319 43 44 4 90 -177 33 303 -161 -86 -111 63 2 -220 -59 166 -174 399
4528 399 64 220 180 120 78 -390 -93 64 143 -9 -277 -326 -12 377 54 341 -12 -89 -203 90 268 -105
4550 -105 11 -233 -67 142 -197 -191 187 12 77 185 -130 -187 0 116 -103 -194 -35 -64 155 -29 46 -103
4572 -103 -193 265 26 69 -16 148 87 220 -13 23 163 -147 15 -93 -93 -186 -333 -11 -5 60 -105 75 -54 -20
4596 -20 268 55 36 -215 -14 8 144 -118 -240 -214 347 87 76 -302 91 355 45 -319 10 60 373 -196
4618 -196 92 -424 216 -147 105 118 -55 -67 -313 252 105 -3 155 91 532 146 -104 -60 248 225 126 447
4640 447 353 71 22 87 51 433 6 157 201 -93 -310 86 -153 112 -103 -200 347 183 29 -152 -85 289
4662 289 85 112 -170 196 -60 -256 -305 17 -111 -183 -258 -155 65 -144 28 -26 84 -68 -11 -67 120 -187
4684a87K22R8k99K34o0p4P5r7J73k25m9N9J14J33k45K83Rl30j6N99m23O9j74J26
4708A5K05k25k45J93j97M76k74j8L15j02P2k54J95l55L55o07M76j79J49k0J25
4729A00N5l23Q1J05J02O2k71K43m00K67O9j23p1J56p8J3N1m12J75J4j31J32O3
4752a21P8M6M3K91p22N64l73J82n3K6K15l40K57q6OJ36l82K91j81J1M9J6J63R1
4776B07m61j27O79l38J41j38Nj87M2p9L0K47l3Q5K3j43N2j60K96p0o0k00K56k06
4800a39O10m62K25l19q1M47q1l39m1O9l78M08j96M85j95j25lL64j78p7p8j98M10
$$ plain form
4684 -187 35 133 -166 68 8 -66 9 -88 85 -140 -189 -130 -16 117 -128 155 164 -166 -182 417 -6 63 -111 15
4708 15 220 -5 -250 -57 -254 222 -52 -70 245 143 215 -39 156 -199 156 -451 25 -154 -5 -25 100
4729 100 155 -168 -87 18 120 182 -89 154 -246 21 90 -33 -104 52 -26 -13 38 -374 -199 -185 -316 -184 -121
4752 -121 -43 3 46 337 -385 179 -194 -12 -65 -39 176 -164 93 7 13 149 -233 58 -123 -112 -63 -47 116 207
4776 207 -254 -381 298 -40 101 -37 -32 -219 -177 -256 -226 21 -12 73 96 -47 5 -155 141 71 11 -189 67 -139
4800 -139 471 9 234 -85 -166 281 200 -139 -180 -111 -489 -81 -277 208 13 -112 -115 249 71 -6 -84 -282 128
$$ [...]
8191c43
##END NTUPLES=NMR FID
##END=
