##TITLE=1H ikalashn
B1G 1511-2
15.11.2024
##JCAMPDX= 6.0         $$ Bruker NMR JCAMP-DX V2.0
##DATA TYPE= NMR FID
##DATA CLASS= NTUPLES
##ORIGIN= UXNMR, Bruker Analytische Messtechnik GmbH
##OWNER= root
$$ TOPSPIN		Version 1.3
$$ 2024-11-15 14:28:15.171 +0400  Irina@DPX200
$$ Compression mode = diff/dup
##.OBSERVE FREQUENCY= 200.131300845
##.OBSERVE NUCLEUS= ^1H
##.DELAY= (6, 6)
##.ACQUISITION MODE= SIMULTANEOUS
##.ACQUISITION SCHEME= undefined
##.AVERAGES= 32
##.DIGITISER RES= 18
##SPECTROMETER/DATA SYSTEM= spect
##.PULSE SEQUENCE= zg
##.SOLVENT NAME= CDCl3
##.SHIFT REFERENCE= INTERNAL, CDCl3, 1, 17.49637
##AUDIT TRAIL= $$ (NUMBER, WHEN, WHO, WHERE, WHAT)
$$ ##TITLE= Audit trail, TOPSPIN		Version 1.3
$$ ##JCAMPDX= 5.01
$$ ##ORIGIN= Bruker BioSpin GmbH
$$ ##OWNER= Irina
$$ $$ F:/spectra/data/iren/nmr/1H/4/audita.txt
$$ ##AUDIT TRAIL=  $$ (NUMBER, WHEN, WHO, WHERE, VERSION, WHAT)
(   1,<2024-11-15 14:27:57.156 +0400>,<Irina>,<DPX200>,<TOPSPIN 1.3>,
      <created by zg
	started at 2024-11-15 14:25:49.078 +0400,
	POWCHK disabled, PULCHK disabled
       configuration hash MD5:
       BE 6D 3F 07 2A EA 11 49 91 17 2B D3 AF B3 58 0D
       data hash MD5: 16K
       14 D3 C7 49 22 BC 23 A1 29 BE 78 FC 4F C1 12 F5>)
$$ ##END=
$$ 
$$ $$ hash MD5
$$ $$ 67 51 C0 25 1A E2 CF 39 B4 3E 16 41 87 25 54 72
##$RELAX= 
##$RELAX= 
##$RELAX= 
##$RELAX= 
##$RELAX= 
##$RELAX= 
##$RELAX= 
##$RELAX= 
##$RELAX= 
$$ Bruker specific parameters
$$ --------------------------
##$DU= <F:/spectra>
##$EXPNO= 4
##$NAME= <1H>
##$PROCNO= 1
##$TYPE= <nmr>
##$USER= <iren>
##$AMP= (0..31)
100 100 100 100 100 100 100 100 100 100 100 100 100 100 100 100 100 100 
100 100 100 100 100 100 100 100 100 100 100 100 100 100 
##$ANAVPT= -1
##$AQSEQ= 0
##$AQ_mod= 1
##$AUNM= <au_zg>
##$AUTOPOS= <>
##$BF1= 200.13
##$BF2= 200.13
##$BF3= 200.13
##$BF4= 200.13
##$BF5= 200.13
##$BF6= 200.13
##$BF7= 200.13
##$BF8= 200.13
##$BYTORDA= 1
##$CFDGTYP= 0
##$CFRGTYP= 5
##$CHEMSTR= <none>
##$CNST= (0..63)
1 1 145 1 1 1 1 1 1 1 1 1 1 1 1 1 1 1 1 1 1 1 1 1 1 1 1 1 1 1 1 1 1 1 
1 1 1 1 1 1 1 1 1 1 1 1 1 1 1 1 1 1 1 1 1 1 1 1 1 1 1 1 1 1 
##$CPDPRG= <>
##$CPDPRG1= <>
##$CPDPRG2= <>
##$CPDPRG3= <>
##$CPDPRG4= <mlev>
##$CPDPRG5= <mlev>
##$CPDPRG6= <mlev>
##$CPDPRG7= <mlev>
##$CPDPRG8= <mlev>
##$CPDPRGB= <>
##$CPDPRGT= <>
##$D= (0..63)
0 2 0 0 0 0 0 0 0 0.06 0 0.03 0 0 0 0 0.0002 0 0 0 0 0 0 0 0 0 0 0 0 0 
0 0 0 0 0 0 0 0 0 0 0 0 0 0 0 0 0 0 0 0 0 0 0 0 0 0 0 0 0 0 0 0 0 0 
##$DATE= 1731666476
##$DBL= (0..7)
120 120 120 120 120 120 120 120 
##$DBP= (0..7)
150 150 150 150 150 150 150 150 
##$DBP07= 0
##$DBPNAM0= <>
##$DBPNAM1= <>
##$DBPNAM2= <>
##$DBPNAM3= <>
##$DBPNAM4= <>
##$DBPNAM5= <>
##$DBPNAM6= <>
##$DBPNAM7= <>
##$DBPOAL= (0..7)
0.5 0.5 0.5 0.5 0.5 0.5 0.5 0.5 
##$DBPOFFS= (0..7)
0 0 0 0 0 0 0 0 
##$DE= 6
##$DECBNUC= <off>
##$DECIM= 32
##$DECNUC= <off>
##$DECSTAT= 4
##$DIGMOD= 1
##$DIGTYP= 9
##$DL= (0..7)
0 120 120 120 120 120 120 120 
##$DP= (0..7)
150 150 150 150 150 150 150 150 
##$DP07= 0
##$DPNAME0= <>
$$ [...]
##$SW= 21.9926040160658
##$SWIBOX= (0..15)
0 0 2 0 0 0 0 0 0 0 0 0 0 0 0 0 
##$SW_h= 4401.40845070422
##$TD= 16384
##$TD0= 1
##$TE= 300
##$TE2= 300
##$TE3= 300
##$TEG= 300
##$TL= (0..7)
0 120 120 120 120 120 120 120 
##$TP= (0..7)
150 150 150 150 150 150 150 150 
##$TP07= 0
##$TPNAME0= <>
##$TPNAME1= <>
##$TPNAME2= <>
##$TPNAME3= <>
##$TPNAME4= <>
##$TPNAME5= <>
##$TPNAME6= <>
##$TPNAME7= <>
##$TPOAL= (0..7)
0.5 0.5 0.5 0.5 0.5 0.5 0.5 0.5 
##$TPOFFS= (0..7)
0 0 0 0 0 0 0 0 
##$TUNHIN= 0
##$TUNHOUT= 0
##$TUNXOUT= 0
##$USERA1= <user>
##$USERA2= <user>
##$USERA3= <user>
##$USERA4= <user>
##$USERA5= <user>
##$V9= 5
##$VALIST= <valist>
##$VCLIST= <CCCCCCCCCCCCCCC>
##$VD= 0
##$VDLIST= <DDDDDDDDDDDDDDD>
##$VPLIST= <PPPPPPPPPPPPPPP>
##$VTLIST= <TTTTTTTTTTTTTTT>
##$WBST= 1024
##$WBSW= 25
##$XGAIN= (0..3)
0 0 0 0 
##$XL= 0
##$YL= 0
##$YMAX_a= 774272
##$YMIN_a= -743400
##$ZGOPTNS= <>
##$ZL1= 120
##$ZL2= 120
##$ZL3= 120
##$ZL4= 120
##$ABSF1= 10
##$ABSF2= 0
##$ABSG= 5
##$ABSL= 3
##$ALPHA= 0
##$AQORDER= 0
##$ASSFAC= 0
##$ASSFACI= 0
##$ASSFACX= 0
##$ASSWID= 0
##$AUNMP= <proc_1d>
##$AXLEFT= 0
##$AXRIGHT= 0
##$AXTYPE= 0
##$AXUNIT= <>
##$AZFE= 0.1
##$AZFW= 0.1
##$BCFW= 1
##$BC_mod= 2
##$BYTORDP= 1
##$COROFFS= 0
##$CY= 7568.61572265625
##$DATMOD= 1
##$DC= 2
##$DFILT= <>
##$DTYPP= 0
##$F1P= 17.9538593292236
##$F2P= -4.03888763876832
##$FCOR= 0.5
##$FTSIZE= 32768
##$FT_mod= 4
##$GAMMA= 1
##$GB= 1
##$INTBC= 1
##$INTSCL= 1
##$ISEN= 128
##$LB= 0.02
##$LEV0= 0
##$LPBIN= 0
##$MAXI= 945.577
##$MC2= 0
##$MEAN= 0
##$ME_mod= 0
##$MI= -402.1523
##$NCOEF= 0
##$NC_proc= 0
##$NLEV= 6
##$NOISF1= 8.587773
##$NOISF2= 6.764455
##$NSP= 1
##$NTH_PI= 0
##$NZP= 0
##$OFFSET= 17.49637
##$PC= 1
##$PHC0= 112.3206
##$PHC1= 14.86436
##$PH_mod= 0
##$PKNL= yes
##$PPARMOD= 0
##$PPDIAG= 0
##$PPIPTYP= 0
##$PPMPNUM= 100
##$PPRESOL= 1
##$PSCAL= 0
##$PSIGN= 0
##$REVERSE= no
##$SF= 200.13
##$SI= 32768
##$SIGF1= 18.5376
##$SIGF2= -6.396296
##$SINO= 400
##$SIOLD= 32768
##$SREGLST= <1H.CDCl3>
##$SSB= 3
##$STSI= 0
##$STSR= 0
##$SW_p= 4401.40845070422
##$SYMM= 0
##$S_DEV= 0
##$TDeff= 0
##$TDoff= 0
##$TI= <>
##$TILT= no
##$TM1= 0
##$TM2= 0
##$TOPLEV= 0
##$USERP1= <user>
##$USERP2= <user>
##$USERP3= <user>
##$USERP4= <user>
##$USERP5= <user>
##$WDW= 1
##$XDIM= 8192
##$YMAX_p= 0
##$YMIN_p= 0
$$ End of Bruker specific parameters
$$ ---------------------------------
##NTUPLES= NMR FID
##VAR_NAME=  TIME,          FID/REAL,        FID/IMAG
##SYMBOL=    X,             R,               I
##VAR_TYPE=  INDEPENDENT,   DEPENDENT,       DEPENDENT
##VAR_FORM=  AFFN,          ASDF,            ASDF
##VAR_DIM=   8192,          8192,            8192
##UNITS=     SECONDS,       ARBITRARY UNITS, ARBITRARY UNITS
##FACTOR=    0.0002272,     1,               1
##FIRST=     0,             0,               0
##LAST=      1.8609952,     350,             197
##MIN=       0,             -743400,         -743400
##MAX=       1.8609952,     774272,          774272
$$ Real data points
##PAGE= N=1
##DATA TABLE= (X++(R..R)), XYDATA
0@%%%%%%%%%%%%%%Pl9O4o4O4o4R5j27J28j60J92k24K57k89L52m15M73n34O04o73
34c53P58q55R63j090J219j357J516j687J869k076K300k542K809l100L419l767
50a974M149m575N040n554O129o771P501q329R281j0393J1703j3280J5225j7688
64i536K0919k5375L1955m2756O4402j81191N56166K25086r27533k45113P80216
75B47240N27032p15606p26575M13581Q46794k03158q50738k1680Q90657K49601
85F57148q18942n27691O14201O08950m63258p37531K90600Q58620L5452p82884
95b65335k10191P18730L84574o60346o01138M58354P11218k45343p22933Q1736
105c50674P56238J26081p33387l78656N65592M87184m50683o00686L24965P36771
$$ y = [0, 0, 0, 0, 0, 0, 0, 0, 0, 0, 0, 0, 0, 0, 0, 7, -32, 32, -32, 32, -32, 63, -64, 64, -96, 96, -128, 129, -160, 192, -223, 250, -284, 320, -353, 405, -450, 513, -577, 642, -715, 801, -886, 983, -1093, 1207, -1335, 1474, -1626, 1793, -1974, 2175, -2400, 2640, -2914, 3215, -3556, 3945, -4384, 4897, -5496, 6207, -7073, 8152, -9536, 11383, -13992, 17963, -24793, 39609, -141582, 414584, 639670, -287863, -532976, 247240, 774272, 58666, -667909, -254328, 592466, 389308, -461430, -483110, 407547, 657148, -161794, -689485, -75284, 533666, 70408, -667123, -376523, 482097, 517549, -265335, -475526, 243204, 627778, -32568, -633706, -175352, 535866, 290523, -432410, -350674, 405564, 531645, -201742, -580398, -14806, 472378, 21695, -578991, -254026, 482745]
115D82745p3814p09348r7613O59656K40400o20457m35677M79994N77502k85532
125B17856o18339J42739O67324K3215o97449k57047N75710L73995m74982m75547
135e22525L75916O14663j59589o29478j6879O02663J57281n83530l29136M98653
145H039M79501l36635n33700K06695N74289p1062o19422j44276N36544K76201
155C76174m49740l78648L76047N13332k12757n59666N2973N45681P0488n30492
165a96608k14029M73617L65753l34791m34781K17230M84216j05175n43855p2724
175c61147N00930J98716m31821k88762L72194M02159k46123m68284R5107M69887
185B42856K1202m69858j46314M45433K90930l44243l65651K46629M13696j52224
$$ y = [482745, 408931, -300417, -398030, 261626, 502026, -118431, -554108, -74114, 503388, 217856, -400483, -257744, 409580, 432795, -264654, -521701, 54009, 428004, -46978, -522525, -146609, 468054, 308465, -321013, -337892, 264771, 422052, -161478, -490614, 8039, 487540, 150905, -382795, -176100, 398189, 327127, -292295, -436571, 99973, 376174, -73566, -452214, -76167, 437165, 224408, -335258, -282285, 263396, 333884, -196608, -410637, 62980, 428733, 93942, -340839, -123609, 360607, 255432, -288423, -361147, 139783, 338499, -93322, -382084, -9890, 392269, 146146, -322138, -227031, 242856, 264058, -205800, -352114, 93319, 384249, 40006, -325645, -79016, 334680, 182456]
195A82456m69417L342M52768J26434l97732k18730L51036L25640k62159m05958
205c12320J37300M22548l6759m28417o8465M16086J95757l41048k81229K52614
215d3933L37859j72521l99470N2921M13092O5795l79344j48361L46645K40592
225C13275k78811l19711J72894L50738p7487l66251j8106L71212J31252l30071
235e1066k19729K63080K73697k01758l32699J06763L57827K004l39680q6749L18636
246I0326J76905k72795k61288J94832L09803j12207l33092L3080L46869O5515
256B37948l21537j55521K64460K17930k10584k82326J29825L22307l5576l26313
266a59387m5778L14890J25673k83498k03404K19848K59175j41813k89448O6299
$$ y = [182456, -286961, -283619, 169149, 295583, -102149, -320879, 30157, 355797, 93638, -312320, -175020, 247528, 210769, -217648, -286113, 129973, 325730, -15318, -296547, -43933, 293926, 121405, -278065, -225144, 187948, 253743, -125601, -273962, 72683, 313275, 34464, -285247, -112353, 238385, 160898, -205353, -223459, 147753, 279005, -51066, -270795, -7715, 265982, 64224, -268475, -161712, 196115, 198119, -141561, -228310, 90326, 267231, -5564, -266852, -72020, 237783, 125576, -207516, -174436, 172433, 237948, -83589, -239110, 25350, 243280, 32696, -249630, -119805, 202502, 166926, -159387, -205165, 109725, 235398, -48100, -251504, -31656, 227519, 85706, -203742, -137443]
276a37443L13617K6062l06111j13441K69894J79504k26837k39149J61786K80288
286B08170q0094k92737j035K85459P7423k65348j56822K19493K16580j58306k53805
297b01022R6299K80210k0056k81050n6271K57289J22721k19494j82076J68294
307c5156K32266j00552k59029L0482K66072L5368k58576j05417K26204J62309
317A93971j77123k06044J19591K37118n1778k52531k0630K47158Q6728k25262
327d8802j44446J90223J95292j34939k26841P3442K42364o287k43426o2974K24842
338E8448J26657j90905j78950J43562K17563q8432k40829K2526K42033M1399k27498
349g4426j01642J95898J57854j49312j99320R4673K27419l4026k36385k7223K28995
$$ y = [-137443, 176174, 202236, -103875, -217316, 52578, 232082, 5245, -233904, -72118, 208170, 128076, -164661, -165696, 119763, 197186, -68162, -224984, -5491, 211089, 52783, -201022, -104723, 175487, 155431, -125619, -181890, 75399, 198120, -21374, -203450, -35156, 197110, 96558, -162471, -131989, 134083, 169451, -89125, -194542, 31662, 193971, 16848, -189196, -69605, 167513, 115735, -136796, -157426, 89732, 176460, -48802, -193248, -3025, 192267, 57328, -169513, -96071, 146293, 140006, -103420, -166394, 58448, 185105, -5800, -184750, -41188, 176375, 87943, -152886, -130360, 111673, 153072, -74426, -176068, 19830, 177684, 28372, -170948, -76275, 151144, 117118, -119267, -146490, 82505]
360H2505Q6957k01670j38481J60569J79860j08129k09760M6482K21866J4642k19544
371h4703p5432J99709J27094j65312j69822J19289J97471o3226k10815M161K10244
382H8658N6544j92435j10264J63867J56562j22856j88640P3885K06446j9554k08706
393i6493l7254J94619Q9750j68400j37505J27640J74260q1041j98632K8574K06258
404A01776K5122j97980p6484J76197J22385j39212j57686R4335J83634m1174j94930
415a04017j2764J93608O4217j77118j10955J47561J47160j07759j73965N8433
425g5599J86013o097j86865m7629J72439R6199j47380j36310J11867J66250o6943
436F5945j80943K0120J83742L0135j71431p7405J47532J19411j13293j51587P2442
$$ y = [82505, 169462, -32208, -170689, -10120, 169740, 61611, -148149, -101667, 120199, 134841, -84703, -160135, 39574, 166668, 1356, -168466, -49177, 148294, 85068, -125747, -121586, 88658, 145202, -47233, -157497, 6370, 162932, 40076, -148564, -74679, 131767, 112213, -96493, -133747, 60872, 150622, -17778, -155283, -27643, 146617, 65576, -133056, -104482, 101776, 126898, -71082, -147566, 28631, 151016, 11804, -145882, -51547, 132087, 90913, -104017, -116781, 76827, 141044, -36074, -147029, 532, 147692, 39933, -134032, -75599, 110414, 104317, -82548, -130177, 42262, 138461, -8919, -145229, -33362, 132888, 65945, -114998, -94878, 88864, 118999, -52432, -129837, 17695, 137106, 23813, -127774, -55332]
447e5332J72608k7544j80779k0303J72433O4077j54400j04920J21975J38818q2095
458D4538j60577L6396J72057J1163j70785n7758J57086R9079j28884j30308R4646
469c3347J54406n0122j66146J649J64751M4083j53988q7606J31673J23287r8609
480C0031j49831N9368J62180j7473j66070k8913J54655P3119j31062j08566J02391
491b0171J39296o4212j57531K1769J61970J9900j54781n8455J37297R6422j06668
502A4836j24550O9060J41311l1427j53188j2378J49998N2440j35047q4947J12581
513a311J13796q1638j34906M1185J42887k73j41017l8208J34584P8585j12645
524A039j07492Q3165J26752n2139j41412J3680J42371K7229j30353o2381J13603
$$ y = [-55332, 117276, 89732, -91047, -111350, 61083, 125160, -29240, -134160, -12185, 126633, 44538, -116039, -79643, 92414, 103577, -67208, -124966, 32120, 131199, 2315, -127993, -33347, 121059, 70937, -95209, -93560, 71191, 115274, -38714, -126320, 5353, 128640, 30031, -119800, -60432, 101748, 84275, -81795, -110708, 43947, 117066, -13996, -122562, -20171, 119125, 54913, -102618, -80849, 81121, 101021, -53760, -112215, 25082, 121504, 14836, -109714, -40654, 100657, 69230, -83958, -96336, 53662, 106102, -28945, -113892, -1311, 112485, 30847, -104059, -62874, 80013, 79740, -61277, -99485, 35099, 113684, 1039, -106453, -23288, 103464, 51325, -90087, -76407, 65964, 93193, -37160, -99541, 14062]
535A4062R3281r0451j22401N4673J35800j9862j40066j3238J38780N2267j21020
546a8175q4899R4303J07758o4753j27400K9356J39114J1846j33536m4540J22270
557C1344P4113j05244j04244P1571J19945l6821j26725L369J29922L5401j21561
568b8930p0635R9413R4344p7662j13522M8762J28666r145j25112k2994J16122
579C9307N3730j03027q7326P7081J08432m6489j17760J8925J24892J3702j21217
590c9750m9564J00483P2441q0680r4490N6225J14623k0303j18169j0867J15038
601D4987L7304j08350o8312Q9563R1691n9085j02004L4031J12709j612j16920
612d5998l5499J02861O0269q8714q2501P0461J04354l9862j11557Q228J07881
$$ y = [14062, 107343, 16892, -105509, -50836, 84964, 65102, -74964, -88202, 50578, 102845, -18175, -103074, -8771, 98987, 34234, -93166, -63810, 75304, 87150, -46386, -90926, 31344, 105457, 213, -104031, -32460, 87485, 50664, -76061, -72692, 57230, 92631, -28930, -99565, -152, 94192, 16530, -96992, -48230, 80436, 71291, -53821, -76815, 39307, 93037, -9990, -97316, -20235, 88197, 41708, -76052, -57127, 67765, 81467, -39750, -89314, 11169, 83610, 2930, -91560, -35335, 79288, 58985, -59184, -70051, 44987, 82291, -26059, -94371, -4808, 86883, 27798, -74206, -40175, 72534, 70922, -45998, -81497, 21364, 81633, -7081, -89582, -19121, 85233, 45371, -66186, -57958, 49923]
623D9923J7319j05317n0055R1965P9275o5785r2657M5407J06448j9128j14128
634e6733j4965J05159M0724r1251o2337P6491Q7044m8334j01820J7123J02527
645E3628M929j05559l4362R8258O2293p5576p6515N5242Q9702l1271j02340k087
657f3658R9696L0111q9212m9466Q2114P5534o1345r2028L2726R3690j1517r7504
669e0859j6868R5115M8184p7664o7543N9302Q1968m2552r9065J3277J00401J4490
681E8186r1202l2992Q4957N9333o6556q0448L9655Q7828j8456r4834m768R9455
693D0158L4299q5539n4874O7987O8006n3419q6524K4535R2254M255q7094k4572
705f0528Q4835M8762p3852p1577N0499P9824l0110q4168R725R0768K0807q1041
$$ y = [49923, 67242, -38075, -88130, 3835, 83110, 17325, -75332, -29925, 76523, 57395, -56733, -71698, 33461, 74185, -17066, -79403, -2912, 84132, 35798, -66022, -48899, 53628, 58557, -47002, -81364, 16894, 79187, 3611, -72904, -17662, 72040, 40769, -61571, -63658, 36038, 66149, -23063, -72529, 9585, 85119, 23774, -68254, -35528, 58162, 46645, -50859, -67727, 27388, 75572, -2092, -69635, -10333, 71635, 29083, -69982, -56705, 43696, 58186, -33016, -66008, 18949, 78282, 11726, -68722, -29067, 58761, 40305, -54529, -59297, 40158, 74457, -11082, -65956, 2031, 70037, 16618, -69906, -45371, 46883, 51138, -35956, -60528, 24307, 73069, -783, -72360, -21861, 57963, 27853, -56315, -46590, 44178, 64985, -16056]
717a6056m2912O6097N8503n6096p7651L4160Q7360q284q4346j0284Q1736L1368
729F3595p5066n6251N3469O9010l4470p7133J6970Q7571R400q2546l1776P1574
741A4347M5166o1107o3394M3706P6962j6657p8072k328P8736K1892p7760m7750
753f6259O1851O1322m5312p0056L0571Q0110n672q0176k0326P1160L6346o3146
765i587n5341N1088P3194k7063p6642R116P8229Q551p8065l2767O4533N0361m7619
778G988o0945L3249P3494j2487p9696j1565P2626K6577o7150m3128N6435O0863
790E6261l4094o7649J5182P0798K860p3559k5294O6263M4680n2418n4222M1082
802a0110O5352k3024p2404j027O7520J7476o3019l5243N6068N3723l9602o3880
$$ y = [-16056, -58968, 7129, 65632, 9536, -68115, -33955, 53405, 45121, -39225, -49509, 32227, 63595, -11471, -67722, -14253, 54757, 20287, -56846, -39876, 47695, 57095, -25451, -57227, 14347, 59513, -1594, -64988, -21282, 55680, 39023, -39049, -41377, 37359, 59251, -18509, -66259, -4408, 56914, 11602, -58454, -27883, 52227, 46555, -33621, -53947, 17213, 53559, -9587, -64928, -13840, 59354, 32291, -44351, -35235, 42994, 51545, -26520, -59287, 5246, 55607, 7988, -52957, -19708, 53786, 41299, -38397, -49962, 22664, 49241, -17909, -61037, -4602, 56261, 22167, -45482, -30300, 40498, 43358, -30201, -55495, 10768, 55448, 3030, -51192, -10110, 55242, 32218, -40186, -41213, 26307, 43783, -19236, -54479, 1589, 55312, 15710, -48170]
814d8170K2583O7432q178p1098j1949O6711L2590n3722m3984M2692N7952k7528
826B5331o8443P044O8506R495o5292k4682O0149M1922m6432n4191K8950N8823
838D1180j4753o5236m880O5272K4393n6583l7215M8564M9719l6437n9962J8189
850b7749O2042j67n9867j5290N8135L3787m8046m8521L4075N5417k2413o1773
862d0370N553O3120J2543n7077k6592M7750M0135l8451n2719K2002N9552n600
874B9846o0590o884O0164K3730n2363l8088L9926M6788k6814n4816J1628N9697
886C2224O709n7708k1942N1781L3688m4521m6927L0826N3095j4674n5416M25N5824
899B3384J6346n1348l2168M2416M3282l1546n1006J9177N7456k808n5770j1590
$$ y = [-48170, -25587, 41845, 33667, -37431, -49380, 17331, 49921, -3801, -47785, -5093, 52859, 25331, -43112, -36068, 32438, 41933, -23359, -48041, 12108, 54030, 7598, -46593, -17643, 41180, 26427, -38809, -43689, 21583, 45976, -10607, -47822, 742, 50461, 14024, -45938, -27749, 34293, 34126, -25741, -41031, 17104, 50891, 2845, -45676, -11601, 43816, 21403, -40370, -34817, 28303, 40846, -16231, -42823, 4927, 45062, 6611, -46108, -24106, 35446, 29846, -30744, -37628, 22536, 46266, -6097, -44185, -4259, 42529, 15715, -39101, -27473, 32224, 38933, -18775, -40717, 11064, 44752, 231, -46696, -15870, 37225, 22551, -32865, -32440, 23384, 39730, -11618, -43786, -1370, 41912, 10366, -40640, -21463, 35993, 33185, -22585, -34175]
911c4175N0312K4517m3447l8992L2375M7630j8749n2399M944N4536Q088n2311
923a7671k2502M4812L2459l4580m0685K2834M8559p543n0548o228M9169J8924
935C7000m5347l0507L7342M0178k5456m5488J3002M7975L67m8854j5261M3383
947H334K7690l6841l7879K7838M5586j6422m8428L452M7966R439m4845k0959L8278
960C209L3494k8439m1250J7745M7097n700m9613p031M6946J8166m0554k9349L1764
973c515L7989k1052m4201P691M6100M588m5433j7303M1914K8242l3908l5630K4122
986a0396M1563j1892m4005q46M3768J3594l9360k5174L3648L4120k4906m0994
998c0880J4023M3347l237m3491r314L9727K0607l3434l0457K4868L7601j4326
$$ y = [-34175, 16137, 40654, -2793, -41785, -9410, 38220, 19471, -32928, -27984, 26552, 34640, -17671, -40173, 4639, 37098, 2518, -38167, -15333, 33226, 25683, -24865, -31093, 18076, 37000, -8347, -38854, -1512, 38666, 13210, -32278, -19276, 28699, 29066, -19788, -35049, 8334, 36024, -817, -38696, -10858, 34728, 18306, -30122, -26670, 21296, 30735, -14110, -35069, 3209, 36703, 8264, -32986, -15241, 31856, 26156, -23457, -30488, 16458, 34624, -5930, -35279, -3515, 34474, 13422, -30779, -23088, 23012, 27600, -17833, -35136, 6778, 35020, 1112, -34518, -10396, 31167, 19275, -24730, -25576, 18192, 31786, -7574, -32748, 900, 35020, 10114, -30880, -16857, 26490, 23253, -20238, -29552, 10175, 30782, -2652, -33109, -8241, 29360, 15034]
1010A5034m1779L779M2871P752m0444j7094L5662K6201k7336l3134J7137L8028
1022B6677n950m0969m876L9214J5853l6942k4349K9282L1912k1441l6256J0438
1034a7407L8325P79l7371j2329L5458K2500l0016k9487K2112L6222j3585l8002
1046b2801L292L8065P481l5620j7509K9915K6068k2623l4105J4275L7148m905
1058A8681l8538n716L6879J4495l1603k2978K5281K9708j5492l4574O314L6639
1070A9096M589l6128j3538L2841K2117k7293k8056J9082L2383r492l5150j255
1082b0804L4459J1087l2590k0087K6781K8015k0722l2628J2306L5033k027l5141
1094a6318p208L2488J7132k7010k5009K0546L1563j2599l4543L406L5111N298
$$ y = [15034, -26745, -22966, 19905, 27657, -12787, -29881, 5781, 31982, 4646, -28488, -11351, 26677, 20727, -20242, -25118, 14096, 29949, -6993, -31342, -2060, 29852, 8411, -27845, -17407, 20918, 21697, -15674, -28003, 7455, 29955, -61, -29548, -7436, 28786, 15201, -22801, -19509, 18556, 26037, -9583, -27092, 2823, 28891, 6268, -27837, -13562, 23586, 18681, -19857, -25573, 11306, 25801, -5802, -28780, -3499, 26209, 10717, -23857, -17543, 19096, 23685, -12443, -25981, 6860, 28977, 1684, -26372, -7290, 25093, 15601, -19549, -20804, 13655, 24742, -7848, -27935, -1154, 26861, 6139, -26489, -14183, 20850, 18823, -16318, -23526, 8962, 26094, -916, -25925, -5379, 26184, 13585, -20958, -17552, 17559, 22857]
1106B2857l3511j4054K8478K1451k2122k7788J3740L1418m762l3949m225L2983
1118A0516J3237k9646k0379K4659K6278j5997k9679P619L1225J716l0792j0854
1130b2097K8512J9268k4276k5154J7388K8794j0005l1019R87L0157P225k7872
1142h092j4969K3369K2474j7462k8010J0602L0708k272l1618m658K9554J3318
1154B2944k4896j9474J9400K4573j2066k8856L448L0145M274k9980j1288K6703
1166D927J7943k2007k3233J4082K6679o856k8561j054K8552J0375k6292j6883
1178b2328K2124K3056j6375k7195R670K8877r25k8279o821K6028J4225k1652k2227
1191b1822J5583K6276j0131k8689K601K8708N962k6876j2223K2065J8398j6738
$$ y = [22857, -10654, -24708, 3770, 25221, 3099, -24689, -10949, 20469, 15707, -18242, -22467, 10516, 23753, -5893, -26272, -1613, 24665, 8668, -21011, -13392, 17833, 19549, -11243, -22097, 6415, 25683, 1407, -23747, -6359, 22435, 12430, -18589, -17602, 12555, 19780, -8092, -23061, 308, 22782, 5320, -22690, -12088, 18620, 16348, -15270, -19928, 9626, 22944, -1952, -21426, -2026, 22547, 10481, -18375, -14927, 15218, 19492, -10488, -21776, 4927, 22870, 863, -22370, -8288, 18391, 11535, -17026, -18080, 10472, 20847, -5445, -22328, -204, 22852, 6477, -20718, -11048, 17829, 16904, -11375, -18196, 7832, 22057, 405, -21822, -6239, 20037, 9906, -18783, -16182, 12526, 18488, -8388, -20611, 1454, 19852, 3114]
1203C114k3373R896K7346j888k7248m940K7009J1683k4248j7760J8652K1697j2355
1216G585k4434M829K5672K998k5032j0941K2556J6112j9337k1311J3644K4479
1228A6820o424k4850K19K4665P344k2990j3687J7889J9777j2949k2986Q146K5968
1241A6942j603k5663n371K2603J0207j9277j6699J4361K1456q216k3745K594K3948
1254A1537L697k4192r857K0992J4991j5543j8470J1240K2001m562k2958k726K2506
1267H656Q625k1080j4459J7728J9601j2466k2179O697K2154r73k2740o930K0645
1280C279J2493j5833j7614J2998K1469p325k3428J185K2833M187k0865r569J8584
1293B394J5516j2302j9543O633K1521k396k2980m888K2055J0177j8543j4461J4987
$$ y = [3114, -20259, -10363, 16983, 15095, -12153, -17093, 9916, 21599, -2649, -20409, -1757, 19940, 7585, -16849, -12020, 13652, 16650, -8382, -19323, 3233, 19345, 8, -21303, -7659, 16820, 10396, -14454, -14235, 10430, 17774, -5216, -18903, -1014, 18763, 5814, -17172, -9026, 16942, 15339, -10324, -15695, 6908, 17115, -2162, -18861, -4500, 16956, 8740, -15005, -12411, 11537, 15234, -8958, -18815, 2177, 17168, 1625, -16845, -5605, 16396, 11834, -11124, -13850, 8656, 17281, -3799, -18258, -530, 19071, 6605, -15574, -8877, 13277, 12304, -10436, -17366, 3279, 15772, -61, -17675, -4677, 16792, 9467, -13961, -12776, 10057, 14244, -6621, -16190, 2394, 17910, 5608, -13935, -7302, 14219, 11823, -11157, -16045, 6010, 16187, -2356, -16817, -1830]
1306a830J7758r557k0639K427K0613L657k0222q250J9072J4709j4933j7553J0172
1319d576J9164n965k0543m7K0124O556j6928j1774J4237J5992j1532j9794N094
1332i992K0273o89j9262m244J8812R774j4823j3683J0025J6209o225j8629J663
1345a0791K0288M240j7947q060J5871J1279j2963j5614Q031J6701k606j7818j964
1358a1353J8086P378j6779j2501J3421J4515r789j7044N467J9155K58j6973n255
1371a1414J5407R822j3306j4871J0052J7521n474j7798J637J8297L108j7221r151
1384a3391J3448J2446j0473j5811N987J8719r07j8368l861J7205P536j5389j2107
1397a4966J2249J5019o508j5699K552J7104L024j7049q586J4832J1199j2126j4018
$$ y = [-1830, 15928, 6371, -14268, -11841, 8772, 12429, -7793, -16043, 3029, 17738, 2805, -14748, -4576, 14588, 8623, -11920, -11967, 8157, 14713, -2215, -13989, 248, 16240, 4708, -15086, -9992, 10281, 9592, -9670, -13914, 4898, 14672, -151, -13834, -3809, 12400, 6175, -12454, -10791, 9497, 13737, -4210, -12270, 3601, 14880, 1917, -13697, -5666, 11035, 8429, -9389, -11353, 6733, 14111, -2668, -15169, -1748, 12767, 2978, -14066, -8599, 10556, 10814, -6159, -11414, 3993, 13815, 509, -14362, -4310, 13211, 7737, -10061, -8424, 9873, 12981, -4240, -13391, 57, 12503, 2030, -13781, -7794, 10925, 10018, -8350, -12211, 4994, 12530, -2859, -14966, -2717, 12302, 5794, -9905, -7353, 9751, 12775, -4274, -12860, 1972, 13171, 1045, -12973]
1410a2973Q682J6230m038j6600j081J5246N145j4442j0040J1731J4187q111j5355
1423a1419N335J6443l56j6614m287J4063Q226j1559j0578Q456J4138m052j6186
1436h390k27J5539L241j5814o874J3193J0098q870j2443O119J3196j829j5246
1449h307k662J4450P276j2836r704J1682J2708p781j3994L106J4257M08j4372
1462e769m626J2788R434j0527j2009P758J3520n128j5403M52J4793L268j2499
1475c948o857J1308J0885q139j3425M109J4763p86j4813k652J4612O820j2215
1488c38r200Q296J1278n341j3716Q38J4223K888j3441o199J2507R049j0292j1889
1502a1337O451J3005k443j3060j248J3290N703j1039q936Q983J1526o934j3580
$$ y = [-12973, -4291, 11939, 7901, -8699, -9780, 5466, 10611, -3831, -13871, -2140, 12047, 3936, -11419, -6084, 10359, 10003, -6611, -10898, 3165, 11391, -168, -10746, -2290, 11848, 7796, -8390, -8617, 6922, 10163, -5651, -12525, 668, 10766, 1896, -10547, -4428, 8768, 6939, -8307, -10969, 3481, 10757, -2079, -11783, -101, 12607, 4826, -9168, -6062, 8195, 8603, -5769, -10395, 2393, 11827, 1300, -10709, -2951, 10569, 5441, -9962, -9510, 5283, 8551, -3948, -10805, 503, 11388, 3249, -10176, -6067, 8696, 7910, -6903, -9555, 5057, 11877, -338, -9538, -1242, 10036, 4695, -9021, -8183, 6040, 8928, -4513, -10712, 1795, 10844, 552, -11337, -4886, 8119, 5676, -7384, -8632, 4658, 10361, -678, -9614, -631, 10895, 3961, -9619]
1515i619L779J4062Q8j2841l854J1494O732r396j0519O288J1709l027j3151K91
1529g964J3400L395j2236o032J0078Q592p367j0398M241J1986m25j1967k971J2151
1543D483N646j0901q874Q333J0239n624j1392K214J1653J167j0979n303R799P935
1557H396p752j0370O195J1927l162j1751L73J1424L074j0541n833Q093Q980o016
1571C037j0714L126J2033l38j2245l455J1209N766j0016p307O615R785l490j1328
1585g322P69J1588K277j1026n255J0060P866p500r594N446J0409j440j1355j455
1599f532J0228M576r414p790P636R466m972j0929K340J0850L80j0131l720Q959
1613I47O490o773q606M723J0711k335j0536o41J0593K968r779m835P601P504n537
$$ y = [-9619, -5840, 8222, 8310, -4531, -8385, 3109, 9841, 445, -10074, -3786, 7923, 4896, -8255, -7964, 5436, 8831, -3405, -9437, 641, 9233, 1866, -8532, -4291, 7695, 7270, -4697, -7668, 4483, 10129, -772, -9646, -1313, 8926, 3302, -8090, -5876, 5777, 6944, -4035, -9338, 461, 8396, 644, -9726, -3531, 8396, 5234, -6517, -6144, 5280, 8354, -2187, -8020, 73, 9053, 3037, -7677, -4551, 7482, 7144, -5101, -8556, 2653, 8419, -1597, -8904, -2289, 7496, 4006, -7322, -6553, 5035, 7312, -3714, -8969, 1091, 8957, 1457, -8137, -2691, 7718, 6278, -5077, -6532, 3696, 8272, -1142, -8932, -1296, 8170, 3198, -7731, -5391, 5459, 5839, -4292, -8012, 947, 7437, 664, -7942, -3219, 7492, 5157, -5379, -6020, 4573, 7541, -2238, -7073, 528, 8032, 2495]
1628B495q954K556R252J61r842l141R255N288q128p294O869P912l565r138J296
1643d978Q733K296q254m508P732O857o262q265M653Q792k472q642q90Q610K593
1658E995p589n202N913P198m135r065K456R354j99r070k260Q942L897o832n670
1673f267M937P340k399q515J15R140K004q761m028P542N860o232p224L605P744
1688D861r02q306j843Q113M193p201o071O010P644m312p767J541Q726M35p732
1703b611k901O909N297n603o661L445Q262k042q478n99Q464J880p475m136N695
1718e54N648l742p223J932Q183N10q355k057P355M543o613n397N099O307k426
1733C210p238O03P109J615p073l788O266N118m591o969L327O864j920o525r98
$$ y = [2495, -6459, -3903, 5349, 5510, -4332, -7473, 1782, 7070, -1058, -8352, -1483, 6429, 2864, -6274, -4978, 3755, 6051, -2203, -6711, 1021, 7878, 1616, -6649, -1996, 6796, 4324, -4318, -5208, 3402, 5995, -1594, -6796, -883, 6315, 2180, -6885, -4429, 4925, 4726, -4344, -6604, 2338, 6235, -597, -6267, -1330, 6010, 3611, -4904, -4789, 4351, 6355, -2406, -6434, 1108, 6968, 736, -6488, -2883, 4861, 3959, -4347, -6190, 1923, 6116, -1085, -7156, -1146, 6498, 2186, -5581, -4040, 4686, 5121, -2611, -5512, 1397, 6694, 1091, -5570, -2125, 6137, 4095, -4383, -4982, 3482, 5362, -2113, -6249, -554, 5094, 1352, -5871, -3939, 4244, 4754, -3601, -5658, 1697, 6240, -373, -5770, -671, 5636, 3210, -4028, -3425, 3684, 5299, -1774, -5562, 704, 5822, 1231, -5738, -2411, 4453, 2533, -3992, -4990]
1748d990P032K561o047m160N096N494k873p018J647Q068k47p029k056O787K911
1763E176m962m508L232N934j632p361K4O552J980o975l147N634M811m649n575
1778e466L041N910l34o154j067N726L556n495m831M964N852l127o837J602O418
1793C758J47o220k601N463M223m244n715K778O385j428o903k74P049J500n536
1808a618k937M514M762k712o137J656O219N98o410k285O695K748n011m961L956
1823i23N007k127n754J00N908J084n020l024M830M638m138m965K462N544q06n394
1839b578m98N067K836m332m379L302N262k588n962J167N919N52n612k100M912
1854I68L023l813m445K450M919j125n087m93O279J430n518k350M323L692l295
$$ y = [-4990, 2042, 4603, -1444, -5604, -508, 4986, 2113, -4905, -3258, 4810, 4563, -2466, -4522, 2265, 5176, 214, -4294, -1062, 4872, 3240, -4121, -4097, 2455, 4435, -2540, -5687, -53, 4758, 109, -5466, -2425, 3485, 3151, -3003, -4070, 1656, 5212, -283, -5114, -150, 5702, 2575, -4262, -2660, 3758, 3905, -2315, -4916, 547, 4770, 526, -5189, -2411, 3974, 2546, -4357, -4631, 2418, 3918, -1618, -4555, -41, 4721, 2009, -4128, -2472, 3747, 4345, -2065, -4350, 2345, 5093, 82, -4879, -923, 4084, 1957, -3797, -3697, 2211, 3295, -1725, -4749, 81, 4719, 581, -4384, -1922, 3622, 2816, -2578, -3076, 1991, 4827, 495, -3884, -582, 4680, 2092, -3870, -2703, 3216, 3768, -1844, -3944, 968, 3991, 178, -4267, -1817, 3102, 1977, -3110, -3603, 2676, 4106, -1412, -3762, 561, 4253, 958]
1869I58m120J586N137l32n018j548M908K429m013m321L215M723k191n217J147
1884b657M833N85m531k240M144L291l189m081K361N067n12n564m46N684J333m563
1900d85l061L193L952j900m766M97N363K7n357j739M736L197l948l943L264M137
1916C167j352m466j9M467J668m218k996M032L654k782l890J815L878l81m269j405
1932c097L973K319l553l273K179M265r59n020N05M534M59m175j059L342K792k747
1948D85l296K039L758q9m937r61M405J989l643k740L263K665k202k841n1L799
1964A643L6l166j813L614K629k967l388K586L760j423l990M71L594P86k796j840
1980b264L140K589k119l942J307L843j102l669k66L790J433l288k133K062K862
$$ y = [958, -3162, -1576, 3561, 3229, -1789, -3337, 1571, 4000, -13, -4334, -1119, 3604, 1413, -3804, -2657, 2176, 2761, -1770, -4010, 134, 3425, 236, -3845, -1484, 3583, 3071, -2493, -2939, 2745, 4078, -485, -3546, -353, 3599, 1699, -3067, -2570, 2793, 2820, -2537, -4276, 460, 3657, -291, -4234, -970, 3167, 1815, -2651, -2670, 1797, 3465, -753, -3749, 283, 3937, 1155, -2735, -920, 2958, 2577, -1692, -3097, 876, 3195, -358, -3631, -1452, 2813, 1854, -3166, -2661, 1873, 2332, -1843, -2902, 440, 3232, 485, -2811, -772, 2986, 2897, -2040, -3001, 1404, 3393, -250, -2990, 273, 2938, 736, -2105, -2156, 1643, 1679, -1487, -3300, 314, 2943, -24, -3412, -826, 2934, 1511, -2479, -2008, 1586, 2372, -424, -2264, 876, 3465, 1346, -2596, -1289, 2554, 1452, -2217, -2483, 1307, 2740, -548, -2681, -619, 2243]
1995B243j092m024O76L720J366m036j384L330K440k856k755J659L170o93l571
2010a807k62L473J269l424k208K732K921k047l574J488L197m43k661p28K628J877
2026B431k487k588J726L388j157l100L51L430P17l371j300K293K243j805k998
2041b227Q60L061J64l306r24L391R97k674k382K095K779j527k232O69K647M46
2057A837k210j650K350K293k307k678K120K454j254k300J21K502N82k361j659
2072b160J907J937j113k969J083K887k23k671n50K882P89j971j742J744K367j232
2088I65k334N21K532M25k820q83K282J079j609j961J156J934m48k601k40K443
2104D41R54k220j789K342K515j680k158M27K458R7k092n31J845J782k169j704
$$ y = [2243, 1151, -2873, -2197, 1523, 2889, -1147, -2531, 799, 3239, 383, -2372, -713, 2457, 1764, -1807, -2069, 1404, 2673, -751, -2959, -227, 2694, 647, -2927, -1439, 1758, 1315, -1346, -2074, 554, 2431, -56, -2644, -918, 2470, 1313, -1787, -1436, 1994, 2711, -660, -1960, 333, 2576, 771, -2227, -1367, 1694, 1858, -1448, -2372, 1019, 2016, -658, -3040, -945, 1834, 307, -1925, -1256, 1391, 1837, -373, -2023, 327, 2620, 313, -2365, -245, 2209, 955, -1345, -1224, 1278, 1860, -501, -2160, -253, 1684, 571, -2398, -1315, 1572, 1349, -1322, -1872, 1010, 1799, -172, -1914, -170, 2197, 965, -1369, -848, 1684, 2109, -711, -1594, 688, 1767, 158, -1803, -647, 1287, 839, -1762, -2002, 441, 1395, -825, -2614, -272, 2243, 563, -1595, -1168, 1290, 1387, -705, -1236, 609, 2391, 222, -1482]
2120a482J366K255j026k622k78K821K05k081j069J435J944j163k128O58K452R1
2136A378k534n94K418J300j853j732J399K062q18j877L7J710O92k046j354J890
2152G8J548j475j706N69K213o93j969k55K259O28j482j986K246J500q60j793K68
2169i10K515m02j676n70J269J450j423j575P27J733j32k369K87J712L75j881p86
2186a656J890J096j242j686P70J889j95j459l46J703N87j163j151J132J446j164
2202D51j598N46J527j25j382q73J621J112j471j395P12K198n87k529Q55J949J14
2219A125j650p50J449J069q39j415NK283K17j772p27J584R20j450j570J193J202
2236H74n65j332j47J390J202k116j240J590J585j131j399P34J683J11j870j58
$$ y = [-1482, -116, 2139, 1113, -1509, -1787, 1034, 1239, -842, -1911, -476, 1468, 305, -1823, -1165, 1287, 1378, -1156, -1750, 668, 1968, 115, -1617, -218, 1844, 1026, -851, -814, 896, 1588, -458, -1812, 78, 1626, 151, -1555, -986, 1227, 534, -1435, -1690, 569, 1197, -285, -2271, -25, 1475, 615, -1178, -910, 1605, 1203, -473, -1043, 226, 1676, 253, -1322, -595, 1138, 1006, -1363, -1076, 636, 1011, -870, -1656, 234, 1330, 88, -1598, -828, 1061, 866, -593, -939, 764, 1351, 188, -963, 169, 1615, 451, -1147, -601, 926, 801, -581, -1454, 167, 1279, -192, -1587, -875, 1323, 736, -1793, -938, 1011, 1125, -525, -1275, 174, 1243, 404, -1011, -1006, 1277, 1494, -278, -1005, 579, 1499, 49, -1521, -328, 874, 309, -1023, -1170, 220, 1422, -694, -1934, -344, 1241, 110, -1289, -555, 1128, 1239, -631, -789]
2252g89J073J195q49j460N89J654o03j345k37J705o57q89m60J270O89j095j217
2269a426R23J309p00j218M16J092M13r18q38J274P09k79j421M50J283L02j643
2286b72n82J654M4j181q11R66J062q53j155L11J188K93j206o65J121Q61o79j188
2304a092R00J207j06j479o8J581j67p78o94O44R17j92j551N6J605k01j378N5O93
2323d8Q48q55j219O55J105j1j150O4R10J088j564p44J214J208p64j464J32J438
2341H43j43j156n04R13J048p38j402L34R42J35j154J46R40J92o43n97M86J028
2359F70l52j254P82O55N40j265l31P97R73j103p34O66P28n04j182J49O94N56p99
2378c14r39R88J093r69p43O49J187n22o89j86P10O02p72m54L25Q26k29j061j8
$$ y = [-789, 284, 1479, 630, -830, -241, 1413, 810, -535, -772, 933, 276, -613, -1073, 197, 886, -209, -1426, -503, 806, 106, -1112, -696, 396, 809, -109, -947, 327, 1036, 757, -664, -214, 1069, 1371, -272, -854, 800, 844, -337, -1148, -182, 880, 27, -1128, -817, 371, 664, -542, -1207, -86, 775, 96, -1092, -192, 1015, 909, -570, -638, 943, 776, -2, -696, -52, 865, 673, -878, -822, 783, 582, -796, -741, -48, 800, -55, -1274, -619, 486, 475, -675, -611, 299, 1387, -177, -921, 293, 1501, 737, -727, -595, 843, 700, -456, -960, -47, 1001, 263, -1139, -805, 137, 272, -882, -736, 204, 396, -247, -844, -358, 670, 318, -936, -154, 501, 1041, -224, -555, 242, 1215, 112, -622, 44, 772, 268, -914, -765, -71, 485, -314, -1253, -265, 828, -141, -884, -235, 952, 430, -259, -445, 265, 867, 95, -359, -34, 792, 563, -498, -516]
2397e16J261k0r35m72N41M74k10p11K91Q60k51j122L8R53N55j211r4P81L66k41
2417C37p70K73Q81M1p96k48N95O19q48j146Q47Q78n11q18J58L78P24m60j047Q07
2437a06Q70m17j155O93O78r3p75l10J447K7o59n62L44P05k40p65o6O42Q7p25j96
2458e76N46L85p16l04MR33k73j53k14M46O08l85o59L97M64j57o83J21N71K44n85
2479A4n70O33K64n71M2j3Q48m63r67J28Q53j75m20m16R46J15k53m76L24M91ql60
2501c4k74J032j3n42m50M95R8j05m70k57O01J97p00k94O89O07r15o51O99M99L13
2522E25p01m4M99K88o25o9L0Q21L5j025P3K58L95m77j67J18K61J99q95n0O47j05
2544im41j68R62J67q29J79N75l7j71k98l37N54M41k32o28L77O29m00o33K13O32
$$ y = [-516, 745, 725, -210, -682, -141, 333, 123, -588, -297, 563, 312, -810, -772, 181, 736, -475, -569, 212, 578, 337, -433, -160, 721, 762, -34, -282, 313, 932, 84, -1062, -215, 663, 152, -666, -508, -130, 594, 134, -913, -106, 764, 347, -808, -115, 563, 470, -305, -615, 832, 859, 200, -362, -18, 687, 447, -318, -384, 258, 345, -380, -576, -30, 355, -361, -665, -661, 272, -1, -154, -368, 78, 686, 301, -358, 39, 503, 346, -337, -216, 355, 599, 14, -556, 77, 341, -230, -188, -201, 647, 184, -783, -655, 198, 23, -397, -813, 133, 248, -5, -481, -157, 334, 326, -34, -308, 724, 711, 169, -281, 214, 312, 207, -263, -520, 81, 278, -422, -716, -27, 580, -335, -986, -287, 212, 525, -176, -220, 279, 567, -58, -127, -97, 724, 759, -266, -193, 65, 460, -17, -184, -66, 195, 394, -501, -551, 96, -9, -450, -618, 344, 511, -318, -139, 436, 399, 228, -70, -407, 147, 588, 356, -272, 105, 734, 334, -299, -86, 546]
2565E46o83l76O0L54M32n75l17k0O64N6p67L82L30K45n72nO76J96l98k88k5N36
2587D51J60p33k1N22J86o47n3K37l7m57P0j6L23J6k96K09J89o0j33o7M6N84l36
2610A37o28J22N51K55m84m3N5N66j52j085Q64J56l66n39l5L48L40n17q1K70M01
2631A35j8l98j93J113m34m56N9N42J98p16j39M84M71k24p37j41L66N92p62l30
2651e88M06K89R9o30k95J264l97m87k12N45K81q6k18j58Q20k76m61k01M93K21
2671D09n62l01J40J80l5k25J24M22m93K17m67M40O54o95k79M17N33l73l44K25
2691a3M45j08k24k6J24K48m94k04K28O70m07n26K26j6R8k64p28R94R7k14m0j50
2713b84M90J46o79l3N19L96l26m83M25L69n88K00l00M25O30r08j92K72K25m65
$$ y = [546, -137, -513, -453, -99, 333, -242, -559, -579, 85, 141, -626, -244, 86, 331, -241, -246, 430, 626, 228, -60, -85, 451, 611, -122, -143, 379, 565, -82, -135, 102, 65, -392, -322, -338, -15, 1, -295, -86, 103, 43, -90, -157, -111, 473, 137, -491, -369, 182, 437, -47, -90, -35, 531, 379, -706, 158, 314, -52, -591, -626, -278, 62, -455, -536, -266, 135, 117, -281, -474, 639, 205, -251, -192, 350, 548, -168, -307, 177, 648, 424, -313, -454, -88, 504, -258, -588, -182, 107, 206, -424, -719, 545, 148, -339, -551, -6, 275, 189, -29, -187, 633, 357, -104, -305, 188, 409, -153, -454, -314, -134, -169, -394, -270, 152, -341, -124, -591, -151, 503, -192, -471, -54, 479, 106, -238, -13, 432, 324, 100, 74, 198, 446, -48, -252, -24, 646, 239, -287, -61, -77, 21, -243, -971, 23, 120, -94, -134, -284, 206, 352, -327, -360, 159, 555, 229, -254, 171, 540, -48, 152, -148, 277, 907, -1, -193, 79, 304, -161]
2733a61j15j45P62k77l68j8L49J26k4k28M5L97L5n36l27O74L07n66j48L61k4o8
2755E1o8n05Q21j71l37m10Q25j89R2j99l36Q26m34n0k15L60M00l76n15L88M95
2776D53j19n11J90L60k11m99N17k44K23j38m75N44K16m24k92m8J25M92l62j02
2796c05M23n5J01j91k31R73k73m89P1M82k3p14K37L8J35N8m49j79M46J30o67j
2818d83N19J30k05p5nL80q96N28o7K35M00o30o9M11M07j53p70L14J69k6n16J35
2840b67M45j09k36o75N83J79M00o04l62P28J31k64j13K54L79k38o59N42J93J16
2860D23k21m1L17L1p87l2jN53j88m75J76K4L12j00m1k81Q14m36o37L39O13J54
2882E16o74Q2L17n7J08k13K19P5k67j68O0j5L86j003K11K60L97m82j40K26M27
$$ y = [-161, -276, -421, 341, 64, -304, -322, 27, 153, 129, -99, -54, 343, 378, -158, -485, 189, 496, -70, -218, 143, 119, 51, -17, -522, 299, 128, -209, -619, 206, 17, 109, -90, -426, 400, -34, -84, -299, 61, 461, 85, -430, -42, 453, 334, -177, 13, 373, 162, -337, 180, -64, 159, 21, -454, 90, 306, -118, -410, -458, -333, 159, -203, -305, 118, 63, 164, -27, -258, 715, 442, -47, 24, 506, 483, -231, 6, 44, 179, 237, -212, -391, 55, 185, -482, -483, 36, 166, -39, -114, -119, 261, -635, -107, -174, 61, 461, -169, -238, 173, 580, 427, -343, -29, 140, 114, -402, -267, 178, 69, -167, -842, -259, -80, 320, -284, -646, 82, 213, -51, -164, 90, 469, 231, -428, 114, 307, 423, 202, 161, 478, 509, -278, -310, -311, 242, 54, -421, -245, -221, 91, -9, -50, -331, 483, 47, -590, -251, 362, 516, -158, -76, 241, 184, 292, 79, 298, 373, 106, -62, -2, -17, 369, -634, -423, -163, 234, -248, -388, -162, 265]
2903B65K25p19J13K54L16q33L54J68N56m90l43Q3K97J7k10J8J62J6m08j79M30
2924I2l1l7n79K67O42m72n8o04P96N9L15r42K62P07k74n58oN06L00j26l82k9N38
2947C86k66lk22L65L04j087K29K33L14n09k02M87J23l20n7j12L39K86k28k12L62
2968B10N03k56k18o46R34mr05J06Q6M74l44n13J65O05m55j17k0N50Q7n00j05N16
2990A53L13M2p43L76J19n3j87o0K30K58m73j30L06J70l04l13J74J1K57r7n28M91
3012A2K75m06l95L81L90l3n85K51M80k3l2k09K13Nl17l87J39L75L45p05j53Q10
3034D31l13l36j07NM59j96p1k9L02K59p01j17L23L95l24l16K67Q00n51l89J41
3055f8N12j84l1o01K57M02l12l75K27J78L67m67j69M06J19q0k37j81O69l34k9
$$ y = [265, 490, -229, -116, 138, 454, -379, -25, 143, 699, 209, -134, -51, 246, 263, 53, 71, 233, 249, -159, -338, 92, 61, 24, -555, -288, 354, -118, -176, -780, 16, 75, 390, -552, -290, 417, 143, -415, -421, 85, 385, 259, -123, -152, 386, 120, 117, -105, 260, 564, -523, -294, -61, 253, -256, -458, 29, 152, -168, -225, -337, 2, 288, 60, -152, 210, 713, 457, 239, -407, 527, 523, -382, -276, -190, 284, -60, -573, -408, 197, -258, -375, -395, 155, 242, -258, -363, 153, 466, 508, -235, 141, 260, 207, 20, -40, 190, 448, -25, -155, 151, 321, 17, -296, -122, -111, 146, 49, -479, 12, 287, -119, -514, -133, 257, 224, -361, -110, 370, 347, 315, 106, 319, 324, 7, -380, -241, 134, 479, -226, -379, 431, 118, -218, -325, -320, 139, -57, -128, -157, 145, 404, -297, -414, -91, 304, -20, -336, -69, 731, 180, -209, -68, 444, 260, 229, -372, -115, 287, -25, -400, -173, 5, 372, -95, -264, 142, 261, 181, -56, -237, 432, 98, 69]
3076F9m3K37q7l56q8P48j86j87n09K49J40m4O6k08L3J89p3l09l01J023m95l45
3098d77K66M78j12M1k99M40J16j78m77J52R1K15p10J75L66K5k34m56M70K82J95
3119C69n68J6K33J96o89M88L24j66k91j52M55J83j23n68mN60J44p24k92N97J39
3140A27o3l23J18M43J46n09o5QL75m9o41J20M76j54k98K18N05l71J21m34L08N98
3162F56m88n3o26J011j53o51l6L41L08m16j29N79R0j84l38k84R85n55k55K44k02
3183a56O31k16m65N21L91m74l86J16L81k91n03o8N15J36j12j60k27M23l14k76
3203e34K75L72Q9m6OJ24j42J62p01J76M53L7l97j00M42r9K18o43J59L98k34l20
3225c05M5K89J22l33p0M46L6k13k12p8J34K52k71K04j12N34l03p47O28L57j64
$$ y = [69, 26, 263, 176, -180, -268, 480, 294, 107, -402, -153, -13, -57, 9, -199, -166, 23, -50, -359, -660, 363, -132, -477, -211, 267, 155, 196, -103, 337, 453, 275, -202, -50, 41, 256, -454, -279, 87, 112, -122, -578, -108, 174, 369, -199, -183, 50, 246, -443, 45, 369, 203, -88, -240, 215, 398, 275, -293, -297, 263, 407, -317, -609, -12, 127, 64, -259, -141, 302, 448, -61, -126, -118, 257, 208, -433, -313, 163, 9, -289, -71, 434, 63, 184, -250, 58, 656, 168, 115, -511, 500, 347, -304, -340, 1, 309, -107, -236, 343, 433, 249, -89, -373, 612, 57, -198, 46, -156, 475, 259, -206, 315, 706, 232, -154, -38, 343, 52, -451, -519, -4, 132, 20, -140, -367, 56, -258, -534, -259, 113, 202, 156, 162, 286, 144, 306, -395, -219, 234, 271, -126, -226, 216, 117, 335, -308, -149, 249, 15, -305, -260, 29, 151, -182, -252, 194, 230, 17, -195, -273, -139, 113, -158, 46, -66, 468, 165, -582, 46, 403, 239]
3246B39n79L5O62J16q36J33J97J99l06o24M19L81Q5k97p4M74L17o94J08LM30j88
3268B00k83J89J57q1j20m76M99K63r2m63K89K74l83P8nj60M40l2q45N57J42K35
3290C83o24M22K57l36l74N07k65L13j41l10O3O40l49o89J59N59J77n52l02M80
3310A8J57k54j80K03L60l19N5l96L95N98o27l43K66M34l81r5N7J35J25k08l45
3331c45O23j32k03j78j22L91K26m29j11N46k34m2k90L3L59j6m99J11P24m9n72
3352b09L74J4J44m88m5J95L50n0l40m6N70k48l73OL9K35k21k05P5J33O4j56j05
3375b87N79Qk69l46L83O0J85l21j36P89l62m43L8J5J82j4k34j59O59k02q8m08
3397c71O89m67J21j36J01N78k22n63p3N73J45n91M09j87N64n17k92K57L24k49
$$ y = [239, -340, -305, 357, 473, -363, -230, -33, 166, -140, -764, -345, 36, 121, -176, -250, 224, 541, -153, -45, -42, 388, 200, -83, 106, 263, 182, 62, -414, 85, 348, 256, -207, 82, 356, -27, 51, 46, -114, 326, 294, -551, 6, 148, 383, -241, 181, 438, 102, -272, 235, -30, 283, 142, -168, -105, 535, 186, -503, -344, 215, 392, -160, -462, 18, 175, -79, -259, -56, 304, -15, 40, -356, 39, 637, 10, -333, -67, 367, -14, -109, -52, 83, 208, 0, -345, 278, 146, -57, -235, -357, 34, 260, -169, -280, 266, 32, -10, -300, -267, 92, 76, -423, -312, 412, 363, -209, 165, 179, 323, -165, -210, -15, 335, 285, -55, -101, 469, 221, -152, -146, -107, 128, -93, -298, -223, -90, -26, -182, -287, 292, 300, 31, -315, 68, 128, 313, -8, -144, 645, 283, -160, -122, -107, 75, 61, -173, -332, 327, 125, 37, -371, 318, -149, -28, -164, -63, 515, 293, -270, -343, 230, 375, -216, 193, 6, 570, 53, -239, 18, 342, 93]
3417I3m64J02L68q9k55l75R37l66j57m46N92L58l15j84j01M86K54o63m4L51K62
3438C44j67j80k55P95l41n36l00Q20J38n38j88K82M83k05l50J09K0N89o09k6J45
3459C0K17m0j57N3j1J1l25j19J68P23o91k24L00L85l02l94O9N64k55j04k04L85
3481G9k24L22k26p9L21M2n8m20O92k80k47J83J39O8k12j03j01K31M80p85L9J76
3503C7N74n51p43L63N04j31l71K83K83k69l48K57K61J59k84LMK68m7n20K68lJ89
3526A86j22n46J1M36J67o14N69J8K75o05k09R12m36J2k40M93k3J44o75q9M94Q3
3548B41k7r3p3K22k35l70J49J43M50m69J8J7Q2j14n33K83Q32l58k84m5P60l23
3570B73r6k85o8K97j90o2k38Q44m08j68NJ28K45p64K82L71K11n34k03p8N24K61
$$ y = [93, -371, -269, 99, 10, -245, -620, 317, -49, -206, -652, -60, 298, -17, -201, -302, 184, 438, -225, -269, 82, 344, 177, -3, -258, 537, 196, -340, -640, 180, 318, -220, -408, -126, 357, 152, -198, -89, -69, 520, -89, -115, 30, 247, 207, 50, 103, 92, 103, -222, -341, -173, 550, -141, -365, -65, 320, 18, -376, -307, 257, 2, -102, -306, 79, -145, 177, -49, -128, 193, 235, 177, -243, 449, 169, -78, 105, 244, 312, 100, -3, -104, 127, 607, -178, -139, 37, 611, 60, -683, -320, 184, 53, -318, -35, 248, -21, -369, -112, 149, 308, 24, 27, 31, 299, 252, -268, 0, -3, 186, 64, -482, -471, -35, 132, -482, 87, 105, 380, -225, -434, 478, 42, 54, -186, 307, 284, 428, -247, -336, 158, 241, 214, 121, 48, 270, 35, -335, -186, -43, 407, -62, -44, -27, 55, -59, -592, -309, 523, 165, -119, -164, 596, 273, 177, -108, -176, 121, -69, -131, -369, 475, 67, -101, -96, 32, 277, -487, -205, 166, 377, -157, -360, -438, 86, 347]
3592C47m22j01M82o9j33l96O37j66j79j66J79M70p7n48r2L7N12n53q7K33L14K24
3614D46p63p0O31j88l54j52K68M56k98K09k27L35k03k88M09j31K85m86k1K66m30
3635c06M25k00n58O62M96r16j67L76N72o46l08O40J82K2m49J11RK22n7j19%M43
3657D34n46l6r2N19R9m94pJ34J55k07n95N02M52m46N9l03P79N1n96o5R3O16m63
3680D3m23K37K01O0l38J21J66M86o57J68L0J7j00J73n00K42M27o14q5M26L74j64
3702B90m56O2L06l03K82j88J47lj69k7J74K37p0l22j58M54j53l83J9J29K46k34
3724a20j8nM43j12j91K7L4L85m65j83L31q9P0k51J76O30m61l55n5K44l00J46k48
3747c67L75J58l28k19J84J59n9J4m02M11P0K67n58J97N13l82P1j04L22l94m17
$$ y = [347, -75, -176, 306, 237, 104, -292, 345, 179, 0, -166, 13, 483, 406, -142, -234, -197, 315, -238, -325, -92, 222, 446, -317, -387, 244, 56, -298, -450, -182, 274, -24, 185, -42, 293, 90, -198, 211, 80, 365, -121, -142, 124, -306, 119, -81, -639, 23, 519, -397, -564, -188, 384, -262, -570, 70, 252, 274, -175, -64, -55, 167, 110, -9, -9, 434, -112, -148, -240, 279, 378, -116, -123, 11, 166, -41, -636, -134, 318, -128, -69, -372, 407, 458, -138, -203, -110, 506, 43, -380, -143, 58, 118, -220, -99, 67, 553, -104, 64, 94, 111, 11, 184, -316, -74, 353, -261, -346, 80, 454, 290, -166, -104, 202, -101, 181, -7, 140, 137, -32, -59, 115, 352, 282, -40, -198, 256, 103, -280, -261, -132, 114, -120, -138, -143, 300, 188, -3, 24, 58, 443, -22, -205, 126, 37, 107, -144, 32, 662, 201, -154, -209, 35, -265, -119, -367, 8, 166, -162, -381, -197, -38, -97, -83, -485, -74, -4, 263, -295, -98, 415, 33, 104, 0, 322, -72, -489]
3768d89L78P5K3Q6J29m95N17Q1p40K89RL24o44K58j13K81J1k28QK76K54l18L19
3791B91j94K79k06j93M0K78l44m34Q6J03N84J89p68J71K21k46RK3M87o19O6Q0
3813i7K80N6n36J20m6J41J43j9j38kJ12k66QL73O9l56L4j92L92Qj76Qn0K08J5
3838H9o17O66K27j95k09LN01k49m7l09K73J91m30j75J15M18k74k38L57p4k3L3
3860C3j1j21K28L39p15J07K32N54q30K23J81J84j10o20L07R8r1Q9l23J74M19l79
3882c2j16K43L85k63k74r6J74J60k90o0K18J72j72k1j5M59k50m7k62J69P2m14
3904b60j63M70L28k76n57P1N05l04j35L7K60O93q59p7M60k96l5k6M16m1j12k33
3926a34K29k78K45l7m39K96M68k94m96L95K17k68J6QL34R6j93p15M42M55n46J50
$$ y = [-489, -111, -36, -13, 73, 202, -293, 224, 305, -435, -146, -137, 187, -457, -199, -312, -31, -20, -248, -240, 36, 290, -28, 291, 97, 376, 170, -23, 17, 295, -49, -483, -397, -294, 290, 479, -289, -118, 103, -143, -134, -111, 376, -243, -177, -97, 183, 239, -297, -177, -223, -82, 61, 42, -96, -98, 14, -252, -244, 129, 198, -158, -124, -316, 76, 84, -92, -84, -134, 74, 89, -528, 138, 365, 170, -39, -36, 465, 216, 169, -140, 133, 324, -106, -281, -166, 252, -22, -260, 97, 23, 0, 33, 22, -99, 129, 468, -247, -140, 92, 646, -184, 39, 220, 404, 294, -326, -19, 79, -12, 77, -246, -72, 347, -32, -148, 95, 480, 217, -57, -153, 21, 181, -109, -169, 49, 221, 49, 28, 13, 472, 222, 175, -87, 82, 154, -260, -423, 47, 375, 99, -458, -387, 118, -186, -321, -284, -24, 669, -190, -267, 193, -103, -138, -164, 252, 211, 99, -134, 95, -183, 62, 25, -414, -118, 350, 56, -440, -45, 172, -96, -80, -72, 262, 358, 165, -550, -108, 347, -199, -49]
3948d9r7L20R9k96l42O23J84q2n35J0N73m7l59M4N36m76l83M3L09m0M9QL6o3m7
3973A8K58n28N58j55J26m83l11O45j42J5K21l25J23M1m06J23M03J31n18j41O35
3994B88j76l95J21J14J35l6j46n4K35j03j78l6L25M8n71J16L55J8rJ70m15L05
4016A11L09j72o83M30J86p2l11n2N69j2m92J67Q3mk0J95j76j36M7k06J14O97n42
4039C0j66M2o6K24L11k56p0j03L81n06j4M10J06m80P0JO36j000J47L27l29M16
4061A11l30RM14q4j38k89J50N9J8Q9N7J21k52j65L0K05K24l39J95K03L0k61N5
4084A12j56%j08M00m62M59j41k62Rj33M74j94k12K69P5PJ57k09K47L7m80l87K91
4107b07L99nm92O1O08j16l78m2K40J10m23K52L9J84k39K09k40K04L91m65m3j05
$$ y = [-49, -146, 174, 273, -23, -365, 258, 442, 360, -175, -165, 408, 361, 2, 46, 582, 106, -277, -234, 75, 35, 84, 92, 128, 65, 18, 276, -252, 306, 151, 277, -206, -517, 128, -14, 1, 222, -103, 20, 61, -345, -222, 181, 312, -206, -347, 288, 112, -283, -162, -48, 87, 51, -95, -149, 86, -17, -195, -231, 94, 142, -429, -313, 42, 60, 51, 221, -194, 111, 420, 248, -435, -5, 181, 109, -202, -254, 315, 303, -189, -22, 61, 57, 37, 232, 56, -80, -33, -239, -125, 572, 30, -136, -94, -160, 64, 375, 119, 49, -54, 327, -179, -193, 217, 323, -157, -87, -86, 550, -450, -303, 24, -305, 111, -219, -210, 204, 120, -18, -307, -157, -98, -80, 9, 66, 187, -65, -230, -200, 5, 229, -110, 85, 288, 318, 57, 112, -44, -44, -152, 248, -214, 245, 104, -158, -149, -282, 192, -2, -214, 55, 130, 137, 294, 85, 332, 369, -111, -498, -207, 192, 187, -305, -244, 364, 248, -130, -172, 68, 178, -245, 7, 46, 230, -9, 200, -40, 164, 555, 90, 47, -58]
4129e8j25J88j88o8M27j20L7j52K22pk15m38L22L03N0k27m8K95j72j3j72J04K3
4152c2L27l61K8j41L82r8j97m8N02m50j13Q5O4J51o1k70J10L54p2k41M48L0j46
4175B51m61l3N31k88J28k41J18k2j19l2N0J6J97k26j87P88m96M31n35n7O87l56
4197A44k90k39O02l13k13O0M49M7j57j82O4L76l02j82NJ84NL6n89L76J38r9j80
4220b60M14k7l12Q0J38L1l0j10J33k83L99M2l20M11q5k69L51k38l59K55L43l58
4242e4k05K90L62n00k42L57L35r7r8J21q1k32m90L27J38k10L18j60J47K60k76
4263A0om64Q58l51k52L55j50R3k92j07M35j36L33r76N70K60O2n33J80Q0J70j04
4285C5l13J79K71j04j24j17L15k6j14j56K09J92J24k54m9J60j29j09k68K40J71
$$ y = [-58, -183, 5, -183, -251, 176, 56, 93, -59, 163, 156, -59, -497, -175, 128, 178, -49, -97, 198, 26, 13, -159, -55, -32, 295, -66, -38, -179, 203, 105, -92, -140, 362, -88, -201, -116, -52, 99, 38, -232, -122, 232, 160, -81, 367, 397, 251, -210, -243, 288, 0, 128, -113, 5, -17, -136, -168, -118, -102, 95, -131, -318, 470, -26, 405, -130, -187, 500, 144, -146, -385, 217, -96, -309, -249, 200, 247, 90, -92, -28, 348, 46, -136, -131, 53, 58, 94, -495, -119, 19, -80, -260, 154, 127, -185, -105, 33, 64, 34, -76, 57, -226, 173, 215, -105, 306, 221, -48, 303, 65, -294, -39, 304, -54, -259, 31, 393, -107, -349, 8, 343, 246, 148, 269, 188, -44, -534, -207, -69, -279, 39, -121, 26, 286, 10, 4, -460, 398, 47, -205, 150, 0, 93, -199, -306, 129, -7, 326, -650, -80, 180, 242, -291, -111, -31, 139, 35, -278, -99, 172, 68, -56, -173, 142, 116, 2, -154, 55, 247, 371, 117, 68, 228, 99, -10, -278, -38, 133]
4306A33K0N4n7k0k80l5J51M32k89l36o3K13J12l48J16M26l88Q5J45j91L66k70
4328b4l13r1N93m6J87p48O67j36Nk05j65N20J40m58o2K62n33O84k53k56M08J21
4350B97j87m74L4P00m70o9J00J97J65l96J6J72n5j95O9K85J64n79k59K56J62K95
4372B28k74O6j52J78n43K84j08L78K98n06L21j07O3l09j84N13j49m6J08j22n1
4393a14J92J10l09j64N52Pj79Jk18q2K14J57%l18M20k31N6K2j50N6lN1k2K29l08
4418c1M0k32L0jJ59J79j77Q2l25K48J61j91l36N12p8j95K50o8Mk67O8j50L56j02
4442f4k04K32L45k76jm2M9j22K10j24k06N38j84j45k2N1J65k80L09k08J36j58
4464al36K45J37L8P5m9k04L81j56l34J22M20j75n34L36J45l23P8M60m50N58k95
$$ y = [133, 153, 207, 150, 130, -150, -185, -34, 398, 109, -227, -290, -77, 35, -313, -197, 229, -159, -74, 71, -120, 246, -24, -337, -428, 165, 119, 306, -442, 225, 89, 94, -111, -276, 244, 384, -74, -136, 126, -407, 277, 24, -232, 176, 297, 110, -364, -330, 370, -100, -169, -69, 128, 293, -103, -87, 85, 30, -165, -96, 189, 353, -226, -485, -229, -67, 228, -46, 20, -132, 46, -497, -213, -321, 57, 355, -151, 170, 63, 126, -183, -367, 146, -3, -49, 59, -63, -114, 78, 188, -121, -285, 267, 274, 95, 96, -122, -204, 10, 167, 167, -151, 269, 38, 94, 116, -34, 22, 19, 70, 48, 277, -31, 9, -223, -193, -194, -35, 144, -33, 49, -276, -28, 133, -58, -394, 118, 40, -155, 95, 27, 31, -236, -168, -318, 38, -64, -268, -36, 309, 33, 32, -10, 39, -83, 127, 3, -203, 335, 151, 6, -16, 35, 200, -80, 229, 21, 157, -1, -337, -92, 45, 83, 158, 109, -95, 286, 130, -204, -82, 338, 163, -371, -35, 110, -213, -135, 325, -125, 433, 138]
4486A38j51j83M34p7k88J55l80K47J14j95J09M08lj89k17J38J60l23j0J30R8j44
4508b9N1K68l11m12N58j22K57o6l51P5k44M43J09k66J80L13k61m22q8M54l31o4
4530b59L83k17n1K95KO8j35J45k12K1j26J07Q6n87O45nn7Q3n9m1K0n9L1l51N09
4555B36M4m64j33L80K77m57M32j91j04L0k20K32K61j41n86L07J29j7k32Q6M09
4576B78K6l20K21j44p4k61N27l64J40J19j84k03K78K52l58K52n56M55j5k22Q0
4597g3j30J90K83l92K39l6R1n88N70Kpj22J3L39j75k10j99P1J65O2l76K33R6l2
4621A4N1N3l20O25k84n6k59j98M80j00M4q2p0j54L33J1q6o0M2Q2p6P5L1j70k59
4646c33K41J48q8P3N3J22m75J58q6O9K40j78R1N13o57K04j70m6K28j21L20l56
$$ y = [138, -13, -196, 238, 161, -127, 28, -352, -105, 9, -186, -77, 331, 328, 139, -78, 60, 220, -103, -113, 17, 115, -29, 22, 290, -21, -433, 125, 3, 260, 194, -157, -82, -326, 117, 226, -40, 140, 453, 192, -230, -318, 136, -195, -259, 124, -93, -144, 151, 153, 221, 86, 231, 19, 40, -86, 21, 107, -480, 165, 160, 103, 186, 127, 86, 106, 47, 78, -273, 236, 280, -184, -317, 63, 340, -117, 315, 124, 20, 50, -170, 62, 323, 182, -404, -97, 32, 15, -217, -131, 278, 304, -16, 205, 61, -13, -274, 253, -111, 29, 148, -36, -239, 39, 291, -67, 185, -371, 84, 69, -153, -73, -203, -13, 270, -122, 117, 81, 172, -416, 154, 156, 149, 27, 40, 379, 204, -6, -205, -134, 31, 93, -283, -50, 46, 14, 65, 118, -202, 423, 139, 83, -176, -374, 106, 6, 50, -32, -102, -256, 77, 88, 2, -58, -16, 66, -10, 65, 96, -74, -333, -92, 56, -32, 41, 94, 216, -259, -101, -187, -118, 122, -56, 35, 548, -109, 95, -75, -121, 107, -14, 306, -50]
4668e0L61j88n08N04j72R3r5p0L74k58l09M77k73K26k44J16J64m0n2j98P0L11
4690B39l46R6KK58l53k1O7l19M88q8j30M8O6j45m7j45N29r7K02n43K65j12l8P1
4714e3j1J69J73p8n30L47M1K07j54k16L17j79j36K29l18M95k8k57j24K24j04j4
4736@K80l95O5j96k41N44K2m31J67j66M69l48JK82l14K76j0j67J51j32L7K23O
4759A23o7j03n2J92k85J79J84O6m12J76n4Q1P8k2J22j94m2Q8J53k6j45j56K17
4782A01M31n88P3k18M25k79J92q3k42L01p3P0m86N91m4k19kO2m22M18J77j86O4
4805F3q7K8k57M69n51J73P1N32m56J70j65L81l10k81L94K0q2M2j22l17N77k47
4827D5k43J03pj70K40r6m6J7K20l06M34j32l3n0J3r4J17J83J81o02M01K8l37o4
$$ y = [-50, 311, 123, -385, 119, -53, 40, -55, -125, 249, -9, -318, 159, -114, 112, -132, -16, 148, 108, 56, -142, -72, 239, -107, -11, -9, 249, -104, -125, -58, -377, 111, 23, -107, -59, 7, -138, -185, -330, 199, 102, 304, -239, 26, -86, -124, -53, -64, 105, 278, 200, -330, 17, 58, 265, 111, -105, 212, 33, -103, 126, -192, 303, 275, 18, -106, 118, 14, 0, 280, -115, -50, -246, -487, 57, 79, -352, -185, -351, 118, -230, -229, 53, -261, 15, 5, -162, -11, -143, -106, 117, 123, 56, -47, -99, 93, -192, -13, 171, 237, -175, 1, -53, 28, 106, 84, 206, 12, -30, 58, 211, 185, 40, -116, 101, 532, -56, 17, -201, 224, -55, 137, 54, -188, 113, 40, 110, -376, 215, 171, -48, -50, 12, -410, 8, 185, -1, 63, -24, 4, -253, 216, -335, -162, -91, 441, -15, 155, -10, 371, 61, -220, 174, 194, 112, 154, 32, -285, 292, 45, -198, -95, -102, -272, -32, -128, -174, -157, 63, -243, 191, 59, 26, -24, -11, -105, 12, 195, 376, -226, 175, 203, -134, -198]
4851a98J16j71L63j71J32J6j67J58l78N4P52l40j71K44l81K71j34k55M41R9m68
4872a88K0K12K64k62k77J53L55k68j8j94J44n7j04M27m44K81j7o1m0R6M40k75
4894A87m07K47k40j25N8K74J13m56N35j60J57J28k06j72J23j59Q3p0j10Mk45K82
4916a59K79j51J51l87J00L95k2l59J78J45r0j57N9j92K62l11J83K11l25J41q5
4937a34M86o38L94p8q1k14J25mj8J39MJ49j1j66m0K14K5l71J75N4K92l95K15P7
4961A99o5k61K08l6M9R1k71R6l25J36K93k40K40l33O31m39j45M4M26l71j75L29
4983H1j46L17l11J12l77M73m67J54J51K86l06k5k21N04j56l84L91l14M14n3j63
5004d0q0RJ07k44J29o3K51j47L14j48k24L57l70P5m7R7j48M4M7K21M1n8j20M5
$$ y = [-198, -82, -253, 110, -61, 71, 87, -80, 78, -300, -246, 506, 166, -5, 239, -142, 129, -5, -260, 181, 280, -188, -168, 44, 308, 46, -231, -78, 277, 9, -9, -203, -59, -116, -220, 207, -237, 44, 27, -34, -74, 22, 462, 187, -220, 27, -213, -338, -280, -6, 107, -349, 186, 26, 183, 311, 105, -67, 56, -103, -20, -90, -200, -196, -441, -159, 120, -31, 120, -267, -167, 228, 206, -153, 25, 170, 80, -77, -18, -210, 52, -259, -76, 135, -190, -49, -134, 352, -286, 108, 30, -51, -265, -140, -144, -162, -23, -19, 130, 119, -47, -87, 127, 152, -219, -44, 10, 302, -93, 122, 199, 134, -127, 81, 45, 94, 185, -86, 10, -315, -179, 114, -126, 114, -219, 412, -27, -172, -128, 298, -73, -248, 81, -65, 252, -59, 53, -324, 149, -318, -164, -13, 273, -33, -58, -279, 225, 69, -315, 76, -238, 176, 123, -40, -120, -111, -4, -248, -119, -182, 69, -78, 236, 88, -136, 221, -149, -74, -121, -24, -172, -128, -81, 140, 181, 123, 3, 48]
5028D8MK42m79R5K96j96L27j17r6j72J36J54k14MJ05j93J39k04J29Mm70N85k64
5051a37j69J05J13K6k00k1K09K26m33L61j97J41p4M30k21k45L49o68N19K27m3
5072B98k6l89P6K35k87M06n88K22J27l17L72j6j32N7l97M49K14M6n11P8L10l34
5094a07L44l0l16J91k44Jr8J86K53q3%O7m1m87M18n7p3L4j0p0J52J56n08K76J54
5119A08l32L96l65l0L44r1j08l31M06L91n88K36k40K2J15M9j83N02j52k53J22
5140A8j72r1N56j85k97j3J81j9l38N83J44n39M5Lo8K17j87M82m17J11m15O3N32
5163A94k97J00K87l52M57m98L4J05J53k84R1j27J63q0N6k02L46J59l62lL5m9k36
5186c10M24j4k4J28j88m41J64N4K45K3p7j2j21K28M3n86j9K04J26J9M26k29m46
$$ y = [48, 52, 294, -185, -90, 206, 10, 337, 220, 124, -48, 88, 242, 28, 32, 137, -56, 83, -121, 8, 12, -458, 127, -137, -306, -201, -88, -62, -262, -283, -74, 152, -281, 80, -117, 24, -50, 380, 159, -86, 263, -405, 114, 341, 298, 272, -117, -41, 194, -93, 313, -275, -53, 74, -243, 129, 113, -19, 38, -359, 90, 304, 350, -161, -83, 227, -107, 237, 207, -109, 82, -162, -161, -259, -73, 180, 97, 97, 164, 123, -364, 54, -3, -76, -42, -52, -122, 30, 186, -322, -46, 108, -224, 172, -193, -223, 121, 30, -78, -409, -3, 388, -200, 36, -204, -182, -67, -18, -201, 301, 149, -104, 18, -154, -245, 311, 126, -171, -184, -3, -22, -360, 223, 367, -172, -127, -124, -192, 25, -162, 320, -97, 14, -401, -338, 194, -103, -3, 284, -68, 389, -109, -75, 30, 183, -101, -10, -137, 26, -54, 2, -200, 146, 305, -57, -60, -25, -74, -310, 114, 100, 76, 204, 16, -425, -261, -207, 38, 61, -16, -28, -149, 79, 122, -464, -483, -279, -153, -134, 292, 63, -383]
5209c83M15k69J36J05L03m79M26j78K71l87L8J29k13R0J78m75L74J70k34M21l15
5230A23l95M16k06J41j80k62o5N02j16N2J57l27J12j11r2J23L09m5m56K57J67
5251A04j58Pn5j9R5l16N22r6j72R1J30l40P3K84r1l57K90M2l0k35O4L50j48J16
5275A51k60K84R0L8o18K39j64L5K45j06j66L53J47n58J03M79k87K15m4n0j47j05
5297a26K43M3l16R6Q5n24O00m6j65k15Q7K04k07K72k64J52nj56J65J10P6l00L72
5320A81l56N3K86l04J72p0k77L09j92N35l27J73k53k4J99j62M01o64N47M9n90
5341c14L60r9L66m85k51O71j98J09l28J1K98j57K65m82J34O12p25J31P4L14n45
5362b39J31k9J83K65k64k22N02J18k14n14J14L92o8j78P2j80k10O10m01J4rL1
$$ y = [-383, 32, -237, -101, 4, 307, -172, 254, 76, 347, -40, -2, 127, -86, 4, 182, -293, 81, 251, 17, 438, 123, -272, 144, -62, 79, -101, -363, -428, 74, -42, 10, 167, -160, -48, -159, -251, -128, 181, 136, -320, -63, 104, -54, -47, -102, -121, -26, -342, 180, 84, -88, 3, 133, -207, -134, 150, 59, -298, -8, 34, 4, -231, -167, 183, 35, 151, -109, 175, 265, 303, -315, -76, -240, -205, 40, -66, -232, 121, 268, -290, -187, 292, 5, 220, 176, 126, -21, -126, 117, 160, -156, -60, 25, -499, 101, 55, -110, -325, -238, -34, -241, 31, -233, -81, -86, -242, -77, 33, 109, -191, 181, -175, -122, 164, -140, 32, -38, -315, -6, -198, 337, 10, 183, -70, -94, 105, -57, 344, -320, 227, 276, -314, 46, -53, 313, -172, -423, 248, 50, 159, -169, -158, 140, -17, 248, -234, -100, 512, -213, -82, -8, 306, -239, -108, -137, 46, 311, 47, -175, 327, 445, 231, -283, -169, 223, 155, -23, 49, -131, -341, 269, -132, -118, -127, -96]
5384i6M04l04L77k65k11q9J32K16k72R2M33j82o4o5p1k1o9J34k00P2m9m1K72r1
5408D2j70L6k63N02J97N3k70k79M44l16O6J9n6L68n91r2N35j43j3j39J08J65j34
5431F9k8m18M75m4j24J47l5k71K81q5J54k66j99K87l4J27J81k00j83j32K96l4
5453c6j4j70L51k52Q3m4J81m9p6o7n0N2L42k31j67k9M13l30pQ7j58J93m1J0j26
5478a35K06j4p0j68M42j65j8l65K07K22r9o4l06J03N34l60J42R7o9k71P7j35O8
5501a41mK09J15ok22N7r5j78L16J80m32J25Q5R2K0L5j36J98j33j25J94Q8Q4m09
5525h3j4P4j94k1J46R4P5q2l49K62Q5L3j15K17j79j46J22k6J14J05j50J48k91
5548a75K88J38j60k46N09l46k11K29lO6k32lK09K38p33N89o9j60n3J90Q0r8k55
$$ y = [-96, 308, 4, 381, 116, -95, -184, -52, 164, -108, -16, 417, 235, 171, 106, 35, 14, -55, 79, -121, -49, -98, -139, 133, 42, -128, -92, -355, 147, 344, 397, 127, -152, 292, -24, 42, 61, 5, 373, -218, -310, 225, 82, 69, -70, 38, 203, 69, 41, -377, 98, 54, -70, 77, 42, -229, 52, -33, 121, -145, -344, -57, -91, 36, 217, 17, -166, -298, -2, -36, -50, -220, 131, -121, -38, -82, 99, 50, -26, -93, -143, -91, 251, 20, -147, -176, 237, -93, -100, -13, -171, 22, -19, -9, -135, 71, 57, -13, -181, 261, 96, 78, -287, -80, 142, 43, -21, -327, -224, 310, -50, 92, 189, 120, -151, -74, -209, -141, -145, 64, 179, 173, -49, 8, -87, -265, 51, 231, -201, -76, 9, 101, 121, 156, 20, 218, 85, -40, 154, 242, 326, -83, -97, -23, -217, -238, -92, 2, 77, -5, -354, -92, -7, 26, -89, 128, -51, -197, -75, -101, 13, 118, -32, 116, -175, 113, 251, 91, -155, 354, 8, -203, 26, 23, 89, -143, -146, 63, 301, -432, 157, 88, -72, -125, 65, 145, 47, -208]
5571b08J62K57n33R44n49k84L82K3k16Qr8L30j00N2q7L1nk14l8J15J9K68k29j08
5595g8qJ49K92m85o0o4K15j63K24l02L70o1q6K98k0l95K59q7OL86m78j34L24m0
5619F2k07R8M79p59N97m11J93L36l65K17l42N9K87k69k9Q9n4p1j64K7L09k14J76
5642D4k09J05j10J95M4L0Rj02lk6j84K65l57N58j93k37K67j83L07l77M18m93q7
5665c19K78M2m1L16q4k88K27j60J53K3o9l24K81k20L94j86O1j19R2J72k38o5l9
5688a13M01l6o39M04Q0jJ64l75K1P3J43n28N22j45K5M1p5J12J06j34l68j04O46
5711B20l74l36O05k69Pj14M10q9N1k95O1m3K34K89o03K96n2L7j24J14r9K09l0
5734A05j57J32j60J09j84K23M11k68K38m04j99M39j29l0l96L99K37l15k64L4N
$$ y = [-208, -46, 211, -322, 622, 73, -211, 171, 194, -22, -14, -112, 218, 118, 170, 83, 114, 109, -105, -143, -28, -9, 259, 30, -78, -86, 63, 355, -130, -190, -254, -39, -202, 22, -280, 90, 29, -57, 241, 221, -174, 85, -2, 4, 390, -88, -222, 102, 62, -145, -47, 432, -327, 270, -141, 52, 388, 23, 240, -102, -43, 244, -25, -54, 35, -19, -90, -254, -227, 82, -132, 44, -165, -60, -170, 25, 69, 99, 108, 6, 3, -23, -207, 58, -299, 259, 66, -171, 96, -87, 220, -157, 261, -232, -319, -41, 1, -40, 276, 192, -96, 131, -29, 124, 147, 78, -246, 35, -185, 209, 23, 84, -35, 57, 229, -9, -74, -113, 288, 252, -387, 17, 97, 96, 260, -115, -94, -21, 122, -406, 116, -29, -4, 37, -38, 74, 180, 46, -322, -426, 220, -154, -490, 115, -154, -147, -261, 149, 60, 111, -184, -123, -166, 68, 357, -246, 50, -2, 35, -89, 25, -74, 135, 105, -52, 80, -80, 29, -155, 68, 479, 211, 449, 45, -154, 285, 156, 126, -270, 129, 366, 51, -213, -179, -174]
5755a74p1L77j64N0k44Q6n0J43K14j05J46n09O79k21n25O41j2m17K80J0j80J65
5777A19k25L64l18k3K30l44L26j32j4J40l83L1M34l0l71K80q9l74N56k41K0k1
5799f5J59j19O9k1J52M7l39J64p5q4K19l93J71n4O8p0L88k38l06K35J52K8J80
5822B68k16K07k98j03K5J4M69n24K8P1m9O0J68j66J34J10m7j84j14K63L65l82
5844I9k08n5p7O9k12K21L33q3j91K13K6m45J07K50o0j23MR9Q6k6K0o7J08j10k90
5869c12K24j90J18J90q9Q5N3j64L30M0m97M75k39j10J23K23l08K8L18k25K37l38
5891b8j34K32j71J02L4J9j44j16J68m21O17j93K6k78K23o0K45k56J25J13k35J91
5913E9K6k8o0M4r5Rn02M30K56k09Q5n4J35l67K1L22j86j76N66N0m82P4O8n6J7
$$ y = [-174, -245, 132, -32, 18, -226, -140, -190, -47, 167, 62, 208, -301, 378, 157, -368, 273, 261, -156, 124, 134, -46, 119, -106, 258, -60, -83, 147, -197, 129, -3, -17, 123, -260, -229, 205, 175, -196, 84, -5, -379, 177, -64, -44, -65, 94, -25, 44, 23, 175, 222, -117, 47, -28, -112, 107, -286, -115, -169, -101, -171, 217, -21, -327, -92, 60, 88, 268, 52, 259, -39, -142, -117, -103, 366, -158, -130, -59, -108, -48, 120, -46, 88, 198, 151, -33, -147, 116, 481, 99, -109, -164, -241, -172, -384, -163, 170, 87, -104, 109, 135, -310, -203, 47, -13, -136, -132, -33, 53, 27, 47, -20, 88, -22, -312, -88, -278, -160, 30, -59, 26, 79, -85, 245, 285, -212, 263, 24, -86, 37, 260, -48, -20, 298, 73, 310, -28, -162, 70, -101, 1, 35, 54, -90, -206, -38, -459, 158, -35, -9, -287, -64, -124, 121, -135, -10, 103, -132, 59, 85, 57, -3, 41, -54, -45, -547, -117, 139, -70, 15, -39, 96, -271, -250, 72, -114, -290, 276, 326, -156, -82, -14, -70, -53]
5938e3k00j58M19K33l17r0J73L33l62L19n36J44M57m62j02J90j20L20j4l22j67
5959c15N42j12k1Q2r6K22j75l45j22J87K01j7M8J22K00n22R1l8p5L03K09m78L44
5982B35o7j89j30L52k98j72L2L23k3l64K85j24k51N44Q4k79J58k68K0O4N49l98
6004H3l19K46J28l0jJ29k22k14N69n69J09M76l00l8R2j45K62o2j60Mj88M12J07
6027C69m71jK02nk31O3l30Q73n89j9K29R5j95N6M4J84l81Q3q1j05J4L21p1K47
6051C01k82k29J67m5K15j72J44j24K21J42m67N5j23J80j36J33k29L42L64p0o13
6072b26J65L8k28M7kK26j16N56l46m9M1L4l34J09K15n05L90K3k3j53l3L54k44
6095f1M7j65K18n5K01r6j4K60j41o4J14n0n2j51j54N04N2l22L8j2k78K50R4J31
$$ y = [-53, -253, -411, 8, 241, -76, -166, 7, 340, -22, 297, -239, -95, 362, -100, -202, -12, -132, 188, 174, -148, -315, 227, 115, 94, 176, 80, 302, 127, -218, -340, -153, 48, 31, 79, 201, 401, -121, -30, -68, -143, 160, 369, -109, 235, 168, -21, -151, 201, -97, -269, -237, 86, 63, -301, -16, -140, -391, 153, 237, -42, 116, -152, -132, -68, 481, 83, -236, 10, 138, 108, 107, 236, 14, -200, 369, -200, -91, 385, 85, 47, 139, -6, 256, 194, 34, 38, -150, 262, 369, -102, -103, 99, 94, -137, -74, -404, 469, -120, -139, 90, 185, -10, 46, 90, 274, -107, -24, -105, -210, -196, 125, 54, 301, 19, -210, -43, -88, 127, -45, 99, -25, 196, 338, -129, -74, -197, -17, -153, -20, -249, 93, 457, 387, -226, -61, -23, -251, -204, -206, 20, -96, 460, 114, 65, 106, 140, -194, -85, 130, -375, 15, 38, 15, -138, -171, 183, -61, -14, -179, 39, -16, 185, 89, 75, 335, 194, 130, 244, 194, 142, -9, -163, 341, 393, 71, 109, 97, -181, 69, 163, 294]
6119B94n73M9J76J07jj69J85K1l09K6J06L29j2n00K08n2O22n84K33j95J92j63
6141a0K11l3j54j08J94K7j49J94r4l7J9o0j74J31n0L13P3j44k26J70q3n2J62n2
6165F8L4l00r3N60k70O5j60K07pj10J78k05N4J68k12R3J34j51L0M9Q4j5k28K86
6189B59j75km98O44j55k06J66J46m83N35K0l84Q2K78j47k73L29j40JK69n51M58
6211A73r1J91j34k32O1N7J35j21j30n9P6K93l32O2j42K17O5k9j08j89j23L00j51
6234b11L64%k53L58k31P1r6k03J62N3p5L16l72K19l03L33p6N3k35L35L2n52L89
6257G8j25Q2j7j56J86K47k33o9Q9l23K51Q4j10J04J92m05k60M88m2m0L1r0K57
6280B19k53Jk33L76O6k45ON0J94j72K30O5l45K89l44J33K81o3k02P4j95J01j22
$$ y = [294, -279, -230, -54, 53, 52, -117, 68, 89, -220, -194, -88, 241, 229, -271, -63, -115, 507, -77, 156, -39, 153, -10, 201, 168, 14, -94, 100, 127, -22, 172, 78, 41, 60, 0, -174, -43, -93, 220, 293, 149, -77, 93, 10, -42, 120, 68, 102, -198, -291, 269, -1, 64, -96, 111, 104, -6, 172, -33, 21, 189, -23, 70, 204, 53, 83, 132, 216, 201, -27, 259, 84, 82, -416, 228, 73, -133, 33, 179, -304, 231, 251, -133, -51, 227, 80, -193, 136, -4, -3, 266, -285, 173, 82, 273, 139, -93, -32, 25, 160, 39, -91, -150, -74, 219, -113, -51, -193, 24, 89, 60, -48, -237, -360, -60, -211, 153, 153, -100, 258, 27, 98, 2, -201, -39, 14, -61, 255, -117, 102, -201, 132, 56, 109, -126, 209, 241, -311, 78, -47, 35, 18, -138, 48, 295, 62, -7, 82, -241, 10, 94, -16, 88, 280, -125, -385, 103, 61, 21, 52, -38, 219, -34, -33, -266, 110, 176, -69, -63, -13, 181, 9, 239, 304, -41, 248, -96, 37, 318, 255, 53, 127, -68, 33, -89]
6303h9K54j26j04K61k2O4m90K76J00r6M9o0J17l89K67P9jk15M71n15p5O02k21
6326A37L64n05J10J12m69J06L35k42q5M71o4m77K96j79j69k13L60J97p0J71k91
6347a05K41k03K29j98q2L20j40j64J75O7l31O2J12L7K6r8J63k6r8J06j80J30p5
6370c2j11J47N0k99N1L17k1n5l7k09L61m41M96n16M12l6k34K36l1N1J31j61j27
6393e8L33k59j43J98p1J32O29j291L02M74l3k63N5j11K86j16Q5l83J14O9q9Q6
6415e4Nj89L01K0l78K01M55k68j02m5j09O26k73M4m49K66Q3n5j46M4l90O13k69
6438f9j34L42k4P4k11J64J62k66J08O4q25O04k29oj1R6M35l48J12J63o4k85L45
6461A97j84J42k98M18r3n99M30l3Jj5j25M1rK81j97n8R5J49k4j59M2k30r9M16
$$ y = [-89, 165, 39, -65, 196, 174, 238, -252, 24, 124, 28, 77, 17, 134, -255, 12, 91, 90, -125, 346, -169, -244, 358, 137, 501, -4, 106, 218, -251, -145, 190, -52, -137, 334, 270, -207, 89, -90, -259, -472, -112, 85, 15, 186, -105, 136, -67, 162, -36, -118, 202, 62, -102, 73, 140, -191, -129, -17, 20, 46, -52, 111, 85, -13, 93, -87, 43, -32, -143, 4, 54, -245, -194, 123, 102, 47, 10, -199, 162, -279, 217, -299, 113, 77, -157, 79, 48, 99, 230, 69, -58, 275, 16, -127, 71, 0, 132, 761, -530, -228, 246, 213, -50, 5, -106, 180, 64, 149, -234, -120, -51, -140, -54, -49, -238, 63, 83, -295, -94, 361, 93, -9, -54, -163, 463, 190, 234, -215, 51, 134, 79, -67, -23, -413, 200, -69, -203, 139, 115, 189, -22, 142, 304, 38, 146, 210, -615, -11, -240, -246, -257, -161, 274, -74, 38, 201, 137, -148, 197, 13, 155, -143, 275, 182, -417, 13, -20, -19, -34, -159, -118, -127, 154, -43, -101, -6, 143, 119, -40, 2, -228, -327, 89]
6485H9pN0j32J40m02J87L18j62l86N14l54N0K55k40K76k26j75J13j97O68k54l01
6507a76L03o5M3l47M00j94j58n3K37J14J20q1o48N94j81r2J81Ln4K0Nr6J14k1
6531c2P6P5r2O1l47J48K68l28j32N01Jm15M52n0j88q0J67j75P6J12j44R2k08j01
6555b63J85Q2k73L47J2N8k89L81n64L55J65j27q1J55R5o4m0m15L82j49m03Q35
6577C84m75J98J77k00J14m18l4J15J05j4o1J01m4J93L4o1j97J52j70J30l7q6J51
6600E7k35L22k41L64j39K10n52J52K7m11O19l58J13M33k69j50j95K51k60L05K1
6621F4l33K02K5K5k7R9J82k73r3N6J42J66m2K6K83m04j43k15J35J17K76r7l8m21
6645b88N56k80p0j75nQ9m3L67k28J11j04N08l49J9n5L02m54J31K2J78k04j61k43
$$ y = [89, 82, 132, 0, 140, -262, -75, 243, 81, -305, 209, -145, -95, 160, -80, 196, -30, -205, -92, -289, 379, 125, -176, 127, 62, 105, -242, 158, -36, -194, -247, -10, 104, 224, 143, -505, 89, -92, -184, -3, 0, -54, -34, -29, -125, -11, -32, 44, 119, 27, 88, -259, -111, 157, -171, -303, 198, 199, -216, 236, 186, -2, -82, 85, -90, -14, 98, -46, 46, -162, -263, -78, 4, -269, 78, 90, 148, -141, 240, -324, 31, 196, 69, -12, 143, 238, 174, 134, -281, 101, -48, -451, 384, -91, 107, 284, 84, 198, -220, -254, -139, -34, -48, -109, -8, -52, 141, 175, 114, -83, 69, -101, 29, -8, -94, 57, -178, 144, -97, 267, 128, 338, -214, -62, -35, -446, 173, -185, -72, 361, 92, -58, -253, -2, -262, 43, 64, -269, -67, -42, -17, -44, 55, 237, -36, -129, -73, 69, 235, 193, 219, 502, 98, -45, -260, -125, -8, 268, 171, 133, -288, 268, -12, -82, -257, -262, -173, -216, 151, -77, 34, -70, 438, 89, 108, 53, 355, -99, 32, 54, 232, 28, -133, -376]
6668c76M49k21R9L42m11O2o7L50j55k69N91k84ok30K28j08p2Q5l4J65l56J64J64
6691A10O0k35l5MK3l05K85J82J50j37m68K34M29k67o2Q8j85K38L5j03k55M19l
6714B02j32P4R4j89l4L4Q5mJ35nk67L07n40K84l5pq2J40l0l44L61K42j25Mk04
6739c6J60j25l80J57J61M9k01K44k82M08j98J05l60M35j3k24l6o4L24k22L53k06
6761D9P4r7l9J91q7K26j94pJ34J35j69l59j56K02K07p3O2o4Q8l21J73L77j22k83
6785e3K7p5L24k04j59L62n50K27N03m77K2K24p6k74K69k8k74r7M8J49K12q3J55
6808A72j76l37L15N9J28l88K01j3J96M3K13m54k44K44j8M2j32K50o9l54N71k61
6830a2o6r6L27m84L58P4n7J67m95J36K83j88r5L38j91L9j06m8j70K26jk98M4L97
$$ y = [-376, 73, -148, -49, 293, -118, -56, -123, 227, 72, -197, 394, 110, 104, -126, 102, -6, -78, 7, -27, 138, -218, -54, 110, 170, -65, -100, -96, -73, -378, -93, 89, 239, 102, -366, -132, 297, 30, -32, 56, -129, 109, 144, 41, -214, 205, 202, 70, 144, 238, 49, 15, 49, 134, 130, 265, 260, -7, 300, -240, 44, 9, 2, -80, 60, 30, -314, 47, 289, 164, 168, -36, 124, -1, -381, -224, -63, -14, -215, 29, -253, 155, -43, 62, -298, 137, 124, -100, -136, -200, 124, -98, 255, 49, 123, 26, -13, 178, 91, 317, 123, 116, 250, 385, 216, -143, -299, -97, 110, 37, 99, 35, 123, -198, -25, 352, 230, -53, -26, -101, 223, 19, -140, 222, -328, -101, 402, -75, -53, 171, 95, -179, 90, 62, -212, -309, -261, -112, 100, 17, 172, -4, -341, -26, 33, 161, -227, -26, -39, 157, 200, 413, -41, -285, -41, -59, -17, -149, 101, 32, -322, 249, -12, -78, -174, 153, -331, 27, 101, 44, 211, -284, -148, 135, -53, -148, 190, -1, 38, -68, -116, -286, -60, -61, -359, -315, 82]
6854H2j78o3M76l15O4k19j16K95n8k08L04K15l19R7n08J66K86J57j63J90l48K0
6876a43J59R0q0KK12l78M2J44J37k11j38R7q8L74k17q1Q3j01R4r5J05K13%l81
6900a61m0L50n8m21N51j59J4k81L6J67L5j54l08M52nkM39m08k55L0M36J16l89
6923a5l9M37k28k96K05K51l98M12k50O5kj99J3K20k95q7K47Qj7l68M69m85K17
6946a35K5J53n6K31j54J95L1j47m9r5J54j27k56K50Lk15J67K1j67J35K5K3J6P2
6970A00q5j83l1J81j9k02N81j56j11K85J05n31J16KQ6k12K34l4O4j25k25j60M70
6993A50r7m78N69k22J03o3J25l35p9K98L98m39J72J7n4p2n5l17L18J53N2l53L80
7016A71j94j15k7J84k83L99j44j65K85l16J8J41k15J38J3Jj43j11J39J09J78q3
$$ y = [82, -96, -159, 317, 2, 66, -153, -269, 26, -32, -240, 64, 279, -40, 57, -451, -285, 1, 158, -5, 185, -163, -143, 16, 106, 26, 28, 240, -138, -96, 48, 185, -26, -164, -67, -155, 219, 2, -79, 4, -97, -3, -98, 7, 220, 220, -161, -201, 149, 91, -330, 221, 62, 76, -205, -169, -2, 33, -121, -429, 23, 18, 16, 455, 47, -208, -178, 258, 374, -15, -54, 383, 155, -141, 64, 315, -83, 329, 79, 144, 142, -57, -44, 176, -119, -206, 41, 49, 32, -336, 133, -352, -135, -110, 43, -13, 218, 64, 259, 290, 143, 94, -1, 153, 26, -230, 20, 23, -192, -25, -4, -171, -36, -11, 12, 28, 100, 15, -168, -199, -18, -37, -239, 342, 186, 75, 360, 465, -66, 50, 52, 138, -74, 160, 126, 190, 65, -160, -320, 150, 53, -425, 144, -78, 25, -38, 87, -248, -327, -29, 369, -70, 102, 119, 65, -7, -62, -379, -61, 92, 144, -209, 171, -23, -138, -165, 19, -264, 135, -9, -174, 111, -205, -187, -46, -261, -123, -110, -109, -252, -363, -224, -115, 63, -20]
7038b0J30j4r8j14l1L22K84k07j71q1K24n00N78l86J29L90m19l45L67j41J42K4
7060F3R4j69J79jl52J0J39R0j42K47j72J3r3L83M0N3k73l38L09m29K48N40l82
7083E7j71J85kl91M65k0q8L1k07K47o2j49M36l62q0J20j61J48M55n77J88n1K0
7106C1Q0j52j47oL17j57m9K59n02K26J18J92j75l43N40l64O3L74j03k68j76M3
7128a99K18j90M04j58j48M52k18j40K51j98l65j54K41L50k29J24N7j16K27k94
7148h5J46j40J37MM8l95L00L05o09O00j63R7l69j74L82k39J96k20j76L36J17J15
7170B13q7n4K42m26O5J12r9j11M33k42m07Q5L6J89j72P02k27k96oK19m20L49L7
7193A35j44O2k6K68l79j17o9L59K14l43P3Q0q8l75N7J93K75n04L36l6J49l18L09
$$ y = [-20, 110, 96, -2, -116, -147, 175, 459, 252, 81, 0, 224, -276, 302, -84, 45, 435, 16, -329, 38, -103, 39, 63, 157, -12, 167, 166, -186, -176, -37, 53, -89, 158, -14, -1, -94, 289, 329, 382, 109, -229, 80, -349, -101, 439, 57, -114, 71, 69, -322, 143, 123, 35, 66, -141, 106, 44, -105, 331, -31, -111, 9, -152, -4, 451, -126, 62, 11, 31, 111, -41, -188, -194, 123, -34, -83, 176, -326, -100, 18, 210, 35, -308, 232, -132, -69, 305, 202, -66, -242, -199, 19, -171, 233, 75, -73, 379, 161, 21, 272, 74, -291, -445, -204, 146, -83, 41, 98, -18, 209, -85, 61, -79, 58, 62, 110, -285, 15, 320, -289, 311, 148, 245, -124, -298, 84, -155, 41, -179, -355, -19, 98, 213, 126, 72, 314, -112, -47, 65, -34, -145, 288, 46, -361, -276, -240, -51, -223, 479, 252, -44, -50, 169, -251, 98, 135, -9, 53, 27, 295, -84, -201, -270, 89, 303, -40, 33, 113, 25, -350, -293, -100, 175, -329, 7, -29, 120, -198, 111]
7216A11n4m5m3K9Q6k30K63o05M18l9K74j79K89k92K59p0k85m3J96k58J69L6Mk71
7240b80pk6j23M44rl7n8K1J32R5r9m42K83J79k48J31K30l07J84M2J19m0l52J75
7264GR6m8j83K28Mll7r6N1K35l34q9J82L27n28J93o4j28K69j77K4L55l04j2o1
7289i3J84k94J51J67k66J13J52N1jj15N4m6J05q1j04j87pm07O02J32OM6k60M0
7313e8j30K72k45N36j3l76l77L60j0O5j20L5j39Q9j1n6k36K99K17p3j97p3P09
7336D68l37j81K80j08j17J52j85J75r1R7N2L8j82p3N9j88K60Q8k75M40J50n67
7358d5J45l55L73K60k26p2N2j33R9Q4j72N0n8J46j72J88l29O9m5K61l18j20L84
7381F6k30K5J62P3r5J94j22p9L23j8l91M81j91l09oJ42j3j35Q1l4L9o9J18l59
$$ y = [111, 57, 12, -31, -2, 84, -146, 117, -488, -70, -109, 165, -14, 275, -17, 242, 172, -113, -156, 40, -218, -49, -13, -9, -280, -287, -313, -436, 8, -1, -38, -96, -75, 57, 152, 53, -389, -106, 73, -175, -44, 186, -121, 63, 105, 224, 184, -168, 7, 103, 55, -128, 100, 104, 101, 64, -32, 19, 254, -80, -169, 13, 340, -188, 5, -59, -187, 82, -95, -71, 284, -20, -32, -93, 91, -203, -52, 115, -151, -38, 114, 165, 164, 49, 103, 57, 162, 81, -23, -210, -217, -624, -22, 110, 116, 162, -98, -58, -188, 84, -161, 375, 362, -14, -391, -31, -41, 24, -96, -61, -200, -111, -122, -178, -414, -115, 102, 29, -168, -241, 468, 131, -50, 230, 122, 5, 157, -28, 147, 56, 153, 205, 243, 61, -12, 47, -141, 119, 207, -68, 372, 522, -45, 100, -255, 118, 378, 152, 80, 132, -1, 98, 182, 10, 60, 2, 148, -24, 164, -165, -96, -141, 120, -198, -318, 66, -164, -139, 23, 96, 1, 195, 73, -6, 317, 299, -92, 389, 198, -111, -117, 25, 12, -123, -42, -76, -37, -106, 12, -347]
7405c47J48K69J2l05N15j49l09N24L0m64j05j10M20j60p3R7PJ99j62J13l19K98
7427A29l43L16J28p9k75j78N97l93J03k07j33J94K17r7j97K93K23m62J62K43k26
7448A5j0K34r2j43J54k46M93n79L98j67j51j59L45n4l28M66l81K31oJ37P6l75
7470a42o6M50j11k0J40k93L01l46j69K96pR5j16J1J20m04O6N74k17l95j4L80k29
7493i6J44k02K80J98m33J08j76j56M46k51M12J39j25l63j08K19L22m45j73L79
7513A19J23k27J68m43J29P0L99k65k3j46QJ23K95l94R7K84k9q4L6J9l02L29j13
7536A73l54K21l83M84j78RJ2m09N45l53j54N57j41J3k78K87O6j83J13m4L6J54
7558A93j9j45l96M42N3n05L89j09K42J4l0j72j86L18L5m30J27j41L55k00j1L7
$$ y = [-347, -199, 70, 82, -223, 292, 143, -166, 358, 388, -76, -181, -291, 129, -31, -104, -7, 0, 199, 37, 150, -169, 129, -214, 102, 230, 151, -124, -302, 295, -98, 5, -202, -335, -141, 76, -21, -218, 75, 298, -164, -2, 241, 15, 5, 239, 147, 4, 158, -88, 405, -174, 224, 57, -94, -253, 92, 38, -290, 176, -205, 26, 20, 157, 233, -142, -208, 242, 131, 111, 251, -42, 259, -87, -256, 40, 33, 128, 12, 23, 143, -261, -195, 379, 162, -233, -247, 133, -96, 48, -154, 126, 324, -109, -1, -177, -333, 113, -138, 274, 413, 288, -75, -183, 36, 358, -87, -260, 119, 242, 15, 183, -260, -131, -61, 338, 73, 50, -96, -88, 35, 330, -64, 33, 317, 288, 204, 240, 259, -43, 286, 173, -181, 40, -343, 141, -37, -28, -16, -425, 120, -233, -387, 170, 29, 42, -236, 51, 117, -66, 47, 3, 39, 193, 174, 29, -367, 75, 128, -377, 12, -97, 145, 159, 129, -43, -229, 89, 124, -306, -179, -320, 35, -165, -176, -139]
7580a39J39J28Pl11M00k29k62M5L19j52K76k84J02J98n37O26q8j9k14K03m06K78
7602H0k96M82n9o38N32k2k11N55l84k56K3l8K80O7l15N87k70j87O9p3K74m94L63
7625F9l9J34j08o4K04P3l5m65J74j65K69m8PK0K93m42L30k93j48K28l27O08n94
7648c19N29l65O5j01K03M2j03j79M96n27N22J45n53P78p47k3O11m04j18jL33l07
7670b3J75k4q2qq8m6j97J98L21m74L46l16J57m7M1L2j5M6j43J14J17J04j83N0
7694E5j2k07K71q1j28M37j42J08k32k7l5L37l21j01k4J32l38K62q3q0k81J99L72
7717H1j10j9O5O0j31L30m45K04J56j10l56M82ok96k27K19l88M55K13k48QK82l31
7740a12K9L62n15M71k66P9m64N23j58O3K21p21N02k84J01K26p6Q46r87K2J48p0
$$ y = [-139, 0, 128, 135, -176, 224, -5, -267, -222, 97, -55, 221, -63, 39, 237, -300, 326, 238, 219, 5, 208, -198, 80, -216, 266, 207, -431, 101, 79, -132, 423, 39, -217, -194, -232, 48, 115, -200, 387, 117, -70, -1, -74, 200, -294, 69, 30, 164, 56, -8, 196, 269, 234, -231, -57, -222, 47, -1, 6, 26, 319, -123, 207, -86, -234, -6, -333, 275, -319, 210, -155, -90, -191, 12, 54, -49, -228, 268, -259, 263, 408, -145, 633, -114, -137, 474, 70, -48, -49, 284, -23, 152, 128, 46, 38, -50, -96, -293, -95, 226, -248, 98, -218, -61, -108, -67, -35, -50, -4, -147, -33, 84, 188, 5, 55, 43, -164, 107, 26, -102, 335, 193, 301, 69, 42, 7, 344, 23, -78, -102, 30, -308, -46, -129, -209, -490, -291, 81, -29, -48, 17, 77, -54, 276, -169, 35, 191, 81, -275, 207, 201, -95, -322, -103, -491, -36, 177, -71, -63, 219, -112, -83, 279, -236, 235, -31, 48, -416, 107, -51, 12, 233, -488, 14, -270, -169, 57, -19, 827, -160, -138, 10, -60]
7762f0nP9Po6k56p3L91J00K46m43j01L45l47J75k76L28m2k3K33J38l02k02K08
7785E4n9m01N1N62m74K42l85N81k22k10J23N6J90k22J82M6LL1m30M22k56p7N40
7808C47m53K31k15k31M2K77J62J95o37L00k70P80j92o24K64L15K14o81J26m3J75
7829H2j54N47o65N2N67l10K13K5j55k18O8l50J09N15k54j10p9K46OL1k7k62M87
7852C64l89l17L78Q5J03j74q8m0J11K5j72L78l8m61L62j08N8J8k6J02%k97J18
7875hK14l26M7K27j50j0M5q8r5K60N7k1m9k9Q1k16m9lK26J5p5l09N42l31N1N1
7901E7j88M59p8j72lK03l57P4n9l63K48J00nj02O67n64pJ14R2L4J74m22k2K94
7925A74k09N3k51K67j42J04J08j9q6N0k69M6p9J11R4k13J17L81n50M86j74K80
$$ y = [-60, -65, 14, 21, -45, -301, -374, 17, 117, 363, -80, -181, 164, -183, -8, -284, 44, 2, -21, 212, 350, 48, -154, 54, -5, -406, -355, 207, -267, -25, -410, 171, -51, -261, -138, -82, 108, -114, 68, 114, 117, 148, -282, 140, -116, -193, 347, -106, 125, -90, -321, -279, -2, 160, 355, -282, 18, -252, 528, 336, -288, -24, 291, 505, -176, -50, -93, 82, -72, 475, -190, -138, 429, 119, 332, 357, 202, -16, 52, -298, -189, 326, 72, -38, -117, 129, 135, 166, 139, -123, 364, -25, -342, 36, 121, 224, 50, -38, -78, 33, 58, -114, 264, 226, -235, 127, 19, 77, 95, 69, 171, 171, -126, -8, 206, -120, -73, 154, 4, -6, 39, -49, -144, 116, 173, 152, 103, 74, 155, -61, -110, -113, 113, 128, 53, -256, 286, -45, 6, 57, -131, 328, 250, 78, 75, 278, -79, -5, -64, -427, -179, -79, -84, -186, 481, -83, -90, 24, 116, 150, 324, -98, -120, 174, -35, 18, -233, 34, -108, -4, 104, 85, -1, 49, -220, -174, -253, -142, -48, -261, -144, 237, -313, 173, -1, 279]
7947B79n00J36L55j4N1m11k0j86N1L17m9K13r0n2L37o05K8J87l2l33K35J75m06
7970c34M81l1k78K20L15m53K3J26j55m4K69l8m3j47J32J38j79Mk5L1K00J14%l55
7994b9j51M40J12n12L71j87j4l05M70J27m19J29n2o0J10K6J49k07p0P7k11L14
8016A08k77P4N4J70K76k24k35RL9P3j69M12o22M12j06p1K08k70J73J58j9j80j10
8039a17J64P1j31J66j79n0K17J98n38L57K01l29J16k07N7k20L95K36p22K68K98
8060B51m76J11K09m24L90J58l8m48M21l85K87N2n7k33M04q3r5j67R5k00J34J2
8082h2L24q2j86p6J94J43j49J8m49M12k33K06j21j44J84K73k31K63k29q6K6j39
8104a64K84n9N62p21K76j32Ko9p8M05l36M8j24R0j02K30P5q2K2l54K30n6rJ73
$$ y = [279, -221, -85, 270, 256, 307, -104, -124, -310, -259, 58, 9, 222, 132, 80, 417, -188, -160, 27, -5, -338, -103, 72, -334, 147, 116, -162, 58, 373, -80, -57, 69, -86, -130, 139, 101, 58, -89, 43, 181, 2, 6, -19, 12, 212, 326, 326, -29, -180, 260, 372, -140, 231, 44, 30, -275, 195, 322, -97, 32, -20, -80, 30, 56, 205, -2, -72, 5, -206, 108, -169, -95, -41, 129, 405, 181, -54, -45, -6, 67, -102, 310, -312, 100, -6, -77, 131, -139, 34, 192, 173, -7, -117, 47, 118, -13, 153, -26, -76, 141, 339, -199, 158, 359, 30, 146, -61, -4, -224, 171, 407, -315, -47, 251, -225, -114, 95, -329, 61, 219, 181, -267, 154, -231, 56, 108, 51, -182, 222, 139, 44, -123, -28, -228, -94, -82, 242, 160, -26, -102, 92, 235, 86, 104, -345, 67, -166, 40, -81, -225, -41, 232, 1, 264, 35, -51, -25, -164, 120, 61, 623, -98, 178, 46, 48, -21, -99, 306, -30, 18, -106, -16, -118, 112, 187, 105, 127, -227, 3, -53, -62, 111]
8128A11o4J94k57o5J07m5j74L18j15J14l54K26k8k75M98k76r6J66j67L30k96j79
8150c27K70K72l62k08O10J38q9lk88K58k03j26N1k52M5P04k88k54p2J8N0k2N4
8173b4P2j32L45l61K4J20o3l12O09l20j77K0J51J52J39J1k13L09
$$ y = [111, 47, 241, -16, -81, 26, -19, -193, 125, 10, 124, -230, -4, -32, -307, 191, -85, -181, -15, -182, 148, -148, -327, -57, 215, -147, -355, 255, 393, 304, 301, 13, 271, 68, -58, -7, -259, -214, 490, 202, -52, -124, -106, -56, -78, -24, 48, -84, 261, -100, -76, 44, -19, -331, 278, -42, -219, -199, -48, 104, 243, 254, 41, 350]
8191C50
$$ Imaginary data points
##PAGE= N=2
##DATA TABLE= (X++(I..I)), XYDATA
0@%%%%%%%%%%%%%L2o4O4o4O5r7J28j30J62j96K28k88L51l92M34n19O06o74P71
32D17q94J009j130J271j431J601j785J998k229K475k746L043l366L714m101M526
48B372m986N495o053O666p344Q104q957R912j0995J2240j3685J5376j7401J9884
62A0628k2990K7012l2464M0303n2601P4779j27071M61022L47975j057254j61280
73d91941P73522M05613q12979o17615N41811Q20309l20978q36210P5226Q84338
83D21096J14407q64781m09081P35870N81085n11507o56924M10740Q17994j18644
93E20255q40854j38548P33278K86181p09850m98578N66984O73459l49875p22188
103d79736J56050P33933N502p64559k63099O59135M49803m91890n28242M09351
$$ y = [0, 0, 0, 0, 0, 0, 0, 0, 0, 0, 0, 0, 0, 0, 32, -32, 32, -32, 33, -64, 64, -66, 96, -100, 128, -160, 191, -201, 233, -286, 320, -354, 417, -477, 532, -598, 673, -758, 843, -942, 1056, -1173, 1302, -1444, 1599, -1767, 1947, -2154, 2372, -2614, 2881, -3172, 3494, -3850, 4254, -4703, 5209, -5786, 6454, -7231, 8145, -9256, 10628, -12362, 14650, -17814, 22489, -30112, 44667, -82404, 378618, 726593, -330661, -491941, 281581, 687194, -125785, -743400, -201589, 618720, 297742, -538468, -463242, 421096, 535503, -329278, -738359, -2489, 578596, 67089, -589835, -179095, 638899, 520255, -320599, -459147, 274131, 560312, -149538, -648116, -81132, 592327, 242452, -479736, -323686, 410247, 415749, -348810, -611909, 47226, 497029, 5139, -523103, -113752]
113a13752O85078j99163p38398k4881O78522J63639o46299l35791N64129N19891
123E52975l82320o07078K04583O33539p6006p00309j46476O47471L31346n14773
133e7048m13708M39426N53312k74168o36473O1120O14508Q6763n94856k37435
143d58559N55622M14780m19553n16381K64032N46656j50084o08306l6431N90402
153A82178K23408m85314l22266M19977M48036l04198n51569J25459N53607R506
163B98824n38081j36650N13591K96876m08598m09210K69620M55461j67873n20189
173c46229K0565N35956J47562m61777k40659M05495L44942l19060m47110J66344
183a93971M71416l5439m69191q0281M65397K21822m02330l38124K90189L87400
$$ y = [-113752, 571326, 372163, -366235, -391116, 287406, 451045, -195254, -531045, 33084, 552975, 170655, -436423, -231840, 401699, 325693, -374616, -521092, 126379, 457725, -57048, -470756, -31330, 521982, 247814, -388659, -327539, 286969, 373732, -221124, -458559, 97063, 511843, 92290, -424091, -160059, 386597, 236513, -371793, -408224, 182178, 405586, -79728, -401994, 17983, 466019, 161821, -389748, -264289, 289318, 298824, -239257, -375907, 137684, 434560, 25962, -383248, -113628, 341833, 173960, -346229, -325664, 210292, 357854, -103923, -344582, 60913, 405855, 86795, -360315, -193971, 277445, 242006, -227185, -307466, 157931, 379753, -22577, -360701, -70512, 316888]
193C16888k04109m44426Q3892M73317P0356m22386j71625L77348K71443l13583
203C7115l73612J98747M19510q4435m25245j3453M27505J31590l86320k47896
213c16494K92554L07971k15791l71247J17933M15919J1925l96969j07859L65235
223A03177J93707l18076k84386K28534L41130j21613l57460L2025L72817P3478
233B63333l57829j82468K94480K46987k35387l04868J58435L51427n0762l51696
243a68348m6523L29635J30456l00653k21748K37569K91465j51501l21109P5559
253a45198L43372J5103l39593j14006K93981J87939k38648k50504J73889L06560
263B32895q2730l28400p053L20270Q4341l04473j66782K55637K35249j81137k75322
$$ y = [316888, 112779, -331647, -247755, 225562, 295918, -126468, -298093, 79255, 350698, 37115, -336497, -137750, 281760, 197325, -227920, -241373, 186132, 317722, -68598, -316494, -23940, 284031, 68240, -303007, -185074, 230845, 242770, -154199, -262058, 103177, 296884, -21192, -305578, -77044, 264086, 142473, -214987, -182962, 189855, 263333, -94496, -276964, 17516, 264503, 29116, -275752, -117317, 234110, 183348, -168348, -214871, 114764, 245220, -55433, -277181, -39612, 251853, 100352, -220757, -145198, 198174, 213277, -126316, -240322, 53659, 241598, 2950, -247554, -73665, 232895, 150165, -178235, -185288, 134982, 219323, -85150, -251932, 3705, 238954, 57817, -217505]
274b17505J05194L03943k1184l13957p1698K90727J49120k49000k08815J97876
284c5299K64172j21525k89795L8062K90114L8284k78848j18463K44795J88675
294B20172j89567k38013J27677K68164o0069k85309j9118K71810R1118k38977
304e2112j51934J97559K10285j35116k48036O5959K64770K840k64720p0279K45214
315F4430J35553k03004j86609J48578K22588q8320k48801J4815K51683N4020k37860
326g2927j16567K10063J71450j63961k13093J05590K37145m0218k44139k6835
336a53492K37326R6571k09374j53929J68278J99979j17334k32149N5418K43747
346A35041Q717k37254p2689K12427J31053j75343j80168J22161K14788o4865k33068
$$ y = [-217505, -112311, 191632, 170448, -143509, -215207, 75520, 224640, -24360, -233175, -35299, 228873, 107348, -182447, -144385, 145729, 184013, -94835, -213298, 31497, 220172, 30605, -207408, -79731, 188433, 128364, -156945, -176063, 95747, 186865, -52112, -204046, -6487, 203798, 68682, -179354, -113395, 151375, 154215, -110505, -180784, 64430, 199983, -3021, -189630, -41052, 181536, 93216, -155585, -140770, 110913, 164933, -72927, -189494, 20569, 192019, 28058, -185035, -79445, 157700, 117482, -126657, -153492, 83834, 180405, -28969, -182898, -14620, 185359, 68025, -164124, -108706, 135041, 143758, -93496, -166185, 46242, 177295, 1952, -178216, -56055, 158733, 93868, -139200]
357a39200L573K35294N8675k16490j13364J82914J61522j34635j96303P8023K18380
368A38389j5730k22750m5914K11454J01659j85027j50690J43059J84363r2186
378F6627k06570L3122K11907K6645k02813q4469J80124J34753j44132j73578R9898
389e8486K00291m6620k09149q207K04189O4388j82876j15249J49315J57470j06470
400D8596j88292N4432K03526j999k04499n2217J88539R9610j58704j41085J16822
411c5271J72825o7805j90599J4468J97001L9390j86398q8075J64759J30719j28349
422B2665j62117Q3702J81865l2677j89283k0942J80712P2360j62160j17955J30345
433a3485J52452r1344j75341M3632J84315N118j79270n3511J61381R9951j31262
$$ y = [-139200, -135627, 99667, 158342, -58148, -171512, 11402, 172924, 38289, -158014, -79991, 138389, 122659, -100091, -146005, 65449, 167108, -17919, -168609, -25550, 158813, 66627, -139943, -106821, 105086, 131731, -71082, -155551, 24573, 159326, 15194, -158384, -58486, 141805, 95185, -113964, -122171, 82018, 146406, -36470, -151719, -2404, 155066, 48596, -139696, -85264, 118262, 116263, -88236, -140453, 48086, 147696, -11008, -152093, -35271, 137554, 69749, -120850, -106382, 90619, 130009, -56389, -144464, 20295, 151014, 22665, -139452, -55750, 126115, 93438, -95845, -116787, 63925, 136285, -25875, -143830, -13485, 138967, 47623, -127718, -84086, 100229, 105347, -73923, -127434, 33947, 133898, 2636]
444B636j35488R4535J63683n0097j78091L432J78698M2482j64909q5403J39338
455A0816J22519j03909j51498N8863J66898j3208j73471l4927J65458P9191j43386
466a6654j15879J13181J43518p2760j61564K6901J67427K1787j59951o5768J45000
477B5238J06655j16541j38188P8733J56625l8715j66140o225J61754N1659j44396
488b9541r2421J17589J24203q4600j50111M3228J61409J9j58701l8929J48313
499D0458P8716j22657j11519Q8136J34076n0916j48045J0054J53761L3113j43876
510c8699p0271J23743R9496r9324j26443O1248J40749k0878j42920j8122J39274
521D7853N8664j24835r4613R8325J19063o8131j34348L4829J44725P343j37444
$$ y = [2636, -132852, -38317, 125366, 75269, -102822, -99390, 79308, 121790, -43119, -128522, 10816, 133335, 29426, -122072, -63209, 103689, 90481, -82990, -117917, 47541, 126732, -16654, -132533, -19352, 124166, 51406, -110158, -83257, 84170, 105957, -53994, -119762, 25238, 131893, 15352, -122836, -44103, 112522, 73807, -92333, -98558, 63196, 114855, -29541, -121962, -4373, 119830, 35230, -114881, -71653, 89756, 89775, -68926, -107855, 40458, 119174, -3483, -115002, -26866, 107210, 56294, -91751, -81697, 72064, 105177, -38699, -108970, 14773, 114269, 14945, -111498, -50250, 90499, 69621, -73299, -91421, 47853, 106517, -18318, -112931, -14606, 104457, 36326, -98022, -63193, 81532, 88875, -48569]
532d8569m5404J21880P7763j03380j09552P2673J30805l7269j38626L313J39885
543F3519L2151j32726o9428J07189R6738p9180j17275M8604J36359q527j37403
554e9979k9001J29040N9567j15592q9942R0093J14304n3660j23970K0571J28483
565F9914J4927j28283n4990J10331Q3072q8944j04315O4764J23309l0056j27901
576f8172p626J20209L7837j09938p0309R2498J00405o0466j13453L2825J21681
587G5491k788j26253l3044J11659O1840r0638q3647P0460J05299l9464j19086
598g0171L208J15994K3517j12603n2591J01567Q2263p3852r7058M6548J07898
609G4720j9168j16620j6880J10663N0581r5092p0647Q0485R4478n6502j10847
$$ y = [-48569, -93973, 27907, 105670, 2290, -107262, -34589, 96216, 58947, -79679, -76366, 63519, 95670, -37056, -106484, 705, 97443, 18263, -99012, -50408, 85951, 77424, -59979, -88980, 40060, 99627, -15965, -105907, -15814, 98490, 44830, -79140, -58569, 69914, 84841, -43442, -98432, 11899, 94971, 6027, -98288, -33524, 89785, 59729, -68172, -75798, 44411, 82248, -27690, -97999, -5501, 94904, 34438, -79015, -46190, 75491, 72703, -53550, -86594, 25065, 86905, -3733, -87380, -16920, 88379, 48915, -70171, -66963, 49031, 72548, -40055, -92646, 8921, 91184, 17332, -79726, -33178, 74720, 55552, -61068, -77948, 32715, 83296, -11796, -82443, -1958, 92520, 36018, -74829]
620g4829K2137J09312M182j07863l3402J01064O6217p9265q7013N4546R9628l4078
632D0636j12029K325J12123L0089r7166m9994Q4999P4977o3685r7147L2057J02366
644E9551o032j04192j8931J04465M9407q8059p1201O3572Q2015m4881r7698J5155
656e6829J02597J8462r3512l9732Q6726O2469p3316q5846M6780R4229k1262r5173
668e4407q33R8742L3009q7143n9845O6943P4743n3403r1873K9096J01642J491
680E8162r5585k3992Q7840M5009p8024p1551N3263Q5709k8074r0328R156R8825
692E0410K0168r3270m6501P6031O0863o1059p7513M0400R1696r150r0631j5269
704e3825Q5605L4786q1659o1864O2267P6851l9355q1638K1562Q9172N235q7775
$$ y = [-74829, -52692, 56620, 60802, -47061, -80463, 20601, 86818, 7553, -79460, -24914, 74714, 40636, -71393, -69068, 43055, 73144, -24022, -74016, 10983, 85960, 22275, -74872, -42815, 59551, 53519, -50673, -69604, 34861, 84268, -3791, -74992, -11420, 70595, 25714, -71984, -56829, 45768, 64230, -29282, -69014, 17712, 80181, 6865, -78981, -32201, 62028, 40766, -54407, -55240, 43502, 76511, -10632, -70477, -3534, 71209, 17806, -74067, -44971, 56671, 58162, -37423, -61415, 26425, 71434, -6590, -78141, -24878, 60831, 32757, -57571, -48415, 50410, 70578, -22692, -69193, 6838, 67701, 6642, -70871, -30471, 61225, 52075, -38556, -53825, 31780, 66566, -15093, -76957, -14690, 62161, 22806, -58832, -37270, 51902, 57137, -30638]
716c0638l3121P3317N0676o0727o7486M7100Q5296k0288q6689j788Q2539J9154
728E7345q0265m4772O4423O3851m2526p2739K5887Q2679m718q7910k2401P7611
740A6465L8899o6585n3648N5121P2245l0096p8070P346P7489J1349p9456l5228
752f4169P1476N6561n2987o5986L8224P5178j9598q2547r246P5829K8640o7321
764a5946m5549N8719O5986l9022p6774J7808P6710r11p8079k0113P2817M3880
776E9526n5462n5475M0806O7516k4824p8456q2P6722J9384o9849l4608O2592N3140
789F0930m6767o5878K3728O8403p177p2174j3456P1689L6950n8982m9587M6828
801e493O0150l3096p0235J0970P1155R669o3907k6136O0376M4758m9050o0786
$$ y = [-30638, -63759, 9558, 60234, -493, -67979, -20879, 64417, 44129, -42560, -44348, 38191, 57345, -22920, -67692, -3269, 60582, 18056, -54683, -28796, 53883, 49165, -38745, -61146, 16465, 55364, -11221, -64869, -9748, 62497, 32401, -45669, -38323, 39166, 50515, -28941, -64169, 7307, 63868, 10881, -55105, -16881, 58297, 38699, -43848, -53094, 22735, 51375, -15946, -61495, -2776, 63210, 24188, -52586, -34778, 41932, 41021, -37058, -57171, 15646, 59526, 4064, -51411, -10605, 56911, 32087, -46369, -46451, 30271, 49655, -20194, -54802, 7790, 60930, 14163, -51715, -27987, 40416, 33239, -38935, -52391, 19298, 56248, -2734, -52321, -5493, 54657, 21561, -48674, -37704, 33451, 43120, -20787, -46923, 13453, 58211, 9161, -51625]
813e1625L0207O5282j5896p0249j114O9858K3249o0475l8717M8437N0476l5911
825A3522o4101J7733O9199L198o6710j5829O3820L3188n4426m9031L7473N5933
837D3969k1794o2071N389O6402J4745o2220l1698N2728M2594m3952n5472K7779
849b3601O2409q525o0830p097N9709K4860n3843m1930M1261N2239k7827n8467
861d1642J4628O4221L183o0622k0418N1908L2954m4489m7121L0777N6540j3436
873B6483o0241n83O0478J5293n7503l1763M6941M3326l2976n0742K0285N8310
885C7308k131n8956j4796N4226K8395m8734m1247L8398N1195k3037n4851P028
897b7202N5879P168n4661k5304M7441L7931l6532m7631K6277N5138j1459n6742
$$ y = [-51625, -21418, 43864, 27968, -42281, -43395, 26463, 49712, -10763, -49480, -1043, 49433, 13522, -50579, -32846, 36353, 39551, -27159, -42988, 20832, 54020, -406, -49437, -11964, 43969, 22175, -39896, -34507, 31895, 46640, -15580, -47278, 5450, 48044, 4092, -51380, -23601, 38808, 30283, -30547, -37644, 22065, 46925, -6918, -48848, -7587, 44652, 16825, -41642, -27014, 37207, 40390, -20232, -40650, 11258, 44212, -277, -47398, -16621, 39919, 26483, -33758, -34341, 26137, 41430, -16073, -47836, -895, 42431, 9455, -41287, -21002, 37308, 35177, -23779, -38575, 15651, 44046, -4688, -45935, -7537, 43658, 20621, -34230, -27202, 28677, 35845, -18816, -44120, 3321, 41252, 4720, -42911, -16634, 38504, 27045, -29697]
909b9697m561N3452J8623m7537l1122L8768M3887k5025n0791J1631N3791J183
921C2602n4749j5864M8369K8386l9768l7554K8788M5471j6099n0019L72N0290
933B0225J2530m7571k4412M2524L6232l1617m2983J9710M7039o358m8915p598
945c1194M5847K2010m0087l2906L2597M1426k2907m7913R709M8111K647m6581
957a9241j5332M2302K7570l3451l7743K3399M4801j1649m8529j38M8525J3103
969C3617m3737k3963L6735L3600k6681m1254J3683M5270r95m7029j1436M4729
981A2539K2434l8718l2346K9524L8384j8119m2976N514M4465P623m1499j9052
993c2227L7164K9977k9303l7728J9481M2780q409m3904l352M1638J4966l6722
$$ y = [-29697, -34258, 19194, 37817, -9720, -40842, -2074, 41813, 16788, -34003, -22372, 31419, 32602, -22147, -38011, 10358, 38744, -1024, -38578, -9790, 35681, 19582, -30437, -30065, 20225, 32755, -14816, -39228, 3296, 39528, 7911, -35072, -15362, 31677, 25319, -23596, -31194, 14653, 36663, -3424, -36330, -3733, 37693, 14786, -33127, -23418, 24693, 27340, -19241, -34573, 7729, 35299, 1848, -35895, -12496, 32305, 20656, -27873, -28011, 20514, 33617, -10120, -34083, 2652, 36252, 9571, -31683, -18000, 27270, 26275, -20754, -32190, 12539, 34973, -3745, -36091, -6567, 31817, 13698, -29278, -23764, 20701, 28324, -13175, -32227, 4937, 34914, 5611, -32117, -12636, 30144, 21735, -22169, -25521, 16117, 31083, -5639]
1005e639k6138K8429L4565k0084m0784R354M3296J390m2001j2462L8515K1906
1017C0347l1311k9709K2379L5923j1216l9449P58M0631J0719l8415k0509L3592
1029C740K7935k5831l3930J5204L7464m661l9008p281L7126J7230l2794k6276
1041c1082K6305L3207j7794l7256Q330L9073J974l6408j2226L2779K2490k6471
1053B921l0453J8853L5347r072l8961m56L8748R445l5557j8769K8338K6470k0726
1066F128l2145J0466L5701k58l7058q560L5052J8330l0453k5212K3667L0806j4113
1079A2351l3830M227L5239N768l3573j6027K9816K4205k4226l0861J6277L3802
1091B3168p210l5300k613L3444J2321k9433k1441K4149K8694j6391l3473Q507
$$ y = [-5639, -31777, -3348, 31217, 11133, -29651, -20297, 22999, 24389, -17612, -30074, 8441, 30347, -964, -30673, -8294, 27629, 16413, -23036, -22278, 18353, 29072, -9343, -29852, 3740, 31675, 5844, -28086, -12882, 24582, 19921, -19087, -26368, 10758, 27988, -4806, -31082, -4777, 28430, 10636, -26620, -18290, 20783, 22757, -13651, -25877, 6902, 29392, 2921, -27532, -8679, 26668, 17596, -21365, -21821, 16927, 26372, -9185, -27954, 384, 26854, 6128, -26017, -15551, 20150, 19892, -17166, -25726, 9326, 27656, -2797, -28009, -4342, 26464, 12351, -21479, -17252, 17987, 23755, -9818, -25845, 3971, 28176, 3950, -26911, -10634, 23168, 15958, -19342, -21955, 11489, 23810, -5623, -27064, -2915, 25779, 9388, -24085, -15578]
1103a5578L5372J215l4526r489L1374J7836k5257k5158J8037K9977r528l3237
1115a8962q26L3929Q801l2228j6892K7820K3201k0904k8216J2162L0622k387l1202
1128a5082o569L0454J5528k6144k2551K0957K7665j3628l0234N366L1098K968
1140A9828k9856j0943K5283J9098k1007k5841J3866K9403p125l0882o27L0699
1152A1896Q850k7813j5609K2292K2027j5196k6952Q171L0029M93k9988p793K8418
1165H825J4514k4656k0959J7984K5077j0961k7654K175K8884O023k7804j4160
1177b2712K4040K0495j9765k5246J3636K8438n036k8484k860K7510J1028k4062
1189c018j8472J8813K4341j2352k7820N639K9498J731k8855r444K4537J4999j9677
$$ y = [-15578, 19794, 21009, -13517, -23006, 8368, 26204, 947, -24211, -6174, 23803, 14275, -18962, -19788, 14141, 22942, -9286, -26178, 1642, 24843, 3939, -24277, -12115, 18507, 16120, -15082, -21651, 8803, 24331, -1813, -24364, -3407, 24258, 10630, -19604, -14238, 16860, 19828, -10028, -20971, 4312, 23410, 2403, -23438, -9572, 19831, 12706, -18176, -18803, 11896, 20746, -7067, -22676, -384, 21643, 6447, -20505, -12334, 17695, 18188, -11800, -19593, 8825, 23339, -1317, -22276, -4292, 20785, 9824, -17830, -15655, 13229, 19252, -8552, -22712, 1328, 21823, 2058, -23188, -9552, 18886, 13850, -14634, -17494, 10016, 21044, -3018, -21490, -2677, 21664, 9312, -18508, -12869, 16629, 18360, -10495, -19939, 4598, 19597, -80]
1202h0k1480J3599K6055o057k7567j362K7802Q066k5784j4892K1659K0553j4788
1215E724k3008Q233K5582q19k5757p410K3604J3472k0635j9247J6409K3293r950
1228I491k5334K593K4828L061k3477j0817K0907J7016j5070k1367J1027K4459
1240A7317m461k5851k324K4544P539k0681j3644J7638J8924j1191k2789M624K3696
1253A3341M76k5156p159K3293J2813j8806j6423J3591K0033q101k2596P90K3344
1266I440N721k1485j1093K0052J7125j4847k0878Q926K2195m058k2746l130K1947
1279G169R875j8297j5279J4027J9356j0321k3308M049K3559J478k1100p007J9754
1292C955J3307j5381j8036R483K0549l821k2193j409K3155P809k0470j2369J6625
$$ y = [-80, -21560, -7961, 18094, 12037, -15530, -16892, 10910, 18976, -6808, -21700, -41, 20512, 5724, -17284, -9051, 16531, 15712, -10045, -17455, 6149, 19621, -1014, -20261, -3852, 19441, 9491, -15843, -13250, 11578, 14639, -8838, -19655, 1252, 18268, 3198, -18169, -7142, 17317, 12856, -12995, -15319, 9225, 16764, -3917, -17561, 77, 19001, 7810, -14979, -10355, 13341, 13817, -11339, -18498, 4795, 17608, -1198, -17621, -4030, 16003, 7902, -14694, -13904, 9440, 15161, -6324, -17417, 2635, 19760, 4913, -15965, -7039, 15156, 11098, -11648, -14778, 7169, 17044, -1253, -16532, -2505, 16851, 6530, -16778, -12729, 10830, 12308, -8792, -15799, 3955, 17262, 1881, -16155, -6672, 13877, 10056, -12137, -13546, 9609, 17418, -3052, -15421, 1204]
1305A204J5551j2705j9712N781K0905P44k0340o130J9592J1704j7346j6588J2730
1318d610J8352p789j9850L364K0650M253j8397r915J5785J4046j2915j8143P642
1331g527K0834k913j9920j882J9299O230j6926j2666J2354J5110p701j7665L744
1344i629K0318J656j9346o310J7033J0018j4834j3534J0515J7029m611j7171J46
1357h720J7772N057j8334j0309J4918J3505j2253j5179P600J8397l302j7997l103
1370a1948J6160P755j5042j2086J2052J6617p272j7668M073J8161M92j7885o449
1383a3040J5986J0536j2203j3752Q702J7133l931j8991j925J7798N269j7004r222
1396a4644J4131J3507r087j5262M545J6488j74j7310n351J6139J0027j2975j2008
$$ y = [1204, 16755, 4050, -15662, -9881, 11024, 11768, -8572, -14702, 4890, 16594, -752, -17340, -4610, 13742, 5953, -13897, -10533, 10117, 14370, -4027, -13942, 1843, 15889, 2974, -15169, -7527, 13307, 10394, -9526, -11408, 7891, 14121, -2805, -15471, -3117, 11993, 4292, -13373, -9629, 10689, 12345, -7001, -13311, 3722, 13740, -1094, -14628, -4113, 12916, 8305, -8866, -8720, 9052, 14109, -4225, -14534, 384, 13889, 1636, -13543, -5943, 12454, 9152, -8845, -11948, 4212, 11967, -3075, -15161, -3109, 13508, 6236, -11432, -7359, 10802, 11294, -6591, -13040, 2946, 13482, 1279, -12473, -3771, 13362, 9431, -9560, -11485, 6313, 11582, -5422, -14644, -513, 12994, 3907, -11355, -6810, 9678, 9504, -7806, -13157, 2982, 13009, 34, -11974]
1409a1974J0547J4960o349j6475P52J5790L071j4824q172J3555J2235j0200j4787
1422a1871O106J5793k616j6926k269J5542O860j2221r665J0489J2967o496j5289
1435i596J853J6322J037j5506m693J4503Q795j1647j1427P141J3023m432j4850
1448i477o22J5256M988j3786p990J2325J1130r969j3469N664J4363j494j3760
1461f841k307J3851P549j1827j0798Q853J2966o869j4691K995J5176J286j4208
1474d865n006J1823Q548r739j2365N886J4458k310j5068o31J5220N115j3493q193
1488a0620J0461J0435o856j2789L576J4067J082j3888m587J2633P788j2013j0955
1501a1666Q571J2178m277j3137R14J2864L608j2391p344J0126J0269p957j2293
$$ y = [-11974, -1427, 13533, 7184, -9291, -8539, 7251, 10322, -4502, -12674, 881, 13116, 2916, -11871, -5765, 10028, 7412, -9514, -11783, 3759, 10619, -1602, -11267, -778, 12189, 5693, -9596, -7743, 8579, 9616, -5890, -10583, 3920, 12715, 1068, -10359, -3218, 9805, 5373, -9477, -10099, 5157, 10145, -3641, -11631, 694, 11824, 1855, -11614, -5950, 8413, 6919, -6841, -9148, 4703, 12252, 425, -10373, -1520, 11446, 4577, -10114, -7119, 8057, 9343, -4865, -9871, 1952, 10500, 761, -11604, -5718, 8740, 6430, -8638, -9269, 5951, 11066, -2427, -10620, -159, 10276, 3420, -9369, -5793, 8274, 9356, -4532, -9119, 3514, 11302, -711, -11666, -3095, 9083, 4806, -8331, -7417, 5447, 9055, -3336, -10680, -554, 9715, 1758, -10535]
1514a0535N541J4476j862j3263j985J2245N372j0725q841P550J1389m188j3065
1527g891J797J3099J093j2919n313J1373P316q799r332N728J1896j990j2661j045
1541g648J2169M581j1856o751R635R672p069j0239L601J1379j58j1790l759J0495
1555B262O360r226q981P017J1368m895j1921J356J1817J706j1047m923R961P602
1569H456o867r436M361J1812j721j2296j838J2293L961j0361o588Q074Q508m917
1583C441j0810J618J1145J113j1414m213J0794O973r143q554O361J0112l278j0811
1597f666M08J0623L283r139o515Q887Q853o937j0559L920J0821j601j0684k021
1611g327J0034M622p862p765N801R672l809j0700J312J1035J579j0039m036R172
$$ y = [-10535, -4994, 9482, 7620, -5643, -7628, 4617, 9989, -736, -9577, -2027, 9362, 5174, -7891, -6094, 7005, 8098, -4821, -10134, 1239, 8555, -244, -9576, -3848, 8048, 6058, -6603, -7648, 4521, 9102, -2754, -9505, 130, 9802, 2733, -7506, -3905, 7474, 7316, -4474, -8233, 2262, 8622, -604, -9585, -2568, 8800, 3905, -8016, -6660, 5157, 6863, -4184, -9107, 854, 8456, 1589, -7847, -3486, 8326, 6605, -5691, -7529, 4764, 8725, -1636, -8224, -150, 8358, 3441, -7369, -5751, 5394, 6507, -4907, -9120, 1674, 8647, -496, -9050, -2689, 7423, 4145, -6666, -6258, 4365, 7648, -1491, -8006, 881, 9734, 2797, -7762, -3842, 6979, 5378, -5306, -7327, 2707, 7329, -533, -8298, -2497, 7175, 3366, -7334, -6022, 5013, 6592, -3447, -7483, 1689]
1625A689O284o662p922L883R517j452r872j494J0119L698r319o362P801P341n196
1640B053q914K425R119M32r127k941Q706N269p053p525N752Q645l562q748Q12
1655d657R428J628q252m255O787O510n017q357K673R505j197r978r37Q538L591
$$ y = [1689, 7973, 1311, -6611, -2728, 6789, 5337, -4535, -6029, 4090, 7788, -1531, -7893, -92, 7249, 2053, -6861, -4436, 4683, 5115, -4012, -6953, 1753, 7022, -31, -7556, -1804, 6841, 3279, -5469, -4657, 4771, 6399, -1853, -6108, 679, 7189, 2172, -6185, -3512, 5993, 4796, -5182, -6119, 2419, 6010]
$$ [...]
8191A97
##END NTUPLES=NMR FID
##END=
