##TITLE=1H ikalashn
AMBC 1311
14.11.2024
##JCAMPDX= 6.0         $$ Bruker NMR JCAMP-DX V2.0
##DATA TYPE= NMR FID
##DATA CLASS= NTUPLES
##ORIGIN= UXNMR, Bruker Analytische Messtechnik GmbH
##OWNER= root
$$ TOPSPIN		Version 1.3
$$ 2024-11-14 14:17:48.765 +0400  Irina@DPX200
$$ Compression mode = diff/dup
##.OBSERVE FREQUENCY= 200.131300845
##.OBSERVE NUCLEUS= ^1H
##.DELAY= (6, 6)
##.ACQUISITION MODE= SIMULTANEOUS
##.ACQUISITION SCHEME= undefined
##.AVERAGES= 16
##.DIGITISER RES= 18
##SPECTROMETER/DATA SYSTEM= spect
##.PULSE SEQUENCE= zg
##.SOLVENT NAME= CDCl3
##.SHIFT REFERENCE= INTERNAL, CDCl3, 1, 17.49637
##AUDIT TRAIL= $$ (NUMBER, WHEN, WHO, WHERE, WHAT)
$$ ##TITLE= Audit trail, TOPSPIN		Version 1.3
$$ ##JCAMPDX= 5.01
$$ ##ORIGIN= Bruker BioSpin GmbH
$$ ##OWNER= Irina
$$ $$ F:/spectra/data/iren/nmr/1H/4/audita.txt
$$ ##AUDIT TRAIL=  $$ (NUMBER, WHEN, WHO, WHERE, VERSION, WHAT)
(   1,<2024-11-14 14:17:36.937 +0400>,<Irina>,<DPX200>,<TOPSPIN 1.3>,
      <created by zg
	started at 2024-11-14 14:16:29.078 +0400,
	POWCHK disabled, PULCHK disabled
       terminated by command 'halt'
       configuration hash MD5:
       BE 6D 3F 07 2A EA 11 49 91 17 2B D3 AF B3 58 0D
       data hash MD5: 16K
       48 77 D1 F6 CB A5 69 FC DE 62 5A 65 51 6F 01 95>)
$$ ##END=
$$ 
$$ $$ hash MD5
$$ $$ 4E F8 55 AA 80 86 03 85 D1 C8 B7 F3 0F 05 82 E5
##$RELAX= 
##$RELAX= 
##$RELAX= 
##$RELAX= 
##$RELAX= 
##$RELAX= 
##$RELAX= 
##$RELAX= 
##$RELAX= 
$$ Bruker specific parameters
$$ --------------------------
##$DU= <F:/spectra>
##$EXPNO= 4
##$NAME= <1H>
##$PROCNO= 1
##$TYPE= <nmr>
##$USER= <iren>
##$AMP= (0..31)
100 100 100 100 100 100 100 100 100 100 100 100 100 100 100 100 100 100 
100 100 100 100 100 100 100 100 100 100 100 100 100 100 
##$ANAVPT= -1
##$AQSEQ= 0
##$AQ_mod= 1
##$AUNM= <au_zg>
##$AUTOPOS= <>
##$BF1= 200.13
##$BF2= 200.13
##$BF3= 200.13
##$BF4= 200.13
##$BF5= 200.13
##$BF6= 200.13
##$BF7= 200.13
##$BF8= 200.13
##$BYTORDA= 1
##$CFDGTYP= 0
##$CFRGTYP= 5
##$CHEMSTR= <none>
##$CNST= (0..63)
1 1 145 1 1 1 1 1 1 1 1 1 1 1 1 1 1 1 1 1 1 1 1 1 1 1 1 1 1 1 1 1 1 1 
1 1 1 1 1 1 1 1 1 1 1 1 1 1 1 1 1 1 1 1 1 1 1 1 1 1 1 1 1 1 
##$CPDPRG= <>
##$CPDPRG1= <>
##$CPDPRG2= <>
##$CPDPRG3= <>
##$CPDPRG4= <mlev>
##$CPDPRG5= <mlev>
##$CPDPRG6= <mlev>
##$CPDPRG7= <mlev>
##$CPDPRG8= <mlev>
##$CPDPRGB= <>
##$CPDPRGT= <>
##$D= (0..63)
0 2 0 0 0 0 0 0 0 0.06 0 0.03 0 0 0 0 0.0002 0 0 0 0 0 0 0 0 0 0 0 0 0 
0 0 0 0 0 0 0 0 0 0 0 0 0 0 0 0 0 0 0 0 0 0 0 0 0 0 0 0 0 0 0 0 0 0 
##$DATE= 1731579453
##$DBL= (0..7)
120 120 120 120 120 120 120 120 
##$DBP= (0..7)
150 150 150 150 150 150 150 150 
##$DBP07= 0
##$DBPNAM0= <>
##$DBPNAM1= <>
##$DBPNAM2= <>
##$DBPNAM3= <>
##$DBPNAM4= <>
##$DBPNAM5= <>
##$DBPNAM6= <>
##$DBPNAM7= <>
##$DBPOAL= (0..7)
0.5 0.5 0.5 0.5 0.5 0.5 0.5 0.5 
##$DBPOFFS= (0..7)
0 0 0 0 0 0 0 0 
##$DE= 6
##$DECBNUC= <off>
##$DECIM= 32
##$DECNUC= <off>
##$DECSTAT= 4
##$DIGMOD= 1
##$DIGTYP= 9
##$DL= (0..7)
0 120 120 120 120 120 120 120 
##$DP= (0..7)
$$ [...]
##$SW= 21.9926040160658
##$SWIBOX= (0..15)
0 0 2 0 0 0 0 0 0 0 0 0 0 0 0 0 
##$SW_h= 4401.40845070422
##$TD= 16384
##$TD0= 1
##$TE= 300
##$TE2= 300
##$TE3= 300
##$TEG= 300
##$TL= (0..7)
0 120 120 120 120 120 120 120 
##$TP= (0..7)
150 150 150 150 150 150 150 150 
##$TP07= 0
##$TPNAME0= <>
##$TPNAME1= <>
##$TPNAME2= <>
##$TPNAME3= <>
##$TPNAME4= <>
##$TPNAME5= <>
##$TPNAME6= <>
##$TPNAME7= <>
##$TPOAL= (0..7)
0.5 0.5 0.5 0.5 0.5 0.5 0.5 0.5 
##$TPOFFS= (0..7)
0 0 0 0 0 0 0 0 
##$TUNHIN= 0
##$TUNHOUT= 0
##$TUNXOUT= 0
##$USERA1= <user>
##$USERA2= <user>
##$USERA3= <user>
##$USERA4= <user>
##$USERA5= <user>
##$V9= 5
##$VALIST= <valist>
##$VCLIST= <CCCCCCCCCCCCCCC>
##$VD= 0
##$VDLIST= <DDDDDDDDDDDDDDD>
##$VPLIST= <PPPPPPPPPPPPPPP>
##$VTLIST= <TTTTTTTTTTTTTTT>
##$WBST= 1024
##$WBSW= 25
##$XGAIN= (0..3)
0 0 0 0 
##$XL= 0
##$YL= 0
##$YMAX_a= 411198
##$YMIN_a= -331342
##$ZGOPTNS= <>
##$ZL1= 120
##$ZL2= 120
##$ZL3= 120
##$ZL4= 120
##$ABSF1= 10
##$ABSF2= 0
##$ABSG= 5
##$ABSL= 3
##$ALPHA= 0
##$AQORDER= 0
##$ASSFAC= 0
##$ASSFACI= 0
##$ASSFACX= 0
##$ASSWID= 0
##$AUNMP= <proc_1d>
##$AXLEFT= 0
##$AXRIGHT= 0
##$AXTYPE= 0
##$AXUNIT= <>
##$AZFE= 0.1
##$AZFW= 0.1
##$BCFW= 1
##$BC_mod= 2
##$BYTORDP= 1
##$COROFFS= 0
##$CY= 7568.61572265625
##$DATMOD= 1
##$DC= 2
##$DFILT= <>
##$DTYPP= 0
##$F1P= 17.9538593292236
##$F2P= -4.03888763876832
##$FCOR= 0.5
##$FTSIZE= 32768
##$FT_mod= 4
##$GAMMA= 1
##$GB= 1
##$INTBC= 1
##$INTSCL= 1
##$ISEN= 128
##$LB= 0.05
##$LEV0= 0
##$LPBIN= 0
##$MAXI= 945.577
##$MC2= 0
##$MEAN= 0
##$ME_mod= 0
##$MI= -402.1523
##$NCOEF= 0
##$NC_proc= 0
##$NLEV= 6
##$NOISF1= 8.587773
##$NOISF2= 6.764455
##$NSP= 1
##$NTH_PI= 0
##$NZP= 0
##$OFFSET= 17.49637
##$PC= 1
##$PHC0= 114.6047
##$PHC1= 13.76591
##$PH_mod= 0
##$PKNL= yes
##$PPARMOD= 0
##$PPDIAG= 0
##$PPIPTYP= 0
##$PPMPNUM= 100
##$PPRESOL= 1
##$PSCAL= 0
##$PSIGN= 0
##$REVERSE= no
##$SF= 200.13
##$SI= 32768
##$SIGF1= 18.5376
##$SIGF2= -6.396296
##$SINO= 400
##$SIOLD= 32768
##$SREGLST= <1H.CDCl3>
##$SSB= 3
##$STSI= 0
##$STSR= 0
##$SW_p= 4401.40845070422
##$SYMM= 0
##$S_DEV= 0
##$TDeff= 0
##$TDoff= 0
##$TI= <>
##$TILT= no
##$TM1= 0
##$TM2= 0
##$TOPLEV= 0
##$USERP1= <user>
##$USERP2= <user>
##$USERP3= <user>
##$USERP4= <user>
##$USERP5= <user>
##$WDW= 1
##$XDIM= 8192
##$YMAX_p= 0
##$YMIN_p= 0
$$ End of Bruker specific parameters
$$ ---------------------------------
##NTUPLES= NMR FID
##VAR_NAME=  TIME,          FID/REAL,        FID/IMAG
##SYMBOL=    X,             R,               I
##VAR_TYPE=  INDEPENDENT,   DEPENDENT,       DEPENDENT
##VAR_FORM=  AFFN,          ASDF,            ASDF
##VAR_DIM=   8192,          8192,            8192
##UNITS=     SECONDS,       ARBITRARY UNITS, ARBITRARY UNITS
##FACTOR=    0.0002272,     1,               1
##FIRST=     0,             0,               0
##LAST=      1.8609952,     -186,            4
##MIN=       0,             -331342,         -331342
##MAX=       1.8609952,     411198,          411198
$$ Real data points
##PAGE= N=1
##DATA TABLE= (X++(R..R)), XYDATA
$$ [...]
$$ plain form
2034 1521 2523 2176 113 -1411 -2509 -1661 -40 1818 2294 1522 -85 -1880 -2371 -1545 -48 1391
2050 1391 2233 1365 -693 -2232 -2187 -1076 357 1976 2156 1186 -310 -1511 -2211 -1103 1291 2596 2046
2067 2046 498 -832 -1842 -2037 -979 533 2157 2295 483 -1633 -2647 -1489 -457 795 1818
2082 1818 1710 777 -950 -2176 -1902 -124 1934 2296 1339 85 -1100 -1903 -1286 3 1421 2378 1493
2099 1493 -434 -2000 -2258 -1196 -327 1479 2153 1120 -512 -1795 -1943 -1276 648 2069 1963 770
2115 770 -598 -1542 -1954 -470 774 1833 1982 1096 -745 -2415 -1822 -422 970 1352 1422 376 -1185
2132 -1185 -1833 -2154 -524 1135 2135 1508 -115 -1030 -1642 -1134 -187 1222 1893 1803 136 -1487 -2002 -919
2150 -919 546 1578 1690 1291 -204 -1640 -2350 -1292 -13 1748 1683 413 -558 -1573 -1833 -1286 425
$$ packed form
2034A521J002l47k063j524j098Q48J621J858M76p72j607j795m91Q26J497J439
2050A391Q42q68k058j539M5J111J433J619J80r70j496j201p00J108K394J305n50
2067B046j548j330j010j95J058J512J624J38j812k116j014J158J032J252J023
2082A818j08r33j727j226K74J778K058L62r57j254j185q03O17J289J418R57q85
2099A493j927j566k58J062Q69J806O74j033j632j283j48O67J924J421j06j193
2115G70j368r44m12J484J244J059J49q86j841j670N93J400J392L82P0j046j561
2132a185o48l21J630J659J000o27j623r15o12N08R47J409O71r0j667j623n15J083
2150i19J465J032J12l99j495j436p10J058J279J761o5j270r71j015k60N47J711
$$ plain form
2167 425 1715 1919 903 -592 -2064 -1524 -65 932 1581 1909 782 -866 -1968 -1507 -627 991 1852
2184 1852 1327 122 -1260 -1716 -1566 -255 1017 1732 1621 275 -1183 -1840 -832 434 1362 1658 1415
2201 1415 135 -1262 -1663 -1045 132 1346 2055 861 -838 -1439 -1731 -1242 82 1241 1550 1033 -317
2218 -317 -1892 -1772 -330 713 1500 1489 1011 -440 -1326 -1510 -634 1082 1927 1787 297 -987 -1133 -1231
2236 -1231 -495 724 1463 1357 168 -1093 -1922 -1513 -34 1272 1446 1008 313 -1129 -1367 -1129 544
2253 544 1223 2078 1118 -248 -1447 -1244 -677 43 1134 1620 727 -490 -1529 -2127 -1143 520 1307 1134
2271 1134 595 -466 -1372 -1526 -542 454 1639 1836 689 -1077 -1326 -945 -276 646 1592 1471 447 -635
2289 -635 -1631 -1462 -355 904 1262 648 -71 -914 -1466 -1190 18 1047 1647 1351 -257 -1304 -1026 -627
$$ packed form
2167D25J290K04j016j495j472N40J459R97O49L28j127j648j102M61Q80J618Q61
2184A852n25j205j382m56J50J311J272P15j11j346j458o57J008J266R28K96k43
2201A415j280j397m01O18J177J214P09j194j699o01k92M89J324J159L09n17j350
2218c17j575J20J442J043P87j1m78j451q86j84Q76J716Q45j40j490j284j46r8
2236a231P36J219P39j06j189j261q29M09J479J306J74m38o95j442k38K38J673
2253E44O79Q55r60j366j199K03N67P20J091M86q93j217j039n98R84J663P87j73
2271A134n39j061r06j54R84R96J185J97j147j766k49L81O69R22R46j21j024j082
2289f35r96J69J107J259L58o14p19q43n52K76J208J029O00k96j608j047K78L99
$$ plain form
2307 -627 124 1111 1542 1195 43 -1196 -1575 -987 619 1451 1319 477 -68 -1320 -1714 -1017 216 1106
2325 1106 1299 675 -813 -1581 -1214 -276 286 1151 1474 607 -815 -1148 -1178 -224 867 1409 938 291 -604
2344 -604 -1121 -1113 -466 702 1520 1071 -55 -1623 -1665 -971 -39 720 1115 1080 -94 -1228 -1469 -734 388
2363 388 1652 1337 832 -279 -897 -1368 -761 441 1198 1281 807 -766 -1567 -1219 -456 151 710 935 455
2382 455 -315 -1198 -1216 -220 870 1450 1052 63 -369 -780 -992 -224 921 1431 970 514 -874 -1370 -889
2401 -889 182 529 753 745 -61 -1114 -1206 -1167 -96 1137 1235 488 -291 -794 -955 -483 247 1130 1346 855
2421 855 -208 -1085 -1219 -227 455 775 1127 668 -605 -1434 -1261 -553 149 1117 1199 -159 -609 -709 -846
2440 -846 -484 512 1301 1384 171 -500 -1136 -947 102 1004 1038 812 -21 -848 -1041 -1103 -210 714 1397 639
$$ packed form
2307f27P51R87M31l47j152j239l79N88J606Q32j32q42n45j252l94O97J233Q90
2325A106J93o24j488p68L67R38N62Q65L23q67j422l33l0R54J091N42m71o47q95
2344f04n17QO47J168Q18m49j126j568m2O94R32P59L95l5j174j134k41P35J122
2363C88J264l15n05j111o18m71O07J202P57Q3m74j573q01L48P63O07N59K25m80
2382D55p70q83j8R96J090N80l98r89m32m11k12P68J145N10m61m56j388m96M81
2401h89J071L47K24qq06j053r2L9J071J233R8p47p79n03j61M72P30Q83K16m91
2421H55j063q77j34R92O82L20L52m59j273q29J73P08P02R68Q2j358m50j00j37
2440h46L62R96P89Q3j213o71o36J89J049R02L4k26q33q27j93o2Q93R24O83p58
$$ plain form
2460 639 -314 -877 -994 -676 -119 985 1195 1019 -236 -894 -974 -293 591 1023 853 747 -55 -938 -1011 -628
2480 -628 315 1224 1094 268 -414 -789 -972 -620 218 1266 860 176 -561 -1083 -790 34 987 790 712 314
2500 314 -432 -1058 -702 160 886 891 864 -52 -1032 -966 -666 -186 424 1258 488 -234 -907 -1406 -642 112 857
2521 857 504 274 -33 -610 -1032 -361 495 1082 1204 538 -624 -754 -490 -175 253 633 855 176 -636 -967
2541 -967 -1090 -309 696 814 439 18 -222 -827 -1023 -289 669 1252 877 -131 -606 -957 -442 -101 622
2560 622 1199 899 -118 -662 -851 -511 -16 881 839 200 -157 -731 -1053 -705 175 664 833 313 -816 -869
2580 -869 -619 -191 438 858 1238 410 -180 -694 -921 -438 484 913 461 -2 -590 -1164 -1112 -272 654 1029
2600 1029 847 264 -748 -982 -523 154 372 675 785 406 -641 -724 -627 315 640 928 263 -226 -614 -837
$$ packed form
2460F39r53n63j17L18N57J104K10j76j255o58q0O81Q84M32j70j06q02q83p3L83
2480f28R43R09j30q26o82l75j83L52Q38J048m06o84p37n22K93Q24R53j97p8l98
2500C14p46o26L56Q62P26Nk7r16r80O6L00M80O10Q34p70p22o73m99P64P54P45
2521H57l53k30l07n77m22O71Q56N87J22o66j162j30K64L15M28L80K22o79q12l31
2541i67j23P81J005J18l75m21k40o05j96P34R58N83l75j008m75l51N15L41P23
2560F22N77l00j017n44j89L40M95Q97m2o39l57n74l22L48Q80M89J69n20j129n3
2580h69K50M28O29M20L80q28n90n14k27M83R22M29m52m63n88n74N2Q40R26L75
2600A029j82n83j012k34M59O77K18L03J10l79j047q3R7R42L25K88o65m89l88k23
$$ plain form
2620 -837 -714 -148 799 750 379 -79 -850 -880 -87 343 438 771 701 -309 -760 -644 -376 530 1029 815 211
2641 211 -178 -670 -771 -255 448 829 739 352 -437 -1164 -767 6 632 429 569 27 -732 -834 -345 110
2661 110 593 1003 893 -150 -543 -346 -532 104 698 846 353 -119 -931 -1156 -594 341 418 485 682 -191
2681 -191 -773 -1068 -353 26 616 760 172 -104 -437 -503 -264 283 506 1094 76 -182 -775 -815 -95 378
2701 378 573 492 274 -542 -1148 -591 -123 376 693 403 -82 -781 -568 -593 53 610 861 319 -52 -585 -733
2722 -733 -487 453 710 479 290 216 -582 -660 -515 66 391 595 135 -323 -556 -557 -393 -156 774 793 391 -325
2744 -325 -766 -455 -69 503 688 644 294 -167 -561 -630 -75 769 925 348 -119 -733 -783 -532 -101 187 622
2765 622 524 -291 -848 -496 -484 151 820 507 295 117 -361 -820 -453 -112 489 796 320 -254 -746 -539 -410
$$ packed form
2620h37J23N66R47m9l71m58p71l0P93M30R5L33p0j010m51J16K68R06M99k14o04
2641B11l89m92j01N16P03L81r0l87p89p27L97P73O26k03J40n42p59j02M89M55
2661A10M83M10j10j043l93J97j86O36N94J48m93m72q12k25N62R35P7O7J97q73
2681a91n82k95P15L79N90J44n88k76l33o6K39N47K23N88j018k58n93m0P20M73
2701C78J95q1k18q16o06N57M68M99L17k90m85o99K13k5O46N57K51n42l71n33j48
2722g33K46R40K57k31j89p4p98p8J45N81L25K04m60m58k33jJ64K37R30J9m02p16
2744c25m41L11L86N72J85m4l50m61l94o9N55Q44J56n77m67o14n0K51M31K88M35
2765F22r8q15n57L52J2O35O69l13k12j78m78m59L67L41O01L07m76n74m92K07J29
$$ plain form
2786 -410 -101 600 640 259 -530 -730 -788 -633 246 534 320 -254 -39 -531 -656 -237 515 684 556 75 -553
2807 -553 -337 -313 -312 91 473 682 -357 -516 -668 -695 -117 273 385 247 48 -384 -504 -675 150 531 668
2828 668 553 99 -432 -377 93 -38 499 638 207 -254 -365 -375 -55 230 564 378 27 -146 -806 -771 -342
2849 -342 418 601 532 -25 -214 -567 -368 15 249 788 555 22 -176 -507 -378 144 520 463 278 -223 -353
2870 -353 -648 -545 -185 526 468 512 -46 -432 -690 -149 123 289 497 509 63 -933 -642 -106 305 814 511
2891 511 87 -322 -292 -519 -519 308 504 569 146 -307 -500 -430 25 268 590 491 80 -159 -576 -307 161 557
2913 557 449 525 -112 -185 -425 -542 -349 596 969 286 -413 -584 -777 -331 50 426 367 268 -117 -539 -527 -254
2935 -254 131 571 531 281 -127 -246 -395 -167 257 572 552 190 -206 -515 -337 7 119 114 224 183 -251 -645
$$ packed form
2786d10L09P01M0l81p89k00n8J55Q79K88k14n74K15m92j25M19P52J69j28m81o28
2807e53K16K4JM03L82K09j039j59j52k7N78L90J12j38j99m32j20j71Q25L81J37
2828F68j15m54n31N5M70j31N37J39m31m61j11j0L20K85L34j86l51j73o60L5M29
2849c42P60J83o9n57j89l53J99L83K34N39k33n33j98l31J29N22L76n7j85n01j30
2870c53k95J03L60P11n8M4n58l86k58N41K72J66K08J2m46r96K91N36M11N09l03
2891E11m24m09L0k27%Q27J96O5m23m53j93P0M55K43L22r9m11k39m17K69M68L96
2913E57j08P6o37p3k40j17J93R45L73o83o99j71j93M46L81L76n9r9l85m22J2K73
2935b54L85M40m0k50m08j19j49K28M24L15k0l62l96l09J78L44J12nJ10m1m34l94
$$ plain form
2957 -645 -623 -79 -6 634 554 -139 -268 -194 -151 -128 360 653 729 -57 -228 -450 -255 57 374 410 239 -207 -543
2980 -543 -669 -311 61 350 408 530 -279 -452 -224 -102 143 500 716 241 -132 -520 -351 -21 150 471
3000 471 344 378 -156 -304 -500 -41 222 456 173 -57 -429 -444 -504 -184 226 367 515 -93 -403 -359 -357 41
3022 41 423 580 389 -112 -140 -533 -301 94 260 460 198 119 -442 -541 -258 -111 155 367 71 -354 -698
3043 -698 -370 -190 186 431 309 160 74 -382 -425 -200 490 520 626 -106 -239 -250 -405 -198 -58 292 467
3064 467 -77 -607 -565 -608 -109 221 336 -35 168 41 -329 -549 -217 464 560 489 84 -381 -71 -200 97
3085 97 393 324 232 -150 -464 -254 -254 30 -173 186 136 -122 -287 -342 -177 115 591 566 360 -327 -142 -118 -25
3108 -25 117 173 475 217 -86 -450 -227 -17 377 209 337 -179 -409 -239 -254 -163 24 426 355 -69 -228 -125
$$ packed form
2957f45K2N44P3O40q0o93j29P4M3K3M88K93P6p86j71k22J95L12L17L6j71m46l36
2980e43j26L58L72K89N8J22q09j73K28J22K45L57K16m75l73l88J69L30J71L21
3000D71j27L4n34j48j96M59K63K34k83k30l72j5o0L20M10J41J48o08l10M4KL98
3022D1L82J57j91n01k8l93K32L95J66K00k62p9n61r9K83J47K66K12k96m25l44
3043f98L28J80L76K45j22j49q6m56m3K25O90L0J06p32j33j1j55K07J40L50J75
3064D67n44n30M2m3M99L30J15l71K03j27l70k20L32O81R6p1m05m65L10j29K97
3085I7K96o9r2l82l14K10%K84k03L59n0k58j65n5J65K92M76k5k06o87J85K4R3
3108b5J42N6L02k58l03l64K23K10L94j68J28n16k30J70j5R1J87M02p1m24j59J03
$$ plain form
3130 -125 -108 267 348 320 756 299 -354 -165 -254 147 192 106 3 -231 -345 -536 -228 60 489 324 241 -172
3152 -172 -709 -387 14 259 244 368 301 -65 -518 -196 -25 353 273 336 -5 -127 -324 -416 -183 190 357 128
3174 128 -91 -288 -497 -263 -54 34 212 67 40 -137 -385 -137 192 219 508 341 25 -429 -110 -169 -103 331
3196 331 379 59 -271 -258 -96 -59 44 128 -59 58 61 15 -137 -124 307 390 293 -98 21 -86 -199 -151 520 276
3220 276 276 14 -194 -168 -302 -133 139 297 182 152 -216 -441 -478 174 144 198 91 -27 -385 -287 -74 39 393
3243 393 641 317 -117 -39 -302 -208 122 41 316 220 262 -234 -488 -128 269 271 48 134 -327 -314 -57 108 -80
3266 -80 251 405 62 -202 8 -273 259 293 443 99 -59 -4 -295 -343 -68 415 463 -17 -333 -288 -321 -1
3288 -1 -172 163 427 220 -179 -419 -298 23 -9 155 278 110 22 -31 -374 -37 286 378 61 17 -349 -283 -273
$$ packed form
3130a25J7L75Q1k8M36m57o53J89q9M01M5q6j03k34j14j91L08K88M29j65q3m13
3152a72n37L22M01K45j5J24o7l66m53L22J71L78q0O3l41j22j97r2K33L73J67k29
3174A28k19j97k09K34K09Q8J78j45k7j77k48K48L29K7K89j67l16m54L19n9O6M34
3196C31M8l20l30J3J62L7J03Q4j87J17Lm6j52J3M31Q3r7l91J19j07j13M8O71k44
3220B76%k62k08K6j34J69K72J58j15l0l68k25l7O52l0N4j07j18l58R8K13J13L54
3243C93K48l24m34P8k63R4L30q1K75r6M2m96k54L60L97Kk23Q6m61J3K57J65j88
3266h0L31J54l43k64K10k81N32L4J50l44j58N5k91m8K75M83M8m80l16M5l3L20
3288aj71L35K64k07l99k40J21L21l2J64J23j68q8n3l43L37L23R2l17m4l66O6J0
$$ plain form
3311 -273 -362 138 240 192 31 -83 -478 -44 -32 -9 123 296 -64 6 -400 -111 -186 342 248 336 -66 -143 -177
3334 -177 -283 90 -7 97 263 327 -415 -271 -100 -97 327 277 105 -3 -49 76 -211 -4 568 371 -2 -191
3356 -191 -40 -136 46 76 151 147 273 -229 -431 -229 -47 33 327 73 -314 -153 -284 -259 60 362 279 115 -241
3379 -241 5 -69 -202 112 7 384 203 -147 -184 -211 -157 212 63 81 -91 -238 -207 -158 -197 188 318 247 38
3402 38 -316 -106 -51 8 157 255 275 58 -52 -229 -247 284 269 221 -20 57 -160 -429 -228 -200 53 174 252 -223
3426 -223 -228 -87 -129 26 174 531 52 23 -124 -729 -187 230 382 51 30 44 -328 -195 -170 -121 -86 101 227
3449 227 -294 -132 -450 -61 77 89 422 342 -196 -293 -90 31 8 90 298 50 -47 -387 -126 -6 189 227
3471 227 318 274 -134 -231 -129 -9 125 40 80 -35 -83 -290 -412 -2 171 331 420 -3 156 91 -43 -174 279
$$ packed form
3311b73q9N00J02m8j61j14l95M34J2K3J32J73l60P0m06K89p5N28r4Q8m02p7l4
3334a77j06L73r7J04J66O4p42J44J71LM24n0j72j08m6J25k87K07N72j97l73j89
3356a91J51r6J82L0P5mJ26n02k02K02J82Q0K94k54l87J61j31K5L19L02q3j64l56
3379b41K46p4j33L14j05L77j81l50l7k7N4L69j49J8j72j47L1M9l9L85J30p1k09
3402C8l54K10N5N9J49R8K0k17j10j77j8N31j5m8k41P7k17k69K01K8K53J21P8m75
3426b23nJ41m2J55J48L57m79k9j47o05N42M17J52l31k1J4l72J33K5M9L5J87J26
3449B27n21J62l18L89J38J2L33q0n38r7K03J21k3Q2K08k48r7l40K61J20J95L8
3471B27R1m4m08r7J02J20J34q5M0j15m8k07j22M10J73J60Q9m23J59o5j34j31M53
$$ plain form
3494 279 402 79 -309 -423 -109 -50 -86 135 132 131 14 -427 -447 -63 235 156 334 -169 24 -54 -51 -115 268 407
3518 407 491 183 51 -353 -131 -151 56 102 141 -7 -71 -299 -300 38 13 284 116 -190 -125 -274 280 126 193
3541 193 198 297 -228 -153 129 50 -82 137 -59 -100 -282 150 -326 -141 160 252 29 -142 83 -236 -13 -99 324
3564 324 84 361 31 -219 -240 -43 101 73 258 355 41 164 -186 -138 -179 176 148 -50 -228 -187 -186 -111 -68 151
3588 151 205 228 -8 -302 -197 174 151 101 46 160 -31 1 59 -184 357 279 403 50 71 64 60 -342 76 3 228
3613 228 256 -125 76 -108 18 86 263 37 22 -89 -199 -162 -165 169 444 109 -78 -11 -300 -9 11 50 254
3636 254 238 -30 -63 -175 -63 -90 55 136 242 103 -329 -128 151 -126 307 87 -52 -334 -51 66 93 298
3658 298 22 12 153 90 -265 -295 -311 -166 189 -83 235 185 -111 -107 35 11 -34 174 44 -60 60 -59 110
$$ packed form
3494B79J23l23l88j14L14N9l6K21ljj17m41k0L84K98p9J78n03J93p8Lo4L83J39
3518D07Q4l08j32m04K22k0K07M6L9j48o4k28jL38k5K71j68l06O5j49N54j54O7
3541A93NR9n25P5K82p9j32K19j96m1j82M32m76J85L01R2k23j71K25l19K23q6M23
3564C24k40K77l30k50k1J97J44k8J85R7l14J23l50M8m1L55k8j98j78M1JP5M3K19
3588A51N4K3k36k94J05L71k3n0n5J14j91L2N8k43N41p8J24l53K1pmm02M18p3K25
3613B28K8l81K01j84J26O8J77k26j5j11j10L7lL34K75l35j87O7k89K91K0L9K04
3636B54j6k68l3j12J12k7J45Q1J06j39m32K01K79k77M33k20j39k82K83J17K7K05
3658B98k76j0J41o3l55l0j6J45L55k72L18n0k96MJ42k4m5K08j30j04J20j19J69
$$ plain form
3681 110 48 261 147 -36 11 -105 -225 14 246 291 -32 -24 69 -211 -245 -172 54 198 -77 -197 -123 63 -60
3704 -60 -60 179 304 232 -184 -132 -160 46 197 -18 332 82 -180 -168 -65 -66 -61 -16 335 -150 -247 141 -376 -130
3728 -130 187 -85 269 55 -87 -112 51 -101 235 91 98 -144 62 -185 -116 -146 188 389 -73 -154 -328 -286
3750 -286 134 140 59 117 127 19 -100 -266 53 -3 380 257 209 179 60 -112 -2 -135 489 221 -142 -338 -216
3773 -216 22 115 -94 112 -42 -86 3 -195 -218 -218 6 -237 -96 -78 -65 -22 -10 62 138 137 74 31 -421 -194 -72
3798 -72 100 86 139 268 -60 112 -107 -145 55 134 -141 -211 -54 -233 -51 -90 187 22 183 241 -25 -168 -28
3821 -28 144 -9 133 59 -55 150 -175 -222 -233 148 176 -89 -51 -122 -258 -32 -12 97 294 17 37 -122 90
3844 90 19 61 -146 272 197 -32 -81 -172 -20 42 225 263 62 -44 -267 -29 36 -5 175 206 -167 117 -267 -200
$$ packed form
3681A10o2K13j14j83M7j16j20K39K32M5l23QR3k80l4P3K26J44k75j20P4J86j23
3704f0%K39J25p2m16N2k8K06J51k15L50k50k62J2J03jNM5L51m85r7L88n17K46
3728a30L17k72L54k14j42k5J63j52L36j44Pk42K06k47O9l0L34K01m62q1j74M2
3750b86M20Oq1N8J0j08j19j66L19n6L83j23m8l0j19j72J10j33O24k68l63j96J22
3773b16K38R3k09K06j54m4Q9j98k3%K24k43J41J8J3M3J2P2P6jo3m3m52K27J22
3798g2J72j4N3J29l28J72k19l8K00P9k75p0J57j79J82l9K77j65J61N8k66j43J40
3821b8J72j53J42p4j14K05l25m7j1L81K8k65L8p1j36K26K0J09J97k77K0j59K12
3844I0p1M2k07M18p5k29m9r1J52O2J83L8k01j06k23K38O5m1J80L1l73K84l84O7
$$ plain form
3868 -200 -171 50 123 37 98 11 -61 94 -11 178 255 261 183 -111 17 -123 -176 -188 126 91 126 -29 -124 61 -145
3893 -145 255 62 75 80 -63 -377 63 -59 283 490 -72 36 -35 86 104 42 -7 134 176 94 28 -93 -18 122
3917 122 40 -184 -259 18 -150 40 45 -156 349 305 77 158 -52 -278 110 43 243 -45 82 29 -294 -26 38
3940 38 81 -13 429 -72 -238 -19 -264 2 216 287 336 -139 -128 36 37 90 -112 232 -21 1 95 103 -290 -119
3964 -119 23 143 159 -67 -103 20 157 -8 217 137 222 -62 -109 -193 188 50 62 70 -112 58 -37 -8 -161 204
3988 204 139 103 49 -72 -136 -209 38 167 55 48 -82 -341 -170 -251 65 70 48 98 -72 46 -290 -213 -6 358
4012 358 26 167 62 -202 -186 -82 -98 -7 8 13 -222 -248 63 -67 93 -29 183 129 -301 92 -72 81 211
4035 211 148 20 -182 -19 81 82 -142 135 120 119 78 -268 -381 -243 -55 -73 151 227 -342 -94 -57 20 -205 131
$$ packed form
3868b00K9K21P3q6O1q7p2J55j05J89P7Op8k94J28j40n3j2L14l5L5j55r5J85k06
3893a45M00j93J3Nj43l14M40j22L42K07n62J08p1J21J8o2m9J41M2q2o6j21P5J40
3917A22q2k24p5K77j68J90Nk01N05m4k28Q1k10k26L88o7K00k88J27n3l23K68O4
3940C8M3r4M42n01j66K19k45K66K14P1M9m75J1J64JN3k02L44k53K2R4Ql93J71
3964a19J42J20J6k26l6J23J37j65K25q0Q5k84m7q4L81j38J2Qj82J70r5K9j53L65
3988B04o5l6n4j21o4p3K47J29j12pj30k59J71q1L16Nk2N0j70J18l36P7K07L64
4012C58l32J41j05k64J6J04j6R1J5Nk35k6L11j30J60j22K12n4m30L93j64J53J30
4035B11o3j28k02J63J00Jk24K77j5jm1l46j13J38J88j8K24P6n69K48L7P7k25L36
$$ plain form
4059 131 -121 -9 327 -133 98 -10 -46 83 217 31 -96 -11 -154 47 -95 -236 174 -3 -43 55 -168
4080 -168 -87 -217 271 37 -302 171 -149 -194 -20 170 167 231 25 86 -29 -33 222 221 -14 26 -26 12 -68 -19 -102
4105 -102 155 211 116 59 -37 68 -156 -30 44 149 93 -86 -87 -10 82 70 30 290 155 -181 113 17 -41 -269 84
4130 84 -155 -163 -3 92 62 7 55 134 -30 180 6 -32 -25 56 -35 -132 201 123 -169 95 -243 -92 5 217 304 -56
4156 -56 -66 -115 -62 17 -134 -156 -30 -116 -26 -146 -65 48 81 -162 -16 63 -29 192 196 -31 148 12 96 26 145
4181 145 -44 93 139 107 133 212 -102 -156 -39 -157 141 -17 -34 48 -43 105 -206 -146 -87 106 -105 20 -35 308
4205 308 -66 -29 122 20 211 -252 -89 -174 67 211 127 -374 -77 -189 -50 -57 -160 -11 -1 84 -140 -124 50
4228 50 77 -13 51 28 303 197 -107 76 226 -132 364 -122 0 -16 14 -99 49 -46 95 80 -89 -82 -110 34
$$ packed form
4059A31k52J12L36m60K31j08l6J29J34j86j27Q5j43K01j42j41M10j77m0R8k23
4080a68Q1j30M88k34l39M73l20m5J74J90lO4k06O1j15mK55jk35M0n2L8q0M9q3
4105a02K57N6r5n7r6J05k24J26P4J05n6j79jP7R2j2m0K60j35l36K94r6n8k28L53
4130H4k39qJ60R5l0n5M8P9j64K10j74l8PQ1r1r7L33p8k92K64l38J51R7K12Q7l60
4156e6j0m9N3P9j51k2J26q6R0j20Q1J13L3k43J46P9r2K21Mk27J79j36Q4p0J19
4181A45j89J37M6l2K6P9l14n4J17j18K98j58j7Q2r1J48l11O0N9J93k11J25n5L43
4205C08l74L7J51j02J91m63J63q5K41J44q4n01K97j12J39pj03J49J0Q5k24J6J74
4228E0K7r0O4k3K75j06l04J83J50l58M96m86J22j6L0j13J48r5J41j5j69Pk8J44
$$ plain form
4252 34 31 -173 13 142 54 66 47 2 73 29 10 46 72 -89 -151 -96 -136 -51 -37 -109 111 -82 -61 76 202 -22
4278 -22 25 84 -30 -90 76 -193 -216 -39 75 -134 -51 98 20 -47 -209 51 187 167 -58 -276 -161 -236 97
4301 97 -36 35 116 53 -204 -109 -44 -111 61 279 209 162 -171 -21 2 187 158 117 85 101 -7 -239 118 -148 104
4326 104 78 71 18 -55 -124 67 112 85 67 -66 209 238 -111 -32 -41 -51 121 -2 -62 -324 -45 -181 -47 105 158
4351 158 179 -185 -131 -83 -83 55 -104 61 -243 -48 49 153 114 131 71 71 228 42 97 -59 313 28 221 179
4375 179 70 9 -167 -35 -248 37 -91 -141 96 -74 268 155 77 135 283 175 194 147 53 144 301 161 13
4398 13 36 -182 -162 -127 -93 -58 77 141 27 -91 -63 -181 -98 -21 15 67 -147 83 -118 66 39 152 28 216
4422 216 -127 30 -10 -86 195 101 115 19 -3 105 131 -7 -107 -110 122 -65 40 -58 -97 -88 130 -112 249 -363
$$ packed form
4252C4lk04J86J29q8J2j9m5P1m4j9L6K6j61o2N5m0Q5J4p2K20j93K1J37J26k24
4278b2M7N9j14o0J66k69k3J77J14k09Q3J49p8o7j62K60J36k0k25k18J15p5L33
4301I7j33P1Q1o3k57R5O5o7J72K18p0m7l33J50K3J85k9m1l2J6j08k32L57k66K52
4326A04k6pn3p3o9J91M5k7j8j33K75K9l49P9rj0J72j23o0k62K79j36J34J52N3
4351A58K1l64N4M8%J38j59J65l04J95R7J04l9J7o0%J57j86N5j56L72k85J93m2
4375A79j09o1j76J32k13K85j28n0K37j70L42j13p8N8J48j08J9m7r4R1J57j40j48
4398A3K3k18K0L5L4L5J35O4j14j18K8j18Q3P7L6N2k14K30k01J84k7J13j24J88
4422B16l43J57m0p6K81r4J4r6k2J08K6j38j00lK32j87J05r8l9RK18k42L61o12
$$ plain form
4446 -363 30 197 -278 -83 44 198 -209 -212 52 33 169 -135 -135 193 -1 -80 40 -241 -238 -6 -23 28 -101
4469 -101 -21 -18 -273 41 132 295 84 128 -31 -55 12 -121 -18 108 106 211 -25 -9 -25 -28 -16 64 -67 98 109
4494 109 -23 -77 -266 1 -99 -264 186 -77 -209 -95 -50 18 208 187 -53 18 -62 87 75 -38 -130 31 2
4517 2 -132 53 32 173 162 -25 -22 -112 -175 68 97 297 -37 44 -6 -151 2 -92 -211 43 74 14 -111 -19 -23 -78
4543 -78 -2 -168 -75 105 7 42 36 186 -12 -138 47 88 30 16 -71 -128 -113 79 -123 18 119 236 -46 -196
4567 -196 60 -26 150 -46 100 169 -36 164 -21 -66 10 -96 38 -86 35 -2 -137 189 120 -69 75 156
4589 156 52 -220 31 -6 337 -9 41 -196 -39 -108 80 66 68 114 -284 136 137 -68 141 -9 195 145 -34
4612 -34 -47 -76 62 50 159 -36 45 17 -121 120 -14 -54 -59 4 187 -209 -323 -20 -217 -30 51 -100 -20 156
$$ packed form
4446c63L93J67m75J95J27J54m07lK64j9J36l04%L28j94p9J20k81LK32j7N1j29
4469a01Q0Lk55L14R1J63k11M4j59k4O7j33J03J26kJ05k36J6j6lJ2Q0j31J65J1
4494A09j32n4j89K67j00j65M50k63j32J14M5O8J90k1k40P1q0J49j2j13r2J61k9
4517Bj34J85k1J41j1j87Lr0o3K43K9K00l34Q1n0j45J53r4j19K54L1o0j25R2mn5
4543g8P6j66R3J80r8L5oJ50j98j26J85M1n8j4q7n7J5J92k02J41J01J17k82j50
4567a96K56q6J76j96J46O9k05K00j85m5P6j06J34j24J21l7j35L26o9j89J44Q1
4589A56j04k72K51l7L43l46N0k37J57o9J88j4KM6l98M20Jk05K09j50K04n0j79
4612c4j3k9J38j2J09j95Q1k8j38K41j34m0nO3J83l96j14L03j97J87Q1j51Q0J76
$$ plain form
4636 156 -193 92 57 114 -8 38 -6 20 112 -16 154 -218 -118 84 -39 -63 -220 -217 152 226 32 -53 -15 3
4660 3 32 92 -78 100 29 147 -25 16 -6 -52 235 -65 -149 269 35 -167 -56 74 82 82 -40 -199 145 -22
4684 -22 41 -209 168 -148 -177 -98 -24 26 30 -100 293 -25 -132 -53 122 -134 73 -77 -172 41 -78 -92 -10 194
4708 194 115 -47 204 139 -63 -79 -4 116 -150 -34 69 198 57 18 96 -269 7 142 137 -4 -44 -68 388
4731 388 -129 2 79 102 50 -170 37 -13 45 -8 -126 -22 51 -152 -331 -116 62 5 -37 -32 -15 -197 225 58
4755 58 -153 -93 70 73 15 -69 -33 127 -141 62 2 -95 131 -82 -26 -290 126 88 -223 -105 -134 -211 1 57 6
4780 6 -54 36 109 -167 124 -58 61 67 54 115 -62 253 -109 -100 37 -15 24 -108 145 170 51 -181 146 3 -4
4805 -4 61 -86 56 -46 -44 2 -216 106 50 -97 74 41 -167 -78 19 55 27 -344 203 -208 -61 -148 7 282
$$ packed form
4636A56l49K85l5N7j22M6m4K6R2j28J70l72J00K02j23k4j57LL69P4j94q5L8J8
4660CK9O0j70J78p1J18j72M1k2m6K87l00q4M18k34k02J11J30Q%j22j59L44j67
4684b2O3k50L77l16k9P9P4N0Mj30L93l18j07P9J75k56K07j50r5K13j19j4Q2K04
4708A94p9j62K51o5k02j6P5J20k66J16J03J29j41l9P8l65K76J35nj41m0k4M56
4731C88n17J31P7K3n2k20K07n0N8n3j18J04P3k03j79K15J78n7m2NJ7j82M22j67
4755E8k11O0J63Ln8q4L6J60k68K03o0r7K26k13N6k64M16l8l11J18k9p7K12N6n1
4780Fo0R0P3k76K91j82J19Oj3O1j77L15l62RJ37n2L9j32K53K5j19k32L27j43p
4805dO5j47J42j02KM6k18L22n6j47J71l3k08Q9R7L6k8l71N47m11J47q7J55K75
$$ plain form
4829 282 133 -177 -90 -58 10 -65 -4 283 32 -172 92 65 117 85 58 51 36 -132 -51 -134 -177 2 -81 143 142 127
4855 127 -61 4 34 -167 -56 232 145 -18 -256 -7 -2 -100 40 -64 9 -181 -5 28 183 -299 -57 235 -126
4878 -126 -142 37 -149 75 -60 80 -110 -104 -112 117 -153 -134 331 107 34 -104 -155 23 -95 20 101 206 208 61
4902 61 75 -256 173 -97 201 65 -126 -210 108 -92 -121 142 125 25 205 237 -41 15 -63 40 27 -45 28 86
4926 86 -107 -130 -21 -109 -208 -53 -244 77 -19 -114 60 7 160 -162 -34 145 215 -17 304 111 -54 -150 33
4949 33 -74 17 -157 54 35 234 99 -65 60 47 18 84 -4 171 116 145 137 -48 48 36 -91 44 -111 112
4973 112 68 -29 65 119 -168 -287 185 -30 -28 27 157 -84 -22 113 62 -62 -80 -143 156 -123 112 231 33 -58
4997 -58 59 -96 -216 198 -67 197 14 229 -71 1 161 -63 26 121 -25 -140 128 -70 -75 178 120 -51
$$ packed form
4829B82j49l10Q7L2O8p5O1K87k51k04K64k7N2l2k7pj5j68Q1q3m3J79q3K24jj5
4855A27j88O5L0k01J11K88q7j63k38K49Nr8J40j04P3j90J76L3J55m82K42K92l61
4878a26j6J79j86K24j35J40j90OqK29k70J9M65k24p3j38n1J78j18J15Q1J05Kj47
4902F1J4l31M29k70K98j36j91q4L18k00k9K63j7j00J80L2k78N6p8J03j3p2P3N8
4926H6j93k3J09q8r9J55j91L21r6r5J74n3J53l22J28J79P0k32L21j93j65r6J83
4949C3j07R1j74K11j9J99j35j64J25j3k9O6q8J75n5K9qj85R6j2j27J35j55K23
4973A12m4r7R4N4k87j19M72k15KN5J30k41O2J35n1j24j8o3K99k79K35J19j98r1
4997e8J17j55j20M14k65K64j83K15l00P2J60k24Q9R5j46j15K68j98nK53n8j71
$$ plain form
5019 -51 167 102 -12 65 162 120 -101 -123 138 95 -7 56 -140 133 -102 78 -233 -111 -381 61 -327 149 174
5042 174 3 291 -66 360 -89 139 -382 6 -2 -73 166 -55 100 -202 19 73 21 -140 -152 32 42 29 -59
5065 -59 -152 -134 -98 -44 128 -85 12 81 97 -54 -274 -53 -24 42 42 250 -52 -23 -120 -61 374 -371 44 -176 -208
5090 -208 87 -29 4 -167 59 -5 -37 34 128 100 57 -79 153 -53 45 24 -62 -112 -52 51 -134 79 -70 -31
5114 -31 -15 -92 -103 6 -27 177 -69 -184 -54 -105 2 -76 -113 -44 -17 127 -54 -53 -52 -4 58 -30 37 -131 47 70
5140 70 -72 -38 -85 198 29 -30 -28 145 -43 -13 -66 179 -56 -181 6 27 -81 -38 132 54 -260 -152 -1 -16
5164 -16 17 -49 77 -154 -38 -217 84 239 44 25 213 23 82 -173 15 -10 132 62 -162 -19 -44 -63 -125
5187 -125 98 29 146 -57 48 -119 -235 319 8 -33 -25 7 -44 112 101 43 157 47 -71 88 -66 30 -6
$$ packed form
5019e1K18o5j14P7R7m2k21k2K61m3j02O3j96K73k35J80l11J22k70M42l88M76K5
5042A74j71K88l57M26m49K28n21L88qp1K39k21J55l02K21N4n2j61j2J84J0j3q8
5065e9r3J8L6N4J72k13R7O9J6j51k20K21K9O6%K08l02K9r7N9M35p45M15k20l2
5090b08K95j16L3j71K26o4l2P1R4k8m3j36K32k06R8k1q6n0O0J03j85K13j49L9
5114c1J6p7j1J09l3K04k46j15J30n1J07p8l7O9K7J44j81JJM8O2q8O7j68J78K3
5140G0j42L4m7K83j69n9KJ73j88L0n3K45k35j25J87K1j08M3J70p8l14J08J51j5
5164a6L3o6J26k31J16j79L01J55j95j9J88j90N9k55J88k5J42p0k24J43k5j9o2
5187a25K23o9J17k03J05j67j16N54l11m1QL2n1J56j1n8J14j10j18J59j54R6l6
$$ plain form
5210 -6 -115 -43 -6 -95 -36 47 111 32 -28 17 -138 -180 154 161 19 -237 -101 -121 151 -92 -138 -6 123 74 -10 29
5236 29 -111 -283 -154 -23 -201 2 125 -54 -260 -113 -266 218 163 60 178 7 55 43 79 -113 5 121
5258 121 25 62 -14 110 -165 -100 -7 -45 -12 -84 154 85 -200 26 -70 167 5 152 -8 15 -24 -12 -36 127 -71
5283 -71 17 -52 -78 -76 -106 -29 109 -304 5 73 42 -196 89 157 16 204 146 160 -74 -254 14 -68 -202 10 -150
5308 -150 157 -53 -246 64 -93 -40 -166 45 -72 -261 28 -84 -6 97 52 -138 19 20 308 -85 139 201
5330 201 -50 121 -144 128 100 303 -323 -19 -22 10 -218 64 175 26 214 81 95 97 -107 -131 -55 -31 181
5353 181 -104 232 -145 125 -91 -137 22 53 154 -30 179 -23 -281 -128 51 -140 111 -106 -36 -65 -37 -254
5375 -254 292 22 -90 19 -35 110 -238 177 159 125 -108 328 -80 -227 170 -21 -61 -118 97 -197 -101 -139
$$ packed form
5210fj09P2L7q9N9Q3O4p9o0M5j55m2L34Pj42k56J36k0K72k43m6J32J29m9q4L9
5236B9j40j72J29J31j78K03J23j79k06J47j53M84n5j03J18j71M8j2L6j92J18J16
5258A21r6L7p6J24k75O5R3l8L3p2K38o9k85K26r6K37j62J47j60K3l9J2k4J63j98
5283g1Q8o9k6Kl0P7J38m13L09O8l1k38K85O8j41J88n8J4k34j80K68q2j34K12j60
5308a50L07k10j93L10j57N3j26K11j17j89K89j12P8J03m5j90J57JK88l93K24O2
5330B01k51J71k65K72k8K03o26L04lL2k28K82J11j49J88j33J4Kk04k4P6K4K12
5353A81k85L36l77K70k16m6J59L1J01j84K09k02k58J53J79j91K51k17P0k9K8k17
5375b54N46k70j12J09n4J45l48M15j8l4k33M36m08j47L97j91m0n7K15k94R6l8
$$ plain form
5397 -139 35 -4 -26 -2 -38 142 -20 -104 280 81 351 115 278 -333 -202 -222 -53 5 -21 82 290 -4 -86
5420 -86 37 255 6 -27 209 -135 169 34 -40 0 126 40 -170 -41 -126 -54 113 32 67 19 340 -145 28
5443 28 -73 77 73 160 6 0 -198 -225 -97 -9 -50 -25 235 -117 -41 20 130 215 -62 121 194 112 167 121 -71 -399
5469 -399 122 39 43 229 118 31 -117 -233 -151 146 -82 -3 -192 -43 98 -294 -141 -115 60 75 149 117 -115
5492 -115 -185 250 145 92 22 3 71 234 167 -153 -52 270 -285 6 152 188 -2 -51 -141 -86 -69 114 6 -30
5516 -30 127 -29 94 7 3 -268 -86 99 -118 15 -15 1 42 43 114 50 -70 33 -64 -25 34 -6 62 83 -59 -107
5542 -107 -84 135 25 -37 -32 -18 63 -122 37 -36 -126 10 74 -8 -71 -4 -126 81 258 -242 118 73 80 -15 -155
5567 -155 -83 -167 46 195 -10 -385 -100 101 -31 -169 -102 84 -27 116 51 181 -42 197 -98 137 64 86
$$ packed form
5397a39J74l9k2K4l6J80j62q4L84j99K70k36J63o11J31k0J69N8k6J03K08k94q2
5420h6J23K18k49l3K36l44L04j35p4M0J26q6k10J29q5P2J67q1L5m8L21m85J73
5443B8j01J50mQ7j54oj98k7J28Q8m1K5K60l52P6O1J10Q5k77J83P3q2N5m6j92l28
5469c99N21q3MJ86j11q7j48j16Q2K97k28P9j89J49J41l92J53K6J75J5P4l2k32
5492a15p0M35j05n3p0j9O8J63o7l20J01L22n55K91J46L6j90m9r0N5J7J83j08l6
5516c0J57j56J23q7mk71J82J85k17J33l0J6M1JP1o4j20J03r7L9N9m0O8K1j42m8
5542a07K3K19j10o2NJ4Q1j85J59p3r0J36O4q2o3O7j22K07J77n00L60m5Pr5j40
5567a55P2q4K13J49k05l75K85K01j32j38O7J86j11J43o5J30k23K39k95K35p3K2
$$ plain form
5589 86 35 74 219 208 -47 -293 -64 -98 -58 -71 188 6 -179 27 9 -288 -268 -173 21 -6 -14 6 81 -54 -115
5614 -115 -240 78 45 -76 198 95 -117 238 62 10 -49 -37 -60 120 -132 43 -18 107 12 132 45 -85 104
5637 104 -390 43 -255 45 189 -197 -123 -156 -17 31 -132 29 5 -40 -115 109 51 272 319 32 -28 42 140 -51
5661 -51 -115 -92 46 12 -256 75 62 -78 164 58 -135 148 150 -79 -9 -73 -47 -94 471 -46 -86 11 -6 92 -188
5686 -188 102 75 -124 55 5 30 -116 -106 138 230 -78 -63 42 54 111 81 125 7 -196 165 163 -40 133 253
5710 253 105 -350 44 85 -19 -220 -6 49 -33 118 -2 166 -151 -47 192 -235 -54 107 158 22 208
5731 208 70 57 -28 46 71 198 110 138 33 -28 262 -199 -115 -188 -93 110 63 54 122 9 -38 -75 146 94 135 -53
5757 -53 -255 160 38 -63 6 173 214 -5 212 167 219 -48 272 22 23 220 305 3 18 -62 -136 68 -71 -81
$$ packed form
5589H6n1L9J45j1k55k46K29l4M0j3K59j82j85K06j8k97K0R5J94k7qK0P5j35o1
5614a15j25L18l3j21K74j03k12L55j76n2n9J2k3J80k52J75o1J25r5J20q7j30J89
5637A04m94M33k98L00J44l86P4l3J39M8j63J61k4m5p5K24n8K21M7k87o0P0R8j91
5661e1o4K3J38l4k68L31j3j40K42j06j93K83Kk29P0o4K6m7N65n17m0R7j7R8k80
5686a88K90k7j99J79n0K5j46J0K44R2l08J5J05J2N7l0M4j18k03L61kk03J73J20
5710B53j48m55L94M1j04k01K14N5q2J51j20J68l17J04K39m27J81J61N1j36J86
5731B08j38j3q5P4K5J27q8K8j05o1K90m61Q4p3R5K03m7rO8j13m7l7K21n2M1j88
5757e3k02M15j22j01O9J67M1k19K17m5N2k67L20k50JJ97Q5l02J5q0p4K04j39j0
$$ plain form
5781 -81 117 101 -117 -41 -66 35 -118 -63 14 52 -37 -13 137 -42 81 -56 197 173 -83 -23 50 17 -2 53 -37
5806 -37 -57 -180 102 160 -174 1 82 9 -162 -172 19 142 -105 176 242 -30 37 56 0 266 40 -202 13
5829 13 -31 49 230 119 -303 -42 -89 -70 -129 -38 -15 76 2 19 187 -15 -148 -73 -206 -107 -14 -93 -82 73 -270
5854 -270 93 80 -195 -89 -29 104 34 136 -159 -34 -255 -90 27 127 -162 102 -154 9 75 134 -106 157
5876 157 -44 -38 85 -238 -122 -7 30 -164 -69 -52 93 -68 -211 -11 -143 -37 28 376 178 97 27 66 26
5899 26 22 -15 -52 57 -65 -192 -141 -144 -85 -64 -105 -171 78 89 -9 -44 122 121 -164 -93 -9 32 -100 -24 230 -55 -80
5926 -80 43 -233 118 -107 -35 31 -110 -110 74 -146 90 -1 49 7 -5 147 263 2 45 -28 -94 -8 -166 -176 19
5951 19 -95 -48 -23 53 94 211 -47 116 -50 -66 -61 -69 63 -207 -36 3 -66 -103 94 121 77 -32 -231 146 142 -256
$$ packed form
5781h1J98j6k18P6k5J01j53N5P7L8q9K4J50j79J23j37K53k4k56O0P3l3j9N5r0
5806c7k0j23K82N8l34J75Q1p3j71j0J91J23k47K81O6k72O7J9n6K66k26k42K15
5829A3m4Q0J81j11m22K61m7J9n9R1K3R1p4J7J68k02j33P5j33R9R3p9J1J55l43
5854b70L63j3k75J06O0J33p0J02k95J25k21J65J17J00k89K64k56J63O6N9k40K63
5876A57k01OJ23l23J16J15L7j94R5J7J45j61j43K00j32J06O5L48j98q1p0L9m0
5899B6ml7l7J09j22j27N1lN9K1m1o6K49J1r8l5J66jk85P1Q4M1j32P6K54k85k5
5926h0J23k76L51k25P2O6j41%J84k20K36r1N0m2j2J52J16k61M3p3o6Q6j58j0J95
5951A9j14M7K5P6M1J17k58J63j66j6NqJ32k70J71L9o9l7J97K7m4j09j99L77ml98
$$ plain form
5977 -256 -171 -89 -172 14 99 17 105 -75 102 135 -272 -49 91 -31 -22 193 -117 24 164 18 -73 -155 -5 -260
6001 -260 -106 -18 -97 -8 9 26 7 263 -36 46 94 -28 3 64 75 22 78 64 -162 -77 -182 -88 -80 -13 -29 77 -122
6028 -122 122 227 142 -67 88 121 -20 45 -57 -119 -171 77 -57 12 72 -38 -30 102 -7 -71 -95 -103 -42 -27 -70
6053 -70 -100 4 -38 35 -176 167 36 -77 -48 90 61 -55 17 -114 30 81 48 45 134 -30 94 164 86 2 -55
6078 -55 -208 -61 -174 25 -183 263 179 -30 -164 -22 87 95 45 -112 49 88 -128 -54 30 -77 -43 -133 -22
6101 -22 154 -45 -34 -170 -27 -109 -239 53 -89 10 104 -19 130 -73 -31 58 -90 28 80 -172 3 -174 78
6124 78 90 73 17 190 126 -21 -68 21 -73 -26 -104 -40 115 -56 11 99 -101 42 71 -142 89 20 45 -75 -40 -27
6150 -27 -104 17 29 27 22 -47 104 143 -253 -58 46 -42 36 -223 -84 -51 -12 16 -153 136 -10 102 1 145 270
$$ packed form
5977b56Q5Q2q3J86Q5q2Q8j80J77L3m07K23J40j22RK15l10J41J40j46r1q2J50k55
6001b60J54Q8p9Q9J7J7j9K56k99Q2M8j22L1O1J1n3N6j4k26Q5j05R4QO7j6J06j99
6028a22K44J05q5k09J55L3j41O5j02o2n2K48j34O9O0j10QJ32j09o4k4qO1J5m3
6053g0l0J04m2P3k11L43j31j13K9J38k9j16P2j31J44N1l3lQ9j64J24P0p8q4n7
6078e5j53J47j13J99k08M46q4k09j34J42J09Qn0j57J61L9k16P4Q4j07L4r0J11
6101b2J76j99J1j36J43q2j30K92j42R9R4j23J49k03M2Q9j48J18N2k52J75j77K52
6124G8J2j7n6J73o4j47m7Q9r4M7p8O4J55j71O7Q8k00J43K9k13K31o9K5j20L5J3
6150b7p7J21J2kno9J51L9l96J95J04q8P8k59J39L3L9K8j69K89j46J12j01J44J25
$$ plain form
6175 270 -23 199 -51 -114 9 -53 129 68 -144 -148 -43 11 165 245 87 -16 252 -236 84 -35 -38 41 31 -31
6199 -31 -67 28 -122 -255 -33 -68 15 49 -350 -119 -74 -66 -195 79 -8 -23 -182 74 -59 78 -200 -101 -105 -50 12
6224 12 -91 -89 173 31 220 -189 -52 66 45 238 113 -15 237 109 -79 -162 -291 -97 -68 94 -209 37
6246 37 23 -26 -97 -16 -222 -186 72 -214 65 -130 -230 53 -30 80 -79 -225 -160 -45 95 -89 185 127 -93
6269 -93 26 -78 -43 102 132 -1 158 155 -229 -101 102 -86 -43 0 -174 142 31 253 39 49 -37 -5 25 74
6293 74 43 96 -130 90 87 -162 -118 -40 15 -58 80 214 -116 -58 246 15 -388 -22 213 -126 -24 118 136 4
6317 4 153 -111 211 -251 125 -3 152 56 84 -59 147 -81 -59 -72 -40 -289 -200 -322 -59 -126 64 -129 -41
6340 -41 22 -67 177 207 177 -130 -32 -91 -143 4 8 70 203 -54 30 74 33 34 97 109 -253 119 110 -44 62 -39 -9
$$ packed form
6175B70k93K22k50o3J23o2J82o1k12mJ05N4J54Q0j58j03K68m88L20j19lP9j0o2
6199c1l6R5j50j33K22l5Q3L4l99K31M5Qj29K74q7j5j59K56j33J37k78R9mN5O2
6224A2j03KK62j42J89m09J37J18k1J93j25j28K52j28j88q3j29J94K9J62l03K46
6246C7j4m9p1Q1k06L6K58k86K79j95j00K83q3J10j59j46O5J15J40j84K74n8k20
6269i3J19j04L5J45L0j33J59ll84J28K03j88M3M3j74L16j11K22k14J0q6L2L0M9
6293G4l1N3k26K20lk49M4P8N5p3J38J34l30N8L04k31m03L66K35l39J02J42J8j32
6317DJ49k64L22m62L76j28J55r6K8j43K06k28K2j3L2k49Q9j22K63o7J90j93Q8
6340d1O3q9K44L0l0l07R8n9n2J47MO2J33k57Q4M4m1JO3J2l62L72rj54J06j01L0
$$ plain form
6367 -9 162 119 -36 -151 169 86 -271 -61 226 140 -121 -139 -164 130 -71 83 186 -130 -33 64 21 190 -161
6390 -161 -244 -200 124 74 111 -134 135 249 184 -246 5 -261 44 158 -10 32 274 -64 216 61 -103 12
6412 12 147 27 48 58 -163 -96 -148 -18 -173 268 21 123 -33 -29 29 54 5 29 115 42 53 23 -162 -48 167
6437 167 141 -172 -36 278 -44 -18 -24 38 -38 -23 59 -83 117 -175 257 45 45 25 142 101 55 -35 70 20 -157
6462 -157 200 306 27 35 -157 -99 -44 114 196 171 8 78 73 -132 -137 -66 -515 -175 105 204 -112 137 -116 10
6486 10 35 -109 121 138 -104 -22 262 121 76 199 32 59 -224 214 146 -167 -6 -104 -188 157 -44 97 -30
6509 -30 -118 74 210 226 -118 -40 75 -95 43 -105 202 95 66 -137 -87 25 -323 190 38 -271 -134 100
6531 100 18 -185 211 177 175 33 -191 66 -29 -25 67 83 -383 -160 -55 113 -22 -49 137 87 -235 158 65 -65
$$ packed form
6367iJ71m3j55j15L20q3l57K10K87q6k61j8k5K94k01J54J03l16R7R7m3J69l51
6390a61q3M4L24n0L7k45K69J14o5m30K51k66L05J14j68M2K42l38K80j55j64J15
6412A2J35j20K1J0k21O7n2J30j55M41k47J02j56MN8K5m9K4Q6p3J1l0j85J14K15
6437A67k6l13J36L14l22K6oO2p6J5Q2j42K00k92M32k12%k0J17m1m6r0J05n0j77
6462a57L57J06k79Qj92N8N5J58Q2k5j63P0nk05nP1m49L40K80R9l16K49k53J26
6486A0K5j44K30J7k42Q2K84j41m5J23j67K7k83M38o8l13J61r8q4L45k01J41j27
6509c0q8J92J36J6l44P8J15j70J38j48L07j07k9k03N0J12l48N13j52l09J37K34
6531A00q2k03L96l4kj42k24K57r5MR2J6m66K23J05J68j35k7J86n0l22L93r3j30
$$ plain form
6555 -65 235 67 -6 -110 17 222 102 160 27 -153 35 -175 167 66 -33 -51 197 81 -39 36 31 -82 -167
6578 -167 215 69 -115 -218 75 -284 67 101 0 -6 56 20 85 -76 87 -34 56 69 120 4 -177 -47 -62
6601 -62 21 124 105 27 -72 -180 -54 13 73 83 -87 29 3 -210 -16 -238 14 -31 140 163 252 -143 -42 -24
6625 -24 -110 55 -127 -161 1 -154 -83 139 280 107 13 -185 78 184 147 82 -110 248 42 -63 -202 63
6647 63 -43 -128 46 41 -96 135 -22 35 -219 27 69 -246 -190 72 -38 37 -305 -175 -88 -188 153 -205 180
6670 180 -57 -158 8 -252 -116 163 173 62 -70 -75 -233 -53 -248 -113 69 -63 116 -21 -69 -31 -32 -6 45
6693 45 10 -324 22 -210 -172 203 93 75 -16 -48 -152 -229 343 -65 -48 -9 -204 -30 19 113 -184 -34 8 -73
6717 -73 184 -94 33 -168 141 -152 -229 -289 122 -79 -230 49 187 206 -246 -193 163 -205 -34 -64 124 -69
$$ packed form
6555f5L00j68p3j04J27K05j20N8j33j80J88k10L42j01r9j8K48j16j20P5nj13q5
6578a67L82j46j84j03K93l59L51L4j01oO2l6O5j61J63j21R0J3N1j16j81J30j5
6601f2Q3J03j9p8r9j08J26O7O0J0j70J16k6k13J94k22K52m5J71K3Q9l95J01J8
6625b4q6J65j82l4J62j55P1K22J41j73r4j98K63J06l7o5j92L58k06j05j39K65
6647F3j06q5J74nj37K31j57N7k54K46M2l15N6K62j10P5l42J30Q7j00L41l58L85
6670A80k37j01J66k60J36K79J0j11j32nj58J80j95J35J82j32J79j37m8L8jK6N1
6693D5l5l34L46k32L8L75j10j8r1l2j04p7N72m08J7L9j95J74M9R4k97J50M2q1
6717g3K57k78J27k01L09k93p7o0M11k01j51K79J38J9m52N3L56l68J71l0J88j93
$$ plain form
6739 -69 294 129 -201 52 -98 -35 58 -136 -76 75 93 -35 -126 81 155 143 -251 54 -159 -23 -187 -212 -122
6762 -122 68 66 2 90 -48 -15 -176 -3 -72 211 -311 15 -94 -115 42 106 54 -145 -192 20 161 28 -102
6785 -102 9 351 -82 110 -43 160 71 -216 -196 -62 -89 37 -106 -262 52 10 92 47 34 -21 22 64 149 196
6809 196 -94 5 162 130 -83 -75 37 -133 -75 -72 219 -17 -124 -54 -167 32 -245 129 103 127 25 -11 -107 4
6833 4 -40 -106 121 -65 64 -86 156 -56 393 -211 94 63 99 -95 -130 -27 -183 34 209 47 254 35
6855 35 -43 -249 -81 51 8 -25 -30 214 23 12 19 -83 157 105 -116 -8 -91 -10 -129 34 158 45 84 132 72
6880 72 -415 -47 -116 111 -51 218 -216 -105 -235 -74 -1 28 -263 -47 -150 -11 22 -46 21 -59 -226 212 98
6903 98 -195 159 -52 -96 -292 42 104 115 -107 115 -14 31 172 -106 123 149 -247 126 6 116 -51 5
$$ packed form
6739f9L63j65l30K53j50O3R3j94O0J51J8j28r1K07P4j2l94L05k13J36j64k5R0
6762a22J90ko4Q8j38L3j61J73o9K83n22L26j09k1J57O4n2j99m7K12J41j33j30
6785a02J11L42m33J92j53K03q9k87K0J34k7J26j43j56L14m2Q2m5j3n5M3M2Q5M7
6809A96k90R9J57l2k13QJ12j70N8LK91k36j07P0j13J99k77L74k6K4j02l6r6J11
6833Dm4o6K27j86J29j50K42k12M49o04L05l1L6j94l5J03j56K17J75j62K07k19
6855C5p8k06J68J32m3l3nK44j91j1Pj02K40n2k21J08q3Q1j19J63J24j13L9M8o0
6880G2m87L68o9K27j62K69m34J11j30J61P3K9k91K16j03J39L3o8O7q0j67M38j14
6903I8k93L54k11m4j96L34O2J1k22K22j29M5J41k78K29K6l96L73j20J10j67N6
$$ plain form
6925 5 -150 226 -46 65 -44 177 -24 180 -8 -100 -87 -55 34 54 5 12 31 13 49 -38 196 -63 125 -89 177
6950 177 148 -96 179 32 -197 175 -131 -2 -166 29 -152 -157 64 2 21 -89 126 -22 184 179 -16 -20 -150
6973 -150 206 70 -5 200 124 -182 -100 -44 -25 217 88 -61 -71 4 3 -177 236 93 -20 267 55 15 -185
6996 -185 132 -18 -81 14 -123 23 -109 267 39 -47 -184 -238 -18 75 -83 -39 -59 48 -112 155 35 58 284
7019 284 -276 -77 -78 -120 39 64 152 44 -36 45 -23 -154 -217 100 -192 11 -102 67 42 63 -87 -72 -45 -96 -69
7044 -69 42 -94 124 -54 -138 -90 145 128 41 -174 126 84 47 -74 -17 16 19 202 2 60 -155 105 84 101 65
7069 65 81 -127 -196 102 45 18 68 -78 -49 -190 -137 -95 -99 -1 -217 146 22 215 -157 -175 -11 57 45 -20 221
7094 221 -72 59 -278 -109 205 104 71 -46 35 88 -340 34 -166 -105 -53 -67 366 -41 -8 -81 110 143 324
$$ packed form
6925Ej55L76k72J11j09K21k01K04j88r2J3L2Q9K0m9PJ9j8L6q7K34k59J88k14K66
6950A77k9k44K75j47k29L72l06J29j64J95j81nK21o2J9j10K15j48K06nj95mj30
6973a50L56j36p5K05p6l06Q2N6J9K42j29j49j0P5jj80M13j43j13K87k12m0k00
6996a85L17j50o3R5j37J46j32L76k28q6j37n4K20R3j58M4k0J07j60K67j20K3K26
7019B84n60J99jm2J59K5Q8j08q0Q1o8j31o3L17k92K03j13J69k5K1j50J5K7n1K7
7044f9J11j36K18j78q4M8K35j7q7k15L00m2l7j21N7L3LJ83k00N8k15K60k1J7l6
7069F5J6k08o9K98n7k7N0j46K9j41N3M2mR8k16L63j24J93l72j8J64O8j2o5K41
7094B21k93J31l37J69L14j01l3j17Q1N3m28L74k00O1N2j4M33m07L3p3J91L3J81
$$ plain form
7117 324 324 -98 38 -21 1 -101 -51 59 -19 203 -31 81 -142 -37 143 -19 30 101 64 -133 -181 -117 173 -40
7141 -40 139 -218 -114 106 70 1 35 -10 75 16 -104 -110 28 74 -35 -226 0 -8 28 1 -140 14 131 201 17
7166 17 -167 60 102 42 3 47 285 168 92 -25 315 237 168 46 16 -52 -268 21 104 -39 133 18 65 -73
7190 -73 -95 -100 -138 -101 -205 2 -199 1 -52 -70 63 66 73 45 -77 -20 -100 260 -212 -85 145 135 -150 -169 -17 -82
7216 -82 2 -58 -209 14 72 28 -158 -75 -65 14 72 -162 51 -124 -70 -35 -99 111 3 -39 -32 -68 72 138 -8 -15
7242 -15 -230 -142 133 89 -108 -122 -54 -104 7 -153 105 207 -114 -27 -39 -106 -30 -23 5 -54 56 107 -123 -46 66
7267 66 -137 -36 31 -23 -3 -112 -31 156 41 -99 -31 5 36 -74 89 -26 -13 99 148 -143 -40 99 -215
7290 -215 -2 4 -148 -111 169 -56 -324 62 186 65 -224 124 -322 50 113 -240 116 -4 22 119 42 57 -58
$$ packed form
7117C24%m22J36n9K2j02N0J10p8K22k34J12k23J05J80j62M9P1l7j97m8O4K90k13
7141d0J79l57J04K20l6o9L4m5Q5n9j20oJ38M6j09j91K26qL6k7j41J54J17P0j84
7166A7j84K27M2o0l9M4K38j17p6j17L40p8o9j22l0o8k16K89Q3j43J72j15M7j38
7190g3k2nl8L7j04K07k01K00n3j8J33LPk8j22N7q0L60m72J27K30j0k85j9J52o5
7216h2Q4o0j51K23N8m4j86Q3J0P9N8k34K13j75N4L5o4K10j08m2Pl6J40O6j46p
7242a5k15Q8K75m4j97j4O8n0J11j60K58J02l21Q7j2o7P6PK8n9J10N1k30P7J12
7267F6k03J01O7n4K0j09Q1J87j15j40O8L6L1j10J63j15J3J12M9k91J03J39l14
7290b15K13Oj52L7K80k25k68L86J24j21k89L48m46L72O3l53L56j20K6R7p7J5j15
$$ plain form
7313 -58 -60 -92 18 -2 -167 162 37 115 -92 -98 -11 -16 25 88 -55 170 2 -136 -154 11 52 0 104 -88 -96 -1
7339 -1 22 -2 203 12 -15 -73 -112 -113 91 312 228 348 241 -55 123 233 -9 -59 -35 122 140 -156 9 -51 22
7364 22 -21 -29 -189 -43 -1 -94 97 -22 120 53 14 163 -82 -44 169 85 -34 -14 -95 -201 -97 -159 -215 70 70
7389 70 -120 -172 17 -111 -133 -166 28 73 -143 1 74 -75 -35 116 32 1 -204 -1 140 -109 98 252 157
7412 157 48 197 56 187 33 55 58 -158 78 -154 -41 -90 -25 60 -55 33 -34 -46 36 25 30 50 -47 -154 27
7437 27 -31 19 13 -16 -175 268 2 23 -72 -20 58 -34 -27 -5 103 -49 15 -56 -8 -23 -88 325 0 -75 146 31 88
7464 88 -131 -56 -57 -36 -201 8 -1 -84 191 98 -196 -143 -14 74 -74 -33 -39 -215 89 -70 -19 70 -97 135 -256
7489 -256 32 -331 69 -229 -88 117 19 27 -81 78 -93 142 -201 9 -175 319 -1 -228 75 -28 71
$$ packed form
7313e8kl2J10k0j65L29j25P8k07oQ7nM1O3j43K25j68j38j8J65M1n2J04j92qR5
7339aK3k4K05j91k7n8l9jK04K21q4J20j07k96J78J10k42n0K4J57J8k96J65o0P3
7364B2m3qj60J46M2r3J91j19J42o7l9J49k45L8K13q4j19K0q1j06J04o2n6K85%
7389G0j90n2J89j28k2l3J94M5k16J44P3j49M0J51q4l1k05K03J41k49K07J54r5
7412A57j09J49j41J31j54K2Lk16K36k32J13m9O5Q5j15Q8o7j2Q2j1NK0r7j07J81
7437B7n8N0ok9j59M43k66K1r5N2P8r2PK2J08j52O4p1M8j5o5M13l25p5K21j15N7
7464H8k19P5jK1j65K09rq3K75r3k94N3J29Q8j48M1oj76L04j59N1Q9j67K32l91
7489b56K88l63M00k98J41K05r8Qj08J59j71K35l43K10j84M94l20k27L03j03R9
$$ plain form
7510 71 -29 -46 31 149 -91 30 -156 19 34 121 189 -145 223 -1 26 -4 98 127 2 193 252 -111 -58 93
7534 93 126 -21 -241 222 -99 53 -117 -294 -59 -50 46 136 -117 66 118 -27 167 88 -10 -64 46 144 114 141
7558 141 -174 24 60 144 53 -290 78 106 -207 -29 230 -106 -193 16 131 -69 -112 15 -73 35 7 -74 -59
7581 -59 -20 214 -116 -11 155 -206 -343 42 51 -26 -139 -215 -235 -125 -16 -29 56 -132 118 134 -122 -86 -81 64
7605 64 -74 41 -107 63 -21 171 -164 -87 195 -44 -138 47 198 -137 90 79 4 99 -3 -18 -145 41 282
7628 282 200 -52 61 117 153 109 28 221 -61 -8 -216 18 40 117 -99 -57 -114 -127 -121 43 -107 164 65 53 153
7653 153 28 -45 -85 169 16 59 108 -84 190 -76 70 46 73 -58 234 225 13 81 3 96 25 -126 -57 108
7677 108 -38 -40 167 41 -60 -245 -110 -207 -26 42 -25 -34 89 65 -12 63 -93 -121 88 173 224 2 126 -82
$$ packed form
7510G1j00j7P7J18k40J21j86J75J5Q7O8l34L68k24K7l0J02K9j25J91N9l63N3J51
7534I3L3j47k20M63l21J52j70j77K35RR6R0k53J83N2j45J94p9r8n4J10R8l0K7
7558A41l15J98L6Q4r1l43L68K8l13J78K59l36q7K09J15k00m3J27q8J08k8q1J5
7581e9L9K34l30J05J66l61j37L85Rp7j13p6k0J10J09j3Q5j88K50J6k56L6NJ45
7605F4j38J15j48J70q4J92l35P7K82k39r4J85J51l35K27j1p5R5j02j5j27J86K41
7628B82q2k52J13N6L6m4q1J93k82N3k08K34K2P7k16M2n7j3OJ64j50K71r9j2J00
7653A53j25p3m0K54j53M3M9j92K74k66J46k4K7j31K92rk12O8p8R3p1j51O9J65
7677A08j46kK07j26j01j85J35r7J81O8o7rJ23k4p7P5j56k8K09Q5N1k22J24k08
$$ plain form
7701 -82 161 67 -57 64 -163 207 -77 4 -21 96 -249 194 83 -68 23 189 -107 25 -81 -158 42 158
7723 158 130 -67 12 -235 -76 -131 -22 258 -13 -20 33 252 72 -142 35 -124 -40 48 102 11 29 24 -169 69
7747 69 -20 47 -27 -31 -58 -114 13 85 -73 -19 13 35 -141 259 -68 -127 134 73 -146 -89 79 -24 4 44 -90 -37
7773 -37 9 248 99 -27 -40 407 109 -84 -37 -16 81 85 222 -165 -131 94 -104 111 -66 178 287 -58 -27
7796 -27 82 107 14 -12 53 -30 -169 -154 -88 -13 164 148 -1 -39 -113 -118 -162 91 166 -88 136 -101 -9 -141 -228 186
7822 186 -11 13 -14 -35 191 93 12 78 -132 -25 26 -80 -172 55 43 260 -16 69 110 4 -221 -207 59 32
7846 32 -41 86 67 -64 -28 216 262 -62 -6 92 80 -149 36 -205 -90 -36 18 -84 13 -159 -1 -170 -142 102
7870 102 -92 -49 73 -1 -96 70 41 -216 -106 -82 112 37 -16 -126 -10 -135 146 -100 16 -11 -165 91 23
$$ packed form
7701h2K43r4j24J21k27L70k84Q1k5J17l45M43j11j51R1J66k96J32j06p7K00J16
7723A58k8j97P9k47J59n5J09K80k71pN3K19j80k14J77j59Q4Q8N4r1J8nj93K38
7747F9q9O7p4mk7n6J27P2j58N4L2K2j76M00l27n9K61o1k19N7J68j03K8M0j34N3
7773c7M6K39j49j26j3M47k98j93M7K1R7MJ37l87L4K25j98K15j77K44J09l45L1
7796b7J09K5r3k6O5q3j39J5O6P5J77j6j49l8p4nm4K53P5k54K24k37R2j32q7M14
7822A86j97K4k7k1K26r8q1O6k10J07N1j06r2K27j2K17k76Q5M1j06k25J4K66k7
7846C2p3J27j9j31L6K44M6l24N6R8j2k29J85k41J15N4N4j02R7j72J58j69K8K44
7870A02j94M3J22p4r5J66k9k57J10K4J94p5n3j10J16j25K81k46J16k7j54K56o8
$$ plain form
7893 23 52 59 13 -99 315 -192 -123 197 114 186 184 81 262 -212 -42 36 162 -192 44 56 -18 -4 -98 203 -60
7918 -60 -8 -241 -48 60 -159 -17 7 -40 79 210 -63 17 225 148 15 177 237 175 -222 121 104 -97 111
7941 111 46 78 19 7 -78 71 -47 45 13 195 105 -251 -214 -249 48 94 -270 -125 125 266 361 -87 -151 -142 235
7966 235 -123 -50 59 77 -199 149 -34 -115 -109 80 -15 -120 -36 -45 -182 -150 -14 16 -14 -109 197 115 187 70 153
7991 153 9 34 -106 26 -95 -254 -150 -176 -210 133 -36 -24 15 -62 -251 183 -175 -53 -181 -254 -31 194
8013 194 -23 -80 130 155 -122 -119 47 107 149 -159 88 -227 42 194 81 -15 242 -115 -220 -72 89 6 235
8036 235 -109 -10 -76 -7 -69 384 84 25 -203 6 71 183 190 -236 85 15 -155 -30 8 130 39 -105 -121 -41
8060 -41 443 24 171 -265 42 24 110 59 64 -21 -147 105 -54 -10 26 -87 274 83 278 -43 -151 58 91
$$ packed form
7893B3K9Pm6j12M14n07O9L20q3P2kj03J81m74J70P8J26l54K36J2p4J4r4L01k63
7918f0N2k33J93J08k19J42K4m7J19J31k73Q0K08p7j33J62O0o2l97L43j7k01K08
7941A11o5L2n9j2q5J49j18R2l2J82r0l56L7l5K97M6l64J45K50J41R5m48o4RL77
7966B35l58P3J09J8k76L48j83q1OJ89r5j05Q4rj37L2J36L0l0r5L06q2P2j17Q3
7991A53j44K5j40J32j21j59J04k6l4L43j69J2L9p7j89M34l58J22j28p3K23K25
8013A94k17n7K10K5k77LJ66O0M2l08K47l15K69J52j13r6K57l57j05J48J61q3K29
8036B35l44R9o6O9o2M53l00n9k28K09O5J12Pm26L21p0j70J25L8J22r1j44j6Q0
8060d1M84m19J47m36L07j8Q6n1Nq5j26K52j59M4L6j13L61j91J95l21j08K09L3
$$ plain form
8083 91 -145 -194 -303 20 94 79 172 1 -85 -98 -49 -33 73 -267 148 -229 44 -45 -138 254 144 53 16 -84
8107 -84 -56 -179 -147 78 185 61 -14 -116 -187 -17 162 68 -45 8 -143 11 126 4 -53 141 124 -192 -62
8130 -62 58 -48 132 132 -9 -287 27 -6 44 60 28 -116 15 180 -178 -196 149 75 -215 130 48 -183 325
8153 325 4 107 -60 258 171 -65 97 8 80 -336 -197 -3 129 7 52 -88 -277 108 -255 -13 96
8174 96 -53 179 181 -244 -5 13 52 -25 178 63 109 -295 -31 6 -206 -184 -186
$$ packed form
8083I1k36m9j09L23P4j5R3j71q6j3M9J6J06l40M15l77K73q9r3L92j10r1l7j00
8107h4K8j23L2K25J07j24p5j02p1J70J79r4j13N3j51J54J15j22n7J94j7l16J30
8130f2J20j06J80%j41k78L14l3N0J6l2j44J31J65l58j8L45p4k90L45q2k31N08
8153C25l21J03j67L18q7k36J62q9P2m16J39J94J32j22M5j40j89L85l63K42J09
8174I6j49K32Km25K39J8L9p7K03j15M6m04K64L7k12K2k
8191a86
$$ Imaginary data points
##PAGE= N=2
##DATA TABLE= (X++(I..I)), XYDATA
$$ plain form
0 0 0 0 0 0 0 0 0 0 0 0 0 0 0 1 -16 16 -16 16 -17 32 -32 45 -48 59 -65 81 -94 105 -121 141 -161 178 -208 227
34 227 -259 291 -331 370 -416 462 -513 569 -628 698 -771 852 -942 1037 -1144 1259 -1387
51 -1387 1532 -1686 1860 -2060 2278 -2530 2820 -3161 3560 -4045 4638 -5395 6390 -7765 9794
66 9794 -13107 19460 -36121 173635 411198 118793 -45301 -59634 -6587 -69260 -52247 102617
78 102617 246299 106271 -189572 -331342 -189714 -22512 17815 32438 134224 154947 -23409
89 -23409 -238752 -217512 8222 180207 154426 70539 50080 16225 -118957 -200115 -56957
100 -56957 191558 262330 119166 -32186 -68895 -80010 -127720 -112018 42816 188218 123110
111 123110 -99745 -224356 -157322 -54015 -17935 40220 163576 204161 53665 -145726 -168215
$$ packed form
0@%%%%%%%%%%%%%Jj7L2l2L2l3M9o4P7r3J07j24J46j75J99k26K62l02L39l86M35
34B27m86N50o22P01p86Q78r75J082j197J326j469J623j794J979k181K403k646
51a387K919l218L546l920M338m808N350n981O721p605Q683j0033J1785j4155J7559
66I794k2901L2567n5581K09756K37563k92405j64094j4333N3047o2673J7013J54864
78A02617J43682j40028k95843j41770J41628J67202M0327J4623J01786K0723j78356
89b3409k15343K1240K25734J71985k5781q3887k0459l3855j35182q1158J43158
100e6957K48515P0772j43164j51352l6709j1115m7710J5702J54834J45402o5108
111A23110k22855j24611O7034J03307L6080N8155J23356M0585j50496j99391k2489
$$ plain form
122 -168215 -9249 123641 116934 74274 82770 42718 -117510 -237747 -137275 85058 179953
133 179953 91253 -17368 -38820 -50040 -117029 -132295 10667 188607 180145 -5731 -139886
144 -139886 -114257 -47611 -34032 1166 113588 188535 94566 -94045 -168964 -67620 56013
155 56013 77617 59626 78479 60985 -65556 -190707 -157476 4586 120038 100766 29237
166 29237 -4875 -29991 -92638 -117606 -14007 139122 170670 58364 -54632 -80882 -70587
177 -70587 -66563 -26212 76391 151481 92928 -56402 -137929 -89433 -8410 24752 51083 99533
189 99533 90836 -24606 -147204 -142302 -21585 79928 85057 50059 36407 5537 -79936 -131680
201 -131680 -50391 96165 147941 73141 -18319 -49214 -55843 -75914 -62614 30073 128911 110521
$$ packed form
122a68215J58966J32890o707m2660Q496m0052j60228j20237J00472K22333R4895
133A79953q8700j08621k1452j1220o6989j5266J42962J77940q462j85876j34155
144a39886K5629O6646J3579L5198J12422P4947r3969j88611p4919J01344J23633
155E6013K1604j7991J8853j7494j26541j25151L3231J62062J15452j9272p1529
166B9237l4112k5116o2647k4968J03599J53129L1548j12306j12996k6250J0295
177g0587M024M0351J02603P5090n8553j49330q1527M8496Q1023L3162K6331M8450
189I9533q697j15442j22598M902J20717J01513N129l4998j3652l0870q5473n1744
201a31680Q1289J46556N1776p4800r1460l0895o629k0071J3300R2687R8838j8390
$$ plain form
213 110521 -16627 -109982 -91095 -30872 -1314 26811 81379 101962 26385 -91115 -129322
224 -129322 -53549 44184 74670 58408 47923 21398 -53356 -114490 -76056 35123 107836 86911
236 86911 21336 -27160 -54329 -77023 -68114 6044 95822 104982 22983 -58987 -78626 -59266
248 -59266 -31229 15048 76021 99689 43178 -54568 -102097 -63330 4273 41418 58273 69949
260 69949 42160 -38615 -104214 -82537 4697 72032 73258 37402 4769 -29109 -73468 -84432
272 -84432 -18750 74610 99441 40730 -28445 -55428 -54319 -44290 -12262 48833 94793 66409
284 66409 -22170 -84756 -69348 -16480 21029 44888 64619 53252 -7941 -77291 -88590 -29965
296 -29965 42505 70005 50653 18893 -16748 -59572 -78164 -36817 39368 82057 62293 7992
$$ packed form
213A10521j27148r3355J8887O0223K9558K8125N4568K0583p5577j17500l8207
224a29322P5773R7733L0486j6262j0485k6525p4754o1134L8434J11179P2713k0925
236H6911o5575m8496k7169k2694Q909P4158Q9778R160q1999q1970j9639J9360
248e9266K8037M6277O0973K3668n6511r7746m7529L8767O7603L7145J6855J1676
260F9949k7789q0775o5599K1677Q7234O7335J226l5856l2633l3878m4359j0964
272h4432O5682R3360K4831n8711o9175k6983J109J0029L2028O1095M5960k8384
284F6409q8579o2586J5408N2868L7509K3859J9731j1367o1193o9350j1299N8625
296b9965P2470K7500j9352l1760l5641m2824j8592M1347P6185M2689j9764n4301
$$ plain form
308 7992 -39293 -60256 -53956 -20676 33681 77729 68034 6765 -51840 -66121 -44033 -6433 37068
321 37068 67573 57123 3964 -55834 -75945 -43400 10248 45604 54962 42429 4083 -50189
333 -50189 -76750 -43774 19967 61679 59328 27152 -11486 -43143 -58052 -41223 12226 66696
345 66696 70467 21864 -31472 -54516 -49326 -24260 14874 52716 62049 26993 -32804 -70254 -55625
358 -55625 -8030 32823 51335 48499 19264 -28562 -62207 -54284 -8420 43155 65045 44663
370 44663 2026 -35787 -54083 -44913 -5429 41546 61320 41355 -3330 -45402 -60721 -38387
382 -38387 5720 43071 54580 34079 -8590 -46411 -55232 -31685 9608 48459 58768 29847
394 29847 -16917 -48139 -49158 -22499 17253 48301 51382 24472 -18218 -52988 -53487 -17426 26107
$$ packed form
308G992m7285k0963O300L3280N4357M4048r695o1269n8605j4281K2088L7600M3501
321C7068L0505j0450n3159n9798k0111L2545N3648L5356R358j2533l8346n4272
333e0189k6561L2976O3741M1712k351l2176l8638l1657j4909J6829N3449N4470
345F6696L771m8603n3336k3044N190K5066L9134L7842R333l5056n9797l7450J4629
358e5625M7595M0853J8512k836k9235m7826l3645P923M5864N1575K1890k0382
370D4663m2637l7813j8296R170L9484M6975J9774j9965m4685m2072j5319K2334
382c8387M4107L7351J1509k0501m2669l7821q821K3547M1293L8851J0309k8921
394B9847m6764l1222j019K6659L9752L1048L081k6910m2690l4770m99L6061M3533
$$ plain form
407 26107 48799 42896 14361 -24731 -52136 -47855 -14801 28100 53835 45063 7097 -32510 -49608
420 -49608 -39186 -5833 33742 53822 40331 4028 -33673 -52079 -38191 1747 39494 51130
432 51130 31775 -5556 -39619 -49520 -31297 2723 36475 51643 31919 -12335 -47116 -47342 -20237
445 -20237 13981 39069 43497 26167 -7890 -42280 -51294 -20840 25082 48677 38099 11896
457 11896 -16012 -38139 -43130 -21125 18586 49183 44678 6219 -32325 -43503 -31458 -9541
469 -9541 18557 43433 42573 9433 -31680 -49233 -31912 3515 31887 40422 31362 6681 -28290
482 -28290 -49147 -33455 6247 37509 42180 23873 -5266 -32631 -43504 -30062 4827 38734
494 38734 44654 18568 -14423 -33948 -37315 -23626 8349 40688 46202 18827 -18841 -39268 -32765
$$ packed form
407B6107K2692n903k8535l9092k7405M281L3054M2901K5735q772l7966l9607j7098
420d9608J0422L3353L9575K0080j3491l6303l7701j8406J3888L9938L7747J1636
432E1130j9355l7331l4063r901J8223L4020L3752J5168j9724m4254l4781k26K7105
445b0237L4218K5088M428j7330l4057l4390r014L0454M5922K3595j0578k6203
457A1896k7908k2127m991K2005L9711L0597m505l8459l8544j1178J2045K1917
469i541K8098K4876q60l3140m1113j7553J7321L5427K8372Q535r060k4681l4971
482b8290k0857J5692L9702L1262M671j8307k9139k7365j0873J3442L4889L3907
494C8734N920k6086l2991j9525l367J3689L1975L2339N514k7375l7668k0427O503
$$ plain form
507 -32765 -10290 13334 32421 40259 21710 -19656 -48812 -37982 -2875 24525 32003 26195 10929
520 10929 -14196 -39918 -42632 -9958 32986 45574 22681 -5127 -20570 -29248 -29652 -9316 26288
533 26288 48649 33750 -6654 -36237 -34169 -14731 2991 19981 36477 31422 -3864 -40060
545 -40060 -44660 -17426 14532 30176 28630 17370 -3051 -29988 -42628 -20556 19219 40437
557 40437 31038 8699 -12074 -28511 -33367 -17459 15227 40767 36010 5308 -22766 -30027 -23953
570 -23953 -11125 11931 36120 35579 4573 -29920 -39034 -22186 1098 17020 26474 28637 11936
583 11936 -22491 -43551 -25803 11745 32232 28057 15174 1592 -17151 -34651 -31352 668
595 668 36425 39876 10846 -16591 -23552 -22584 -19052 -1311 27736 40952 19579 -18680 -39119
$$ packed form
507c2765K2475K3624J9087P838j8549m1366k9156J0830L5107K7400P478n808j5266
520A0929k5125k5722k714L2674M2944J2588k2893k7808j5443q678m04K0336L5604
533B6288K2361j4899m0404k9583K068J9438J7722J6990J6496n055l5286l6196
545d0060m600K7234L1958J5644j546j1260k0421k6937j2640K2072L9775K1218
557D0437r399k2339k0773j6437m856J5908L2686K5540m757l0702k8074p261O074
570b3953J2828K3056K4189n41l1006l4493r114J6848K3284J5922R454K163j6701
583A1936l4427k1060J7748L7548K0487m175j2883j3582j8743j7500L299L2020
595F68L5757L451k9030k7437o961R68L532J7741K9047J3216k1373l8259k0439
$$ plain form
608 -39119 -27848 -3995 10854 20043 29208 21844 -9286 -37748 -33217 -2067 24664 30080 20941
621 20941 7313 -9926 -29283 -34539 -11938 22693 35528 18764 -3801 -17449 -24737 -24132 -7142
634 -7142 20845 37682 25812 -4979 -26973 -26084 -13786 -1580 15209 31336 27226 -3021 -31573
647 -31573 -32017 -9743 12123 21401 22633 18245 1597 -26171 -39416 -18914 16217 30829 19256
660 19256 3256 -7633 -18770 -27597 -18834 10855 38157 34381 3454 -21309 -22653 -14591 -8642
673 -8642 4613 26015 32340 9040 -24120 -36006 -19034 5376 16826 18916 20033 10972 -14645
686 -14645 -35678 -26368 4214 25019 23912 11281 -1874 -13915 -24584 -22802 31 27750 33790
699 33790 13768 -8763 -18176 -19300 -15396 -303 21456 30093 14173 -13929 -29308 -22492 -6450
$$ packed form
608c9119J1271K3853J4849R189R165p364l1130k8462M531L1150K6731N416r139
621B0941j3628j7239j9357n256K2601L4631J2835j6764k2565j3648p288O05J6990
634g142K7987J6837j1870l0791k1994Q89J2298J2206J6789J6127m110l0247k8552
647c1573m44K2274K1866R278J232m388j6648k7768j3245K0502L5131J4612j1573
660A9256j6000j0889j1137q827Q763K9689K7302l776l0927k4763j344Q062N949
673h642J3255K1402O325k3300l3160j1886J6972K4410J1450K090J117r061k5617
686a4645k1033R310L0582K0805j107j2631j3155j2041j0669J782K2833K7719O040
699C3790k0022k2531r413j124L904J5093K1759Q637j5920k8102j5379O816J6042
$$ plain form
712 -6450 6065 16926 25473 17979 -9257 -31205 -25847 -1995 16601 20665 16393 8763 -5836
725 -5836 -24489 -29316 -8104 22599 31414 15365 -2660 -10956 -17103 -20489 -10463 13742 31377
738 31377 22408 -6236 -26295 -22663 -9176 -813 9093 23070 24364 2661 -23773 -29031 -9890
751 -9890 11489 19657 16850 11671 2114 -16203 -29227 -17390 10249 25796 20202 5064 -7374
764 -7374 -16072 -20321 -13887 5292 24764 24636 4424 -15198 -20427 -15432 -7853 6409 22401 24696
778 24696 7238 -15350 -24009 -14846 1470 12436 17485 18434 8420 -13979 -28462 -19533 3258
791 3258 17889 17881 10361 1022 -10816 -22064 -20740 -859 22477 26045 8765 -8268 -13747 -14295
805 -14295 -12752 -1774 17107 27004 15290 -8808 -23268 -17580 -2922 5833 11505 17783 14317
$$ packed form
712f450J2515J0861Q547p494k7236k1948N358K3852J8596M064m272p630j4599
725e836j8653m827K1212L0703Q815j6049j8025q296o147l386J0026K4205J7635
738C1377q969k8644k0059L632J3487Q363R906J3977J294k1703k6434n258J9141
751i890K1379Q168k807n179r557j8317j3024J1837K7639J5547n594j5138j2438
764g374q698m249O434J9179J9472j28k0212j9622n229M995P579J4262J5992K295
778B4696j7458k2588q659R163J6316J0966N049R49j0014k2399j4483Q929K2791
791C258J4631qp520r339j1838j1248J324J9881K3336L568j7280j7033n479n48
805a4295J543J0978J8881R897j1714k4098j4460N688J4658Q755N672O278l466
$$ plain form
818 14317 -4683 -24206 -24126 -5896 12635 18111 12966 4455 -5094 -16141 -21252 -8717 13733 24202
832 24202 16007 683 -10356 -15835 -14693 -4929 10822 22154 17747 -312 -16853 -18897 -11319
845 -11319 -1378 10357 19276 15733 -1070 -17894 -21420 -10768 4394 13761 15818 11906 749
858 749 -14865 -22292 -11221 8727 19209 15748 6651 -3152 -12611 -17674 -12097 4959 20499 19994
872 19994 3226 -11573 -15321 -12561 -7538 2833 15965 19428 7279 -12055 -20935 -13869 905
885 905 10367 13276 13427 7563 -7892 -20153 -16409 385 14897 17353 10303 -682 -9765 -15444
899 -15444 -14402 -2710 13741 19441 10001 -4720 -13914 -15597 -10458 995 13336 17706 10755 -3781
913 -3781 -15489 -15741 -6323 4972 13467 16690 9776 -5025 -16592 -15828 -5161 6784 14028 13224
$$ packed form
818A4317j9000j9523Q0J8230J8531N476n145q511r549j1047n111J2535K2450J0469
832B4202q195j5324j1039n479J142R764J5751J1332m407j8059j6541k044P578
845a1319R941J1735Q919l543j6803j6824l526J0652J5162R367K057l912j1157
858G49j5614p427J1071J9948J0482l461r097r803r459n063N577J7056J5540n05
872A9994j6768j4799l748K760N023J0371J3132L463j2149j9334q880P066J4774
885I05R462K909J51n864j5455j2261L744J6794J4512K456p050j0985r083n679
899a5444J042J1692J6451N700r440j4721r194j683N139J1453J2341M370o951j4536
913c781j1708k52R418J1295Q495L223o914j4801j1567P64J0667J1945P244q04
$$ plain form
927 13224 5669 -5589 -15800 -17243 -6068 10021 16440 11197 1890 -6775 -13309 -13561 -5021 9177
941 9177 18402 14867 277 -11942 -13815 -7988 -1112 7740 15361 13765 1047 -13285 -17781 -10128
955 -10128 3128 11824 12430 7973 -313 -11015 -17071 -11294 3466 14559 15072 6851 -4436 -12018
969 -12018 -12730 -6888 3746 13844 16039 6776 -6373 -13810 -12805 -5417 5783 13783 12653 4291
983 4291 -7034 -14697 -13472 -3834 7211 13141 11999 3180 -8790 -14836 -10638 -670 8405 13290
997 13290 11316 2255 -8203 -13818 -10809 306 11594 14484 8027 -1649 -9068 -12786 -10260 -228
1011 -228 10510 14371 8433 -3545 -12937 -12960 -5715 2686 9505 12960 8576 -2793 -12429 -13278 -5276
1026 -5276 6177 13493 11924 4262 -4058 -11015 -12722 -5545 6257 13138 11575 2701 -7923 -13283
$$ packed form
927A3224p555j1258j0211j443J1175J6089O419n243r307q665o534k52Q540J4198
941I177R225l535j4590j2219j873N827O876Q852P621j596j2718j4332m496P653
955a0128J3256Q696O06m457q286j0702o056N777J4760J1093N13q221j1287p582
969a2018p12N842J0634J0098K195r263j3149p437J005P388J1200Q000j130q362
983D291j1325p663J225R638J1045N930j142q819j1970o046M198R968R075M885
997A3290j974r061j0458n615L009J1115J1288K890o457r676p419l718K526J0032
1011b28J0738L861n938j1978r392k3P245Q401O819L455m384j1369r636q49Q002
1026e276J1453P316j569p662q320o957j707P177J1802O881j563q874j0624n360
$$ plain form
1040 -13283 -10924 -2606 6124 11313 10887 2776 -7882 -13281 -9916 -1217 9086 13455 9059 386
1054 386 -7498 -11099 -8831 -414 9645 13395 8540 -1489 -10438 -12928 -6872 2037 8293 10505 7214
1069 7214 -1740 -11192 -13022 -6365 3699 11374 11587 4735 -3739 -9504 -10484 -5211 4288 12363 11891
1084 11891 4358 -5267 -11355 -10457 -2832 6057 10368 9494 3000 -6687 -12479 -10301 -2348 6515 11430
1099 11430 8732 270 -7615 -10527 -8231 -1030 7989 12144 8949 394 -8122 -11448 -7095 2203 8741
1114 8741 9810 6955 111 -8418 -12116 -7522 1855 9633 10719 4594 -4166 -8841 -9216 -5828 1243
1129 1243 9916 11853 4987 -4716 -10540 -9240 -2469 5233 9078 9152 4760 -3748 -11106 -10449 -2120 6259
1145 6259 10028 7988 1180 -6226 -10144 -8774 -2704 6066 11016 7906 -241 -7264 -9703 -7472 -119
$$ packed form
1040a3283K359Q318Q730N189m26q111j0658n399L365Q699J0303M369m396q673
1054C86p884l601K268Q417J0059L750m855j0029q949k490O056Q909O256K212l291
1069G214q954r452j830O657J0064P675K13o852q474n765r80N273R499Q075m72
1084A1891p533r625o088Q98P625Q889M311q74o494r687n792K178P953Q863M915
1099A1430k698q462p885k912K296P201R019M155l195q555q516l326M353R298O538
1114H741J069k855o844q529l698M594R377P778J086o125q760m675l75L388P071
1129A243Q673J937o866r703n824J300O771P702L845P4m392q508p358O57Q329Q379
1145F259L769k040o808p406l918J370O070Q770M950l110q147p023k439K231P353
$$ plain form
1160 -119 7905 10852 7018 251 -7328 -9796 -6216 1387 7947 10169 6612 -2335 -9251 -9595 -4671
1175 -4671 1243 7016 9377 5522 -2908 -9463 -10640 -4442 4931 9353 7628 3141 -2138 -7917 -9473
1190 -9473 -4200 5109 11095 9286 1637 -6143 -8493 -6281 -2392 3401 9275 9436 1507 -7882 -10955
1205 -10955 -6929 145 5982 7954 5826 1187 -5712 -10340 -7722 1565 8602 9459 5403 -789 -6172
1220 -6172 -8482 -5403 796 7727 9965 4859 -2876 -7922 -8153 -4999 1729 7867 8853 3437 -3712
1235 -3712 -8542 -8467 -3561 3070 7748 8375 4091 -3676 -9092 -7281 -692 4838 7494 7409 3302 -4113
1251 -4113 -9191 -8120 -1255 6487 8934 4783 -555 -4481 -7462 -7905 -2375 6169 10073 6205 -1568
1266 -1568 -7423 -7882 -3786 742 4790 8432 7395 -416 -8120 -8867 -3233 3347 7061 7006 3778 -1183
$$ packed form
1160a19Q024K947l834o767p579k468L580P603O560K222l557q947o916l44M924
1175d671N914N773K361l855q430o555j177O198R373M422j725m487n279n779j556
1190i473N273R309N986j809p649p780k350K212L889N793N874J61p929r389l073
1205a0955M026P074N837J972k128m639o899m628K618R287P037Q57m056o192n383
1220f172k310L079O199O931K238n106p735n046k31L154O728O138R86n416p149
1235c712m830P5M906O631M678O27m284p767n416J811O589N530K656q5m107p415
1251d113n078J071O865P742K447m151n338l926k981m43N530Q544L904l868p773
1266a568n855m59M096M528M048L642j037p811p704p47N634O580L714n5l228m961
$$ plain form
1282 -1183 -6576 -9298 -5375 2902 8359 6943 1831 -3288 -6950 -7390 -3414 2965 7876 8055 2722
1297 2722 -4392 -7609 -5595 -1488 3767 8397 7551 1543 -4959 -7678 -6100 -832 4617 7639 5893
1312 5893 961 -5801 -9219 -5838 1212 5550 6234 4635 495 -5611 -8649 -5559 1388 7830 8752
1327 8752 3570 -1992 -4947 -5677 -4597 566 7133 8859 3925 -3923 -7942 -6582 -1981 2312 4943
1342 4943 6365 4253 -2785 -8984 -7838 -1370 4815 6607 5345 1761 -2646 -6172 -6699 -2316 5338
1357 5338 8699 5838 -81 -4303 -6047 -5379 -958 4270 7349 5446 -240 -6054 -7979 -4553 295
1372 295 4755 7074 5026 -885 -6545 -6862 -3359 1269 5964 7435 4359 -918 -5987 -7409 -3394
1387 -3394 3668 6995 5529 2519 -1434 -5778 -7639 -3719 2857 7210 6404 744 -4479 -6318 -4619
$$ packed form
1282a183n393k722L923Q277N457j416n112n119l662m40L976O379M911J79n333
1297B722p114l217K014M107N255M630q46o008o502k719J578N268N449L022j746
1312E893m932o762l418L381P050M338O84j599m140o106l038L090O947O442R22
1327H752n182n562k955p30J080N163O567J726m934p848m019J360M601M293K631
1342D943J422k112p038o199J146O468O185J792j262l584m407l526n27M383P654
1357E338L361k861n919m222j744O68M421N228L079j903n686n814j925L426M848
1372B95M460K319k048n911n660l17L503M628M695J471l076n277n069j422M015
1387c394P062L327j466l010l953m344j861L920O576M353q06n660n223j839J699
$$ plain form
1402 -4619 -2339 1922 7157 7552 1714 -4939 -7174 -4353 648 4419 5710 5057 2282 -3609 -7741
1417 -7741 -5929 883 5632 5658 3229 -621 -4562 -6237 -5275 -763 5135 7461 3715 -2352 -5449 -5217
1433 -5217 -3164 1079 5759 6759 3982 -1491 -5760 -5984 -2279 2800 5736 5817 2720 -2661 -6738 -5750
1449 -5750 -1670 2356 5160 5281 1802 -3110 -6627 -6028 -1297 4309 6407 4172 426 -2418 -4674
1464 -4674 -5367 -867 4666 7300 4931 -616 -4707 -5478 -3016 -521 2737 5905 5246 -515 -6063 -6694
1480 -6694 -3043 1430 4231 4717 3127 -233 -4405 -6643 -3839 2858 6748 5535 1926 -1518 -4497
1495 -4497 -4880 -2719 1767 5548 6136 2027 -3985 -6035 -4598 -1674 1986 4940 4829 952 -3163 -5511
1511 -5511 -5048 -946 3719 5660 4449 1124 -3415 -5609 -3934 489 3947 5431 4298 730 -3873
$$ packed form
1402d619K280M261N235L95n838o653k235K821N001L771J291o53k775n891m132
1417g741J812O812M749K6k429l850l941j675R62M512N898K326l746o067l097K32
1433e217K053M243M680J000k777n473m269k24L705N079K936Q1l097n381m077R88
1449e750M080M026K804J21l479m912l517N99M731N606K098k235l746k844k256
1464d674o93M500N533K634k369n547m091p71K462K495L258L168o59n761n548o31
1480f694L651M473K801M86j590l360m172k238K804O697L890j213l609l444k979
1495d497l83K161M486L781N88m109o012k050J437K924L660K954j11l877m115k348
1511e511M63M102M665J941j211l325m539k194J675M423L458J484j133l568m603
$$ plain form
1526 -3873 -5733 -3957 566 4697 5569 2707 -1379 -4000 -5068 -3937 -158 4795 5883 2562 -2135
1541 -2135 -5157 -4733 -1731 1658 4268 5406 3404 -1563 -5732 -5077 -794 2644 4790 3971 1466 -1869
1557 -1869 -4677 -5440 -2440 3133 5868 3888 -418 -3678 -4695 -3988 -693 3209 5075 4279 840 -3897
1573 -3897 -5546 -2958 881 3735 5060 3448 -104 -3867 -5101 -3143 161 4064 4964 2661 -1431
1588 -1431 -4301 -5571 -2723 1365 4066 4254 2163 -930 -4574 -5128 -1856 2300 4996 4857 1766 -2096
1604 -2096 -3851 -3876 -1915 1804 5270 4958 1030 -3329 -4810 -3758 -827 2381 3888 3549 1122 -3027
1620 -3027 -5750 -4381 452 3792 4563 3044 -115 -2968 -4189 -3133 -118 3955 5859 3326 -1310
1635 -1310 -3950 -4079 -2561 699 3500 4119 2408 -945 -4465 -5443 -2470 1643 4101 4022 1848 -1618
$$ packed form
1526c873j860J776M523M131Q72k862m086k621j068J131L779M953J088l321m697
1541b135l022M24L002L389K610J138k002m967m169O55M283L438K146q19k505l335
1557a869k808p63L000N573K735j980m306l260j017P07L295L902J866p96l439m737
1573c897j649K588L839K854J325j612l552l763j234J958L304L903R00k303m092
1588a431k870j270K848M088K701J88k091l093l644n54L272M156K696j39l091l862
1604b096j755k5J961L719L466l12l928m359j481J052K931L208J507l39k427m149
1620c027k723J369M833L340P71j519l159k853j221J056L015M073J904k533m636
1635a310k640j29J518L260K801O19j711l353l520r78K973M113K458p9k174l466
$$ plain form
1651 -1618 -4062 -3828 -1691 1642 4359 4543 1718 -2310 -4088 -3541 -797 2475 4247 3376 806 -2107
1667 -2107 -4863 -4357 -613 2823 4303 2629 -67 -3151 -4328 -2972 -582 2424 4819 3429 -390
1682 -390 -3420 -4154 -2086 794 3363 4049 2581 -348 -3137 -4704 -2708 1394 4232 3502 1552 -1428
1698 -1428 -3515 -3957 -2149 695 3405 4465 1773 -2091 -4355 -3485 -894 1912 4179 3926 1260 -1386
1714 -1386 -3498 -3708 -807 2884 4118 3031 414 -2610 -4000 -3159 -579 2002 3870 3483 48 -3480
1730 -3480 -4471 -2696 250 2711 3993 2445 66 -2268 -3884 -2738 979 4119 4040 1657 -916 -3126
1746 -3126 -3793 -1790 664 2959 3937 2377 -1572 -4297 -3608 -1360 1371 3018 3407 1023 -1525 -3176
1762 -3176 -3384 -1181 2298 4320 3325 610 -2017 -3356 -3029 -380 1718 3266 3232 723 -2699 -4033
$$ packed form
1651a618k444K34K137L333K717J84k825m028j778N47K744L272J772q71k570k913
1667b107k756N06L744L436J480j674k696l084j177J356K390L006K395j390l819
1682c90l030p34K068K880K569O86j468k929k789j567J996M102K838p30j950k980
1698a428k087m42J808K844K710J060k692l864k264Q70K591K806K267k53k666k646
1714a386k112k10K901L691J234j087k617l024j390Q41K580K581J868l87l435l528
1730c480r91J775K946K461J282j548k379k334j616J146L717L140p9k383k573k210
1746c126o67K003K454K295R78j560l949k725O89K248K731J647L89k384k548j651
1762c176k08K203L479K022r95k715k627j339L27K649K098J548l4k509l422j334
$$ plain form
1778 -4033 -2758 -45 2201 3282 2308 -356 -2438 -3417 -2875 7 3312 4034 2016 -777 -2566 -2994
1794 -2994 -1673 974 3010 3440 2381 -739 -3612 -3653 -1132 1227 2779 3093 1194 -1458 -3215 -3527
1810 -3527 -2050 1569 3658 3230 224 -1909 -2738 -2743 -883 1763 3689 3110 1092 -1666 -3496 -2657 85
1827 85 2377 3229 2483 81 -2253 -3030 -2599 -417 2076 3523 2158 -841 -2475 -3355 -2271 530 2660
1844 2660 2922 2151 12 -2662 -3391 -1405 1425 3019 2983 1397 -844 -2335 -2782 -1735 642 2987
1860 2987 3175 554 -2111 -3004 -2573 -724 1071 2666 2358 1218 -1528 -3525 -2922 43 2546 2783
1876 2783 2447 721 -1412 -2777 -2328 -704 2086 3643 2209 -660 -2523 -2768 -2088 -43 1946 2557
1892 2557 1753 -365 -2378 -3493 -1871 911 2729 2693 1913 -295 -2446 -2637 -1063 1066 2604 3301
$$ packed form
1778d033J275K713K246J081r74k664k082r79N42K882L305P22k018k793j789m28
1794b994J321K647K036M30j059l120k873m1K521K359J552L14j899k652j757l12
1810c527J477L619K089m28l006k133q29nJ860K646J926n79k018k758j830Q39K742
1827H5K292Q52p46k402k334p77M31K182K493J447j365k999j634q80J084K801K130
1844B660K62p71k139k674p29J986K830J594l6j586k241j491m47J047K377K345
1860B987J88k621k665q93M31J849J795J595l08j140k746j997O03K965K503K37
1876B783l36j726k133j365M49J624K790J557j434k869j863k45O80K045J989O11
1892B557q04k118k013j115J622K782J818l6p80k208k151j91J574K129J538O97
$$ plain form
1908 3301 1570 -1079 -2521 -2495 -992 1381 2484 2201 600 -1105 -3016 -3101 -1039 1761 2824 2029
1924 2029 256 -1468 -2727 -2219 -490 1424 3206 2943 366 -2077 -2675 -1225 -59 1589 2686 1925
1940 1925 9 -1981 -3363 -2382 316 2547 2391 1056 -309 -2014 -2579 -1720 458 2322 3096 1742
1956 1742 -1141 -2532 -1946 -614 920 2370 2725 1293 -984 -2327 -2344 -1222 1501 2544 2079 470
1972 470 -1428 -2896 -2447 -638 1258 2265 2352 602 -1764 -2816 -1673 117 1874 2731 2048 -123
1988 -123 -1333 -2524 -1932 55 2497 2931 1367 -432 -1760 -2533 -1661 -22 1691 2349 1917 -780 -2946
2005 -2946 -2376 -735 934 1880 2220 1472 -177 -1679 -2118 -1252 1090 2875 2459 203 -940 -2021 -2189
2022 -2189 -629 865 2133 2179 728 -1958 -2978 -1828 -404 1334 2188 2055 413 -1845 -2321 -1566
$$ packed form
1908C301j731k649j442K6J503K373J103k83j601j705j911q5K062K800J063p95
1924B029j773j724j259N08J729J914J782k63k577k443n98J450J166J648J097p61
1940A925j916j990j382R81K698K231j56j335j365j705n65Q59K178J864P74j354
1956A742k883j391N86J332J534J450L55j432k277j343j7J122K723J043m65j609
1972D70j898j468M49J809J896J007Q7j750k366j052J143J790J757Q57o83k171
1988a23j210j191N92J987K442M34j564j799j328p73Q72J639J713O58m32k697k166
2005b946N70J641J669R46L40p48j649j502m39Q66K342J785m16k256j143j081j68
2022b189J560J494J268M6j451k686j020J150J424J738Q54j33j642k258m76P55
$$ plain form
2038 -1566 -121 1822 2781 1669 192 -1262 -2378 -1432 328 1834 2164 1478 -202 -2173 -2725 -1190
2054 -1190 597 1663 1830 1141 -662 -1865 -2324 -1476 409 2434 2549 580 -857 -1560 -1669 -791 821
2071 821 2058 2291 1365 -882 -2585 -1962 -347 1339 1643 1513 322 -1117 -2389 -2169 -800 1381 2200
2088 2200 1724 -254 -1508 -1713 -1502 -17 1829 2332 1903 131 -1342 -2091 -1087 726 1742 2022 1367
2105 1367 -276 -1907 -1987 -1383 255 1534 2147 795 -832 -1817 -1974 -803 595 1959 1667 852 -415
2122 -415 -1782 -1964 -466 1452 1918 1550 529 -975 -1904 -1648 -460 903 1915 1789 -142 -1723 -2035
2139 -2035 -1341 -539 967 1529 1414 308 -1194 -2196 -1723 339 1867 1845 1171 216 -1151 -1850 -1216 362
2157 362 1804 1898 1119 -864 -1903 -1857 -949 125 1266 1646 766 -807 -1908 -1962 -757 1128 1854 1440
$$ packed form
2038a566J445J943R59j112j477j454j116R46J760J506L30o86j680j971n52J535
2054a190J787J066J67o89j803j203m59Q48J885K025J15j969j437p03j09Q78J612
2071H21J237K33r26k247j703O23J615J686L04j30j191j439j272K20J369K181Q19
2088B200m76j978j254k05K11J485J846N03m29j772j473p49J004J813J016K80o55
2105A367j643j631q0O04J638J279O13j352j627r85j57J171J398J364k92q15j267
2122d15j367j82J498J918M66l68j021j504r29K56J188J363J012j26j931j581l12
2139b035O94Q02J506N62j15j106j502j002M73K062J528k2o74r55j367o99O34J578
2157C62J442R4p79j983j039M6R08J074J141L80q80j573j101n4J205J885P26m14
$$ plain form
2175 1440 622 -527 -1656 -1617 -277 1098 1872 1903 326 -1081 -1938 -1504 -200 747 1610 1255 5 -1368
2193 -1368 -2039 -1729 -242 1538 1737 882 -240 -1032 -1423 -1071 -11 1608 2111 1378 47 -1614 -1740
2210 -1740 -571 474 1314 1775 1037 -431 -1499 -1954 -950 606 1867 1268 45 -781 -1461 -1695 -629
2227 -629 647 1695 1818 697 -1122 -1784 -806 45 870 1650 1746 686 -1000 -1561 -1317 -356 1050 1674
2245 1674 795 -115 -863 -1531 -1485 -10 1238 1736 1199 41 -1467 -1585 -560 382 1125 1500 1128 82
2263 82 -981 -1651 -931 371 1909 1692 526 -510 -1355 -1446 -1059 149 1104 1189 367 -662 -2105 -1514
2281 -1514 -336 470 1383 1370 553 -601 -1267 -1184 -218 1241 2036 1178 -18 -881 -1232 -960 -326 844 1532
2300 1532 1035 -96 -1458 -1792 -1028 274 737 977 966 -192 -1191 -1458 -781 175 1396 1696 749 -414
$$ packed form
2175A440q18j149j129L9J340J375P74L1j577j407q57M34J304R47Q63l55j250j373
2193a368o71L10J487J780J99q55j122p92l91L52J060J619N03p33j331j661j26
2210a740J169J045Q40M61p38j468j068m55J004J556J261n99j223q26o80k34J066
2227f29J276J048J23j121j819o62R78Q51Q25P80R6j060j686n61K44R61J406O24
2245A674q79r10p48o68M6J475J248M98n37j158j508j18J025R42P43L75l72j046
2263H2j063o70P20J302J538k17j166j036q45r1L87J208R55Q5q22j029j443N91
2281a514J178Q06R13j3q17j154o66Q3R66J459P95q58j196q63l51K72O34J170O88
2300A532m97j131j362l34P64J302M63K40j1j158r99k67O77R56J221L00r47j163
$$ plain form
2318 -414 -976 -1169 -632 401 1572 1424 624 -471 -1724 -1531 -534 606 774 963 549 -562 -1304 -1347
2336 -1347 -314 879 1670 1422 173 -852 -1047 -972 0 954 1521 1190 15 -820 -1620 -815 231 1021
2354 1021 1046 745 133 -925 -1436 -869 171 1062 1555 621 -70 -997 -957 -658 259 1211 1417 936 -95
2373 -95 -908 -1487 -263 803 1085 1077 590 -408 -1022 -1443 -465 239 1139 1142 49 -898 -1263 -726 -215 505 1319
2394 1319 1072 354 -827 -1102 -1075 131 1029 1326 756 84 -512 -1275 -780 -398 742 1194 876 -333 -1217
2413 -1217 -966 -581 -102 804 1131 650 -240 -995 -1219 -312 740 1116 1031 352 -175 -804 -1137 -322 553 1085
2433 1085 1071 95 -815 -1197 -1049 -268 222 917 1075 308 -782 -1555 -1236 -315 859 1336 733 291 -532
2452 -532 -884 -836 -123 714 1333 1024 -39 -851 -1121 -489 49 696 929 728 -415 -841 -1349 -690 312
$$ packed form
2318d14n62j93N37J033J171j48q00j095j253J93R97J140J68J89m14j111p42m3
2336a347J033J193P91k48j249j025j95P5R72R54N67l31j175q35q00Q05J046P90
2354A021K5l01o12j058n11N67J040Q91M93r34o91r27M0K99R17R52K06m81j031
2373i5q13n79J224J066K82qm87r98o14m21R78P04R00Lj093r47l65N37N11P20Q14
2394A319k47p18j181k75K7J206Q98K97n70o72n96p63M95L82J140M52l18j209q84
2413a217K51L85M79R06L27m81q90p55k24R07J052L76q5o79n27o29l33Q15Q75N32
2433A085j4r76r10l82J48P81M90O95J58p67j090p73L19R21J174M77o03m42q23
2452e32l52M8P13Q37O19l09j063q12k70O32N38O47K33k01j143m26n08O59J002
$$ plain form
2471 312 1201 813 154 -286 -840 -1000 -697 570 1216 1028 632 -422 -1234 -814 -77 418 816 1154 479
2490 479 -693 -1230 -807 -381 414 1194 484 -257 -359 -958 -984 -103 672 1254 964 269 -755 -992 -602 269
2510 269 620 892 773 -2 -1132 -971 -748 -61 960 1131 182 -647 -602 -876 -722 99 852 810 381 -272
2530 -272 -870 -961 -132 565 820 885 687 -200 -1019 -754 145 620 1105 1028 -146 -413 -755 -895 -625 433
2550 433 1013 735 152 -729 -1104 -713 96 460 650 747 388 -747 -854 -640 218 1149 1190 490 -291 -474
2570 -474 -670 -697 -94 722 1010 657 -457 -1202 -1093 -441 364 726 649 447 -149 -873 -773 -275 620 1033
2590 1033 957 198 -571 -634 -756 -243 555 909 781 23 -725 -904 -737 -99 433 772 496 314 -700 -1366
2610 -1366 -695 -58 774 963 724 -83 -507 -568 -470 -187 627 1295 803 -207 -741 -924 -408 219 569 570 202
$$ packed form
2471C12Q89l88o59m40n54j60L03J267O46j88l96j054q12M20P37M95L98L38o75
2490D79j172n37M23M26P95P80p10p41j02n99k6Q81P75N82k90o95j024k37L90Q71
2510B69L51K72j19p75j130J61K23O87J021J71r49q29M5k74J54Q21P53m2m29o53
2530b72n98r1Q29O97K55O5j98q87q19K65Q99M75M85p7j174k67l42j40K70J058
2550D33N80k78n83q81l75L91Q09L64J90R7l59j135j07K14Q58R31M1p00p81j83
2570d74j96k7O03Q16K88l53j114p45J09O52Q05L62p7k02n96p24J00M98Q95M13
2590A033p6p59p69o3j22N13P98L54j28p58p48j79J67O38N32L39k76j82j014o66
2610a366O71O37Q32J89k39q07m24o1R8K83Q14O68m92j010n34j83N16O27L50Jl68
$$ plain form
2631 202 -106 -890 -1068 -406 177 544 663 187 -542 -558 -627 -105 287 893 1060 424 -248 -691 -773 16 744
2652 744 676 294 121 -461 -894 -822 -304 406 820 527 96 -1090 -851 -216 94 330 1228 799 -10 -829
2672 -829 -683 -417 448 1009 706 213 -300 -698 -958 -440 118 782 688 119 -474 -695 -501 -158 -168 550 784
2693 784 365 -536 -664 -618 -255 644 1020 478 380 -152 -402 -713 -25 438 678 507 6 -558 -872 -230 94
2714 94 358 599 521 23 -670 -679 -407 56 791 705 214 -36 -324 -718 -297 240 876 1115 494 -306 -817 -695
2736 -695 -227 99 221 862 169 -361 -989 -559 -214 566 725 456 -309 -467 -607 -597 -183 723 781 886 322
2757 322 -351 -828 -213 281 358 555 461 205 -623 -894 -606 100 355 457 146 -254 -463 -407 -599 45 508
2778 508 624 461 124 -381 -477 -1 433 650 285 548 27 -614 -836 -226 272 691 457 -24 -430 -492 -629
$$ packed form
2631B02l08p84j78O62N83L67J19m76p29j6o9N22L92O06J67o36o72m43q2P89P28
2652G44o8l82j73n82m33P2N18P10M14k93m31j186K39O35L10K36Q98m29q09q19
2672h29J46K66Q65N61l03m93n13l98k60N18N58O64r4n69n93k21J94L43j0P18K34
2693G84m19r01j28M6L63Q99L76n42r8n32k50l11O88M63K40j71n01n64l14O42L24
2714I4K64K41p8m98o93rK72M63P35q6m91k50k88l94M21N37O36K39o21q00n11J22
2736f95M68L26J22O41o93n30o28M30L45P80J59k69p65j58j40J0M14R06N8J05n64
2757C22o73m77O15M94P7J97r4k56q28k71K88P06K55J02l11m00k09N6j92O44M63
2778E08J16j63l37n05r6M76M34K17l65K63n21o41k22O10M98M19k34m81m06o2j37
$$ plain form
2799 -629 -267 231 490 385 180 -498 -571 -528 118 365 535 676 484 -541 -817 -176 -286 627 678 398 -252
2820 -252 -473 -765 -628 -103 417 773 125 -323 -521 -695 -221 190 443 384 561 -237 -619 -378 -290 141 990
2841 990 651 439 -351 -256 -478 -210 85 570 426 160 -395 -582 -540 -182 355 538 194 23 -272 -769 -144
2862 -144 -9 494 648 684 -60 -412 -501 -90 68 212 755 513 -142 -535 -621 -344 80 265 298 -54 -153 -412
2884 -412 -588 -531 95 619 655 76 -300 -494 -156 -68 54 669 667 30 -267 -575 -680 -158 202 523 18 72
2906 72 -341 -573 -754 -184 457 685 266 109 -293 -199 -316 195 190 747 592 13 -379 -565 -106 23 431
2927 431 597 17 -60 -372 -732 -576 59 526 240 287 -321 -295 -220 -310 135 445 586 142 -228 -453 -169 56
2949 56 250 455 361 136 -36 -317 -558 -351 442 525 236 -51 -510 -549 -325 218 -3 520 373 -110 -384
$$ packed form
2799f29L62M98K59j05k05o78p3M3O46K47J70J41j92j025k76O41j10R13N1k80o50
2820b52k21k92J37N25N20L56o48m48j98j74M74M11K53n9J77p98l82K41Q8M31Q49
2841I90l39k12p90R5k22K68K95M85j44k66n55j87M2L58N37J83l44j71k95m97O25
2862a44J35N03J54L6p44l52q9M11J58J44N43k42o55l93q6K77M24J85L3l52r9k59
2884d12j76N7O26N24L6n79l76j94L38Q8J22O15ko37k97l08j05N22L60L21n05N4
2906G2m13k32j81N70O41K28m19j57m02R4j17N11nN57j55n79l92j86M59J29M08
2927D31J66n80p7l12l60J56O35M67k86M7o08K6P5r0M45L10J41m44l70k25K84K25
2949E6J94K05r4k25j72k81k41K07P93Q3k89k87m59l9K24N43k21N23j47m83k74
$$ plain form
2970 -384 -520 -314 -120 367 606 512 120 86 -376 -273 -55 609 456 116 -33 -374 -653 -464 -134 -98 309
2991 309 70 -647 -758 -278 5 340 510 514 -10 -109 -181 -93 -279 278 667 338 328 -354 -351 -237 -19 214 189
3014 189 325 312 -559 -777 -378 -77 135 544 298 12 -194 -166 -353 170 566 453 487 -65 -209 -427 -190
3035 -190 279 515 299 455 -217 -600 -729 -258 353 212 253 -92 -303 -263 -404 -567 155 433 312 171 -329
3056 -329 -343 -365 136 491 258 138 78 -207 -422 -624 -118 317 324 49 -397 -477 -299 -335 -68 333 642 225
3078 225 -166 -380 -254 -159 182 660 411 275 -35 -315 -655 -194 61 81 324 171 -185 -274 -490 -99 89
3099 89 325 369 -45 -86 -309 -584 -126 174 456 496 54 -82 -472 -299 154 368 458 430 214 -217 -132 7
3121 7 -213 -102 676 359 -11 -457 -339 -355 -101 365 551 147 49 -30 -479 -361 279 513 566 172 -108 -127
$$ packed form
2970c84j36K06J94M87K39r4l92l4m62J03K18O64j53l40j49l41k79J89L30L6M07
2991C09k39p17j11M80K83L35J70Mn24r9p2Q8j86N57L89l29j0o82LJ14K18K33k5
3014A89J36j3q71k18L99L01K12M09k46k86k06K8j87N23L96j13L4n52j44k18K37
3035a90M69K36k16J56o72l83j29M71O11j41M1l45k11M0j41j63P22K78j21j41n00
3056c29j4k2N01L55k33j20o0k85k15k02N06M35Pk75m46q0J78l6K67M01L09m17
3078B25l91k14J26R5L41M78k49j36l10k80l40M61K55K0K43j53l56q9k16L91J88
3099H9K36M4m14m1k23k75M58L00K82M0m42j36l90J73M53K14R0k8k16m31Q5J39
3121Gk20J11P78l17l70m46J18j6K54M66J86m04r8p9m49J18O40K34N3l94k80j9
$$ plain form
3143 -127 -253 -211 -206 98 726 91 -268 -367 -406 -294 -43 341 15 -9 -352 -127 -305 -86 360 174 347 122
3165 122 -401 -27 -209 -118 -30 535 371 60 21 -459 38 -33 290 296 -33 -202 -133 -505 -198 -111 434 497 75
3188 75 -119 -163 -31 40 2 201 383 297 -28 -350 -249 -213 207 352 324 33 42 -144 -339 -240 120 604 109
3211 109 273 -127 -529 -199 -27 129 129 159 193 -261 -146 17 -30 342 311 -77 -124 -58 -139 -132 -53 95 345 211
3235 211 25 -256 -400 -236 3 -81 -3 115 67 -275 -364 -32 246 262 275 -55 -218 -165 -188 -86 140 416 375
3258 375 18 -133 -253 -405 -164 -93 269 153 137 -133 -629 -164 -26 216 382 322 54 -129 -16 -275 60
3279 60 289 330 337 -290 -453 -350 -267 264 125 114 143 -108 -332 -326 -198 -135 213 284 205 -56 -79 -333 -251 113 3
3304 3 503 113 -114 25 -108 -35 131 179 110 54 16 -377 -190 -188 -87 162 -6 -47 -340 -301 -312 53 -55 301
$$ packed form
3143a27j26M2NL04O28o35l59r9l9J12K51L84l26k4l43K25j78K19M46j86J73k25
3165A22n23L74j82R1Q8N65j64l11l9m80M97p1L23Ol29j69O9l72L07Q7N45O3m22
3188G5j94m4J32P1l8J99J82q6l25l22J01L6M20J45k8k91Rj86j95R9L60M84m95
3211A09J64m00m02L30J72J56%L0L4m54J15J63m7L72l1l88m7O6q1PP9J48K50j34
3235B11j86k81j44J64K39q4P8J18m8l42q9L32K78J6J3l30j63N3k3J02K26K76m1
3258C75l57j51j20j52K41P1L62j16j6k70m96M65J38K42J66o0k68j83J13k59L35
3279F0K29M1Po27j63J03Q3N31j39j1K9k51k24OJ28O3L48P1p9k61k3k54Q2L64j10
3304CN00l90k27J39j33P3J66M8o9n6l8l93J87KJ01K49j68m1k93L9j1L65j08L56
$$ plain form
3328 301 193 -90 -207 -113 -395 -18 241 404 229 177 -157 -420 -187 98 110 290 105 -153 -157 -219 -228 -102 121
3351 121 401 192 -207 -378 -93 112 246 362 28 -42 -74 -338 -178 78 209 119 386 -52 -282 -335 -301 -91
3373 -91 -58 349 163 -206 -309 -292 147 178 265 270 130 -187 -112 -157 61 80 466 208 119 23 -84 -290 -234 -13
3397 -13 -108 357 97 -48 -382 -202 -158 -75 240 328 193 133 62 -76 -100 162 336 190 13 6 38 54 -259 130
3421 130 379 204 -14 -396 -274 -275 30 147 3 73 60 2 -321 -71 155 244 224 57 71 19 -202 -74 43
3444 43 291 306 420 118 -503 -193 6 92 40 -29 72 -84 -101 -202 -370 66 251 360 -21 -269 -76 -66
3466 -66 191 198 184 91 173 78 -183 -148 -147 262 329 408 97 -197 -93 -398 14 273 188 225 51 0 -143 -317 164
3491 164 -16 249 80 208 26 -274 35 375 135 166 3 84 -221 -300 -546 5 216 193 -192 -145 -163 -217
$$ packed form
3328C01j08k83j17R4k82L77K59J63j75n2l34k63K33K85J2J80j85k58mo2rJ26K23
3351A21K80k09l99j71K85K05J34J16l34p0l2k64J60K56J31r0K67m38k30n3L4K10
3373i1L3M07j86l69j03J7M39L1Q7Nj40l17P5m5K18J9L86k58q9r6j07k06N6K21
3397a3r5M65k60j45l34J80M4Q3L15Q8j35o0p1j38k4K62J74j46j77pL2J6l13L89
3421A30K49j75k18l82J22jL05J17j44P0j3n8l23K50K26Q9k0j67J4n2k21J28J17
3444D3K48J5J14l02o21L10J99Q6n2o9J01j56j7j01j68M36J85J09l81k48J93J0
3466f6K57Pj4r3Q2r5k61L5JM09O7P9l11k94J04l05M12K59q5L7j74n1j43j74M81
3491A64j80K65j69J28j82l00L09L40k40L1j63Q1l05p9k46N51K11k3l85M7j8n4
$$ plain form
3513 -217 -10 15 141 219 259 -137 -181 -411 280 -63 100 250 379 86 -70 119 12 257 271 45 -16 -256
3535 -256 -286 -205 -117 121 199 -228 15 -176 -123 58 271 299 159 162 60 -136 -121 132 163 88 147 281 -114 -90
3559 -90 201 -64 106 -17 182 95 -383 -357 -436 -11 -152 -58 39 124 -36 -149 1 44 339 248 239 51 -97 -198
3583 -198 38 -79 21 276 98 28 -346 -336 34 28 25 16 -42 24 -136 76 -26 -25 7 290 105 135 -134 -187 -143
3608 -143 123 114 115 300 17 -150 -259 -67 71 -7 -120 -107 -133 -148 -197 -99 -129 75 229 -39 -64 -220 -225 -139 65
3633 65 269 214 309 -148 -250 -24 130 246 297 -41 329 -201 -124 9 -34 21 125 296 64 -278 -101 -99 -174
3656 -174 41 97 129 -16 -64 -120 137 288 162 107 -119 174 -123 -229 -156 71 311 45 -4 -302 -299 -40 194
3679 194 214 118 -166 165 -225 -8 -209 86 159 268 184 121 316 -59 -36 -27 239 87 266 -95 -135 70 -43
$$ packed form
3513b17K07K5J26P8M0l96m4k30O91l43J63J50J29k93j56J89j07K45J4k26o1k40
3535b56l0Q1Q8K38P8m27K43j91N3J81K13K8j40Lj02j96J5K53L1p5N9J34l95K4
3559i0K91k65J70j23J99q7m78K6p9M25j41R4R7Q5j60j13J50M3K95r1rj88j48j01
3583a98K36j17J00K55j78p0l74J0L70olrn8O6j60K12j02JL2K83j85L0k69n3M4
3608a43K66rJJ85k83j67j09J92J38p8j13J3k6j5m9R8l0K04J54k68k5j56nQ6K04
3633F5K04n5R5m57j02K26J54J16N1l38L70n30P7J33m3N5J04J71k32l42J77Kp5
3656a74K15N6L2j45m8n6K57J51j26n5k26K93k97j06P3K27K40k66m9k98LK59K34
3679A94K0r6k84L31l90K17k01K95P3J09q4o3J95l75K3RK66j52J79l61m0K05j13
$$ plain form
3702 -43 -37 67 -52 -71 -32 -188 -254 -25 166 264 115 58 22 -166 -73 -68 156 -100 115 44 8 -68 -31 91 -54
3727 -54 138 340 -30 -198 -185 -342 28 61 279 -65 -193 135 -67 -261 172 329 454 73 356 -305 -100
3748 -100 -237 146 290 297 23 62 -197 -164 11 -155 206 132 160 -183 -34 -128 -227 106 188 81 16 144 -175
3771 -175 -186 186 37 169 113 76 -191 -102 -54 168 -84 145 50 -150 -246 -281 -310 -184 -107 62 72 -190 54 -151
3795 -151 17 180 162 113 61 254 -75 -5 -170 -81 5 -24 -16 -52 -163 -96 -309 -92 128 109 0 -301 -164 -103
3819 -103 -102 10 195 175 241 147 -91 -142 -68 -32 361 277 -34 1 -80 -128 4 -71 206 -120 -320 -155 -166 -147 -18
3844 -18 -10 78 133 -19 -110 -57 -152 107 217 359 342 -273 250 82 3 151 5 238 -123 -254 -27 -265 -355 -46
3868 -46 32 49 47 51 -37 8 -81 172 42 140 162 -298 -168 -49 -201 103 177 143 -72 107 22 -380 -219 -108 407
$$ packed form
3702d3OJ04j19j9L9j56o6K29J91R8j49n7l6j88R3NK24k56K15p1l6p6L7J22j45
3727e4J92K02l70j68J3j57L70L3K18l44j28L28k02j94M33J57J25l81K83o61K05
3748a00j37L83J44Pk74L9k59L3J75j66L61p4K8l43J49r4r9L33Q2j07o5J28l19
3771a75j1L72j49J32n6l7k67Q9M8K22k52K29r5k00r6l5k9J26P7J69J0k62K44k05
3795a51J68J63j8m9n2J93l29P0j65Q9Q6k9Ql6j11O7k13K17K20j9j09l01J37O1
3819a03JJ12J85k0O6r4k38n1P4L6L93q4l11L5q1m8J32p5K77l26k00J65j1J9J29
3844a8QQ8N5j52r1N3r5K59J10J42j7o15N23j68p9J48j46K33l61j31K27k38r0L09
3868d6P8J7kMq8M5q9K53j30R8K2m60J30J19j52L04P4l4k15J79q5m02J61J11N15
$$ plain form
3893 407 -86 33 11 -149 25 84 304 346 -27 -169 -195 -50 16 132 -40 147 138 -19 -61 -243 -171 90 137
3916 137 -48 -333 140 -233 -214 -256 -95 34 104 104 -268 -7 -81 36 -106 250 15 6 -143 -102 -102 214 351 172
3940 172 -23 -133 -3 -63 -78 -111 155 -266 388 4 -149 -309 93 -27 141 126 176 236 8 -2 -182 57
3962 57 134 287 224 -90 -42 -15 257 -61 75 131 25 -201 -292 -227 76 10 -197 41 -29 -247 9 -231 -43
3985 -43 100 259 130 -140 -27 -136 -157 -189 168 -55 -23 19 -336 -123 -93 68 7 -162 24 200 -248 -89
4007 -89 75 67 -165 4 -232 -123 42 -86 111 128 262 234 46 129 -208 26 166 105 -78 -52 -120 -234 -123
4030 -123 148 -14 105 197 124 -158 44 -74 -25 50 -113 185 -50 239 -69 -280 -277 0 19 305 30 -1 50
4053 50 43 -268 133 41 108 39 15 111 -10 -229 67 -123 5 4 -257 151 -329 -92 167 -105 141 188 90 -88
$$ packed form
3893D07m93J19k2j60J74N9K20M2l73j42k6J45O6J16j72J87rj57m2j82P2K61M7
3916A37j85k85M73l73J9m2J61J29P0%l72K61p4J17j42L56k35rj49M1%L16J37j79
3940A72j95j10J30o0j5l3K66m21O54l84j53j60M02j20J68j5N0O0k28j0j80K39
3962E7P7J53o3l14M8K7K72l18J36N6j06k26r1O5L03o6k07K38p0k18K56k40J88
3985d3J43J59j29k70J13j09k1l2L57k23L2M2l55K13L0J61o1j69J86J76m48J59
4007h9J64qk32J69k36J09J65j28J97J7J34k8j88Q3l37K34J40o1j83K6o8j14J11
4030a23K71j62J19R2p3k82K02j18M9P5j63K98k35K89l08k11LK77J9K86k75l1N1
4053E0pl11M01r2O7o9k4R6j21k19K96j90J28jk61M08m80K37K59k72K46M7r8j78
$$ plain form
4077 -88 -365 122 149 135 10 29 -23 -326 -147 48 -67 -131 143 -128 -28 -108 -41 -133 99 206 110 -25 127
4100 127 6 -161 4 -102 22 202 219 -314 -114 40 73 273 23 -64 150 24 -207 -60 -57 -79 28 55
4122 55 66 -27 -37 -170 269 77 25 244 -64 18 -106 -138 40 -82 56 76 60 -95 -184 116 179 -148 34 -121
4146 -121 -1 226 -289 168 205 -67 -41 -95 -77 -82 60 -35 48 113 -60 -48 -136 -174 90 -145 90 -4 -99 -43 -211
4171 -211 -198 -301 -51 -20 191 -38 73 -47 -124 -87 -72 -40 194 -64 -38 -35 65 -104 138 152 -54 -139 -14 49
4195 49 12 -160 47 152 161 -62 -32 -234 -106 -37 99 49 389 116 -85 4 -97 166 57 346 143 -100 -57
4218 -57 6 -159 97 24 -35 -182 151 45 43 -46 -178 121 187 56 -5 -307 -175 -11 -22 40 327 51 95 -259
4242 -259 -2 67 92 -135 139 -7 -125 -248 134 70 127 -31 -21 200 8 182 31 229 -144 96 -140 39
$$ packed form
4077h8k77M87K7j4j25J9n2l03J79J95j15o4K74k71J00q0O7r2K32J07r6j35J52
4100A27j21j67J65j06J24J80J7n33K00J54L3K00k50q7K14j26k31J47Lk2J07K7
4122E5J1r3j0j33M39j92n2K19l08Q2j24l2J78j22J38K0j6j55q9L00O3l27J82j55
4146a21J20K27n15M57L7k72K6n4J8nJ42r5Q3O5j73J2q8l8K64k35K35r4r5N6j68
4171b11J3j03K50L1K11k29J11j20p7L7J5L2K34k58K6LJ00j69K42J4k06q5J25O3
4195D9l7j72K07J05Rk23L0k02J28O9J36n0L40k73k01Q9j01K63j09K89k03k43M3
4218e7O3j65K56p3n9j47L33j06kq9j32K99O6j31o1l02J32J64j1O2K87k76M4l54
4242b59K57O9K5k27K74j46j18j23L82o4N7j58J0K21j92J74j51J98l73K40k36J79
$$ plain form
4264 39 -10 259 -341 -260 217 167 225 252 1 -112 10 56 -5 -40 43 8 121 39 77 32 -60 -37 170 -133 54
4289 54 -2 35 -50 -71 -311 -105 107 -18 -200 -127 52 -196 125 0 177 -47 -87 -16 -47 5 194 -140 -218 23
4313 23 -215 -136 224 -4 71 9 -210 -38 -42 116 -223 71 286 63 -30 -98 -93 -342 -19 -11 -3 66 -56 115 -68
4338 -68 71 -90 -14 -170 -68 -33 -68 59 -1 -90 68 154 103 -26 14 56 61 164 -9 -74 -148 235 135 73 -175
4363 -175 121 28 19 -113 -278 -11 8 239 -108 115 136 111 47 54 -93 260 -18 160 139 -148 143 76 75 91 5
4388 5 -54 128 -93 25 -76 -80 233 190 20 4 16 91 125 -131 38 -147 105 -86 28 -29 300 -56 -39 -208
4412 -208 15 -56 1 39 45 -67 -28 -17 51 -20 -2 -121 -147 -35 -102 85 -175 122 117 -66 46 208 -15 201 83
4437 83 -143 -35 26 -63 140 78 -114 9 46 -208 -246 255 77 73 57 -76 24 -39 -86 10 123 -160 270 -87
$$ packed form
4264C9m9K69o00Q1M77n0N8K7k51j13J22M6o1l5Q3l5J13q2L8m5r2K3K07l03J87
4289E4n6L7q5k1k40K06K12j25j82P3J79k48L21j25J77k24m0P1l1N2J89l34p8K41
4313B3k38P9L60k28P5o2k19J72mJ58l39K94K15k23r3o8Nk49L23QQO9j22J71j83
4338f8J39j61P6j56J02L5l5J27o0q9J58Q6n1j29M0M2NJ03j73o5p4L83j00o2k48
4363a75K96r3rj32j65K67J9K31l47K23K1k5o4Pj47L53k78J78k1k87K91o7jJ6q6
4388En9J82k21J18j01mL13m3j70j6J2P5L4k56J69j85K52j91J14n7L29l56J7j69
4412b08K23p1N7L8Oj12L9J1O8p1J8j19k6J12o7J87k60K97nj83J12J62k23K16j18
4437H3k26J08O1q9K03o2j92J23L7k54l8N01j78mj6j33J00o3m7R6J13k83M30l57
$$ plain form
4461 -87 43 -55 -54 30 251 -151 -35 -189 -300 -436 120 -81 214 70 -33 136 -227 -56 56 -5 -54 41 -1
4484 -1 9 -11 99 60 192 -45 -80 -20 -105 -305 -77 -22 84 212 -60 207 -129 -157 -136 67 -127 -47 206 -56
4508 -56 -33 -213 216 -33 58 68 -139 -26 -114 -15 72 82 11 -12 132 -177 -26 -14 44 72 50 -66 213 24 -66
4533 -66 -9 255 246 171 -113 -164 -71 33 -25 -108 143 306 135 7 -107 -32 -2 -24 -157 -281 -9 -147 -71 53
4557 53 -191 200 -165 60 187 33 23 -32 226 89 151 249 -16 -82 74 -12 79 -20 91 168 -66 178 -93
4580 -93 -140 58 113 -60 4 -264 -257 130 31 -177 91 58 -204 89 -301 -366 152 100 -139 -92 -4 77 53 -9 -3 3
4606 3 204 68 16 -3 82 -91 -149 -68 47 74 175 223 -241 13 -25 140 95 240 -44 45 -124 -14 47 28 89
4631 89 -176 -6 -26 -131 63 -37 70 -72 149 95 150 -34 -123 171 177 -103 104 138 86 -71 -112 115 9
$$ packed form
4461h7J30r8JQ4K21m02J16j54j11j36N56k01K95j44j03J69l63J71J12o1m9R5m2
4484aJ0k0J10l9J32k37l5O0q5k00K28N5J06J28k72K67l36k8K1K03j94Q0K53k62
4508e6K3j80M29k49R1J0k07J13q8R9Q7J0p1k3J44l09J51J2N8K8k2j16K79j89r0
4533f6N7K64rp5k84n1R3J04n8q3K51J63j71j28j14P5L0k2j33j24K72j38P6J24
4557E3k44L91l65K25J27j54j0n5K58j37O2R8k65o6J56q6R1r9J11P7k34K44k71
4580i3m7J98N5j73O4k68PL87r9k08K68l3k62K93l90o5N18n2k39M7Q8Q1k4o2OO
4606CK01j36n2j9Q5j73n8Q1J15K7J01M8m64K54l8J65m5J45k84Q9j69J10O1j9O1
4631H9k65J70k0j05J94j00J07j42K21n4N5j84q9K94Ok80K07L4n2j57m1K27j06
$$ plain form
4654 9 -8 -53 179 -166 -33 -16 -75 -60 31 63 -205 6 7 39 -124 8 31 11 13 59 -135 -67 89 60 51 -3 123
4681 123 130 -25 28 -147 173 -144 -4 -35 -137 13 -190 283 -185 198 -63 -95 20 -222 143 252 147 184
4703 184 -3 27 -46 -51 -116 -272 -87 -40 -136 349 -64 -36 38 -36 -200 40 48 23 -66 -172 -29 -40 -196 76 205
4728 205 166 193 156 -157 46 366 27 -287 -313 -81 14 57 -77 36 -23 129 -120 90 -218 -140 169 30 11
4751 11 -42 -1 78 -91 -197 -114 216 -63 -230 -33 59 87 128 69 -117 -142 77 80 1 186 -253 150 37 -408
4775 -408 -168 -188 37 208 -98 -101 -89 140 45 62 258 15 -16 32 12 -3 312 -58 -193 -57 61 107 -22 -138
4799 -138 -255 140 31 -76 -25 -152 63 41 -16 23 94 90 -388 -267 104 104 155 273 355 54 64 28 -60 241 -51
4824 -51 -377 98 -40 207 -33 -19 -202 -66 -97 115 -114 -125 -126 -175 124 65 -148 138 -73 -34 10 -53 38 25
$$ packed form
4654Ij7m5K32l45J33J7n9J5R1L2k68K11JL2j63J32K3k0KM6j94O8J56k9rn4J26
4681A23Pj55N3j75L20l17J40l1j02J50k03M73m68L83k61l2J15k42L65J09j05L7
4703A84j87L0p3no5j56J85M7r6M85m13K8P4p4j64K40Qk5q9j06J43j1j56K72J29
4728B05l9K7l7l13K03L20l39l14k6K32R5M3j34J13n9J52k49K10l08P8L09j39j9
4751A1n3M1P9j69j06Q3L30k79j67J97R2K8M1n9j86k5K19Lp9J85m39M03j13m45
4775d08K40k0K25J71l06lJ2K29r5J7J96k43l1M8k0j5L15l70j35J36J18M6j29j16
4799a38j17L95j09j07N1j27K15k2n7L9P1mm78J21L71%N1J18Q2l01J0l6q8L01k92
4824e1l26M75j38K47k40J4j83J36l1K12k29j1jm9K99n9k13K86k11L9M4o3R1j3
$$ plain form
4848 25 137 -101 19 -163 107 121 4 -13 -58 12 -46 4 87 -44 393 137 -27 -174 252 229 -203 35 42 56
4872 56 -131 -84 -321 -111 -39 131 -9 -111 292 -138 47 -83 -137 -111 -6 -138 -173 13 35 186 -67 130
4894 130 134 156 36 -149 29 4 138 -83 63 125 171 -13 211 207 -299 -89 -120 -237 88 -50 136 -59 -148
4917 -148 -66 227 -70 -169 43 -6 35 159 -173 146 3 -71 -169 -141 -33 293 217 77 -122 -107 232 -230 -9
4940 -9 -11 234 -22 196 -150 -83 39 174 22 14 153 -80 -18 40 -92 42 -309 121 -192 -133 -191 -234 -36 -162
4964 -162 69 -112 47 16 -44 -16 -63 -258 153 -41 54 195 -67 -35 -128 -8 32 5 -116 49 -2 91 -30 -165
4988 -165 -153 -69 57 -42 30 157 170 21 230 -295 -22 -156 187 45 -54 -82 123 259 -7 11 -46 43 -110
5011 -110 -146 -7 -137 43 21 30 51 -245 -65 3 99 196 221 202 -38 27 -119 89 38 -194 -90 -116 -25 15 44
$$ packed form
4848B5J12k38J20j82K70J4j17j7m5P0n8N0Q3j31M37k56j64j47M26k3m32K38PJ4
4872E6j87M7k37K10P2J70j40j02M03m30J85j30n4K6J05j32l5J86K2J51k53J97
4894A30MK2j20j85J78k5J34k21J46O2M6j84K24mn06K10l1j17L25j38J86j95q9
4917a48Q2K93k97r9K12m9M1J24l32L19j43p4r8K8J08L26p6j40j99J5L39m62K21
4940ikK45k56K18l46O7J22J35j52qJ39k33O2N8j32J34l51M30l13N9n8m3J98j26
4964a62K31j81J59l1o0K8m7j95M11j94R5J41k62L2r3J20M0k7j21J65n1R3j21j35
4988a65J2Q4J26r9P2J27J3j49K09n25K73j34L43j42r9k8K05J36k66J8n7Q9j53
5011a10l6J39j30J80k2RK1k96J80O8R6R7K5j9k40O5j46K08n1k32J04k6R1M0K9
$$ plain form
5036 44 -31 -143 88 -224 -13 202 -75 -47 -277 204 221 79 -251 43 86 -69 -48 293 71 -65 30 -183
5058 -183 -18 -24 8 -68 19 25 -101 113 173 -218 -209 170 138 14 -69 106 -100 217 -56 61 14 80 109 -19 1
5083 1 -85 26 140 108 135 -22 -65 169 -2 30 93 65 -118 13 -17 -49 -11 158 219 35 -16 142 36 96 126
5108 126 76 110 -137 -26 -6 -148 -35 70 64 39 172 105 65 68 14 166 31 -58 80 93 -45 -80 -120 -68 -65 187
5134 187 -59 -125 -13 115 114 92 -109 196 70 143 -49 -110 -108 157 60 -226 39 -85 -26 -101 -172 76 -65 -26
5158 -26 -24 -69 152 -49 -1 -56 -101 -136 -85 -94 -207 -216 -16 -75 14 61 -74 147 -198 -59 26 75 -228 -68 6 -150
5184 -150 -45 -35 33 -111 131 50 -192 124 181 30 224 122 1 2 -115 -50 142 -58 -77 1 -229 165 1
5207 1 62 -49 -12 17 153 -132 28 -112 46 -115 96 116 -20 -48 20 -57 -40 -73 44 213 141 241 80 -139
$$ packed form
5036D4p5j12K31l12K11K15k77K8k30M81J7j42l30K94M3j55K1L41k22j36R5k13
5058a83J65oL2p6Q7Oj26K14O0l91RL79l2j24q3J75k06L17k73J17m7O6K9j28K0
5083Aq6J11J14l2K7j57m3K34j71L2O3k8j83J31l0l2L8J69O1j84n1J58j06O0L0
5108A26n0L4k47J11K0j42J13J05ok5J33o7m0Ln4J52j35q9J38J3j38l5m0N2LK52
5134A87k46o6J12J28jk2k01L05j26P3j92o1KK65r7k86K65j24N9p5p1K48j41L9
5158b6Km5K21k01M8n5m5l5N1rj13rK00n9Q9M7j35K21l45J39Q5M9l03J60P4j56
5184a50J05J0O8j44K42q1k42L16N7j51J94j02j21Jj17O5J92k00j9P8k30L94j64
5207AO1j11L7K9J36k85J60j40J58j61K11K0j36k8O8p7J7l3J17J69p2J00j61k19
$$ plain form
5231 -139 -53 -169 -61 99 46 -150 -24 90 106 157 173 222 269 38 -383 63 136 -138 55 108 -13 -97 -17 135
5255 135 39 15 -93 43 -162 96 160 -43 75 -25 162 10 -40 -26 243 55 -82 65 -32 -159 60 -126
5277 -126 -61 44 17 55 162 255 -80 -124 38 -33 -52 -8 -183 57 28 28 -106 129 -38 -19 -119 -11 18 -51 104
5302 104 232 87 -148 -115 35 -25 -87 52 -106 198 132 105 -131 35 34 62 -5 -67 126 99 165 -288 -146 -59
5326 -59 -216 -210 188 132 -64 123 -94 -136 115 -3 11 5 61 94 16 91 111 -15 -41 -81 57 134 164 -22 -281 272
$$ packed form
5231a39Q6j16J08J60n3j96J26J14J6N1J6M9M7k31m21M46P3k74J93N3j21q4Q0J52
5255A35r6k4j08J36k05K58O4k03J18j00J87j52n0J4K69j88j37J47r7j27K19j86
5277a26O5J05k7L8J07R3l35m4J62p1j9M4j75K40k9%j34K35j67J9j00J08K9o9J55
5302A04J28j45k35L3J50o0o2J39j58L04o6k7k36J66jK8o7o2J93k7O6m53J42Q7
5326e9j57OL98n6j96J87k17m2K51j18J4oN6L3p8P5K0j26k6m0J38P7L0j86k59N53
$$ [...]
8191D
##END NTUPLES=NMR FID
##END=
