##TITLE=1H ikalashn
AMBC 1211
12.11.2024
##JCAMPDX= 6.0         $$ Bruker NMR JCAMP-DX V2.0
##DATA TYPE= NMR FID
##DATA CLASS= NTUPLES
##ORIGIN= UXNMR, Bruker Analytische Messtechnik GmbH
##OWNER= root
$$ TOPSPIN		Version 1.3
$$ 2024-11-12 15:08:34.343 +0400  Irina@DPX200
$$ Compression mode = diff/dup
##.OBSERVE FREQUENCY= 200.131300845
##.OBSERVE NUCLEUS= ^1H
##.DELAY= (6, 6)
##.ACQUISITION MODE= SIMULTANEOUS
##.ACQUISITION SCHEME= undefined
##.AVERAGES= 32
##.DIGITISER RES= 18
##SPECTROMETER/DATA SYSTEM= spect
##.PULSE SEQUENCE= zg
##.SOLVENT NAME= CDCl3
##.SHIFT REFERENCE= INTERNAL, CDCl3, 1, 17.49637
##AUDIT TRAIL= $$ (NUMBER, WHEN, WHO, WHERE, WHAT)
$$ ##TITLE= Audit trail, TOPSPIN		Version 1.3
$$ ##JCAMPDX= 5.01
$$ ##ORIGIN= Bruker BioSpin GmbH
$$ ##OWNER= Irina
$$ $$ F:/spectra/data/iren/nmr/1H/4/audita.txt
$$ ##AUDIT TRAIL=  $$ (NUMBER, WHEN, WHO, WHERE, VERSION, WHAT)
(   1,<2024-11-12 15:07:11.703 +0400>,<Irina>,<DPX200>,<TOPSPIN 1.3>,
      <created by zg
	started at 2024-11-12 15:04:59.312 +0400,
	POWCHK disabled, PULCHK disabled
       configuration hash MD5:
       BE 6D 3F 07 2A EA 11 49 91 17 2B D3 AF B3 58 0D
       data hash MD5: 16K
       90 D1 9E EF AF 2F 18 A6 A5 AE 8B 2D F3 95 5D D4>)
$$ ##END=
$$ 
$$ $$ hash MD5
$$ $$ 9B 33 D0 A6 23 58 B5 E2 71 A8 EA 8F A7 53 4D 71
##$RELAX= 
##$RELAX= 
##$RELAX= 
##$RELAX= 
##$RELAX= 
##$RELAX= 
##$RELAX= 
##$RELAX= 
##$RELAX= 
$$ Bruker specific parameters
$$ --------------------------
##$DU= <F:/spectra>
##$EXPNO= 4
##$NAME= <1H>
##$PROCNO= 1
##$TYPE= <nmr>
##$USER= <iren>
##$AMP= (0..31)
100 100 100 100 100 100 100 100 100 100 100 100 100 100 100 100 100 100 
100 100 100 100 100 100 100 100 100 100 100 100 100 100 
##$ANAVPT= -1
##$AQSEQ= 0
##$AQ_mod= 1
##$AUNM= <au_zg>
##$AUTOPOS= <>
##$BF1= 200.13
##$BF2= 200.13
##$BF3= 200.13
##$BF4= 200.13
##$BF5= 200.13
##$BF6= 200.13
##$BF7= 200.13
##$BF8= 200.13
##$BYTORDA= 1
##$CFDGTYP= 0
##$CFRGTYP= 5
##$CHEMSTR= <none>
##$CNST= (0..63)
1 1 145 1 1 1 1 1 1 1 1 1 1 1 1 1 1 1 1 1 1 1 1 1 1 1 1 1 1 1 1 1 1 1 
1 1 1 1 1 1 1 1 1 1 1 1 1 1 1 1 1 1 1 1 1 1 1 1 1 1 1 1 1 1 
##$CPDPRG= <>
##$CPDPRG1= <>
##$CPDPRG2= <>
##$CPDPRG3= <>
##$CPDPRG4= <mlev>
##$CPDPRG5= <mlev>
##$CPDPRG6= <mlev>
##$CPDPRG7= <mlev>
##$CPDPRG8= <mlev>
##$CPDPRGB= <>
##$CPDPRGT= <>
##$D= (0..63)
0 2 0 0 0 0 0 0 0 0.06 0 0.03 0 0 0 0 0.0002 0 0 0 0 0 0 0 0 0 0 0 0 0 
0 0 0 0 0 0 0 0 0 0 0 0 0 0 0 0 0 0 0 0 0 0 0 0 0 0 0 0 0 0 0 0 0 0 
##$DATE= 1731409626
##$DBL= (0..7)
120 120 120 120 120 120 120 120 
##$DBP= (0..7)
150 150 150 150 150 150 150 150 
##$DBP07= 0
##$DBPNAM0= <>
##$DBPNAM1= <>
##$DBPNAM2= <>
##$DBPNAM3= <>
##$DBPNAM4= <>
##$DBPNAM5= <>
##$DBPNAM6= <>
##$DBPNAM7= <>
##$DBPOAL= (0..7)
0.5 0.5 0.5 0.5 0.5 0.5 0.5 0.5 
##$DBPOFFS= (0..7)
0 0 0 0 0 0 0 0 
##$DE= 6
##$DECBNUC= <off>
##$DECIM= 32
##$DECNUC= <off>
##$DECSTAT= 4
##$DIGMOD= 1
##$DIGTYP= 9
##$DL= (0..7)
0 120 120 120 120 120 120 120 
##$DP= (0..7)
150 150 150 150 150 150 150 150 
##$DP07= 0
##$DPNAME0= <>
$$ [...]
##$SW= 21.9926040160658
##$SWIBOX= (0..15)
0 0 2 0 0 0 0 0 0 0 0 0 0 0 0 0 
##$SW_h= 4401.40845070422
##$TD= 16384
##$TD0= 1
##$TE= 300
##$TE2= 300
##$TE3= 300
##$TEG= 300
##$TL= (0..7)
0 120 120 120 120 120 120 120 
##$TP= (0..7)
150 150 150 150 150 150 150 150 
##$TP07= 0
##$TPNAME0= <>
##$TPNAME1= <>
##$TPNAME2= <>
##$TPNAME3= <>
##$TPNAME4= <>
##$TPNAME5= <>
##$TPNAME6= <>
##$TPNAME7= <>
##$TPOAL= (0..7)
0.5 0.5 0.5 0.5 0.5 0.5 0.5 0.5 
##$TPOFFS= (0..7)
0 0 0 0 0 0 0 0 
##$TUNHIN= 0
##$TUNHOUT= 0
##$TUNXOUT= 0
##$USERA1= <user>
##$USERA2= <user>
##$USERA3= <user>
##$USERA4= <user>
##$USERA5= <user>
##$V9= 5
##$VALIST= <valist>
##$VCLIST= <CCCCCCCCCCCCCCC>
##$VD= 0
##$VDLIST= <DDDDDDDDDDDDDDD>
##$VPLIST= <PPPPPPPPPPPPPPP>
##$VTLIST= <TTTTTTTTTTTTTTT>
##$WBST= 1024
##$WBSW= 25
##$XGAIN= (0..3)
0 0 0 0 
##$XL= 0
##$YL= 0
##$YMAX_a= 1092012
##$YMIN_a= -610345
##$ZGOPTNS= <>
##$ZL1= 120
##$ZL2= 120
##$ZL3= 120
##$ZL4= 120
##$ABSF1= 10
##$ABSF2= 0
##$ABSG= 5
##$ABSL= 3
##$ALPHA= 0
##$AQORDER= 0
##$ASSFAC= 0
##$ASSFACI= 0
##$ASSFACX= 0
##$ASSWID= 0
##$AUNMP= <proc_1d>
##$AXLEFT= 0
##$AXRIGHT= 0
##$AXTYPE= 0
##$AXUNIT= <>
##$AZFE= 0.1
##$AZFW= 0.1
##$BCFW= 1
##$BC_mod= 2
##$BYTORDP= 1
##$COROFFS= 0
##$CY= 7568.61572265625
##$DATMOD= 1
##$DC= 2
##$DFILT= <>
##$DTYPP= 0
##$F1P= 17.9538593292236
##$F2P= -4.03888763876832
##$FCOR= 0.5
##$FTSIZE= 32768
##$FT_mod= 4
##$GAMMA= 1
##$GB= 1
##$INTBC= 1
##$INTSCL= 1
##$ISEN= 128
##$LB= -0.5
##$LEV0= 0
##$LPBIN= 0
##$MAXI= 945.577
##$MC2= 0
##$MEAN= 0
##$ME_mod= 0
##$MI= -402.1523
##$NCOEF= 0
##$NC_proc= 0
##$NLEV= 6
##$NOISF1= 8.587773
##$NOISF2= 6.764455
##$NSP= 1
##$NTH_PI= 0
##$NZP= 0
##$OFFSET= 17.49637
##$PC= 1
##$PHC0= 121.0826
##$PHC1= 3.548266
##$PH_mod= 0
##$PKNL= yes
##$PPARMOD= 0
##$PPDIAG= 0
##$PPIPTYP= 0
##$PPMPNUM= 100
##$PPRESOL= 1
##$PSCAL= 0
##$PSIGN= 0
##$REVERSE= no
##$SF= 200.13
##$SI= 32768
##$SIGF1= 18.5376
##$SIGF2= -6.396296
##$SINO= 400
##$SIOLD= 32768
##$SREGLST= <1H.CDCl3>
##$SSB= 3
##$STSI= 0
##$STSR= 0
##$SW_p= 4401.40845070422
##$SYMM= 0
##$S_DEV= 0
##$TDeff= 0
##$TDoff= 0
##$TI= <>
##$TILT= no
##$TM1= 0
##$TM2= 0
##$TOPLEV= 0
##$USERP1= <user>
##$USERP2= <user>
##$USERP3= <user>
##$USERP4= <user>
##$USERP5= <user>
##$WDW= 1
##$XDIM= 8192
##$YMAX_p= 0
##$YMIN_p= 0
$$ End of Bruker specific parameters
$$ ---------------------------------
##NTUPLES= NMR FID
##VAR_NAME=  TIME,          FID/REAL,        FID/IMAG
##SYMBOL=    X,             R,               I
##VAR_TYPE=  INDEPENDENT,   DEPENDENT,       DEPENDENT
##VAR_FORM=  AFFN,          ASDF,            ASDF
##VAR_DIM=   8192,          8192,            8192
##UNITS=     SECONDS,       ARBITRARY UNITS, ARBITRARY UNITS
##FACTOR=    0.0002272,     1,               1
##FIRST=     0,             0,               0
##LAST=      1.8609952,     -42,             303
##MIN=       0,             -610345,         -610345
##MAX=       1.8609952,     1092012,         1092012
$$ Real data points
##PAGE= N=1
##DATA TABLE= (X++(R..R)), XYDATA
$$ [...]
2163G93j672j587O33J465J486Q33M59j439k084o11O58J248P87J077oj813k047
2180a820q4P32M47J394J129k30j944j309n17J120Q34J234Q67J3k290j606L30J312
2198c88R40M04J130Lk223j768K5J226J416M67N96o07j971j024r0Q11J682N72j1
2217A190n58j599r20K36J298R14J203L2j117j810l94L64Q96J119P03J94j596j538
2235a383k52L95Q15J857k2j46j553j335n57J162J090J090M1J74j229j173n55J228
2253c53J090P37L00q58q87n55p37NJ565J449l46o17j570r32l4R35J040J065Q06
2272B103j745j405p48N57O98J323Q93p6j032j510n7J95O26J457M40o85j032r04
2290i02j71k07J419Q67L84p58j207o46m27K56O77K079L51j022j185k95M39m21
$$ plain form
2163 793 -879 -2466 -1833 -368 1118 1951 2410 971 -1113 -1724 -1066 182 969 2046 2040 227 -1820
2180 -1820 -1904 -1172 -725 669 1798 1568 -376 -1685 -2202 -1082 -248 986 1853 1866 -424 -2030 -1700 -388
2198 -388 552 956 2086 2089 -134 -1902 -1877 -651 765 1232 1828 1221 -750 -1774 -1864 -1053 629 1201 1190
2217 1190 632 -967 -1887 -1651 -353 561 1764 1796 679 -1131 -1525 -1161 -265 854 1557 1751 155 -1383
2235 -1383 -1635 -1240 -425 1432 1410 1264 -289 -1624 -2181 -1019 71 1161 1202 1376 147 -1026 -1581 -353
2253 -353 737 1474 1774 916 29 -526 -1263 -1258 307 1756 1410 793 -777 -1709 -1743 -808 232 1297 2103
2272 2103 358 -1047 -1795 -1238 -540 783 1676 1600 568 -942 -999 -804 -178 1279 1719 1034 2 -902
2290 -902 -1073 -1280 139 1006 1390 632 -575 -1221 -1648 -1392 -715 1364 1715 693 -492 -787 -348 -769
2308g69P40J509M37j220j302l29j89L22J280O72M29j106j495l29J23N23N45J308
2326A149qr15j308l81L56M11J371J331p25j555l90jk37K97J652R74j129j858m23
2345a389N72J98K92O04J096p22j534j92L50J33K79R69Q70p14j260n82J73K30J095
2364D68Q30n6o29q98o07k80R42L68J322l71r81q92k25M8p4J204J369l53j465r51
2384a231P48K9k49J330J201k97j522j190Q8L83P56N29R44n78q37j299l6Q53L64
2403a4L45Q55l50j315n12O0J66P03J293j77q17n24l74R2k98J475O99Lo21j248
2423e59k39jK0R13Q63L67j382q82J15l0q9Q63J280l15j035q57j76L64O45P92O04
2444A261o00l42o98o89M79P55Q20J35l99j121l28K9k03N51J308J49j055p94K80
$$ plain form
2308 -769 -29 1480 1917 697 -605 -934 -1123 -801 479 1151 1580 474 -1021 -1350 -1227 -704 -159 1149
2326 1149 1141 226 -1082 -1463 -1107 -696 675 2006 1281 -274 -664 -665 -902 -605 1047 2021 892 -966 -1389
2345 -1389 -817 -619 -327 277 1373 651 -883 -1075 -725 -592 -313 656 1526 812 -448 -1030 -857 -627 468
2364 468 1298 1242 613 -285 -892 -1172 -230 138 1460 1089 108 -784 -1009 -961 -1035 169 1538 1185 -280 -1231
2384 -1231 -483 -454 -703 627 1828 1531 9 -1181 -1093 -710 46 575 1519 941 104 -1195 -1231 -378 -14
2403 -14 331 1186 836 -479 -991 -931 -765 -62 1231 1054 237 -287 -661 -569 -867 608 1307 1310 689 -559
2423 -559 -798 -799 -779 134 997 1364 -18 -900 -785 -815 -904 -41 1239 924 -111 -968 -1144 -780 -135 657 1261
2444 1261 661 319 -379 -1068 -589 166 986 1121 722 -399 -727 -698 -901 -350 958 1107 52 -742 -462
2463d62l03m19J041J210no27p69k91K3N03L72R81n1o58o52q24K09L13Q78P34l38
2484H65q08o62n81k01M16J583Q03p81j069K27m46j81K59J240M52l15r10p21L82
2503d48n2M52N77Q92l97j513q38N08n1K47J241J42m12q12l54m99O34Q08N33Kk35
2524D25n63p27M44L04N82Q08j82p80m14k71l07k81R49J124k58q40n10k67qL43
2544d29M81P47j04q36l33p9p2O11L34R14l38p24k27n05J03P01P02o1l88p32l53
2565e88k63N48L39M75L0j30m07p18M3j15J036K91J71l03p37m7K44l94O95R75n30
2586F15j74q87j61J82P8O47L76j03j20p45o59j3Q61K41P5p1M4n33n54L54M71L82
2608C06N02j21l69m08l30n4M98O95L2k21m32l44l02j74P69O27l39K8n65k84j80
$$ plain form
2463 -462 -765 -1184 -143 1067 1062 435 -334 -625 -602 -99 273 1254 1203 545 -107 -931 -722 -409 469 1203 865
2484 865 57 -605 -1186 -1387 -971 612 1415 634 -435 -208 -654 -835 -576 664 1116 801 -109 -830 -448
2503 -448 -500 -48 529 1421 1024 -489 -1327 -819 -870 -623 618 760 348 -464 -818 -1317 -683 125 658 660 425
2524 425 -138 -865 -421 -117 465 1273 1091 311 -103 -374 -681 -962 -13 1111 853 13 -497 -764 -772 -429
2544 -429 52 799 695 -141 -474 -553 -625 -14 320 1234 896 172 -55 -560 -457 244 946 885 497 -235 -588
2565 -588 -851 -303 36 511 541 411 4 -714 -671 -786 250 541 712 409 -328 -375 -131 -525 170 1145 615
2586 615 441 -446 -607 -425 -347 300 676 573 453 -292 -951 -964 -103 138 213 142 186 -347 -901 -547 -76 306
2608 306 808 687 318 -90 -420 -474 24 719 751 530 98 -246 -548 -722 47 674 335 363 -202 -486 -666
2629f66J31Q56L69J64n71j94p43J81J0O77M96k74k18J30p73n60O49R30L3l75l83
2650a31l64j54m1K28O92N57n84n12J36l34R2K54Q11L73n69n81j01n8q8L68K97
2671B91L68m1o13p24N0L81J73M13K4k14j62m29N8j16L17Q98K91j073J02l18j60
2692d84J31Q25K82j41n16k00l44k5K20N27j3K98o74n20M52m92Q02R9N83j68n59
2713H3o17J33j9K58N93J84k26l41o7j01k44P84r0L58o44j22l26r3K60k4K92N92
2735F23m13r17qJ22P0O01K92M88p76m39R5k82M40K04O37j23J0o21q50L97Q49j84
2757B15J2Q1j09k05p63J99N09M1K72j19J57n97m04L38L42N93k52J02o2j016J58
2778e08Q50q5O4J75K08n60o13n4M90K38J9J77j68m51k96K8J8P75m5J76J35l73
$$ plain form
2629 -666 -535 321 690 854 283 89 -654 -473 -463 214 710 436 218 348 -425 -985 -336 594 627 252 -131
2650 -131 -495 -649 -690 -462 230 787 203 -309 -173 -507 -415 -161 650 1023 454 -127 -228 -286 -374 -6 291
2671 291 659 618 5 -719 -669 -288 -115 298 322 108 -54 -483 -425 -541 -224 674 965 -108 -6 -324 -484
2692 -484 -353 472 754 613 97 -103 -447 -472 -252 275 262 560 -114 -634 -182 -674 128 227 810 642 83
2713 83 -534 -401 -420 -162 431 615 389 48 -19 -120 -364 420 330 688 44 -78 -404 -497 -237 -261 31 623
2735 623 210 -707 -715 -593 -523 78 370 858 82 -357 -262 -544 -104 100 737 614 624 3 -847 -450 399 215
2757 215 227 308 199 -6 -769 -570 -61 -20 252 133 290 -307 -711 -373 -31 562 310 412 350 -666 -508
2778 -508 342 257 321 496 704 144 -469 -523 -33 205 224 401 233 -218 -514 -486 -468 307 262 438 573 200
2800B00o35lM92m2L04k61K52l58p05J56M14L05K32p2m97N0m98o9N98K82r8J8j07
2823d2k16l37K24M58K51m1K64k07l69n87N93M31j93M12k80o17j81j33J97L18M62
2844D07m32J84r2j56n20o6P20p4OM06j90j94m44L68P8M87j83J05o60L61k60k81
2866d30O95k06N78p63j52J43k05K55k8K58Qk4k51k10J65L7O05j73M02q33J90m08
2888c47K22M42R2k37K10j51o62O2L2L87K56q0O0o82q3O02k18P7M95j95k26L3k27
2911a38K65K2km9P3L06m28m34K58OL73n9J18m58n2m64J97L12K59K70p5j50j04
2934D6l34O84m47n8M18J44n06m93N51j51k27L97L53L9l39m82N16j96Q6J15O8J1
2956A95k22k62j58N12k39O07l29J31j73n10K82qO54O5j77k42l87k50O42j34K07
$$ plain form
2800 200 -435 -438 54 12 316 55 307 -51 -756 -600 -186 119 351 279 -218 -168 -666 -735 -137 145 47 65 -42
2823 -42 -258 -595 -371 87 338 297 561 354 -15 -602 -9 422 229 641 361 -256 -437 -570 -373 -55 407
2844 407 -25 159 67 -89 -609 -675 45 -29 -23 383 193 -1 -445 -77 1 488 305 410 -250 111 -149 -430
2866 -430 265 59 637 -126 -278 -135 -340 -85 -113 145 153 129 -122 -332 -167 -130 475 302 704 -129 61 -347
2888 -347 -125 317 409 172 382 231 -431 -369 -337 50 306 226 286 -396 -479 123 -95 -18 477 282 56 89 -138
2911 -138 127 149 147 98 171 477 49 -385 -127 -121 252 193 311 -147 -199 -663 -466 -154 105 375 300 150 46
2934 46 -288 396 -51 -109 309 453 -53 -546 5 -146 -373 24 377 416 77 -405 111 -85 1 116 184 195
2956 195 -27 -289 -447 65 -174 433 104 235 62 -448 -166 -174 480 545 368 126 -261 -511 131 -3 204
2977B04n5L37m81l09j08K39K43m62P34K88n83l79J37J11L43q2k01O54j79o70n2
2998b71M53P3j26k5M01m03k01k79O3N60k32p0K89l82j99K17K66J85j49q9J61n59
3020c17KK82J53j91J50K23K46o63l43M6M64K5k40K78o7l46j84Q5L40O1K75j25
3042A54l93K89m24J69K8J31J79k95L86o11m4M35M6J79M2j14o2m98Q3J06o8M53
3064A71j10K18l22j79p6L23J52M6m8p1Q4m66J31O0L91L7j19J94k26m16M25l89
3086a90J62L84l92K49o24R7L5%P9L55j44N0J75m54J03Q5K32J36J10k96j99k97
3108c44K21L87l27N63m50l9j67r0L47k83Q5J47J28m81M19k72k60L25J85J77j36
3129A35J29n83L88j19qJ96K54n21M4K26j78K0%L44r3k77j01k63J24j34L05K73
$$ plain form
2977 204 149 486 5 -304 -412 -173 70 -392 342 630 47 -332 -195 -84 259 177 -24 630 451 -219 -271
2998 -271 182 255 129 104 505 102 -99 -378 -315 245 13 -57 232 -150 -349 -132 134 319 170 81 242 -317
3020 -317 -315 -33 120 -71 79 302 548 -115 -458 -412 52 77 -163 115 48 -298 -482 -397 -57 4 279 154
3042 154 -239 50 -374 -205 -177 -46 133 -162 224 -387 -431 4 50 229 271 157 95 -403 -320 -214 -282 171
3064 171 61 279 -43 -222 -298 25 177 223 175 104 188 -278 -147 -87 304 341 222 416 190 -226 199 -190
3086 -190 -28 356 -36 213 -411 -314 -279 -279 -200 155 11 61 236 -218 -115 -30 202 338 448 152 -47 -344
3108 -344 -123 264 -63 500 50 11 -156 -246 101 -182 -97 50 178 -303 116 -156 -416 -91 94 271 135
3129 135 264 -319 69 -50 -58 138 392 -129 -85 141 -37 -17 -17 327 234 -43 -144 -407 -283 -417 -112 161
3151A61K04k54j33l71K83K74k71L91j91j56j65j17K11M6J78J96l2rm35K08k24
3172b06K44K45k26j69j20l5N4j97K54J96O3P0K10m42O8k43K75O8p7J84k5r8o93
3195f00K54M54k7q1J47l87q5J17J82K61j03m1J92m88o0K61J88j28R1L26l43j7
3217A13m10j55L91M02l80J37L5j72l26L14J64J9K90j75k17l10M1K60m5J35j9j
3239I1q2L84l33j62J10O27o68pj8K55n25P2J81M10l90j04K30k80j84K96L44K7
3261B74n77L43m7m65L01j31K04L15J5k17R7j71J2J00J43n57L22j57Q0j63m8M75
3283A48Q2k08l80NL24r0P9m08O30K13m69j57L53j6l24K01k5K41m32K53q3P1J87
3306A95m4k35J03j20J27o6j45L26k02j00r2L35m9k20M26k0K31n4l58J39m6m32
$$ plain form
3151 161 365 111 -22 -393 -110 164 -107 284 93 -63 -228 -345 -134 -88 90 286 254 245 -190 18 -206
3172 -206 38 283 57 -112 -232 -267 -213 -410 -156 40 103 173 383 -59 9 -234 41 109 32 216 191 93 -600
3195 -600 -346 108 81 0 147 -240 -325 -208 -26 235 132 91 283 -205 -265 -4 184 56 147 473 130 113
3217 113 -297 -452 -61 341 -39 98 133 -39 -365 -51 113 132 422 247 30 -280 -239 21 -24 111 92 91
3239 91 9 393 60 -102 8 635 -33 -40 -58 197 -328 -256 -75 335 -55 -159 71 -209 -393 -97 247 274
3261 274 -303 40 -7 -472 -171 -302 -98 217 232 15 112 -59 -47 53 196 -361 -39 -196 -116 -279 -327 148
3283 148 230 22 -358 -353 -29 -119 -40 -448 182 395 -74 -231 122 106 -218 -17 -42 199 -233 20 -63 8 195
3306 195 151 -84 19 -101 26 -40 -185 141 -61 -161 -253 82 33 -187 239 219 450 396 38 177 131 -301
3328c01O00l12j7M6K65j61j07m18J97L5L09Ok04J89j71l23K74K24k53K55j75K5
3350a7k29K15p6K32p4k13L49j13L1l07M3J65j49op5Q4j0j49K5K23K63m25K09j79
3374a83M16l77Q8L9K00k7l0M4l71Q3J30L7j72L60k31p4l22J25O1L42J7l08RJ48
3398Dj63P9j71L92j89j08J46J43j64J37Q5r2j58q6M31L3n08J23L44l15L76m26
3420h7O54m25k91j94R5M89k89P4L16j90o54O96l18K26j21N4L89m88j81L77j77
3441d5Q0J32M0m67K11q9L51o44N22j41M23j89k14j17M2K62j64M17m38N2k67R1
3463a52k31L87J27k84M05m71N6J41Q4N7j40p8Q05q32o9L16n96N11k08M09J7k62
3485hm58J09J22M15k6J94m21l6j37O09l38j00J21l33J16K36k96J02K2K97l14K74
$$ plain form
3328 -301 299 -13 -30 16 281 120 13 -405 -208 -173 136 142 -62 127 -44 -367 -93 131 -122 133 -42 -17
3350 -17 -246 -31 -107 125 51 -162 187 74 105 -202 -159 6 -143 -149 -224 -140 -150 -299 -274 -51 212 -213 -4 -183
3374 -183 233 -144 -56 -17 183 156 126 170 -201 -118 12 49 -123 237 6 -68 -390 -265 -204 138 155 -153 -144 4
3398 4 -159 -80 -251 141 -48 -156 -10 133 -31 106 191 99 -59 -145 286 319 -189 -66 278 -37 339 -87
3420 -87 567 142 -149 -343 -248 241 -48 26 342 152 -502 194 -124 102 -19 35 424 -64 -245 132 -45
3441 -45 35 167 207 -260 -49 -138 213 -431 91 -50 373 184 -30 -147 -105 157 -7 410 -28 24 -243 -152
3463 -152 -383 4 131 -153 252 -219 -163 -22 62 119 -21 -99 706 -126 -195 121 -475 36 -172 237 254 -8
3485 -8 -466 -357 -235 180 154 348 -73 -109 -246 363 25 -75 46 -287 -171 65 -231 -129 -107 190 -124 150
3507A50l60L01j08l13K59K09q6Q6k51j78P7J78N5R8J02k31L07n36j43L76K53m71
3529b26J17n7R6k4M6K13l11K8k19N61k27k22L85n18L42K53j22Jo0q9J41j34j94
3552b20P7M17j86l64N4L86j96j84K39M38n14L1j78K24J21k05J99j69K20j33k19
3573a62J36J66J2j1l1m18OM54j33L2l13L98k23K36p2k62N1p3K24K58n22N94m18
3596g1J76j74K47l13L98J08k94m97M41l61J51K40k76L85m85O0J98K22j19K33j70
3617I9K7Q4M8j68k14K82j24J07r6ok21J85p0p8M84j9j01m28P2k18L35N02l34j80
3641c2M75o14k45M35o2J85k35M52j06k09l1J36k62L72q5j36j23q9J31Q1Q7n8k41
3664a74Q0k1Q1j59K25K56n20L76n6j58k39M40L23l59r5k4j0J75l07K26l09P0J93
$$ plain form
3507 150 -210 91 -17 -330 -71 138 52 138 -113 -291 -214 -36 19 117 219 -12 295 -241 -384 -8 245 -226
3529 -226 -109 -166 -70 -94 -48 165 -146 -118 -337 224 -3 -225 160 -358 -16 237 115 116 56 -33 108 -26 -220
3552 -220 -143 274 88 -276 -222 164 -32 -216 23 461 -53 -22 -200 24 145 -60 139 -30 190 57 -162
3573 -162 -26 140 152 141 110 -308 -302 152 19 51 -262 136 -87 149 77 -185 -134 -207 17 275 -247 347 -71
3596 -71 105 -69 178 -135 263 371 77 -420 21 -340 -189 51 -225 160 -325 -265 -67 155 36 269 99
3617 99 126 210 258 90 -124 158 34 141 45 39 -182 3 -67 -145 339 320 219 -209 -137 -355 -20 482 148 -32
3641 -32 443 -171 -416 19 -43 142 -93 359 253 44 13 149 -113 259 174 38 -85 -174 -43 38 125 67 -174
3664 -174 -94 -115 -34 -193 32 288 -232 144 88 -70 -309 131 454 95 0 -24 -34 141 -166 60 -249 -179 14
3687A4P4J07j53o4l48K72j45J01m7J78J87l99K94o7j84K3M75j59k02K86j75J10
3709A78m60M76o5k69L58k74k2M50l63J20J44m75nL9J10J74l1k79L07j87j47O8
3731a53J45K27m30K61K44j93J64n48L76Lm49M97j44n1J19m8j67L04m46J06R3N2
3753c8l78J26L56m10L00J03n6k01O6K94j55L07m59Q3K54j26j44j5K09k41L36j79
3775C2j15j10K34oOq5L40m78m05K11N89k14K14k14mj89p7L02K23l11k14O19k94
3798E4J58k07k78K51K65o71O49j72j38k43L61l20J67j0M65k32J3j28j09p5K71
3819G1K49l26J59n43L18J07m16M74j04j62J05k16J41R0N8K31m00M31k1j38n9K09
3841B58J9k81N3K9j21r5L87k98L3j13M05n71J26J58r6K98l51M31p7k0L53m63k16
$$ plain form
3687 14 88 195 42 -22 -370 -98 -243 -142 -189 -11 176 -223 71 4 -180 -157 318 159 -43 243 68 178
3709 178 -282 194 129 -140 218 -56 -78 372 9 129 273 -202 -207 -168 -58 116 85 -194 113 -74 -221 -153
3731 -153 -8 219 -211 50 294 101 265 -283 93 96 -353 144 0 -51 68 20 -147 157 -289 -183 -90 -38
3753 -38 -416 -290 66 -344 -44 59 3 -198 -132 162 7 314 -145 -62 192 66 -78 -93 116 -125 211 32
3775 32 -83 -193 41 35 41 -44 296 -182 -587 -376 213 -1 213 -1 -5 -194 -271 31 254 -57 -271 348 54
3798 54 212 5 -273 -22 243 -428 221 49 -89 -332 29 -291 -124 -134 331 99 112 -16 -125 -200 71
3819 71 320 -6 153 -390 -72 35 -381 93 -11 -173 -68 -284 -143 -53 5 236 -164 267 246 108 49 258
3841 258 277 -4 49 78 -43 -138 249 -49 -16 -129 276 -295 -169 -11 -107 191 -160 271 194 174 527 64 -152
3864a52j58O92l55k30J87P3r1J67J38l62j4k76L07l7Q4J01J44J67l38K24J06n71
3886a94J89K17J24k01j4j00J54J0r8K11k28k63M03l9n5j2k01J09N4J7J30j50k37
3909a74K19M6m87L30p0P2n4L27J4l61m42N47J27p3oJ69k26J35j09j17O61m01j72
3932d5K85j06m40K08j57M66r8n15L82J23J05k71K53k6m10J43j14L42o43M52J27
3953F1r3K72k44l57J14K41j72J57k2k18P01n01k1M0M01l89M38m49l24L53J20l79
3975b71N22l14J70k9j68O2j44Q5m2K95j53J94m73L94j14Qj55N01n76L3l3N43l28
3998GN5j55Q7k38K56Qk09L91m1M0l61K69J9l29J5M28k63K61l50r3J12K3r3R2M12
4023C43j66m4l43M02k46K6j79J85j57R0L35l57J71k39p8L21L8j86j5K20K47o88
$$ plain form
3864 -152 -310 382 27 -203 -16 57 -34 133 271 -91 -105 -381 -74 -111 -27 74 218 385 47 271 377 -194
3886 -194 -5 212 336 135 121 21 175 185 87 298 70 -193 210 171 116 104 -97 12 66 83 213 63 -174
3909 -174 45 91 -396 -66 -136 -64 -118 209 223 -138 -580 -33 94 21 15 184 -42 93 -16 -133 528 127 -45
3932 -45 240 134 -306 -98 -255 211 113 -402 -20 103 208 -63 190 164 -246 -103 -217 125 -518 -66 61
3953 61 -32 240 -4 -361 -247 -6 -178 -21 -43 -261 440 -61 -82 -42 359 -30 408 -41 -365 -12 108 -271
3975 -271 251 -63 107 78 -90 -28 -172 -87 -129 166 13 207 -266 128 14 22 -133 368 -208 -175 -208 335 7
3998 7 62 -93 -6 -244 12 20 -189 202 161 201 -160 109 128 -201 -186 242 -21 240 -110 -203 -91 -68 -161 -69 343
4023 343 177 133 -210 192 -54 -28 -207 -22 -179 -89 246 -111 60 -179 -257 64 102 -84 -99 121 368 -320
4045c20J24J88k05K57j61l7K76N9l97J99J68j76r6J69J1j35O8K54l54k9m9K21
4067C5j90M9M5K71J39m90L66K8m56j81K71J69p9jL08n85L88j71L95j78o2k79J77
4090c1j00P1M3M77k69l97j7K54Q4J21j40J6j71K91j83m57L18j59K45R1m0K82j40
4113A89r7n77M48K93j19K62o26J36K79k75K07K0J54n80K76O3K67l96j30P2O5Q3
4135A4j36J09Q5j6j26J16J1J94k27k66M60k70m7J78K84q14P38j2k82k42K79m6
4157a6p2j08j33O76k03K1l03j26O14l16k09K60p2n3k5P71p21k71L72Q0r0m96O55
4180B35j31l13K43L01l72l7L27k93K91p0k0Q2k70r7J50j10J53j36p3K64J73o03
4202c06P4L61L8r2O5q2j85nL15J0k57L47l43R7k26o5K45J89J8m83K47j64Q6J65
$$ plain form
4045 -320 -196 -8 -213 44 -117 -154 122 181 -216 -17 151 -25 -121 48 59 -76 -8 246 -108 -137 -186 35
4067 35 -155 -106 -61 210 349 -141 225 253 -203 -384 -113 56 -23 -24 284 -301 87 -84 311 133 71 -208 -31
4090 -31 -131 -60 -17 460 191 -206 -223 31 115 236 96 112 -59 232 49 -408 -90 -249 -4 87 47 329 189
4113 189 92 -485 -37 256 137 399 -227 -91 188 -87 120 140 294 -286 -10 53 320 -76 -206 -134 -69 14
4135 14 -122 -13 72 56 -70 46 57 251 24 -242 218 -52 -99 79 363 -451 287 275 -7 -249 30 -16
4157 -16 -88 -196 -329 347 144 165 -138 -264 350 34 -175 85 13 -40 -65 706 -15 -286 86 166 76 -420 235
4180 235 104 -209 34 335 -37 -74 253 -40 251 181 161 243 -27 -124 26 -84 69 -67 -140 124 297 -306
4202 -306 -232 129 167 75 140 58 -127 -132 183 193 -64 283 -60 37 -189 -254 -9 180 198 -285 -38 -202 -116 49
4226D9j44K66m61K91L64m99J42m6J03j69J28K71k23k89R0J18K51J18o29K77J84
4247A92k78J21j55J4L02k02J73k9k70P4J59j09L46n50K86n2n6R2J16j90J25j93
4269h4j74O45n44M67m25L1j46P5O08n72K19j82K29q1r1j39k0J60R3J95k99K19
4291A84L8n13J54P9L4NJ68K02j70m56L13N8l36L2J78J87lk75L99j05n09N20l47
4314a63L00K3k61J24j10P4J12o8K03l38k37M57K81o81j4L22K98n85J4J28r0K27
4336A6l7j6r2K04j39m6J54q1m22J030n6l99k60L38l7l25K70K8j51q9K53j61j96
4359b14j01L77k8R5j27K4l57J97K39n0o1J43k06j53J47k92L50J2P7J14l73J35
4381e2k55L10k77n0P32l69J48n18j10O52m95M9M51p8m07N82m53K30k4r2J99n05
$$ plain form
4226 49 -95 171 -290 1 365 -134 8 -38 65 -104 24 295 72 -217 -127 -9 242 360 -269 8 192
4247 192 -86 35 -120 -106 196 -6 167 138 -132 -58 101 -8 338 -212 74 22 -34 58 174 -16 109 -84
4269 -84 -258 387 -157 310 -115 -84 -230 -155 453 -119 100 -82 147 66 -25 -164 -184 -24 69 264 -35 184
4291 184 222 -291 -137 -58 -24 -19 149 351 181 -275 38 96 -240 -208 -30 157 154 -121 278 173 -336 184 -163
4314 -163 137 160 -101 23 -87 -13 99 31 234 -104 -341 116 397 -284 -298 24 322 -263 -249 -121 -211 16
4336 16 -21 -37 -129 75 -64 -110 44 -37 -459 571 515 116 -144 194 157 -168 102 130 -21 -110 143 -18 -214
4359 -214 -315 62 34 129 2 26 -331 -134 105 55 -6 137 -69 -222 -75 -367 -17 -5 72 186 -187 -52
4381 -52 -307 3 -274 -324 408 39 187 -331 -441 211 -284 -235 216 138 -269 313 -140 90 66 -26 173 -332
4403c32M72j06k66K41n4j36J27P4J74j31m05N25k19k7j49K52Q8K79m54K8j84M48
4425B45Kj00j83K79j0k95j38L08J79m11L03k15k4L35l68Q7k80L73k46L91k62k
4447c2J79m19M92k32k7R8O2k23K49k65J28r0o9K79L03o00m6K04J24R1m68K70r5
4470h7l8r3K04J32OL9k40L22j8k3k32l73J69K44k67Q3L77k57N2J2k1L6kJ14M7
4495A86k10j4k45L04K16J20n73L03j26K74k39N5o3j72K8K12O4l63J19J94L5l8
4517F7M8L9K68r25L29r3J07K90P4J60l89J7K01j04l34j59O15j16J81n50L05k1
4539A0j27P3l03N51J43l28k68L12j83Q1k5K58m3K74m19k50m5N91k89L4n2j70r8
4562b73L54p3o6L3m9L97m32l5J49L49l80N9J25k95j69L24n4j07P5l6J80l70P7
$$ plain form
4403 -332 140 34 -232 9 -45 -181 -54 20 194 63 -342 183 -36 -63 -212 40 128 407 -47 -19 -203 245
4425 245 247 147 -36 243 233 -62 -200 108 287 -124 179 -36 -60 275 -93 -6 -286 87 -159 232 -30 -32
4447 -32 147 -272 220 -12 -39 59 121 -102 147 -118 10 -80 -149 130 433 -167 -213 -9 115 206 -262 8 -87
4470 -87 -125 -218 -14 118 124 163 -77 245 227 204 -28 -401 -232 12 -255 -172 205 -52 0 12 -9 27 25 139 186
4495 186 -24 -38 -283 21 237 357 -216 87 -39 235 -4 51 -12 -184 -156 56 120 -243 -124 70 105 67
4517 67 115 154 422 -503 -174 -267 -160 130 204 364 -25 -8 193 89 -245 -404 211 95 276 -274 31 10
4539 10 -117 -44 -347 204 347 19 -249 63 -120 -39 -64 194 151 425 6 -244 -289 302 13 47 -5 -175 -273
4562 -273 81 8 -58 -25 -74 323 -109 -144 5 354 -26 33 158 -137 -306 18 -36 -143 -68 -104 76 -294 -217
4585b17L00J80l84J07L0l2J64m6k54J11j25K53J61j08k28Q0NJ5R7j62O8K80k24
4608G1J00l40L79l02p2N28l33o5r5k0K47RlK67j13l24j11K68k09M36j60j62J69
4631A65k44q8J20K65k01K81m40k09M73m47K92o6P3J57k32L6kJ39m0N6R6l32J58
4654A0j02j17J09L53k04l1R6j32j63Q9J80M1k26OmJ52o2p0K90k53O0J0Jj85Q3
4679f9J24m9M2m5n9m3O7p1mJ17o5J33M18l84k14k80K79J48j07N4K42l77k7K77
4703A07q8j19J77j10M12k88j51Rj42qK93K9j00K54l90R9k15J19KrJ98k5P8l14
4727a82j70K23k00L61K39l04N3MJ83Qn7k51M5K60l17J6J60k04nK06P8j62O9k62
4751b09M15j70n27O93k42J41m09M95m22K35j18K69K12p92O36J24p56J99L17j95
$$ plain form
4585 -217 83 263 -121 -14 16 -16 148 102 -152 -41 -166 87 248 140 -88 -8 -3 12 109 -53 15 295 71
4608 71 171 -169 210 -92 -164 364 31 -34 -129 -149 98 107 104 371 258 -66 -177 91 -118 318 158 -4 165
4631 165 -79 -167 -47 218 17 298 -142 -351 122 -325 -33 -99 -26 131 -101 -65 -67 72 32 88 184 -148 10
4654 10 -92 -209 -100 253 49 18 114 -18 -181 -92 88 129 -97 -91 -95 57 -5 -75 215 -38 22 32 33 -152 -69
4679 -69 55 6 48 3 -56 -99 -32 -103 -107 10 -55 78 496 112 -102 -382 -103 45 -62 -8 234 -143 -170 107
4703 107 19 -100 77 -33 379 91 -60 -51 -193 -201 92 121 21 275 -115 -16 -231 -112 -110 -119 79 54 132 -182
4727 -182 -352 -129 -329 32 271 -33 20 24 207 215 158 -93 -48 212 -105 -89 71 -133 -138 68 146 -16 53 -209
4751 -209 206 36 -491 202 -40 101 -308 187 -235 0 -118 151 363 -429 207 331 -425 -226 91 -104
4771a04K35K2J47l30J5n4k8K29k6k23j86L67N2j19L46j78j12J64l62J5K22M7n21
4794c82P45j22n30j45L76K85j64l6L70o95L9L96k82J95J22k43L0l5L09j95j82
4815a44K99P0j32j2j26r8N13l30j66M65l07J01k15J89k42j18L78k42L88J7m75
4836a87J55p8n2M9L75n40L58l13L19j6p3O7k5r9J41P8K26l02m20J49M08nk03k2
4860a0k9m06M45k8o8M58n29j4K94q7M6j7k18L31N0k19j91L60q6j17J01O4j15n5
4884d0L48o39o0N80l21k09M51j69ok22L32L30l53MK24j63k99P3J30Q5J78m53Q
4907a91K42J16j35k28k98M05NL30l45k4J62K7J36k11K08l90K72l67M42j83N6l06
4929b77J50L79J51n01R1R3j09j3R5K06m92K66jJ1M9k31m5J9O3J48k13N08J02m70
$$ plain form
4771 -104 131 153 300 -30 -15 -69 -97 132 106 -117 -303 64 116 -3 343 165 53 217 -145 -130 92 139 -382
4794 -382 363 241 -289 -434 -58 227 63 27 397 -298 -259 137 -145 50 172 -71 -41 -76 233 38 -144
4815 -144 155 225 93 81 -45 -143 370 40 -126 339 32 133 -82 107 -135 -253 125 -117 271 288 -187
4836 -187 -32 -110 -162 -113 262 -278 80 -233 86 70 -3 64 39 -60 81 159 385 83 -337 -188 220 215 12 -10
4860 -10 -39 -445 0 -28 -96 362 -167 -181 113 26 72 55 -163 168 218 -1 -192 168 82 -35 66 130 15 -40
4884 -40 308 -331 -391 189 -132 -341 110 -59 -65 -287 45 375 22 26 250 87 -212 -139 -9 76 254 -199 -191
4907 -191 51 167 32 -196 -494 -89 -84 246 -99 -123 39 66 202 -9 199 -191 81 -286 156 -27 29 -277
4929 -277 -127 252 403 -98 -7 86 -23 -36 59 265 -227 39 38 49 98 -133 -178 -159 -96 52 -161 347 449 -21
4953b1J33K37k17l18O7K51k10K29l73L63j32O0J18l54M51j53j48K92j69k98QK60
4975G6K64m0k79L6R1N2k8L24n48k40L41j73L42l39K67M8k17k13J92j83Q8J30J55
4998A46j48m6O1o0r2m1J32m9K66l50J18J05k08J64j65J68J45l82K67j88K48K75
5020C66l63K27%n29J21J86K00Po3J17l21L55n48L22j96j54N42l63R9q5L51k38
5042C3J0j26j53J30Q4l06L83m2K58Lj29J64J21l61l3J68j03M9l63P1P7j78M6j00
5066b97N34j16n3K18p4m25M64j58k55K73j67J18j21pJ37j51K97l34o5j25L91k2
5088F2q7J01k81L03L07l26k93N16k92j67R4M15l76P8L43l66J37l6k33K85k82L20
5110B22k91k12L21J6jp1L69j70k91M9p6M2J82J98m09K59j79L04l95J52j16j98
$$ plain form
4953 -21 112 349 132 -186 -119 132 -78 151 -222 141 9 69 187 -167 284 131 -17 275 106 -192 -184 76
4975 76 340 300 21 57 148 200 172 496 -52 -292 49 -124 218 -121 146 194 -23 -236 -44 -227 -139 -9 146
4998 146 -2 -48 13 -47 -139 -180 -48 -97 169 -181 -63 42 -166 -2 -167 1 146 -236 31 -157 91 366
5020 366 3 230 230 -299 -178 8 208 215 152 269 -52 303 -245 77 -119 -273 269 -94 5 -80 271 33
5042 33 43 -83 -236 -106 -22 -328 55 13 271 274 145 309 430 69 36 204 101 150 -213 -142 -65 -243 -197 -297
5066 -297 237 121 68 286 212 -213 251 93 -162 111 -56 62 -59 -66 71 -80 217 -117 -182 -307 84 62
5088 62 -25 76 -205 98 405 79 -214 302 10 -157 -63 352 -24 54 397 31 168 132 -101 184 -98 222
5110 222 -69 -281 40 56 55 -16 353 183 -108 -59 -135 -93 89 287 -122 137 -42 262 -133 19 -97 -295
5132b95J04K71k3j99J51j29k4K57mj87m5lL50o4q6J79l13O7k3m9J37M1j03r4J50
5157F6j65J77R1l53N24l57QJ24k60J33j52M75k47m8o5L19n46Q5M62l90J04K94
5179B79l4k63j48j63L93j89L3J56L3j08K45j55j51j69J78K19r7J18l96M8K29n
5201E3J23m27M88j85l95Q42j32o30L68N38m73l33K54n8j27M8L3l0L51l05P5J67
5223B45J41k12l86M55k89K34k44J68k11J24k13O5L49j86N6k28o5J39K36l47l53
5244e22K93K83m45N8P11m89j2q6N7m3K91j2j6M67m26m9M99o63l72P40k59Q8j29
5267c6J65l09J02J97j63J99p9J4J41k1n02PK67J30j65k85M34Mj89J46l39L18R0
5290A26J5j86j59J72j62L88q3l06K00l73j22M44K62oj72j7J38l72K49j7j4R6j72
$$ plain form
5132 -295 -191 80 57 -142 9 -120 -144 113 109 -78 -123 -126 224 160 74 253 -60 7 -16 -65 72 113 10 -84 66
5157 66 -99 78 169 -184 340 -17 -9 115 -145 -12 -164 311 64 16 -49 270 -276 -191 271 -119 -15 279
5179 279 245 -18 -166 -329 64 -125 -92 64 97 -11 234 79 -72 -241 -63 156 59 177 -219 -171 58 53
5201 53 176 -251 237 52 -343 499 367 -263 105 643 170 -163 91 33 -94 -46 -13 -43 308 3 78 245
5223 245 386 174 -212 243 -46 188 -56 112 -99 25 -188 -123 226 40 96 -132 -197 -58 178 -169 -522
5244 -522 -229 54 -391 -333 378 -111 -123 -209 -152 -195 96 84 68 535 109 60 559 -104 -476 264 5 93 -36
5267 -36 129 -180 -78 119 -44 155 76 90 231 210 -292 -285 -18 112 -53 -338 96 100 -89 57 -282 36 126
5290 126 141 -45 -204 -32 -194 194 111 -195 5 -368 -490 -46 216 210 38 21 159 -213 36 19 5 101 -71
5313g1Pl9N5n7O6j39P31n39J8j45p5L35Q6m48k2P6j71J91K76K83m38m3j75J49
5337h9N6J50l19J13K77k74m71K89L62j49l02O55n32JO30k87q9J4q2j26m9M85j56
5360A07m42O24k10J10j42pj59L31j44k95J00L93L3m30j3L84m26L04P7L7L4k19
5382D7k91M51j99O7k88L51P4l22Q4M84n35r3r2J76M96l46l12K80J55j7K04l36
5404C8j35Q0j13J93j51j73K26K1K3o8q4J86j72O1M08m57J46j38L81l37o7o0K22
5427C0J01j29r4J01l0N5k17k3K6k29N76k1jJ54j00l25J11J31j52p0M03m73Q3J49
5451E6j53L56n47L47r8m9O8K27l09K65m71L98j14L10n38M01m7m19K8M49K1k68
5473h7J30j14K48k24K83l86K83q7J46R0m46P4J16j82J15N8k58K49Q9k86N14o57
$$ plain form
5313 -71 -64 -103 -48 -105 -39 -178 553 14 32 -113 -188 147 233 -215 -237 -161 -332 -141 135 418 -20 -63 -238 -89
5337 -89 -33 117 -202 -89 188 -86 -557 -268 94 -55 -357 298 -234 -233 397 110 21 35 -47 -173 -222 263 107
5360 107 -335 289 79 189 47 40 -119 212 68 -227 -127 266 299 -131 -144 240 -186 118 195 232 266 47
5382 47 -244 207 8 75 -213 138 212 -110 -26 458 -77 -170 -262 -86 410 64 -248 32 187 170 374 38
5404 38 -97 -17 -130 63 -88 -261 -35 -14 9 -59 -143 43 -129 -68 340 -117 29 -109 272 -65 -132 -192 30
5427 30 131 2 -92 9 -21 34 -183 -206 -180 -409 167 146 145 299 199 -126 -15 116 -36 -106 297 -176 -93 56
5451 56 -97 259 -288 59 -39 -88 -20 207 -102 163 -308 90 -24 286 -252 149 102 -317 -289 160 181 -87
5473 -87 43 -71 177 -47 236 -150 133 46 192 282 -164 -90 26 -156 -41 17 -241 8 97 -189 325 -332
5495c32J90M27m91L24k70J23K24k90J71Kl38K95j86L59l7k50J54j16j5j25P2L3
5517g6K61k98N1Q2L06j64m53J18M34n72K61K50k96p9K64j21K03k94j03O18j75
5538B17l07R6J38k30m5m7j45J78J26K94r2k13J68m12m5K86N2k08L54j21j79N55
5560D20k72k73O8K51l41L25P4J43j4l50J07k17O04m67q7q9K76j17K0L1j68K62
5582A86k34j61K97O9l32R1L44mj31j63J0K9J04k25o5k2Q8P2M8L4j20Q3J86m95
5606c11Q3L99l83R4K98m30K77j98K08j11K58k76J29N8k13k19M44k13K29j51j46
5627a74M19l77l9L96R9n63L30N9K96m37j89J46J8QJ51q0k43m9L09j54J54R3l66
5650a93M3K16m23m0L12J90m91M19j01j57L29l75J4O9J25J35jN9j4m0k5M8k45K7
$$ plain form
5495 -332 -142 285 -206 118 -152 -29 195 -95 76 78 -260 35 -151 208 171 -79 75 -41 -56 -181 -109 -76
5517 -76 185 -113 -62 20 326 162 -291 -173 261 -311 -50 200 -96 -175 89 -32 171 -123 -226 392 217
5538 217 -90 6 144 -86 -131 -178 -323 -145 -19 275 183 -30 138 -274 -319 -33 19 -189 165 44 -135 420
5560 420 148 -125 -57 194 -147 178 252 395 381 31 138 -79 525 58 -29 -118 158 41 61 92 -76 186
5582 186 -48 -209 88 157 -175 -84 260 256 125 -38 -28 1 105 -120 -185 -207 -119 -47 1 35 -85 -2 184 -311
5606 -311 -228 171 -212 -118 180 -250 27 -171 37 -74 184 -92 37 95 -118 -337 107 -106 123 -28 -174
5627 -174 245 -132 -171 225 324 -239 91 150 446 9 -180 -34 -16 -8 143 63 -180 -229 80 -74 80 173 -193
5650 -193 -150 66 -357 -397 -85 105 -386 33 -68 -225 104 -271 -257 -188 -63 72 71 130 116 76 51 99 -146 -119
5674a19j08J17J57M1m92M08j05N5L75n68M12k58P6N9j59K0M43k56m6qJ07J77k30
5697I8O2j97J10J47k65l3k4L6j36O2L52n04K36J94l80K13j31l3P7N09j29r2k3
5720A49m9M4l79K58o6J59j80J84k41P8K40o7nk13L07o6k68L78l67J87K16k73K09
5743B35J21l99K23Rq5l48K67K85n77O37k43O2J63j29m18L45J99k27l00J61j70
5764a89L9J1O3L19k81J37p7PJ7j74J22N0M07m79j50J20J01J2j4j50j04N41l58
5787c0k8K77n33J94L24l65J26J29m12K44J98k02QJ95M6k00K14j8k30L33l71R9
5809bJ59O4j19P7l9q4q0j84J77k75L29o3P3M21m09N6k2p4l60K10J60j43l6J53
5833a1N6j69K30j62M33m66L88m22M16l74M4p4J30j21l54J74M36o3k49M23l10K0
$$ plain form
5674 -119 -227 -110 47 88 -404 4 -101 -46 329 -239 173 -85 -9 50 -109 -89 354 98 52 44 151 328 98
5697 98 160 -37 73 220 -45 -78 -102 -66 -202 -140 212 -292 -56 138 -242 -29 -160 -193 -116 393 264 172 149
5720 149 100 144 -235 23 -43 116 -64 120 -121 -43 197 130 125 -88 219 153 -115 263 -104 83 299 26 235
5743 235 356 -43 180 189 104 -244 23 308 -269 368 125 187 350 221 -197 148 347 120 -180 -19 -189
5764 -189 -150 -139 -76 243 -38 99 22 29 46 -128 -6 44 451 -28 -178 -58 43 55 41 -109 -213 328 -30
5787 -30 -58 219 -314 -120 204 -161 -35 94 -318 -74 124 -78 -70 125 171 -29 185 167 -63 270 -101 -2
5809 -2 157 221 102 179 140 56 -24 -208 -31 -306 23 -40 33 454 45 101 79 5 -355 -145 15 -128 -164 -11
5833 -11 45 -124 106 -56 377 -89 299 -123 293 -81 -37 -111 19 -102 -456 -282 154 91 -158 265 -45 -25
5855b5K75k86K62L5j14K92n29j00K91J98j3l90P8L24l53n0J30K12k00j75K20q8
5877fK48j24p8k51L11l26pM19j94J9k39J84N3p9J82O9n14L28M97m13k56M9L12
5900A84k88R9%k05L76l1j62m72M29mm6p4Q7K02k01K15J17k87J38j23j5J83j51
5923b9J79ln9L0j68K47j68n76K78L20l37M34J63m10J44J81j66J37m1k00L47m04
5945a01K0l6k60K12k29O95l99Q5N4k07M04l69K2J1J71L29q55O28n04j1L85n8k32
5968b45k46N91j40J27j57M17l43K38j23k13L13j75j94l2L99J3k0l28J07J08l31
5989b34R3J52l93O49o74N88j69p5J54k45L98R5m41Q2K39j23m0L56q62L99L9j81
6011a93L86k82n6p2J6J06J50j57K55k19K56k94L8n9j9O5j13J08k01J91j78P2J48
$$ plain form
5855 -25 250 -36 226 261 147 439 -90 -190 101 299 286 -104 -26 298 -55 -105 25 237 37 -138 82 -6
5877 -6 242 118 40 -211 100 -226 -233 186 -8 11 -228 -44 9 -70 112 181 -333 -5 492 79 -177 -128 184
5900 184 -104 -5 -5 -210 166 135 -27 -499 -70 -74 -120 -194 -107 95 -106 109 226 -61 77 -46 -61 122 -29
5923 -29 150 147 88 118 -50 197 29 -547 -269 51 -286 148 311 -99 45 226 60 197 156 -44 303 -101
5945 -101 -81 -117 -377 -165 -394 301 -98 -13 41 -166 238 -131 -109 -98 73 402 -453 175 -329 -340 45 -13 -245
5968 -245 -491 100 -40 87 -70 347 4 242 119 -94 219 44 -150 -182 217 230 210 -118 -11 97 -234
5989 -234 -141 11 -382 267 -407 181 12 -63 91 -154 244 339 -102 -20 219 96 56 412 -450 -51 -12 -193
6011 -193 193 -89 -145 -217 -201 -95 55 -102 153 -66 190 -104 -66 -125 -144 -79 -192 -84 -285 -94 -272 -200 -52
6034e2R5N2j42l9J56J5l30J62K82j46K0L03k63l53L28N5q8m5NL57j28l61j38O2
6058a93M22n34J88J56k69n4M00J0n28N87k11J56J06m1l56L34l93J7K40j87M10
6079B60r3k49Q7O7O9O5l40O0L19j64k45J70n9R2K77l16j11K5K16r2k30J91k67
6102b68O15k65j53K69R0j50j05K07k69K51LM0k03J64k0m34L39j16j73J84L75o25
6124b44M66j99j84J08r8p4L31k43j90M9O99l14j03j2q8%J40J77j8j92J30j69l3
6147f1L04j34K2n8J61k12k7L12j46R2m39M57J00m50Kl55M90k54K45j35k7L72P3
6170C32k08l91J51K87m52M45j50k40J78K4N49l10l91L10o65N59n8j96K4J77J27
6191A02o5k56J58K11J75m19O5M85p67J09K77O9o1k96K14K18l43l1K76k3l94M96
$$ plain form
6034 -52 43 95 -47 -86 70 85 -245 -83 199 53 73 376 113 -240 88 143 55 10 15 372 244 -117 -255 -193
6058 -193 229 -305 -117 39 -230 -284 116 126 -402 185 -26 130 236 195 -161 173 -220 -203 37 -150 260
6079 260 167 -82 5 72 141 206 -134 -74 245 81 -164 6 -53 39 316 0 -111 -86 130 38 -192 -1 -268
6102 -268 347 82 -71 198 288 138 33 240 -29 222 225 265 62 226 206 -228 111 -5 -178 6 381 -244
6124 -244 222 23 -161 -53 -151 -225 106 -137 -327 -278 421 107 4 -8 -96 -96 44 221 203 11 141 -28 -61
6147 -61 243 109 131 73 234 22 -5 307 161 253 -186 271 371 -79 -77 -432 58 -196 49 -86 -113 259 332
6170 332 124 -267 -116 171 -281 164 14 -226 -48 -24 525 215 -176 134 -531 28 -30 -226 -202 -25 102
6191 102 37 -219 -61 150 325 -94 -29 456 -311 -202 75 144 83 -213 1 219 -124 -155 121 98 -296 200
6213B00o59M91k33J35J8K52R0m74L47J3j83L5k1OJ08j25k84M37l08K76k39K78
6235A60k23P3R0l50k58O75M2j21O2J37r5l0j71K50l27M66l21L06l72Jl1m9K64
6258A78k21oK25k19J71O0j22p2J46K98j17k43p0Q1l13j16K39m9j07R0K11n2j07
6281a15J89m3k2k35J11j00J39M01l40J60Rp5k29MQR0P4J07j2r8J10q1J07J91N8
6306D08k15k54J86j40J4j27j01J66k17P2K21j30J15Q2k34M4J05J81n2l01L9J45
6328Gk02J91l25N28m9K4k27n4J34j91L9J81J56k75J69l54K6K9J91k79K44M35l89
6351Im1J73m05N14k63J83J33r0N0k42J03j63N4jM0K06j90j44K23k82M63n78M78
6374B30n4p41O11L06k14N2j99Q4J49k7K2k84J3J27k33J01j89K75K65l02p9j05
$$ plain form
6213 200 -459 32 -201 -66 -48 204 294 -180 167 180 -3 32 11 17 125 0 -284 153 -155 121 -118 160
6235 160 -63 10 100 -250 -508 167 209 88 150 287 192 162 -9 241 -86 380 59 365 -7 -6 -37 -86 178
6258 178 -43 -49 176 -43 128 188 66 -6 140 438 321 78 8 89 -224 -340 -101 -150 -257 -167 44 -8 -115
6281 -115 74 31 9 -226 -115 -215 -76 325 -15 145 154 79 -150 -146 -138 -48 26 133 121 23 133 52 159 350 408
6306 408 193 -61 125 -15 -1 -128 -229 -63 -280 -208 13 -117 -2 80 -154 -110 -5 176 124 -177 -138 7
6328 7 -195 -4 -329 199 150 174 -53 -107 27 -164 -125 56 212 -63 106 -248 -222 -193 -2 -281 -37 398 9
6351 9 -32 141 -264 250 -13 170 303 213 263 21 124 -39 15 14 54 260 70 -74 149 -133 330 -248 230
6374 230 176 -565 46 352 138 190 -9 75 224 197 219 -65 -52 75 -158 -57 -246 29 294 -8 -87 -192
6396a92J91o5L22l13q2J25l6n6K06q2Q4j32J87k99J79j06J13j97l06M87O3l65
6418b74K16N1J44q3Q1o43L45N90k39j24l17L59l67N62k97j87K59K05n54O1P4L04
6440A66m13J59o8L3j49J48P7L2J06j59L4J24k4o6K2j09K35l6j40j29N7L16m92
6463b76J76Q7k5K48q6r1j30O2K26J60m57k66K78J62q9J7j75J16M6n5L12o00K71
6486h9J85o1j85Q9L95N2l88K50j59N1Lj52Q9l35J80L69l65J82k31K09n28K55J45
6509c9m9J67M8j46N1R5k13L8K47m3l83L90l39K69k81J59L5M0J35k62J06k29o4
6532b68l0N56o09O25n48P42m02o5J98l65P4J5Mj27M92j47M4J6m8k53K28k71L01
6555A62l98J20K23j17k14J61j29J64J97o7j96j1K53j21p4q1J01o0P9j75N92j35
$$ plain form
6396 -192 -1 -66 256 -57 -139 -14 -50 -106 100 18 102 -30 157 -142 37 -69 44 -153 -459 28 91 -274
6418 -274 -58 -7 137 54 135 -508 -163 427 188 64 -253 106 -261 301 4 -183 76 281 -273 -212 -138 166
6440 166 -247 -88 -156 -123 -272 -124 -47 -15 91 -68 -34 90 66 0 22 -87 148 112 -28 -157 -100 216 -276
6463 -276 -100 -13 -38 210 124 33 -97 -35 191 351 -106 -372 -94 68 -21 -4 -179 -63 -17 -72 240 -360 -89
6486 -89 96 35 -150 -61 334 386 -2 248 89 140 143 -9 80 -255 -75 294 -71 111 -120 89 -439 -184 -39
6509 -39 -88 79 127 -19 32 127 -86 -48 199 156 -227 163 -176 93 -188 -29 6 46 181 -81 25 -204 -268
6532 -268 -298 258 -351 274 -274 468 66 1 199 -166 -92 -77 -73 -200 292 145 189 205 157 -96 132 -139 162
6555 162 -236 -116 107 -10 -224 -63 -192 -28 169 102 -94 -105 148 27 -47 -128 -27 -87 -8 -183 409 274
6577B74j07q8Q4l32K05j93o3l1K63P7q0kl13J04L97j25o2o3J60k9%k32K52J86
6601B82k5n78K01K67k82K77J35l09j24M0k44J9L55k69M65j96j44K19k87M01j98
6622EK19Mm03o3l3k07M18k22L90j99P0J54j14l45J30K18j01J33K45j42J92m17
6644f8J86j25J55m11K58PO0N4Q8k24RJ06j04p3m0K45ML48o43J13l3L47l50J40
6668D9n03M53n0k94L61k1p5O1j37K32Mo9n6j08J8M01k16j35O6j2K4j63j1J64M02
6693C85j72l92L85k83j35p3L40K86l58q6M1J26J47k70k01kM24m04k40O22j2jp5
6716E2j03p4K67J61m52J26j59J04K46m17K06J1k3K91l46N3J56k00RL35l25J23
6738D1J78j82L9K62Mo22O0l4L80m28J94J49o7J09m28K83J73j88j51M40O1j17l07
$$ plain form
6577 274 167 79 163 -169 36 -157 -220 -251 12 89 9 7 -306 -202 195 70 8 -55 105 76 76 -156 96 282
6601 282 257 -321 -120 147 -135 142 277 -32 -156 -116 -360 -341 14 -255 210 14 -130 89 -198 203 5
6622 5 224 228 -175 -238 -271 -478 -60 -282 108 -91 -21 133 19 -326 -196 22 -79 54 299 157 349 -68
6644 -68 118 -7 148 -263 -5 2 62 116 204 -20 -11 95 -9 -82 -122 123 127 475 -168 -55 -88 259 -91 49
6668 49 -454 -1 -51 -345 16 -5 -80 -19 -156 76 80 11 -45 -153 -135 266 50 -85 -19 -31 -7 -170 -181 -17 385
6693 385 213 -179 206 -77 -212 -285 55 341 -17 -103 -62 64 211 -59 -260 -262 162 -242 -482 140 128 127 52
6716 52 -51 -125 142 303 -149 -23 -182 -78 168 -249 -43 -32 -55 236 -110 -57 99 -101 -92 243 -82 41
6738 41 219 37 76 338 342 -280 -220 -254 126 -302 -108 41 -26 83 -345 -62 111 -77 -228 212 273 156 -151
6761a51J5L59m09K23R7k39K11J19l11m5K38j61o9m39N00M17k71j92L81m27l7K82
6783I1j22L4J83k4k75K19l08k5R3M42l75K3K31l01K21j87L61k09k28L06k29Qk30
6806c01K82J32l66L06Q8p0m35L81j2P3j09j0M2r0l29N48m96M32j38P4J18k1n65
6829d66K40q8L44J99l02K6R5j1k58M42m06K43K27l55K09o9N2J16k58O6j67N32
6851D11k12k88q7n7p1K25j10M49k75l2J29K30l22K6L13l96m7J4L76l81M27k86
6873C6j8j48J97L19m84J20J38j36J18m87K65k08K69J21m61N71j23j07J22k05L70
6894B69k84k31J42r1L7K41p7O4j01R2l4J75Q0j10m89m0N66k15j63J87K22N3n55
6917b62R3j76K82J90l1j12m3k72K57J9lQJ18J61j66J29o9q1J18k5j93n5j6L56
$$ plain form
6761 -151 -136 223 -186 37 134 -105 106 225 -86 -131 107 -54 -123 -562 -62 355 84 -108 273 -154 -191 91
6783 91 -31 3 186 162 -113 106 -202 -227 -134 308 -67 -44 187 -114 107 -80 281 72 -156 150 -79 -71 -301
6806 -301 -19 113 -253 53 141 71 -364 17 5 78 -31 -41 1 -89 -418 130 -366 66 -72 2 120 99 -466
6829 -466 -226 -314 30 229 -73 -47 48 37 -221 221 -185 58 285 -70 139 70 122 238 -20 46 -121 411
6851 411 199 -89 -176 -233 -304 -79 -189 260 -15 -47 82 312 -10 16 329 -67 -114 -100 276 -105 322 36
6873 36 18 -130 67 386 -98 22 160 24 142 -345 -80 -288 -19 102 -359 212 89 -18 104 -101 269
6894 269 -15 -246 -104 -195 -158 83 6 70 -31 61 27 202 282 172 -317 -357 209 -6 -169 18 240 293 -262
6917 -262 -169 -345 -63 127 96 -16 -59 -331 -74 -55 -58 -50 68 229 63 192 123 42 160 135 -58 -113 -129 227
6941B27m60Q6J91j5k57M01q6k44K00o7K83j81M30n23J18k5j53l8K8M9r4K83k25
6964g2K04m0K1k80J48q6J73j89R2m24L98L20j88k5L6J1p3n8J03L64k99k41K99
6987A94l89jJ18k68N23k73J12j10q5R1J12M9j68J65J10n04M24k06K47m15N6L41
7009A23k83L66k73j95L69Q2l28K2J68m8k4j76J60K05k86L41j98J09R2m9k07K5
7031ej93P0m4R5Q4K67m26P6J13l11L79R9n57N37l3l2k36J17n3J27J85k11J64M3
7055B55j89o2Q4L09q41P07k28J53Lk34J07q5K28R7k26k70L94n98M12J09J86k96
7077A5M8k87mJ76J41J97l13j24j03L13m55M92j72J28Qj96J48k60N17l54K84m99
7099c00m0L5O11j64k39J56o3K48k07l27O78l68K76k94j24K45j71K92j20l6J45
$$ plain form
6941 227 -233 -147 44 29 -228 173 87 -157 43 -24 259 78 508 -15 103 78 -75 -113 -85 -36 -130 153 -72
6964 -72 132 92 113 -167 -19 -105 68 -121 -29 -453 -55 265 77 52 88 99 26 -32 71 435 136 -105 194
6987 194 -195 -196 -78 -346 177 -96 16 -94 -179 -88 24 73 -95 70 180 -324 100 -106 141 -274 -218 123
7009 123 -160 206 -67 -262 107 189 -139 -117 51 3 -21 -197 -37 168 -118 223 25 134 226 177 -30 -5
7031 -5 -198 -128 -172 -77 7 274 -152 -76 37 -274 105 204 -353 184 151 119 -117 0 -53 74 259 48 212 255
7055 255 66 4 88 397 -444 263 35 188 191 -43 64 -21 207 304 78 -192 202 -396 16 125 311 15
7077 15 63 -224 -228 -52 89 286 -27 -151 -254 59 -396 96 -76 52 60 -136 12 -248 269 -85 199 -300
7099 -300 -340 -305 306 142 -97 59 -4 244 37 -290 388 20 296 2 -122 123 -48 244 124 88 233
7120B33N4l31J76m57K24J4J99O7r9j41l64J57J37J92L2N7m39M52l95N0Q5j20J32
7143h5P4q1K0R7O7m85L84j75K73k25N4j29J08J65R6M8m56N33m73j32M17m2j08
7166e5N9NK05mo7l2j46K40q7j73J70jJ25j38o6J01MK2j62O4K09k50O7L2j29k50
7192b57L87J92m58M52k79K0J56m00J69j96N5q5M97j30k14J34P5J6On6l49L32J08
7215A75j13l8M8l52M35L05m79j09o9L05j4k54o2J48n5R2j92K65n3L70k62r9j71
7238a79L47k90R1K51k30J95l29J69P8q3q2J75k04j26K27M75n95p0J34J77j81L
7260d7L8Jj36R6n0J04l26P18m75Ok17L97N6j91j11J97R7J09j53J8k37j62L36J38
7284B06j76k4k55Q6p3K40N8l49M35k10o7J03n8L02n58M65k9j22n1R1k2k19L10
$$ plain form
7120 233 287 -44 132 -325 -101 -87 112 179 80 -61 -425 -268 -131 61 93 150 -289 163 -232 -182 -97 -217 -85
7143 -85 -11 -92 -72 25 92 -393 -9 -184 89 -136 -82 -211 -103 62 158 206 -250 283 -190 -322 95 53 -55
7166 -55 4 9 214 210 143 111 -35 205 118 -55 115 114 239 101 35 136 140 162 0 64 273 23 90 122 -7 -257
7192 -257 130 322 -136 316 37 57 213 -187 -18 -214 -159 -244 253 123 -91 43 118 134 140 84 -265 67 175
7215 175 62 24 72 -280 155 460 -19 -128 -197 108 94 -160 -222 -74 -129 -37 -229 36 -17 353 91 -8 -179
7238 -179 168 -122 -31 220 -10 185 -144 25 103 20 -62 113 -91 -217 10 485 -110 -180 -46 131 -50 -47
7260 -47 -9 -8 -144 -48 -98 6 -320 398 -77 -71 -288 109 165 -26 -137 60 157 266 113 131 -106 -268 68 206
7284 206 30 6 -249 -163 -236 4 62 -287 148 -62 -129 -26 -84 218 -340 125 96 -26 -77 14 -8 -227 83
7307H3l08K72R2k14N4O9J66R2l9j30J4K1Nk23K79l99Pm1K72L2M8K09l45J68r1
7332I3n2m3N6k44J7L95j73j18Pj30N43l03k22L30k13k44L76j35L80l82L58m17
7354a21j30M13k04M4j81K08J29j68k55K68J19K63n52J09M27j9o96L76j34K57L29
7375D82m43j27K45P1l14k35J81q4N04l37J63n3k73K4JK6j36L38J0lm06O44j93
7398H5M6l30J76p7K77m60J10K82k37J22J60k23m2J68rk10K2n5J9rM23j49o5q2
7422e8J64k4l6o9j45N13q8l29jJ2J86n3Q3L46k67K1m20L74l80J83J91oj53q4r3
7447a33j26J77K77m01K31R4j75l20M71l56N02k56J47j32qQ8J00q6J5kj35m2m8
7470a18J86Mj65J64k05J84o6K22O2K2m6m28K82j76J45j56J11P3j5k09J08J15m0
$$ plain form
7307 83 -225 47 139 -75 -21 48 214 306 267 137 151 172 177 -46 233 -166 -159 -200 72 104 152 361 16 184 93
7332 93 41 -2 54 -190 -173 222 49 -69 -62 -192 351 48 -174 156 -57 -301 75 -60 320 -62 296 -121
7354 -121 -251 162 -42 2 -179 29 158 -10 -265 3 122 385 -167 -58 369 350 -346 30 -104 153 482
7375 482 39 -88 157 228 -86 -321 -140 -224 280 -57 106 53 -220 -196 -195 -169 -305 33 43 40 -366 278 85
7398 85 131 -199 -23 -100 177 -283 -173 109 -128 -6 154 -69 -111 57 48 -162 -140 -195 -176 -185 238 89 24 -58
7422 -58 106 82 46 -23 -168 345 257 -72 -73 -61 125 72 155 501 234 255 -165 209 -171 12 203 197 44 -40 -133
7447 -133 -259 -82 195 -206 25 119 -56 -376 95 -261 241 -15 132 0 -8 80 180 94 109 107 -28 -70 -118
7470 -118 68 72 -93 71 -134 50 -16 206 268 290 244 -184 98 -78 67 -89 22 95 80 -129 -21 94 54
7493E4p4P5k36K15m0JK02j69J19r8M34n20K59j18o15K43J94J21J24j44M9N6m70
7516c38L24j8L86m27J42k43j33L59K04k31j24P0O3K54l53L90m46J64J80l66j95
7537c38K79k05K44k2J33j9l50J41J84j66J25j74J72o3K36L36n47K42l10K4J79
7558A01k56J33R7k28M12j17J17j10j4k66J41ok57k7K14j28N33l16J28J27n52R7
7580a77J97J00L6j00L26m37k25M46k71o4K97m36J32K64k37O7J35k50J32P4J2p1
7602e0j52l6N0K4J36lJ18q6K08m10j70N04l38M11J41r6m90l9L76j48K7P7q4Q1
7626E1k47Q7RJ22oJ0j15K32ol04p9L54jp8k6k4j8L4K17k52l7m6j6J87j57K12M3
7653A46k36l7J07m26K10J02j55P55l53k17K63j08J05O6l80L07r0j30L37l44m9
$$ plain form
7493 54 -20 55 -181 34 -6 -5 197 28 147 49 483 -37 222 104 -511 -268 -74 47 171 27 76 132 -338
7516 -338 -14 -32 354 -73 69 -174 -307 52 256 25 -99 -29 34 288 -65 325 -121 43 223 -143 -338
7537 -338 -59 -264 -20 -42 91 72 -278 -137 47 -119 6 -168 4 -59 177 513 -34 208 -102 -78 101
7558 101 -155 -22 75 -153 259 142 259 149 135 -131 10 4 -253 -280 -66 -194 339 23 151 278 -274 -177
7580 -177 20 120 156 56 382 -55 -280 166 -105 -169 128 -308 -176 88 -149 -82 53 -197 -65 9 21 -50
7602 -50 -202 -238 -188 -164 -28 -31 87 1 209 -201 -371 133 -205 206 347 251 -239 -278 98 -50 -23 54 -30 51
7626 51 -196 -109 -100 22 16 26 -89 143 137 -167 -246 108 107 29 3 -21 -39 -5 212 -40 -77 -123 -139 48 -109 103 146
7653 146 -90 -127 -20 -446 -236 -134 -289 466 113 -104 159 51 156 222 -158 149 59 -71 266 -78 -127
7674a27Q3j34K18j75q5J86r3L0K81K11j70l71L00Lk16P1l52M80Q3J8J05l09n11
7697d74P28m11K61R8k04L5k77K29r4R9J52J23l79p8J71J43n00J17J78j7%K59j72
7720a3J4m72M37J8N1k88K92R7r8K97m45l0P2J15k42L67kl51R3J29J24r2j73J23
7744B3K9R4l30K23L1l81K96k32K56k01L89r0J67m15J54j04j74J18K52k69L91M0
7766B67M1p26L73r3L2J31j32p7M5l8Q8N14p04M22l79J72l7J94p7l89O86m67Q5
7789f9J12k39m7K62J55J38n01L79j63j62J91k60M38k85L5K64j18k71PK8n9L39
7811A74Q1m60m1M84l88L63k49o0k6J42j39L86j07m6P2m18P1J32l95O38k37q4K10
7834A03Qj58M80j84%k71m5n1K20k69J96L02m79j30K93J5O1J42n63M70j11m1k3
$$ plain form
7674 -127 -44 -178 40 -135 -220 -34 -127 -97 184 395 225 -146 154 157 -59 12 -340 140 223 241 346 37 -474
7697 -474 254 -157 104 202 -2 33 -244 -15 -109 -10 142 265 -114 -192 -21 122 -378 -261 -83 -100 -100 159 -13
7720 -13 1 -471 -34 -16 35 -253 39 136 38 335 -110 -140 -68 47 -195 172 170 -181 -88 41 165 73 -100 23
7744 23 52 146 -184 39 70 -311 -15 -247 9 -192 197 107 274 -141 13 -91 -265 -147 105 -164 227 267
7766 267 308 -418 -45 -138 -106 25 -107 -184 -139 -177 -89 425 -279 143 -236 -64 -101 93 16 -373 313 -154 -69
7789 -69 43 -196 -243 19 174 312 -189 190 27 -135 56 -204 234 -51 -16 248 130 -141 -134 -106 -165 174
7811 174 255 -205 -246 238 -150 213 -36 -96 -122 20 -119 267 160 114 186 -232 -161 -29 -424 214 -23 -107 103
7834 103 111 -47 433 249 249 -22 -67 -118 102 -167 29 331 -148 -278 15 30 91 233 -330 140 29 -12 -35
7857c5j87J13m5L08k29j41M61j41k40L26o7J18k22qO4j32j3k34O36q25N52J44
7879B03l29p0J43m2O11o14R4J82o0n44L66M4J13k23q9M28j2p3J16rl18o5L06j27
7903C1p7N8J19k68N0J52j70J80q0k63N84k9j39m36M76N0r9l8n97O48j55J75p3
7926I9J99m53K61l98M53r2o3n4J81j77l9n6nr7P0k60N36k1N7J6J71j34k93R7L6
7951C4k14K16q9J52k69M1J74j27R6J7p6K9o5L36k40N1Q6j33l7j23O5J59J00r5
7975H8k9K58n05n9J12K90k0l4mJ12j19k99L37o49O79k57P4K27m55N39l42J51k27
7998a32J40l9L0O3j91M83o78K61R6R9P9j41j7q1M71q12N18l26J52j09K60l70o9
8021c13K91K34j70j34L15k22n7o6N0J55Q6k84%K0j51M36k98J47J47q3j68K43k66
$$ plain form
7857 -35 -222 -109 -154 154 -75 -216 245 104 -136 190 123 241 19 11 75 -57 -70 -304 332 -493 59 203
7879 203 -126 -196 -53 -95 516 -98 -4 178 118 -426 -60 -16 97 -126 -215 213 201 128 244 235 -83 -148 158 31
7903 31 -46 12 131 -137 -87 65 -105 75 -5 -268 316 287 148 -288 188 238 139 101 -496 152 -3 172 99
7926 99 298 -155 106 -292 161 69 6 -48 133 -44 -83 -139 -144 -241 -171 -431 105 84 141 157 328 194 -99 -2 34
7951 34 -180 36 -53 99 -170 -129 45 -82 14 31 -45 -16 -81 255 15 66 152 19 -18 -141 -76 83 183 88
7975 88 59 317 -188 -247 -135 155 135 101 97 209 90 -209 128 -521 158 -99 -25 202 -253 286 -56 95 -132
7998 -132 8 -31 -1 62 -129 354 -324 -63 33 132 211 70 53 -28 443 -369 149 -177 -25 -134 126 -244 -313
8021 -313 -22 212 42 -92 223 1 -56 -122 -72 83 169 -115 -115 -95 -246 190 -108 39 186 103 -65 178 -88
8044h8R6J64k74J05j90K23j32O1J69j85J11R5o9n5m3j24K4J08Q3R5j96j13j51
8067b86K0M4K60O5N0o8k63K56k78K02J25j09j74L54KO6r3j1M2m59K30M5M9l73
8091c04K18L17j57L07n65j26K02K14j30K4O9M33m50mK99l66j92M2L45N6n2k97
8113a17j31J75J38J59l10J02J09l71K77oJ85l98M71r9j13L10j4k78L6l8M0j95
8135f8K84j36K06k20Q6j35MJ26J1k19J79k50J34J89j71J08O4J9l45O2j09K32M9
8158A00l89M84n84J35K17j48j5K37j83J91J88n18M1K8k26M63j33L01n17K20J27
8179A9L4K75k20o3L9k29j67K74L9J79j37q5
$$ plain form
8044 -88 8 172 -102 3 -187 36 -96 -35 134 -51 60 155 86 31 -12 -136 -112 -4 79 174 -22 -135 -286
8067 -286 -266 -222 38 103 153 85 -178 78 -200 2 127 18 -156 198 200 266 173 162 204 -255 -25 20 69 -304
8091 -304 -86 231 74 381 -184 -310 -108 106 -24 0 69 502 52 48 347 -19 -211 -169 176 232 180 -117
8113 -117 -248 -73 65 224 -86 16 125 -246 31 25 210 -188 283 184 71 381 367 89 125 87 127 -68
8135 -68 216 80 286 66 152 17 21 147 158 -61 118 -132 2 191 20 128 192 211 -134 -72 -181 51 100
8158 100 -289 195 -389 -254 -37 -185 -200 37 -146 45 233 -285 -244 -216 -442 21 -112 189 -328 -108 19
8179 19 53 328 108 45 84 -145 -312 -38 1 180 43 -42
8191d2
$$ Imaginary data points
##PAGE= N=2
##DATA TABLE= (X++(I..I)), XYDATA
0@%%%%%%%%%%%Jl3O4o4O4o5R7j29J61j93K26k90L23l56M27n20O09o92P89r03J032
32E48j175J336j514J708j915K141k392K676k984L312l671M072m510M980n495O060
48C177o677P356q108Q937r851J0864j1998J3280j4731J6398j8331K0600k3314
61a2398K6623l0773L6157m3442N3909p0347J00017j70219O30701N71784j160977
72f8965k72270M71463J33643o34087L027P58941L60686p01478o61305Q2147L72052
83a56146N287j205K94655K82128j82168m09415k53548P9031L03858L29409N3658
94C45544j72860j13080k8497k24141k26940K56474N80268J47143l89675k83852
104a09616O1259n2420k53109O8411M84013K41715l20253l81880l3657O3708l1663
$$ plain form
0 0 0 0 0 0 0 0 0 0 0 0 0 1 -32 32 -32 32 -33 64 -65 96 -97 129 -161 162 -194 233 -287 322 -370 419 -484 548
32 548 -627 709 -805 903 -1012 1129 -1263 1413 -1571 1741 -1930 2142 -2368 2612 -2883 3177
48 3177 -3500 3856 -4252 4685 -5166 5698 -6300 6980 -7751 8647 -9684 10916 -12398
61 -12398 14225 -16548 19609 -23833 30076 -40271 59746 -110473 520228 1092012 -68965
72 -68965 -341235 130228 263871 -370216 -367189 391752 752438 50960 -610345 -528198 -156146
83 -156146 -150859 -152064 142591 424719 242551 -166864 -420412 -341381 -37523 291886 345544
94 345544 172684 59604 31107 -193034 -419974 -163500 416768 563911 174236 -109616
104 -109616 -48357 -100777 -353886 -285475 198538 440253 120000 -261880 -295537 -231829 -263492
115b63492J35107L64667J80003j78016k31379j21382j07431K6907L10816K77863
125C93663j16201k68571n4757l6075k50878p6405M35376M45656j59550m44660
135a32402n9113J86136j15665k22087K62207N19406L045n05412k75820J66522
145a73183J30928p3055P2039L00249J40127k36941l51063j17354J63995K27218
155H2960Q8054l5422j6299j3142j76995k81576k5978L58815L31298q3496k55349
166b7130j2273Q0145j79630j96529K52768M55963J7567l76555j79335J09238j7986
177g3757j58992J07199L63750J28162k67084k72559j2145P4620J2010P8540J92439
188A72183Q7032j45915k17256j15136J463J12553J94918J23198n3601j21057p8132
$$ plain form
115 -263492 -128385 236282 416285 238269 6890 -114492 -221923 -195016 115800 393663
125 393663 277462 8891 -45866 -81941 -332819 -409224 26152 471808 312258 -132402
135 -132402 -191515 -5379 -121044 -343131 -80924 438482 441527 -63885 -339705 -173183
145 -173183 -42255 -115310 -43271 256978 397105 160164 -190899 -308253 -144258 82960
155 82960 171014 135592 119293 106151 -70844 -352420 -378398 -19583 311715 228219 -27130
166 -27130 -39403 40742 -138888 -335417 -82649 373314 390881 14326 -165009 -55771 -73757
177 -73757 -232749 -125550 238200 366362 99278 -173281 -185426 -110806 -98796 -20256 172183
188 172183 259215 113300 -103956 -219092 -217629 -105076 89842 213040 159439 38382 -39750
199c9750q8556q3691R2683K62301J47536j20157j96141p6919j4434l7596L7923
210a16801J86386J69046m8349k06411j51629j3371O8356J04528J10494N9691j9346
221A42594r2449j56852j31873O1915K38024J47694p4932j07213m597n0446j64611
232a92746l0366K48216K45727o1231k24925p3504M4599n9290q3604J43408K67261
243B23545L0172k34855j71891K8122M9826p879O9687J66811O9696j37780k03627
254a18173p4313P8662J13363O9142M4007K5671n3371j49846j30380K6629J66206
265b403J41918M720p5339n4960n5185r9701l7437J38746J94204L1868j24561j03877
277d2007l3665l4797j2070R4602J52938N8153q7888j35233p9394o619N0271R6906
$$ plain form
199 -39750 -128306 -211997 -119314 142987 290523 170366 -25775 -102694 -117128 -154724 -116801
210 -116801 69585 238631 190282 -16129 -167758 -181129 -112773 -8245 102249 161940 142594
221 142594 50145 -106707 -238580 -176665 61359 209053 134121 26908 22311 -28135 -192746
232 -192746 -223112 25104 270831 209600 -15325 -88829 -44230 -103520 -187124 -43716 223545
243 223545 253717 18862 -153029 -124907 -75081 -82960 -13273 153538 223234 85454 -118173
254 -118173 -192486 -113824 -461 68681 112688 138359 84988 -64858 -195238 -168609 -2403
265 -2403 139515 144235 68896 13936 -41249 -140950 -178387 -39641 154563 186431 61870 -42007
277 -42007 -75672 -110469 -122539 -27937 125001 183154 95266 -39967 -119361 -125980 -75709 21197
289B1197R7302K3568o7500j01235q6815l9487O0058J47963J02896l8348j01749
300A7850o2787m2905m4458L2717J45933J28765k8379j40943j00138n960K0950
311g9355K4172Q4350J19661J4608j37156j45015j8260O9042O4333N3436N8677
322A08493J5183q5769j39527o5167P3268J24653O1607m229j5678m4235j02708
333g4109q2098M7607J43782R6082j9211p1896n3774m6378n1648P987J16555J29211
345A42110l04j12166q9883k1222m729J3097Q0846J09117K2674r7355j19211m1395
357a18421L3738N3373N9948P0817K5094p7978j21662n0449M1876P2003O6825N2200
369A07364j346p8071j01530m6248L6452Q0349P2155L4400j6571p3449r7008m3018
$$ plain form
289 21197 118499 142067 74567 -26668 -113483 -152970 -92912 55051 157947 119599 17850
300 17850 -44937 -87842 -132300 -99583 46350 175115 146736 5793 -94345 -100305 -79355
311 -79355 -55183 29167 148828 163436 26280 -118735 -136995 -67953 -3620 49816 108493
322 108493 123676 37907 -101620 -166787 -93519 31134 92741 88512 72834 28599 -74109
333 -74109 -156207 -108600 35182 131264 112053 40157 -13617 -59995 -111643 -103656 12899 142110
345 142110 141806 29640 -60243 -81465 -86194 -73097 7749 116866 139540 42185 -77026 -118421
357 -118421 -84683 -31310 28638 99455 124549 46571 -75091 -125540 -83664 -11661 55164 107364
369 107364 106018 27947 -73583 -119831 -83379 -3030 69125 103525 86954 13505 -83503 -126521
381a26521M9684R0226O2145J9063k2369p0398q6205l3882M9309R1984P0613R566
393A03215m8860p2040n9829k2258L7805Q8605P5742J954o3428p6802n2098o306
405i4300M6601P9675O3739J801o5036q5331m4641J3588N0380P0908O2540j009
417I8915p8008q5738k9007K4128N0542O8004N4570j0358p9629q5692k7012L6744
429f2541O0281N5941L8561r632p7512r1456k0542N4032O4837M4062K8062j2715
441G1378p2795q4587j9087N6701P7796M6327K987k8971n4210o5940l0397M8259
453e2539R3222N4547j8293n2714m9635l9560j8449K9540Q0149P3056p006q2472
465I846p1531r074J6435J8371N2031P5150J1576q5484r1706j4410M4222M2780
$$ plain form
381 -126521 -76837 13389 75534 94597 72228 1830 -84375 -118257 -68948 23036 93649 103215
393 103215 54355 -17685 -77514 -99772 -61967 26638 102380 104334 40906 -35896 -87994 -94300
405 -94300 -47699 31976 95715 97516 32480 -52851 -97492 -83904 -33524 37384 99924 98915
417 98915 20907 -64831 -93838 -69710 -19168 48836 103406 93048 13419 -72273 -99285 -62541
429 -62541 -2260 53681 92242 82610 5098 -86358 -106900 -52868 11969 56031 84093 71378
441 71378 -1417 -86004 -105091 -48390 29406 75733 78720 49749 -4461 -70401 -100798 -52539
453 -52539 40683 95230 76937 24223 -25412 -64972 -83421 -53881 26268 99324 92318 9846
465 9846 -61685 -70759 -54324 -35953 16078 91228 102804 17320 -74386 -88796 -44574 -1794
477a794L5503L9936J1749n9139r3087l5765M8383O9188L8947J5486q637n3171
489G599p1960k8885L5087O6522N7069J6167l6164o2051m7824j1449K8015N8843
501A0969O0021J6486m2407p0429m7237L698M0939N0010M1849J4497l7328p3479
513c2411m8952J0693M8502N3252L7700k044m6852n7635l2515K632M0582O5867
525C8819M5952j9654o4327n0716j1411J3738K9055N2388N2403p558p9576p2214
537g3101M193M3848K6642K3945M3038N831p3023q3257o565N9644N2157K0767Q256
550E2375n003m1963o5558k7271M6197P5090L7929j3094l5631l8752l4608j4027
562f4316K4243N8360N7350K793o1188o2037j3102J6389J7607L4155N2147J4031
$$ plain form
477 -1794 33709 73645 85394 26255 -66832 -102597 -54214 14974 53921 69407 60770 7599
489 7599 -64361 -93246 -58159 8363 65432 81599 45435 -16616 -64440 -75889 -47874 10969
501 10969 70990 87476 45069 -25360 -72597 -68899 -27960 22050 63899 78396 41068 -32411
513 -32411 -81363 -70670 -22168 31084 68784 66740 19888 -37747 -70262 -67630 -27048 38819
525 38819 84771 65117 790 -49926 -61337 -47599 -18544 33844 86247 78689 -887 -73101
537 -73101 -68908 -25060 1582 25527 68565 74396 1373 -81884 -88449 -28805 23352 44119 52375
550 52375 47372 5409 -60149 -87420 -41223 33867 71796 58702 23071 -15681 -50289 -64316
562 -64316 -40073 18287 75637 78430 17242 -44795 -57897 -41508 -23901 10254 62401 76432
574G6432n7272p4265k0947L1915M0110K9111K6253J0081l7288o6915l2707K9278
586d6214N4622L8160J4477j4010m3939m6546j8142J3657M0899N5004K7437l3391
598D2014o4331l3627P997J9179K5213M2823L5012k3223p5776n2186J8248M8811
610i846K7023J5253K2897o196o0308n9412N004N6302N0117J5498j2828k6299l2114
623a4909l4322j6494L0174O8031M2771k6985o0243k8995N180K301M922M3709O1443
636G6583k161p9595o2630J7598L9884N654J0496M7932J7390o3880p4397K55N2415
649a4456L4898R796J1843K393l7288n7504k1846L5589N5129L0632m499k6327l4028
662a5668k4156p146J3430M1221N3242J3117n3948o0772n702K2876O541J3326M7402
$$ plain form
574 76432 19160 -55105 -76052 -44137 -4027 25084 51337 61418 24130 -42785 -75492 -46214
586 -46214 8408 46568 61045 47035 3096 -43450 -61592 -47935 -7036 47968 75405 42014
598 42014 -22317 -55944 -47947 -28768 -3555 39268 74280 51057 -24719 -76905 -58657 -9846
610 -9846 17177 32430 55327 49131 -11177 -70589 -65585 -9283 40834 56332 43504 17205 -14909
623 -14909 -49231 -65725 -35551 32480 75251 48266 -11977 -40972 -35792 -33491 -28569 15140 76583
636 76583 74422 -5173 -67803 -50205 -10321 -4667 5829 53761 71151 7271 -67126 -66871 -14456
649 -14456 20442 30238 42081 44474 7186 -50318 -72164 -36575 18554 49186 44687 18360 -15668
662 -15668 -39824 -46970 -33540 7681 60923 74040 20092 -40680 -46382 -23506 -16965 -3639 43763
675D3763K8187m6624p4150j8305L8024L2920J1469J9351J9003k6272o2344l1647
687f6625K5159M2658K9525J4352q390l6299l4103q769P633K2772M6689L6858k6254
700D5206o4281k7895J8455J3267J151L0971M7097j2089p6019m7527K9911M2544
712G91L754Q033L7230K646o4181n4620J7515M7340K2821R162R422j2331m2194
725a4612l4526J709L1488M0320K7440o094l7660l6955q750Q425J0606K6756M3416
738E1563N562n7083n5304R003L5534M793O502M2080J9914n2416o4014J414M3785
751h667K1988L330J7094J0335l5641n2874j0439L4228L2785J6454J0228q901l7855
764g935l3599K509K1327K0062K7445K1264k3671n3700k2213K0036K0683J0833
$$ plain form
675 43763 71950 25326 -48824 -67129 -29105 3815 15284 34635 53638 27366 -34978 -66625
687 -66625 -41466 1192 30717 45069 36679 380 -33723 -42492 -34859 -12087 34602 71460 45206
700 45206 -19075 -46970 -28515 -15248 -14097 16874 63971 51882 -24137 -71664 -41753 791
712 791 4545 12578 49808 52454 -11727 -66347 -48832 -1492 21329 30491 39913 27582 -14612
725 -14612 -49138 -47429 -15941 24379 51819 45725 8065 -28890 -37640 -29215 -18609 8147 51563
738 51563 57125 42 -55262 -46259 -10725 -5932 570 42650 62564 10148 -53866 -52452 -8667
751 -8667 13321 16651 33745 44080 8439 -44435 -54874 -20646 12139 28593 38821 29920 -7935
764 -7935 -41534 -39025 -17698 2364 29809 51073 27402 -26298 -48511 -28475 -7792 3041
776C041K4263K4710k0893n5863k8394K3507L3692J2866R785J3250j6291m7420
788b3747k8885J6375L4443K3508J3786k186k8675l3347q973R626J8460L0469K8531
801D9385j1103m6044l0612P753J6988P793K0206L1652j068n1024m3436J2467L4815
814b228R651L679K3438N083m3663m5536M837L6282K3957Q353N156q170k7800k8064
828c5025m127K2856L2817K2490k566k5884k9604j1967O384J2588K0979K8201O800
841D3942l4965m2616n215K1420J3479J1418K3830Q248l2295m1340q052K1644K3253
854B751J6407J1995k355k4739l0667j0123J4805K5553K3438J1227j3769l2766
866h243k1632L617R993J2941K6356K0166j9655m3123j8363J4665J4739Q579J9310
$$ plain form
776 3041 27304 52014 31121 -24742 -53136 -29629 4063 16929 26714 39964 23673 -23747
788 -23747 -52632 -36257 -1814 21694 35480 33294 4619 -28728 -37701 -28075 -9615 20854 49385
801 49385 38282 -7762 -38374 -30621 -13633 -5840 14366 46018 44950 -6074 -49510 -37043 -2228
814 -2228 7423 11102 34540 39623 -4040 -49576 -44739 -8457 15500 23853 29009 20839 -6961 -35025
828 -35025 -39152 -16296 16521 39011 36445 10561 -19043 -31010 -24626 -12038 8941 37142 43942
841 43942 8977 -33639 -38854 -17434 -3955 7463 31293 39541 7246 -34094 -42146 -20502 2751
854 2751 19158 31153 28798 4059 -26608 -36731 -21926 3627 27065 38292 24523 -8243
866 -8243 -29875 -26258 -16265 -3324 23032 43198 23543 -19580 -37943 -23278 -8539 40 19350
879A9350J8619j3807m0732k4689J3337K6657J4429Q451Q122r459l2509k4654O800
892c0085K6319K3765J1372o224k1350k0708r442j019J4222L0614K3432j3971l5687
905h762j8634M730O313O098K2353K7421n540m0436k9570R649K1259O786R424K2035
919C3126j15l6953l2405N867K3870J4784R538Q746o394k6629k4142j199J9031
932a2875K3335J4723J016j4591k3695j4853K849J4353J8897J9021L902k2531k9011
945a9460p911J0415J1776J4442J7997K854k4015k8580p515J1371J6017J6238J1588
958B5217k044k0557k5276p948J2799J9458J5716R932n533k4142k1054j665J2199
971a2898J4672J8151J1733j1914k8687j7078L977J2160J3334J5106R054j0625
$$ plain form
879 19350 37969 24162 -16570 -41259 -27922 -1265 13164 21615 29737 20278 -12231 -36885 -30085
892 -30085 -3766 19999 31371 25147 3797 -16911 -26353 -27372 -13150 17464 40896 26925 -8762
905 -8762 -27396 -22666 -16353 -10255 12098 39519 33979 -6457 -36027 -26378 -5119 1667 11091 33126
919 33126 33011 -3942 -36347 -30480 -6610 8174 17712 26458 20064 -6565 -30707 -31906 -12875
932 -12875 10460 25183 26199 11608 -12087 -26940 -24091 -9738 9159 28180 32082 9551 -19460
945 -19460 -27371 -16956 -5180 9262 27259 30113 6098 -22482 -29997 -18626 -2609 13629 25217
958 25217 23173 2616 -22660 -30608 -17809 1649 17365 27297 21764 -2378 -23432 -25097 -12898
971 -12898 1774 19925 31658 19744 -8943 -26021 -22044 -9884 3450 18556 27610 16985
983A6985k8101j9481N484J9163J4469Q552O227q341k5554j9821O832K0206J6430
996A3050Q984O07j2803k1681j3354L510J7992K0273R027o373j6318j7612j0446
1009b5144M488J7684J9054Q313o453j9210j8973m947R959J5139J5822J0561p640
1022A8653k2649j7661J9J0359J4823J5239P738j0173k2295j6668k95J4231J6062
1035G383J0401L833p842k1905j8312K111J8444J5874P208K673r170k0368j5054
1048b4724K812J7532J8504Q109m016j2443j5000j1970M00J7390J9978O879p950
1061A5501j4187j4770q600L880J5384J6963Q334o203j9091j5923k271Q122J2879
1074A8J4360R203p673j9891j4993j300J0746J5110J2018L685p765j7226j7135
$$ plain form
983 16985 -11116 -30597 -25113 -5950 8519 17071 23298 14957 -10597 -30418 -23586 -3380 13050
996 13050 22034 22641 9838 -11843 -25197 -21687 -3695 16578 25605 19232 2914 -14698 -25144
1009 -25144 -20656 -2972 16082 24395 17942 -1268 -20241 -25188 -15229 -90 15732 26293 18653
1022 18653 -3996 -21657 -21638 -11279 3544 18783 26521 16348 -5947 -22615 -22910 -8679 7383
1035 7383 17784 21617 13775 -8130 -26442 -24331 -5887 9987 17195 19868 10698 -9670 -24724
1048 -24724 -21912 -4380 14124 22233 18217 5774 -9226 -21196 -20796 -3406 16572 23451 15501
1061 15501 1314 -13456 -22056 -18176 -2792 14171 22505 16302 -2789 -18712 -20983 -12861 18
1074 18 14378 23581 15908 -3983 -18976 -20276 -9530 5580 17598 21283 13518 -3708 -20843
1087b0843j440J4429J6143Q167J652p419j8620j4988J977J4527J4772R415L12
1100A8084j0934j7423j0587K783J4296J5849P730k616j1287j5722j1240M365J7036
1113C34J3918M324l814j1232j6842q299O331J4866J3716N623n888j5032j3937
1126a5932l770O946J4010J3978M747p380j5289j3573k316R579J4527J0193L012
1139A8732o270j6744j5450P88J3910J1839P050K983p567j6975j3220K346J3640
1152d938J3632P169p34r004j4822j0396J830J5071J4117M908k335p813j5774j0878
1166a9967N453J5883J0904L567k203j0319j5755p871O367J4639J2528K791o201
1179I816j0882j0912o597N359J5456J3509J236p452j2329j0694k601Q159J1797
$$ plain form
1087 -20843 -22283 -7854 8289 16456 18108 10689 -7931 -22919 -20942 -6415 8357 17772 18084
1100 18084 7150 -10273 -20860 -18077 -3781 12068 19798 17182 5895 -9827 -21067 -16702 334
1113 334 14252 18576 14762 3530 -13312 -21611 -15280 -414 13302 18925 13037 -1995 -15932
1126 -15932 -19702 -12756 1254 15232 19979 12599 -2690 -16263 -18579 -9000 5527 15720 18732
1139 18732 12462 -4282 -19732 -18944 -5034 6805 13855 16838 9271 -7704 -20924 -18578 -4938
1152 -4938 8694 15863 15129 6125 -8697 -19093 -17263 -2192 11925 16833 14498 6685 -9089 -19967
1166 -19967 -14514 1369 12273 15840 13637 3318 -12437 -20308 -13941 698 13226 16017 9816
1179 9816 -1066 -11978 -18575 -13216 2240 15749 16985 9533 -2796 -13490 -16091 -7932 3865
1192C865J0500M143p279j7432j2187M275J0329Q273O969M842p030j7034j2969
1205b0735L401J5270J1618J943k19l756j2351j4451J481J7451J4547K33m079n816
1219D537j0911r518R53J3342J4424M994p400j2355q650k999K014R038J2987O689
1233A7145n899j4653j1433j031Q527J0080O789M061j393j2986j4962p92J2648
1246c899J0922M610J635m332j1616j1359j536R134J2998Q019k352q973j0100p013
1260a3862j32Q710J1445P769m7r850j4155o066O824R932O123N384K479r293j5885
1275a0624o541Q213J2030O904J665j563p464j2081q063N733J4340R575p62n538
1289E824o796q860n344N486J1715R872L307p163j3214p447K691N725N499R019
$$ plain form
1192 3865 14365 18508 11229 -6203 -18390 -14115 -3786 4487 11456 16298 9268 -7766 -20735
1205 -20735 -17334 -2064 9554 11497 11278 7522 -4829 -19280 -17799 -348 14199 14432 10353 4537
1219 4537 -6374 -15892 -14939 -1597 12827 17821 10421 -1934 -10584 -13583 -11569 -2531 10456 17145
1233 17145 11246 -3407 -14840 -15871 -7344 2736 9525 13586 12193 -793 -15755 -16547 -3899
1246 -3899 7023 11633 13268 8936 -2680 -14039 -15575 -6441 6557 14576 12224 3251 -6849 -13862
1260 -13862 -13994 -5284 6161 13930 13883 4033 -10122 -16188 -9364 568 6691 12075 14554 5261 -10624
1275 -10624 -17165 -8952 3078 9982 11647 10084 2620 -9461 -17524 -11791 2549 12124 11362 5824
1289 5824 -972 -9832 -15176 -9690 2025 11897 15204 8041 -5173 -12620 -9929 -4204 1295 10314
1303A0314N987p042j5869r337M812R976N992L232L311k773j4410j2602M205J4788
1317E84P169M02J025l105j2141r940L820J2614R781K499k719p275r861n727L092
1332i782J0093R642K934l451r649j0467l847P238R405N361K583n87r873j3240
1346a3640r44R767R301L504K435j699r620j0912r27Q706J0412M660n56m018r386
1361b917q811p25R409R498K928j97m092j0924r093L433J0878O790K503P75m739
1376D716j1338p311M195J1438P646N35k295m128q470q400K869J2962Q920j348
1390I991m207n455q112n586M771J0384P336J403m036q992p805j466N914Q508O522
1405I170J650m560q140p963j615P894R716L672r87l142p173r833r75R419R681
$$ plain form
1303 10314 16301 9259 -6610 -15947 -11135 -1159 4833 8065 11376 8603 -5807 -18409 -14204 584
1317 584 7753 8155 9180 6075 -6066 -16006 -12186 428 10209 12708 9989 2714 -7147 -12874 -9782
1332 -9782 311 9953 12887 9436 -213 -10680 -14527 -7289 2116 7477 10060 9473 -400 -13640
1346 -13640 -14584 -4817 4484 7988 10423 8724 -896 -11808 -12735 -4029 6383 11043 10487 6469 -2917
1361 -2917 -11728 -12453 -3044 6454 9382 9185 5093 -5831 -14924 -11491 -613 6177 8680 9455 4716
1376 4716 -6622 -13933 -9738 1700 9346 9881 7586 3458 -5012 -13412 -10543 2419 11339 9991
1390 9991 5784 329 -7783 -13369 -8598 1786 9122 10525 6489 -2503 -10308 -11774 -5860 2648 9170
1405 9170 10820 6260 -1880 -9843 -11458 -3564 6152 9824 8837 5695 -1478 -11311 -12286 -2867 6814
1420F814K349k041l922p956o335J25P770R432M642k744p278p261m035K083P631
1435g26Q288L303k704n999q641n626M579J0290N665Jj707n466r037m684M426J0621
1451B583O547n22n202n377n096l339K275J0446R396j257q164n836l461j085L549
1466d543P531P359R69o886j0308m246L039N285M122N098K301o158j0152n440L581
1481h448P435O331K673j339m027o780o219J270R876Q065Q33m056m649n486l958
1496h479J169P312P487L047n100q580m730J40K527M296P372L524m463r068n880
1511i426P28M854O978L742R07k135p447p492l6P965O046L261l6m143p073n001
1527h308M07N078P185M452j862o248o091k449L53M566P479M345j702o225o965
$$ plain form
1420 6814 9163 7122 3200 -4756 -11091 -10966 -3196 6236 10878 8134 856 -6405 -10440 -8357 -726
1435 -726 7562 10865 8161 2162 -6479 -12105 -7526 2764 8429 8430 6723 1257 -7780 -12464 -8038 2583
1451 2583 9130 8608 3406 -1971 -7067 -10406 -8131 2315 11711 10454 2290 -3546 -7007 -8092 -4543
1466 -4543 2988 10347 11316 4430 -5878 -10124 -7085 -1800 2322 7420 9721 3563 -6589 -12029 -8448
1481 -8448 -1013 5318 7991 6652 2625 -4155 -10374 -9104 772 8837 9670 5614 965 -4521 -8479
1496 -8479 -7310 2 7489 10536 5436 -3144 -7874 -7734 -5207 -911 6461 9985 5522 -3546 -9426
1511 -9426 -8698 -3844 3134 6876 7783 5648 -1799 -9291 -9327 -1362 4684 7945 7909 3766 -3307 -8308
1527 -8308 -7901 -2823 4362 8814 6952 704 -5387 -7836 -7483 -2917 4562 8907 7205 980 -5985
1542e985k709L729N632L909L222M01o652q558k328N029O330L623J762k111n372
1557g8o715k877L975Q004M724n41l972l622n640k453M600P596M629k74l723o234
1573b601m545O86M462N349M416K88n014p123l653J322M648N341L058m76m178o346
1589d366m720J565P180M836J259j56l469o673m348L323O957M602P33j550m156
1604A017n400l320J955P513N426k57l880l912m196l501K802P472N100r40l492
1619B387l781m704j652L804O714M396Rm573n093l156m82L392O367L957j133m844
1635A608m638l326l20M682O644K014k088l547m552m019P41O154N598J016j604
1650D363l753m565k613O96N859O622J035m220m131k532k647O69N770O271K50m296
$$ plain form
1542 -5985 -8694 -4965 667 4576 7798 8199 1547 -7011 -9339 -4310 2020 5643 7405 5294 -78
1557 -78 -6793 -9670 -5695 2309 7033 6492 2520 -1102 -6742 -9195 -4595 3001 7630 7356 3633 -2601
1573 -2601 -7146 -6460 -1998 3351 7767 8055 3041 -4082 -7735 -6413 -1765 3576 6634 6158 1980 -4366
1589 -4366 -9086 -7521 -341 4495 5754 5598 2129 -4544 -8892 -5569 1388 5990 6723 5173 1017
1604 1017 -4383 -7703 -5748 1765 7191 6934 3054 -858 -5054 -8555 -5753 1719 6819 5879 2387
1619 2387 -1394 -6098 -7750 -3946 2768 7164 7173 2600 -2493 -5649 -6131 -2739 3628 7585 6452 1608
1635 1608 -3030 -6356 -6676 -1994 4650 6664 4576 1029 -3523 -7542 -6801 -647 4951 5967 4363
1650 4363 610 -3955 -6568 -5872 -13 6609 7644 3424 -707 -3239 -5886 -5217 553 6824 7074 2778
1666B778m119l729k231K785N817M138J20l125m757l703m22L577N501M130p50m338
1682A672l650k975q73L167O635M122k976m130l150k610j640L993O752K222k039
1697D520n054l718j272L33L332N158L821k817m812m025p29J566L986M750J567
1712F606k513m172l455k480K081N907K934n2j955l129m649j943K867N584L657
1727E288p11l232l403k128j536J771N884N173j575m352l314j893r78K894N199
1742C087L670j874l624l950k485R25L272M077J808n76m222m055k039J155M183
1757f48M448J418j849l352l309k490J123N577M278J38k726j934l610k850K023
1772c763N177L727p57k230l496k819j402J762M642M150l95l636k830j982j268
$$ plain form
1666 2778 -1341 -5070 -7301 -4516 1301 5439 5559 2434 -2323 -6026 -6448 -2871 2630 6760 6010 1672
1682 1672 -1978 -4953 -5826 -2659 3976 8098 5122 992 -2158 -4768 -6408 -2415 4337 6559 4520
1697 4520 -534 -4252 -5524 -5191 -1859 3299 7120 4303 -509 -4534 -5263 -3697 289 5039 6606
1712 6606 4093 -79 -3534 -6014 -3933 1974 4908 4856 2901 -228 -4877 -6820 -3953 1631 5288
1727 5288 4577 1345 -2058 -4186 -5722 -3951 1933 7106 5531 1179 -2135 -4028 -5006 -2112 3087
1742 3087 6757 4883 1259 -2691 -5176 -4251 -979 3098 4906 4330 108 -3947 -5986 -4831 -648
1757 -648 3800 5218 3369 17 -3292 -5782 -4659 918 5196 5334 2608 674 -2936 -5786 -3763
1772 -3763 1414 5141 4384 2154 -1342 -4161 -5563 -3801 841 4991 4596 960 -1870 -3852 -5120
1787e120K364M925L205r24l021k656l050m99L669M677J492j322k354l556k814
1802d984K21L791M566J252k143l175k124j981m97L739N745O81l044k431j952k093
1818d429M27M115M365R26k408l047l080q99J411L374L024O15k157l685k785l03
1834d536J714M530K452r38k510j837k226j898L095N382J453j258k653j416k495
1849c141j036K385M720K293j325l888k251j087k17J739M093K588j791m137k325
1864c380q44N71L396K698J316j050k263l574j865K498M103K081N9r98k582k668
1880b502j821J450M487L134j230k454j920j561j932J140M724K905j687k375j636
1895a278j461r47J904L534K394m85k649k863j257L23K080L103J687q62k228l215
$$ plain form
1787 -5120 -2756 2169 5374 4450 1429 -1227 -4277 -4776 -1107 3570 5062 3740 1386 -2170 -4984
1802 -4984 -4763 -972 3594 4846 2703 -472 -2596 -4577 -5074 -1335 4410 5091 2047 -384 -2336 -4429
1818 -4429 -4002 113 4478 5404 2996 -51 -3131 -4030 -2619 755 3779 4394 2237 -1448 -4233 -4536
1834 -4536 -2822 1708 4160 3222 712 -1125 -3351 -5249 -2154 3228 4681 3423 770 -646 -3141
1849 -3141 -4177 -1792 2928 5221 3896 8 -2243 -3330 -3547 -1808 2285 4873 3082 -1055 -3380
1864 -3380 -4224 -3653 -257 2441 3757 2707 444 -3130 -4995 -2497 1606 3687 3746 2748 166 -2502
1880 -2502 -4323 -2873 1614 4748 3518 1064 -856 -2417 -4349 -3209 1515 4420 2733 358 -1278
1895 -1278 -2739 -3686 -1782 1752 4146 3661 1012 -1851 -3108 -2785 -705 2398 4085 3223 995 -2220
1911b220j915M65L340K863P20j255j796k334k562P03M491K909k54j390j634k407
1927b276j467J334L203L056Mj887k517j728r46Q96L391K231j88j673k199k108
1943b874j543K656L178J371q50n97k344l008J16K746L266J280j091j219j855k312
1959c080l71K744L794N88j795j090j759k526j33L614L289o94j407j254j876k380
1975d336J198L496K368J05j141j998j919j123J022K934K734K97k378j307j909
1990a957j125Q71L872J481r56r86j641k323j214K158L278J437j265j049j722j604
2006b745n20K001L561J466j687j776j033j416p70J941L964P98k009j869j336j202
2022b632l82K251K666J013j233k156j988n52P56K302K005M96j006k197q72j516
$$ plain form
1911 -2220 -4135 -3670 -330 2533 3253 1998 202 -2132 -4694 -3991 500 3409 3155 1765 131 -2276
1927 -2276 -3743 -2409 794 3850 3854 1967 -550 -2278 -3224 -2328 1063 3294 3106 1433 -766 -2874
1943 -2874 -4417 -1761 1417 2788 1938 1341 -1003 -4011 -3895 -1149 2117 3397 2306 1087 -768 -3080
1959 -3080 -3451 -707 3087 3675 1880 790 -969 -3495 -3628 -14 3275 2581 1174 -80 -1956 -4336
1975 -4336 -3138 358 2726 2831 1690 -308 -2227 -3350 -2328 606 3340 3637 1259 -48 -1957
1990 -1957 -3082 -2211 1661 3142 2186 1200 -441 -2764 -3978 -1820 1458 2895 1630 581 -1141 -2745
2006 -2745 -3265 -1264 2297 3763 2076 300 -733 -2149 -2919 -978 2986 3784 1775 -94 -1430 -2632
2022 -2632 -3014 -763 1903 2916 1683 -473 -2461 -3013 -2257 45 2050 2546 1540 -657 -1529 -3045
2038c045J365K756K178n17j436j355j583j433J453L287J242o06j447j600j650
2053b391l59J161K431J843j75k469j391o97j95Q43K980J582n39k226j615q55L43
2070a729J785J906N44p0j518k824q57P55K208J603j4l00j868j675q21Q00J526
2087e49K691M95j597j196j169r71O89K181K150o9q92k460j716L15K003M52J557
2104A914O88j148k920j478R73J656J024Q53N99r55k415j501N52K004J953K50m73
2121A576p07j608j959R47J865J606L86n66r54k036r32J016J258J564P49m49k008
2138b52j959k81J188J340J273N58k04j810j694m80J627J471M24O10r2j523k362
2155b166n4K147J355O27m73l25j915j336j88J435J985M58l71n41j472j463K63
$$ plain form
2038 -3045 -1680 1076 3254 2737 1301 -54 -1637 -3070 -1617 1670 2912 2306 859 -741 -2391
2053 -2391 -2750 -1589 842 2685 2510 41 -1350 -2047 -2242 -1399 1581 3163 2624 398 -1217 -2072 -1729
2070 -1729 56 1962 2506 2436 918 -1906 -2763 -2008 200 1803 1789 1489 -379 -2054 -2875 -2075 -549
2087 -549 2142 2637 1040 -156 -1325 -2296 -1607 574 2724 2655 1763 -697 -2413 -2098 -95 357 1914
2104 1914 2602 1454 -1466 -2944 -1971 -315 709 1562 2161 1206 -1209 -2710 -2158 -154 1799 2049 1576
2121 1576 869 -739 -2698 -1751 114 1720 2106 1540 586 -1450 -2382 -1366 -108 1456 2205 1756 -252
2138 -252 -2211 -2492 -1304 36 1309 1867 1663 -147 -1841 -2321 -694 777 1201 1811 1719 196 -2166
2155 -2166 -2220 -73 1282 1909 1436 1111 -804 -2140 -2328 -893 1092 1550 1179 638 -834 -2297 -2034
2172b034J786J762J36J21r49j998j047J149J548R93N34k69j074j988q97J222J431
2189D26O60L94o06p15j629r96R24K281N91k41k03n61j989m36J424J963N11j67
2207A631l51j598j228j0O93J756P19j1j519p94j161j76J395J690P07l15j015j550
2225a137r87N08J971N04M96N57j077j900r43J203J327O97L99n43r17j391o28M10
2243a451J660J204J6q50p01j199p11O37J266J315N88r25j417p43j11J044M09J283
2261A314N43n74j884o95K10Q69O97J123k47m98k116o33M26P46J334M14j7o43j389
2280a020q55P29J446O09P71j38j299j087k54K83N76J337R86q14j636j044J61N56
2298f93N24J015M47p2j956j222K71J470J94N30J222k10k123j106O66J068L48O84
$$ plain form
2172 -2034 -248 1514 1650 1771 822 -1176 -2223 -1074 474 1467 2001 1732 658 -1330 -2227 -1005 426
2189 426 1086 1480 874 159 -1470 -2466 -1542 739 1330 1089 886 325 -1664 -2100 -676 1287 1798 1631
2207 1631 1280 -318 -1546 -1556 -863 893 1612 1601 82 -712 -1873 -2049 -654 1036 1743 1428 413 -1137
2225 -1137 -2124 -1616 355 859 1355 1912 835 -1065 -2008 -805 522 1219 1618 1075 158 -1233 -1861 -1451
2243 -1451 209 1413 1429 579 -122 -1321 -2032 -1395 -129 1186 1774 849 -568 -1311 -1422 -378 31 1314
2261 1314 1857 1283 -601 -1296 -1086 -217 480 1603 1356 858 -1258 -1891 -1465 -719 615 1029 1012 369 -1020
2280 -1020 -1875 -1146 300 909 1680 1542 243 -844 -1098 -815 -239 1098 2084 1270 -366 -1410 -1249 -693
2298 -693 -169 846 1293 1221 -735 -1957 -1686 -216 -22 508 1730 1520 -603 -1709 -1043 25 373 1057
2316A057Q65o40j723q87J98Q75P19O49rq47j055j174P33J157J60R82M81r67j939
2335a365k92J304J93N89P68K55j182j513j0J011M46P81M35J34j059j984j29J419
2353a99O41j66M17N96j602j150j02J321M80M58O91q04r02q89M72M10P27R95J11
2372A505q05j110q60M46P52K71N06O55q28j690o65J336P37k79O69K65m83j404
2390i82l30M46R42O91J4O98r17j259n51N26J030O53J39k14j018r65o0O52N47N63
2410F05L85l96j247n60M40K69J84R21Q98p19j322p19L88Q91J51Q73K16o63j405
2429h10n58M75J128J06j3Q10r47j194k02L01P23L65Q10k10q64o79j81kO77J011
2449G46P43o06o23r08N7M66J01N55O04q9j145j427Q88L54K91L94N25k22j162j044
$$ plain form
2316 1057 1922 1282 -441 -1328 -1130 -255 464 1113 1104 257 -798 -1972 -1239 -82 78 1060 1541 574 -1365
2335 -1365 -1657 -353 -160 429 1197 1452 270 -1243 -1253 -242 204 985 1420 1554 495 -1489 -1618 -199
2353 -199 442 276 693 1289 -313 -1463 -1565 -244 236 694 1385 581 -321 -1210 -738 -328 399 1394 1505
2372 1505 700 -410 -1270 -824 -72 199 705 1360 532 -1158 -1823 -487 250 -29 640 905 422 -982
2390 -982 -1312 -866 76 767 781 1479 562 -697 -1248 -722 308 961 1100 886 -132 -1097 -1157 -505 42 605
2410 605 990 594 -653 -1213 -773 -504 -320 601 1499 780 -542 -1261 -873 18 169 1042 1258 595 -810
2429 -810 -1368 -893 235 341 328 1138 191 -1003 -1205 -904 -181 184 994 784 -80 -759 -940 -942 -265 746
2449 746 1489 883 260 -648 -591 -125 -24 531 1135 1046 -99 -1526 -638 -284 7 401 926 704 -458 -1502
2469a502L75P18P76K71M47n40o95r00K32N84P56M08J42p69r73j84M56Q9N80Q48
2489A119J89j286q93l47M81L15N08Q47k03p60r87L9M74O58L48L77L85p67j226
2508g29l90Q00N28N67M63o80n85p02j78K57R10M51p3j7j000m40J96R5O63N58O09
2529A303q81o80p89O19L97jQ14O71j024p52k53L00K0L41N70L19n79j320m14Q02
2549e37P30q4M32J55n58m63q65N02Q35K19M60j19m00p20Jk5O28N67L67o20q35
2570c30k82K05R8l4Q48K5l58p38m68M53J24N83M48Q0j45j002o05Q72j63P69L92
2591G72N0k71q98k13MK88Q14p3k2n86l25m46l4R44M38m4k00l72n8l79L94K17P09
2614G09J49N9p17p20L13N4K86P77P6p19k59p27J60q6N25M99K74n17n65j87j65
$$ plain form
2469 -1502 -1127 -409 367 638 1085 545 -150 -1050 -818 -234 522 930 1072 303 -670 -854 -398 -309 271 1119
2489 1119 1308 22 -871 -1218 -737 -422 86 933 730 -30 -1017 -978 -504 154 502 879 1264 497 -729
2508 -729 -1119 -319 209 776 1239 559 -26 -728 -906 -649 261 712 639 622 -378 -818 -622 -527 136 694 1303
2529 1303 422 -258 -1047 -428 -31 -32 782 1453 429 -323 -576 -276 -256 85 655 974 395 -925 -1339 -537
2549 -537 193 109 541 696 138 -325 -1190 -688 147 366 826 707 307 -413 -412 -437 191 758 1125 505 -330
2570 -330 -612 -407 -309 -343 505 530 172 -566 -1034 -581 -457 126 574 654 509 -493 -1098 -226 -389 380 772
2591 772 822 551 -347 -560 -556 -268 546 473 451 -135 -460 -906 -940 4 442 398 198 -174 -232 -611 -217 0 709
2614 709 858 917 200 -520 -207 -153 133 910 986 267 8 -719 -559 -645 -120 379 653 136 -429 -616 -781
2635g81N80K75M95L35o15n88k90L39M7O52M80k72p02o8L1l20O3M53M32j66m83
2656a03n22mJ77j76P32K09r0j84q49M56O0N00M30J08k82m3p81l07J07Q15O21j98
2678F76j04m77m69l03R2L32L82K89j63p55j61K29J46K56P48j34%o81n51M34oN19
2700B99J65J14n5p37m25O73k14P74k71K68j81p52j73pQ11m26P02j38j87n38j84
2721d82J90O26J47Kl25J32p54J91J27K94M6N03n77k25l63k69M81L03N0J7l6k26
2743a48n65J5O44K84L2L2L9l63k32m81N37J108m99k44j90k49J95m07P68j61K88
2764D03k19k10l21l86N32J63J52L90j46n69j09k02P5P06J43l65K90j61k46n41
2784f21M95L64K73l60L04m19m16k81K03O53K04r6k98m32k43j42L43O13L71l26
$$ plain form
2635 -781 -201 74 569 904 289 -299 -589 -250 -203 449 929 657 -45 -113 -82 -402 -339 114 546 380 -103
2656 -103 -625 -629 -452 -628 104 313 223 39 -810 -354 -294 206 636 744 462 419 -362 -669 -562 253 874 676
2678 676 572 95 -374 -677 -585 -253 129 418 255 -500 -661 -432 -286 -30 718 584 584 -97 -648 -214 -220 299
2700 299 464 578 523 -214 -639 34 -180 594 323 591 410 -342 -515 -522 289 -137 565 427 240 -298 -482
2721 -482 -292 334 481 483 158 290 -464 -273 -146 148 194 697 120 -105 -468 -737 -256 47 97 114 78 -148
2743 -148 -713 -698 -54 230 262 294 333 -30 -262 -743 -206 902 403 159 -31 -280 -85 -492 276 115 403
2764 403 184 -26 -347 -733 -201 -38 114 504 358 -211 -320 -522 -447 259 402 37 327 166 -80 -621
2784 -621 -126 238 511 151 455 36 -380 -661 -458 195 399 303 5 -427 -670 -812 -469 144 515 189
2804A89j16L00l67l35J79M02J27J11l00l48j96j17M77k0L00l39M0r1o38N46J49
2825d7k8J07J32n5k13m37J98P35J75J0l06L3j42n01j3K91M82%n14P0P1p48L3O78
2849A1O98m09l04j26m42M77j99M76q2J66Oq83K32L40K93p7J69J2j71m13k69j25
2871f20R07J49O3m68L53q37n4M2M52K97N8k85m62l5N8K39k0L71P6j01R7o29K33
2894a16J72Q7qM16m31l02j78l44P68J70Q4n30L24j48o08n1M39J33K83J05P0k1
2916C14m06K3J35K75q5P9j93j07k63q0L47M16l15J11R2p71J7K19J86K32p9j71
2938b4J25l78M1K5O65m06L15J03l78j9l58M20K60j66j4Q7k59J4n12K13j16P22
2960C60m74J51k91l8k61K03L48j12K26K04k82l06L0K97J07Q0L44l38l00o79M38
$$ plain form
2804 189 73 373 6 -329 -150 252 379 490 190 -158 -354 -471 6 -14 286 -53 -13 -104 -742 -196 -47
2825 -47 -75 32 164 109 -104 -541 -343 392 567 577 271 304 162 -339 -352 -61 421 421 -93 -23 48 -700 -667 11
2849 11 709 300 -4 -130 -572 -95 -294 182 100 266 272 -611 -379 -39 254 177 346 358 187 -226 -495 -620
2871 -620 287 436 499 31 384 -453 -507 -465 -13 284 342 57 -405 -440 -382 -143 -163 208 284 183 280 -349 -116
2894 -116 56 143 135 551 120 -182 -360 -704 64 234 318 -212 112 -36 -644 -695 -256 -123 160 265 335 314
2916 314 -92 -69 66 341 256 335 142 35 -228 -308 39 455 140 251 343 -428 -411 -192 -6 226 147 -24
2938 -24 101 -277 -236 -211 454 48 363 466 88 69 -289 131 391 225 211 298 39 53 -459 -246 -362 360
2960 360 -114 37 -254 -292 -553 -350 -2 -114 112 316 34 -272 -242 55 162 242 586 248 -52 -731 -293
2981b93M90J36l36pq4l6n91M43K79M47k73o5N2q0n57P6L89L74j5j72r3ll21OM38
3006B04J21j09m90M14j40m77L0O12J1p2J30m11j41J08j93M43K38j59n59M93n06
3027d53j60P77k52M78l25L64l82l73j33P66K22l18J0k05l54j54n4N43J29J98j1
3048C13l31k07J35k64N17n8J9j39m6M63o89K45k77L44J04l0k22J60m1j49L58k68
3070f3R9J50n3j24l6j63N30j06j00j04K11m69J15K82j7K54j09Pj97k27k59J35
3092b44K49J50n13M42k55j31k94O11L24l39Kk45L44n55L82Q7M07j28J93k22l24
3113e9j04j32J69N16j40k9m40N2Q4j27J90j2J16J56j57j8l60J73Q5K05K8j31J17
3136A82o68K57N18k01k20N53k02m73N4O1L77n9j01r1J28k27k71k30K51M91K33
$$ plain form
2981 -293 197 333 -3 -10 -94 -130 -721 -278 1 448 175 110 162 82 -475 -399 -10 364 349 177 84 81 -240 -234 204
3006 204 325 216 -274 140 0 -477 -447 165 176 104 234 -177 -318 -210 -403 40 278 119 -440 53 -453
3027 -453 -613 164 -88 390 65 429 47 -326 -459 307 529 211 221 16 -338 -492 -546 -3 126 324 313
3048 313 -18 -225 -90 -354 163 105 124 -15 -61 402 -287 -42 -319 25 129 99 -123 37 -4 -153 205 -63
3070 -63 36 186 133 9 -27 -190 340 234 134 30 241 -228 -113 169 152 406 297 304 107 -120 -379 -244
3092 -244 5 155 -358 84 -171 -302 -596 15 339 0 2 -243 101 -454 -72 15 422 294 487 265 -59
3113 -59 -163 -295 -126 390 250 221 -219 -167 -83 -210 -20 -32 84 240 83 65 -295 -122 -37 168 196 65 182
3136 182 -486 -229 289 88 -132 421 219 -254 -200 -139 238 179 78 -13 115 -112 -383 -613 -362 129 362
3157C62o66N67L7n43L16j09J12p7J57n5l52K55k13K21l02L33K41k02P4l50J68
3178b6J87r5j95P7L02l76m24M88j16K17M8L04l74m26K16Lm0L20K23k77K28k22
3200D2M1j40l7J92K05n89K80l69k13L94J01J24nk07P5j22L9l8K21M02m95K69j40
3223C0j14J56k51N39m85M39j15k77k91M40M3m0L4j77J71j96J54j95P4lK00L9r
3246A66L8k29L3J46m54M50k29J37K58m32J12o9R7J60p3j48j11j06K43L18m62J04
3268e1k07K84J18L1J6M8k07J05j10J02r3k29n5M67K90m20l74L13k38j76K47J29
3290a0m6K8j77J25K94m22K4L86k09J31j85Q5k51J24K05q0k75L90k34J90l45O6
3312a86rQ7K14N8m55L07k38m7K22N7m2K12k78q0j10J31L95j18L67n71P7m8j24
$$ plain form
3157 362 -304 263 300 -243 73 -36 76 -1 156 101 -251 4 -209 12 -290 43 284 82 156 -194 -26
3178 -26 161 66 -129 -52 250 -126 -550 -62 -178 39 87 391 17 -409 -193 -190 -230 90 313 36 264 42
3200 42 83 -57 -94 98 303 -286 -6 -375 -588 -194 -93 31 26 -181 -106 -228 -189 -227 -6 396 -99 170 30
3223 30 -84 72 -179 360 -125 314 199 -78 -369 71 114 74 108 -69 102 -94 60 -135 -61 -64 136 175 166
3246 166 204 -25 8 154 -300 150 -79 58 316 -116 -4 -73 24 184 111 -37 -148 -254 -11 307 -155 -51
3268 -51 -258 26 144 175 191 239 32 137 27 129 36 -193 -248 219 509 89 -285 28 -210 -386 -139 -10
3290 -10 -56 -28 -205 -80 214 -208 -184 202 -7 124 -61 24 -227 -103 102 22 -253 137 -97 93 -252 -186
3312 -186 -195 -108 106 164 -291 16 -222 -269 -47 10 -32 180 -98 -178 -288 -157 238 120 487 -84 -7 -55 -179
3335a79K05J04qj65k82L39j47r7L87m33L13l49L38%r7R6q6l5K40jm9K00n35J87
3359e4k07M23L51n22p2J00j78J00mK46R6l47LL74n44R9J63K24m8j93Q9J7m31M02
3383H7l0m5QK59m22K41j7k67K72N2j32j44L68j86j19n2q5K35J48l38J26k01K74
3406C2k25K12K13kj18j09J4l86O59L3j69k24N3L18l90j12M6L23kl15K91L4o8K1
3430A29j44J37j93j7L43M5l58O9j02N22r4k54k80L68m22N0L89P9l76K4p1K77n00
3453c79K68J73J5j7j59M16n36k81O67k70K84k69R2K86J42n73j05N41m7j16k95
3474a63J72P3m24J37M25L2l18J27l17L99l91K64N03m41k66nJ66J56l89L06N0J41
3496B37K86n84J39l11j78L71K30j62k33K38rll64N25k62K0k6p7K90o6k56J16K70
$$ plain form
3335 -179 26 130 122 -43 -325 14 -133 -230 157 -276 37 -312 26 26 -71 25 -61 -96 144 143 94 294 -241 -54
3359 -54 -261 162 513 -9 -81 19 -159 -59 -63 183 279 -68 -65 309 -235 -136 27 251 203 10 99 116 -315 87
3383 87 57 12 20 279 -143 98 81 -186 86 138 6 -138 230 44 -75 -127 -212 23 171 -167 -41 -242 32
3406 32 -193 19 232 230 112 3 17 -369 290 323 154 -70 -17 301 -89 -201 -155 168 166 -149 142 176 108 129
3430 129 -15 122 -71 -88 255 300 -58 11 -91 431 337 83 -197 171 -251 -201 188 267 -109 -85 -156 121 -379
3453 -379 -111 62 77 60 -99 317 -219 -500 167 -103 181 -88 4 290 432 -141 -246 295 248 132 -163
3474 -163 9 82 -342 -205 220 252 -66 61 -256 143 -248 16 519 78 -188 -193 -27 129 -260 46 96 237
3496 237 523 -61 78 -233 -411 -40 190 28 -205 33 24 21 -343 182 -80 -60 -86 -163 127 61 -195 -79 191
3519A91N5k22K10N4k26k0j44M21k88K71l14J0l24K35M33l08K8m9j21Qj5K46j08
3542B3L35J06l54j53J20k50K17J28j00j82J1K62l15J44K4K00P4k24J29l10p6j55
3564c46O58k46K62k48j69P4l18L24J45J0j87L16l21J07k62K27P5k73J85K27j74
3585F6k27o7n6N71k42l10K73J47j27k06L81n1k83J65K63k57j03j93M64j20j0j31
3607e3N6k41K26K6p1J72k47mJ47q0K85j84M0j18J54j44j33K87n64N26N2R9n64
3630c33K60J44k21J02j69N25k44m44K06L26p0m82N35o3p6J15k41P0l3m9JN4M7
3653d0o4J52p7J50k77J6L80k26L35k93J97j89k74K52k5J72j62l6j2mK86k87K42
3676B16k34l21L08K93j98k34J61K19q9k0k2J92m14j8q4O9K77J0o7J13j12j73K38
$$ plain form
3519 191 246 24 234 288 62 42 -102 319 31 302 -12 -2 -326 -91 342 34 62 13 -108 -100 -115 131 23
3542 23 358 464 110 -43 77 -173 44 172 72 -110 -99 163 -152 -8 16 216 290 66 195 -115 -191 -346
3564 -346 312 66 328 80 -89 -15 -333 -9 136 146 -41 275 -46 61 -201 26 101 -172 13 240 66
3585 66 -161 -228 -284 287 45 -265 8 155 28 -178 203 152 -131 34 297 40 -63 -256 208 88 78 -53
3607 -53 3 -238 -12 14 -57 115 -132 -136 11 -69 216 32 72 -46 108 -36 -169 118 -446 80 132 231 -333
3630 -333 -73 71 -150 -48 -217 308 64 -380 -174 152 82 -400 135 72 -4 111 -130 -60 -93 -142 -141 -87 -40
3653 -40 -104 48 -29 121 -156 -140 240 14 349 56 253 64 -210 42 17 189 27 -9 -21 -25 261 -26 216
3676 216 -18 -339 -31 262 64 -170 -9 210 121 101 79 271 -143 -161 -245 -176 101 111 44 157 45 -128 110
3699A10J41j36l55J59K01m18N04m59PM29k80K85k29K7%K39p5l73L71J9n9j84k30
3722c06L20Jo4K13Pr9N8k71L46q2l70L48k44L21j63J84j67J64l6m6j70J87j59
3745b8J99M7mn5k75K17j92j32M40k29J36j34j20j84L30j0j71L73n61J68K94j89
3767h0Q0j65L61q5Q8m39R9O3P6k5k48M48O3k08n9Q7r4Ro5K6J59j18p9j33J85J67
3793A13p1J67o1m46L35rJ05q9j49J65j68O0J68l5l09R5L06pl01r3M22k36J39k09
3817a08J49K14j46j54jK1K92l40J54m6Q2k76K38o50N08J06m4k13J36k2M5L99j85
3840A59o0J20k23l37L63M4j70m2L78o5o2k21J21l22M67j04L17k38j3R3j58j50
3862a03j45M4L72j27l62M77l94j64K94K08J52j14j14J55j90j5j45L93k9l00o0
$$ plain form
3699 110 251 115 -240 -81 120 -298 206 -253 -246 183 -97 188 -41 -14 -14 225 150 -223 148 167 108 -76 -306
3722 -306 14 15 -49 164 171 72 130 -141 205 123 -247 101 -143 178 15 199 32 196 160 114 -56 131 -28
3745 -28 171 218 214 159 -116 101 -91 -223 217 -12 124 -10 -130 -314 16 6 -165 208 -353 -185 109 -80
3767 -80 0 -165 196 111 199 -240 -141 -78 -2 -27 -275 173 236 28 -31 56 -38 -29 -94 -68 91 -27 -106 -239 -54 113
3793 113 42 209 148 -298 37 28 133 44 -105 60 -108 -48 120 85 -224 -129 177 170 -131 -224 198 -38 101 -108
3817 -108 41 255 109 -45 -46 -25 267 -73 81 35 117 -159 79 -571 -63 43 -1 -214 -78 -100 -55 344 159
3840 159 99 219 -4 -341 22 66 -104 -146 232 167 105 -116 5 -317 150 46 363 125 112 205 47 -103
3862 -103 -248 -204 168 41 -321 156 -238 -402 -108 100 252 138 24 179 -11 -26 -171 222 193 -107 -167
3883a67o4M17o66O39N7l28L53j38k51K60K51m01j08M41J75o74L53K21n75J09J34
3904C8J9J49k91J75nl43L59J2l41O5J70j59k95J67J97p7K29K2M3k30r3K90j19
3927a8J99j83L8m21L51J00k7J92r8J82n0k17m2k38M78m57K35Q8k56J98N5j11K94
3950B92j93N9J82l23j9m4L3k31K62J26k29J63j67KJ46k22L81M7k76k83j17L39
3972g2k9N3L48j43J23k32p7L30p8m9l26j9K77k53j31K85o7N0J57P9j84l21L25
3995D6k73j76L07K61l4j30Kq7K32k29L9K2P6j00j20l10O81l31J45q5J57J91j65
4018A19j67OM3J43p9j30L87m66J34p7L5N6J24n9p1j8K04k48O7J95o9k47J01k04
4042b21O2KR3J76j21J60J67l11l24J02M79k75n1j22J89k4n9P1j49K77k5m36O7
$$ plain form
3883 -167 -231 186 -480 159 216 -112 241 103 -148 112 363 -38 -146 295 470 -204 149 370 -205 -96 38
3904 38 57 206 -85 90 85 -258 101 113 -228 -163 7 -152 -447 -280 -83 -160 69 91 134 -96 -189 101 -18
3927 -18 181 -2 36 -385 -34 66 39 231 133 315 265 48 6 -232 246 -211 24 112 -144 54 109 -2 292
3950 292 99 158 340 17 -2 -46 -13 -244 18 144 -85 78 -89 -87 59 -163 218 265 -11 -294 -411 -72
3972 -72 -101 -48 300 157 280 48 -29 301 223 174 -152 -171 106 -147 -278 7 -60 -10 147 226 42 -279 46
3995 46 -227 -403 -96 165 131 1 3 -84 148 -81 -42 -20 56 -44 -164 -474 207 -124 21 -64 93 284 119
4018 119 -48 -42 1 144 65 -65 322 -144 -10 -87 -52 4 128 69 -2 -20 184 -64 3 198 129 -118 -17 -221
4042 -221 -159 -157 -64 112 -9 151 318 7 -317 -215 264 -11 -62 -184 5 -19 -78 -7 -156 121 96 -340 -273
4065b73M13j18l44O00j60l10N3n1R3j38J31K28J42j50k74M17j26j97K27k1l05
4086a63L13q3p4P9p1J35j35L28k76j90J77O8k67P5K52J91l82k15M7L27m11K8M58
4109B11P1l09l0J61j45j74J62J91L2l15L39j90R6k49K94l5P4n87M68J05m23K84
4131C1j00K11O4k19j87K71N5J73j53J22L10o43lJ82p1k00K35l00J89L5j52o1l2
4154b43K43J25m2k69j7l7L52j08K6j10q7L2lK77q7l06L64K4p0l42K51j07q4L13
4178I5J47J54o18q8K91K7r3K17K2K46n32R0q1K29p9M1n8JK9j32K30j01l45L70
4202F2K43k35j65L26l3k72l44N89K04l61N4j19Q8k17L8L05M2k39m00L59L0o7O0
4225e2K60Q1m03k40L87l56M53N1l35N08n14J8K26Q4m55L21k47M35Q2j78k17J85
$$ plain form
4065 -273 140 22 -322 278 118 -192 -139 -190 -97 -235 -104 124 266 116 -158 259 133 -64 163 142 -163
4086 -163 150 67 -7 72 1 136 1 329 53 -137 40 108 -159 -84 168 359 -23 -238 -191 136 -275 -247 211
4109 211 282 -27 -57 104 -41 -215 -53 138 170 -145 194 4 100 -149 145 110 184 -403 65 170 -253 31
4131 31 -69 142 206 -13 -200 71 126 299 146 268 578 -65 -68 114 43 -157 78 -222 -33 2 -150 -211 -243
4154 -243 0 125 83 -186 -203 -240 112 4 30 -80 -167 -135 -138 139 52 -254 110 134 64 -278 -27 -134 -218 95
4178 95 242 396 -222 -310 -19 8 -85 132 154 400 -132 -42 -123 106 27 68 10 11 40 -92 138 37 -308 62
4202 62 305 70 -95 231 198 -74 -418 171 375 14 68 -51 37 -180 -142 163 205 -34 -434 -75 -45 -112 -52
4225 -52 208 289 -114 -354 33 -323 130 181 -154 354 -160 -142 84 168 -287 34 -213 222 304 126 -91 94
4247I4j26K0N3O2j6m28N47R8l24L70J24m25r4J74l82j92O50l75P21m26nl69K41
4270hj5n0L81k69L34l07q6J05k12J33R9J01j46j64K84j21n56N4L62N92n31l6j72
4293b28L91m55J35p9L56l01l8J81R9k00K41N7jJ82o22K52J60o2j92Q1j09J00M0
4316a2J34k07K89qR7m03j05K19q3J7j4l7J34N4r7l69M05M4l43L95K5K35j80k53
4340f3J42J27RK6m76K56j28Rp1L32l2j1n20L82P9J25J13m26l4M94l97j29P3K64
4364A44mk20L61l32q6K58j23P9J6l17P1O14n26J92k40J10K86l85q7l5L87j73P3
4387F3j42K35m9k93R8O8J59R9k40m1j98L06j9K14k41j45L0NJ0M81l27j16j60q1
4411b84R0K66Oj52K26j92qL56l84J34m5lL6O9K23l23j40J87k90P7M53k62j08J58
$$ plain form
4247 94 -32 -12 41 103 87 -341 206 304 -20 350 474 49 -45 129 -253 -445 205 -170 551 125 120 -249 -8
4270 -8 -23 -73 308 39 373 66 -20 85 -127 6 105 206 60 -104 180 59 -497 -443 -81 511 -20 -56 -228
4293 -228 163 -292 -157 -236 120 -181 -219 -38 61 -139 102 159 158 340 -282 -30 130 68 -124 -43 -152 -52 -12
4316 -12 122 -85 204 196 293 -110 -215 4 -79 -62 -76 -113 21 75 -22 -391 14 58 -285 110 135 370 190 -63
4340 -63 79 206 215 241 -235 21 -107 -98 -169 163 131 120 -400 -18 61 186 299 -127 -161 333 -64 -193 -120 144
4364 144 140 -80 281 -51 -137 121 -2 77 93 -224 -153 461 -65 127 -113 -3 283 -102 -189 -224 163 -10 63
4387 63 -79 156 107 -186 -88 -20 139 238 -2 -43 -241 65 46 260 19 -126 -96 -91 -81 400 73 -43 -203 -284
4411 -284 -194 72 78 -74 152 -40 -48 308 -76 58 13 10 46 115 338 15 -125 62 -228 -151 302 40 -68 90
4435I0m12N90m07J28J96j87J22k14j0o9M4N40n40K48j85R1L3O4l60N00l27P5j36
4458a26j73M28j51J18j25q1J28o0l1L8J64L0l1j98J24M0k79J94K25r1k78Q8k36
4481b83L54p6k8L2N0J58k79L10l85K36L3J28k74oQ4O4n24M25L9K8j35K47o0k64
4505a26N65j89j93JJ06O3k4j43j55%J7J54l4L9m82M56j84J16Q7O2j61N1j76J4
4529a36J66J51l30j5O1M3J2N8K11Jk19n8J44J19n02M43O4j93MK6J40j93n9k91
4553c53N4L26j68P8O7j44M06o39M49j44r8N05r1m57m8K40Rj29L27j94J34k5j18
4576a3J94l81M5J43l4J47l27N3L85J10j65J38l82L34l66n2O2m7K94j99K30m3m32
4599c06O8M96l91J43n6Rj58K10L48n30k4k2K73J0J02k38k30L54o7k42L55m9q8
$$ plain form
4435 90 -322 268 -139 -11 185 -2 120 -94 -104 -173 -129 411 -129 119 -66 25 58 122 -238 262 -65 10 -126
4458 -126 -299 129 -22 96 -29 -110 18 -42 -73 -35 129 159 128 -70 54 94 -185 9 234 143 -135 -47 -283
4481 -283 71 -5 -33 -1 49 207 -72 238 -147 89 122 250 -24 -30 54 118 -406 19 58 86 -49 198 138 -126
4505 -126 439 250 57 58 164 227 203 60 -95 -95 -78 76 42 81 -401 55 -129 -13 74 136 -25 26 -150 -136
4529 -136 30 181 -149 -164 -103 -60 -48 10 221 222 3 -55 89 208 -294 149 213 20 24 50 190 -3 -62 -353
4553 -353 -299 27 -141 -63 4 -140 266 -373 76 -68 -166 339 248 -209 -257 -17 -8 -137 190 -4 130 105 -13
4576 -13 181 -200 -155 -12 -46 101 -226 -173 212 322 157 295 -87 247 -119 -171 -109 -156 138 -61 169 126 -306
4599 -306 -238 258 -133 10 -46 -37 -195 15 363 -167 -191 -213 60 70 172 -66 -296 58 -9 -251 104 55 -33
4622c3j67K05J72k87R8p8K09k32j84Q5L87k49J32J59q0l13J0K34o6o3M4k71J53
4645a35N5K82N0n5n2l04K32J43o17P37j29k10j12J76k29J96J2j28j15J70L00m03
4667a36L14J19l04Kl3J21L5m23K34n5k92M73p2K42j95j2l7m11K39L03J21l94K11
4690E0j30K53m45K07L50m36R9K9M48j21o01K43P8J43k78J58l2j60J25J42k9l5
4712E8k63L89j89k44M78q6k77K16l48L37k3K46n30O33k98l11J60J6o0l45K6L01
4734a14K35J17l18j99M44k13J25l0L37o7n81K88K30k16K53k01j04L0j1K47k70
4755a8k1R0m4K31o15K02J54J24l71K72l39O34l90J83J59j89j33J46k68q9M25j65
4777b2J41j29l85R7O22o25J13J66m6J25o5m34L61o4O4J41J97k4m17J10K00J97
$$ plain form
4622 -33 -200 5 177 -110 -12 -90 119 -113 -297 -212 175 -74 58 217 137 -176 -166 68 2 -61 -17 -288 -135
4645 -135 -80 202 252 197 145 -159 73 216 -401 336 207 -3 -115 61 -168 28 40 -88 -203 -33 267 -136
4667 -136 178 297 -7 -5 -38 83 118 -305 -71 -126 -418 55 -17 225 30 18 -19 -430 -191 112 233 -161 50
4690 50 -80 173 -272 -65 285 -151 -52 -23 425 304 -297 -54 24 167 -111 47 15 -145 -20 122 93 58
4712 58 -205 184 -5 -249 229 143 -134 82 -266 71 48 294 -236 397 99 -212 -52 -36 -96 -441 -415 -114
4734 -114 121 238 -80 -279 165 -48 77 47 384 317 -264 24 254 38 291 90 -14 16 5 252 -18
4755 -18 -39 51 7 238 -377 -175 -21 103 -268 4 -335 299 -91 92 251 62 -71 75 -193 -282 143 -22
4777 -22 119 -10 -395 -298 324 -301 -188 -22 -68 57 -8 -442 -81 -145 -81 60 257 233 -184 -74 126 323
4799C23n52M49l5j72K01k38J41j13L2J41Pm26L68k32L42l20K79J29k32l40k28
4820d76O40K46o03q4L82N6n47N22k8k05P3P8L75m38j11K85k79J9J96l6n6n9mO5
4844A1p9J88r1j30J89j92K18j07j53J13Q1J52j79J04j81M36l88m7J70k89N58l68
4866A6R5j37l3J71r9K11m39N17l43O3l39M43j35j56L4M87l51k27L10j45K7%q4
4889a14l3K03j7J88j47K3r3j04l37M83J03l47J19K71o1O7k50l00K40L7J86J42
4911B59j01k86K0L80j89J30l23P3OQ8k24M35l92k32O6P27m92k35j1N56k20M75
4933E10l84M6k02J40n74N34J22l26j47L63k42N7L73q3j02k24J57J14r0k84K73
4954C1j39k21L95j80K06m05L3L43j2k46J87nL51l16j79o6k76J83K09M14k43k15
$$ plain form
4799 323 -229 220 185 13 214 -24 117 4 36 177 184 -242 126 -106 236 -84 195 324 92 -248 -476
4820 -476 164 410 -193 -277 105 161 -386 136 108 -97 -24 54 429 -9 -120 165 -114 -95 101 65 9 -50 -54 11
4844 11 -68 120 29 -101 88 -104 114 7 -146 -33 48 200 21 125 -56 380 -8 -55 115 -174 384 16
4866 16 111 -26 -59 112 13 224 -215 302 -41 22 -317 126 -9 -165 -131 356 5 -222 88 -57 -30 -30 -114
4889 -114 -147 56 39 227 80 103 10 -94 -431 52 155 -192 -73 198 137 204 -46 -346 -106 -69 117 259
4911 259 158 -128 -108 272 83 213 -110 -37 -31 57 -167 268 -124 -356 -290 437 -55 -290 -301 255 35 510
4933 510 126 172 -30 110 -464 70 192 -134 -281 82 -160 -103 270 187 85 -139 18 132 42 -242 31
4954 31 -108 -329 66 -114 92 -313 -280 63 51 -195 -8 -13 338 22 -157 -223 -499 -316 -107 307 64 -151
4976a51j36L7M47J00j81l08J50j37M5k59L51j14N5M5n6P0J65N6l66J4J37J43J9
4999A26J9j63p7n5K46m79M97o5m2J78k95k0k88L30k6p5K82J4K86k28j50j46K13
5022H2J0k16k9N8K03n12Q51k56j19J73l58o6L09L07m02J24j98J14k16k31M87k11
5044i6M58l59j55K72M05l32l79J06m2n4L62l42J99ml41K79J81J62l90j12M28l77
5066a31M0J0j07PM9j73N65j05K71k92l87J48LJ20r8P5K98j34o2k22K31k6k03J64
5090D1k13p4M84n27N5J1K09k2K33M8j28l61N60k12J03l86K16k50N03m51J88k4
$$ plain form
4976 -151 -287 -250 197 297 116 -192 -42 -179 -134 -393 -42 -156 -101 -56 -112 -42 123 179 -187 -173 -36 107 126
4999 126 145 -18 -95 -150 96 -383 114 49 7 185 -110 -130 -418 -88 -114 -189 93 107 393 165 15 -131 82
5022 82 92 -124 -153 -95 108 -404 447 191 72 245 -113 -179 130 437 35 159 -39 75 -141 -372 115 -96
5044 -96 362 3 -152 120 525 193 -186 -80 -122 -176 186 -156 43 39 -302 -23 158 320 -70 -182 246 -131
5066 -131 -91 -81 -188 -181 -132 -305 260 155 426 134 -253 -105 -102 18 -80 -5 293 159 97 -125 106 80 -123 41
5090 41 -172 -246 238 -289 -234 -223 -14 -36 197 245 117 -244 316 104 207 -179 37 -213 290 -161 27 3
$$ [...]
8191C03
##END NTUPLES=NMR FID
##END=
