##TITLE=1H ikalashn
2B1d 1211
13.11.2024
##JCAMPDX= 6.0         $$ Bruker NMR JCAMP-DX V2.0
##DATA TYPE= NMR FID
##DATA CLASS= NTUPLES
##ORIGIN= UXNMR, Bruker Analytische Messtechnik GmbH
##OWNER= root
$$ TOPSPIN		Version 1.3
$$ 2024-11-13 10:42:07.296 +0400  Irina@DPX200
$$ Compression mode = diff/dup
##.OBSERVE FREQUENCY= 200.131300845
##.OBSERVE NUCLEUS= ^1H
##.DELAY= (6, 6)
##.ACQUISITION MODE= SIMULTANEOUS
##.ACQUISITION SCHEME= undefined
##.AVERAGES= 32
##.DIGITISER RES= 18
##SPECTROMETER/DATA SYSTEM= spect
##.PULSE SEQUENCE= zg
##.SOLVENT NAME= CDCl3
##.SHIFT REFERENCE= INTERNAL, CDCl3, 1, 17.49637
##AUDIT TRAIL= $$ (NUMBER, WHEN, WHO, WHERE, WHAT)
$$ ##TITLE= Audit trail, TOPSPIN		Version 1.3
$$ ##JCAMPDX= 5.01
$$ ##ORIGIN= Bruker BioSpin GmbH
$$ ##OWNER= Irina
$$ $$ F:/spectra/data/iren/nmr/1H/4/audita.txt
$$ ##AUDIT TRAIL=  $$ (NUMBER, WHEN, WHO, WHERE, VERSION, WHAT)
(   1,<2024-11-13 10:41:51.703 +0400>,<Irina>,<DPX200>,<TOPSPIN 1.3>,
      <created by zg
	started at 2024-11-13 10:39:43.671 +0400,
	POWCHK disabled, PULCHK disabled
       configuration hash MD5:
       BE 6D 3F 07 2A EA 11 49 91 17 2B D3 AF B3 58 0D
       data hash MD5: 16K
       BD BE E6 C4 26 7C 72 FC 12 1E D1 FA 01 BE 64 D1>)
$$ ##END=
$$ 
$$ $$ hash MD5
$$ $$ A8 B4 AF 3D 62 A4 B3 77 31 3E B3 96 3B BF F9 97
##$RELAX= 
##$RELAX= 
##$RELAX= 
##$RELAX= 
##$RELAX= 
##$RELAX= 
##$RELAX= 
##$RELAX= 
##$RELAX= 
$$ Bruker specific parameters
$$ --------------------------
##$DU= <F:/spectra>
##$EXPNO= 4
##$NAME= <1H>
##$PROCNO= 1
##$TYPE= <nmr>
##$USER= <iren>
##$AMP= (0..31)
100 100 100 100 100 100 100 100 100 100 100 100 100 100 100 100 100 100 
100 100 100 100 100 100 100 100 100 100 100 100 100 100 
##$ANAVPT= -1
##$AQSEQ= 0
##$AQ_mod= 1
##$AUNM= <au_zg>
##$AUTOPOS= <>
##$BF1= 200.13
##$BF2= 200.13
##$BF3= 200.13
##$BF4= 200.13
##$BF5= 200.13
##$BF6= 200.13
##$BF7= 200.13
##$BF8= 200.13
##$BYTORDA= 1
##$CFDGTYP= 0
##$CFRGTYP= 5
##$CHEMSTR= <none>
##$CNST= (0..63)
1 1 145 1 1 1 1 1 1 1 1 1 1 1 1 1 1 1 1 1 1 1 1 1 1 1 1 1 1 1 1 1 1 1 
1 1 1 1 1 1 1 1 1 1 1 1 1 1 1 1 1 1 1 1 1 1 1 1 1 1 1 1 1 1 
##$CPDPRG= <>
##$CPDPRG1= <>
##$CPDPRG2= <>
##$CPDPRG3= <>
##$CPDPRG4= <mlev>
##$CPDPRG5= <mlev>
##$CPDPRG6= <mlev>
##$CPDPRG7= <mlev>
##$CPDPRG8= <mlev>
##$CPDPRGB= <>
##$CPDPRGT= <>
##$D= (0..63)
0 2 0 0 0 0 0 0 0 0.06 0 0.03 0 0 0 0 0.0002 0 0 0 0 0 0 0 0 0 0 0 0 0 
0 0 0 0 0 0 0 0 0 0 0 0 0 0 0 0 0 0 0 0 0 0 0 0 0 0 0 0 0 0 0 0 0 0 
##$DATE= 1731480111
##$DBL= (0..7)
120 120 120 120 120 120 120 120 
##$DBP= (0..7)
150 150 150 150 150 150 150 150 
##$DBP07= 0
##$DBPNAM0= <>
##$DBPNAM1= <>
##$DBPNAM2= <>
##$DBPNAM3= <>
##$DBPNAM4= <>
##$DBPNAM5= <>
##$DBPNAM6= <>
##$DBPNAM7= <>
##$DBPOAL= (0..7)
0.5 0.5 0.5 0.5 0.5 0.5 0.5 0.5 
##$DBPOFFS= (0..7)
0 0 0 0 0 0 0 0 
##$DE= 6
##$DECBNUC= <off>
##$DECIM= 32
##$DECNUC= <off>
##$DECSTAT= 4
##$DIGMOD= 1
##$DIGTYP= 9
##$DL= (0..7)
0 120 120 120 120 120 120 120 
##$DP= (0..7)
150 150 150 150 150 150 150 150 
##$DP07= 0
##$DPNAME0= <>
$$ [...]
##$SW= 21.9926040160658
##$SWIBOX= (0..15)
0 0 2 0 0 0 0 0 0 0 0 0 0 0 0 0 
##$SW_h= 4401.40845070422
##$TD= 16384
##$TD0= 1
##$TE= 300
##$TE2= 300
##$TE3= 300
##$TEG= 300
##$TL= (0..7)
0 120 120 120 120 120 120 120 
##$TP= (0..7)
150 150 150 150 150 150 150 150 
##$TP07= 0
##$TPNAME0= <>
##$TPNAME1= <>
##$TPNAME2= <>
##$TPNAME3= <>
##$TPNAME4= <>
##$TPNAME5= <>
##$TPNAME6= <>
##$TPNAME7= <>
##$TPOAL= (0..7)
0.5 0.5 0.5 0.5 0.5 0.5 0.5 0.5 
##$TPOFFS= (0..7)
0 0 0 0 0 0 0 0 
##$TUNHIN= 0
##$TUNHOUT= 0
##$TUNXOUT= 0
##$USERA1= <user>
##$USERA2= <user>
##$USERA3= <user>
##$USERA4= <user>
##$USERA5= <user>
##$V9= 5
##$VALIST= <valist>
##$VCLIST= <CCCCCCCCCCCCCCC>
##$VD= 0
##$VDLIST= <DDDDDDDDDDDDDDD>
##$VPLIST= <PPPPPPPPPPPPPPP>
##$VTLIST= <TTTTTTTTTTTTTTT>
##$WBST= 1024
##$WBSW= 25
##$XGAIN= (0..3)
0 0 0 0 
##$XL= 0
##$YL= 0
##$YMAX_a= 1502277
##$YMIN_a= -1924786
##$ZGOPTNS= <>
##$ZL1= 120
##$ZL2= 120
##$ZL3= 120
##$ZL4= 120
##$ABSF1= 10
##$ABSF2= 0
##$ABSG= 5
##$ABSL= 3
##$ALPHA= 0
##$AQORDER= 0
##$ASSFAC= 0
##$ASSFACI= 0
##$ASSFACX= 0
##$ASSWID= 0
##$AUNMP= <proc_1d>
##$AXLEFT= 0
##$AXRIGHT= 0
##$AXTYPE= 0
##$AXUNIT= <>
##$AZFE= 0.1
##$AZFW= 0.1
##$BCFW= 1
##$BC_mod= 2
##$BYTORDP= 1
##$COROFFS= 0
##$CY= 7568.61572265625
##$DATMOD= 1
##$DC= 2
##$DFILT= <>
##$DTYPP= 0
##$F1P= 17.9538593292236
##$F2P= -4.03888763876832
##$FCOR= 0.5
##$FTSIZE= 32768
##$FT_mod= 4
##$GAMMA= 1
##$GB= 1
##$INTBC= 1
##$INTSCL= 1
##$ISEN= 128
##$LB= 0.02
##$LEV0= 0
##$LPBIN= 0
##$MAXI= 945.577
##$MC2= 0
##$MEAN= 0
##$ME_mod= 0
##$MI= -402.1523
##$NCOEF= 0
##$NC_proc= 0
##$NLEV= 6
##$NOISF1= 8.587773
##$NOISF2= 6.764455
##$NSP= 1
##$NTH_PI= 0
##$NZP= 0
##$OFFSET= 17.49637
##$PC= 1
##$PHC0= 315.4552
##$PHC1= 13.06014
##$PH_mod= 0
##$PKNL= yes
##$PPARMOD= 0
##$PPDIAG= 0
##$PPIPTYP= 0
##$PPMPNUM= 100
##$PPRESOL= 1
##$PSCAL= 0
##$PSIGN= 0
##$REVERSE= no
##$SF= 200.13
##$SI= 32768
##$SIGF1= 18.5376
##$SIGF2= -6.396296
##$SINO= 400
##$SIOLD= 32768
##$SREGLST= <1H.CDCl3>
##$SSB= 3
##$STSI= 0
##$STSR= 0
##$SW_p= 4401.40845070422
##$SYMM= 0
##$S_DEV= 0
##$TDeff= 0
##$TDoff= 0
##$TI= <>
##$TILT= no
##$TM1= 0
##$TM2= 0
##$TOPLEV= 0
##$USERP1= <user>
##$USERP2= <user>
##$USERP3= <user>
##$USERP4= <user>
##$USERP5= <user>
##$WDW= 1
##$XDIM= 8192
##$YMAX_p= 0
##$YMIN_p= 0
$$ End of Bruker specific parameters
$$ ---------------------------------
##NTUPLES= NMR FID
##VAR_NAME=  TIME,          FID/REAL,        FID/IMAG
##SYMBOL=    X,             R,               I
##VAR_TYPE=  INDEPENDENT,   DEPENDENT,       DEPENDENT
##VAR_FORM=  AFFN,          ASDF,            ASDF
##VAR_DIM=   8192,          8192,            8192
##UNITS=     SECONDS,       ARBITRARY UNITS, ARBITRARY UNITS
##FACTOR=    0.0002272,     1,               1
##FIRST=     0,             0,               0
##LAST=      1.8609952,     -207,            371
##MIN=       0,             -1924786,        -1924786
##MAX=       1.8609952,     1502277,         1502277
$$ Real data points
##PAGE= N=1
##DATA TABLE= (X++(R..R)), XYDATA
$$ [...]
2290d176M475L045k377k974J254J786r07p49J515N24k447j593K770L462k347n397
$$ -4176 299 3344 967 -2007 -753 1033 126 -623 892 1416 -1031 -2624 146 3608 1261 -4136
2306d136N61O569K168o187m960M243O737j061p208j909N992M223l746n024J278
$$ -4136 -3575 2994 5162 -1025 -5985 -1742 4995 3934 -3274 -5183 809 5032 1286 -3738 -2460
2321b460M662O60l441j052J842M43r29L29J280q10k664L70L980J104m768l397
$$ -2460 2202 2862 -579 -1631 211 654 -275 54 1334 524 -2140 -1770 2210 3314 -1454 -4851
2337d851M082N740j947p197o62O843L664n064n803K207O550O37n539k659L740
$$ -4851 -769 4971 3024 -4173 -4835 2008 5672 608 -5195 -2988 3562 4199 -1340 -3999 -259
2352b59L444j764k983N27J548o5q46R40L68j950j272K412L080k038m673L68N709
$$ -259 3185 1421 -1562 -1035 513 448 -398 542 910 -1040 -2312 100 3180 1142 -3531 -3163 2546
2369B546K261n546m623L526O423o72o650k163N536M263l070n364Q09M619R53l110
$$ 2546 4807 -739 -5362 -1836 4587 3915 -2735 -4898 638 4901 1831 -3533 -2724 1895 2848 -262
2385b62j806J624J361p38k80P00l65j859M40K951O46l727k566L476M785j916n925
$$ -262 -2068 -444 917 179 -101 599 234 -1625 -1185 1766 2412 -1315 -3881 -405 4380 2464 -3461
2402c461n76N990L226m465n328K066N838N57m926k789L485L360j551l105J56J786
$$ -3461 -4037 1953 5179 714 -4614 -2548 3290 3847 -1079 -3868 -383 2977 1426 -1679 -1523 263
2418B63M83q12J00K47q99r00J668K184j356l658J79M705J779m231m179L007N352
$$ 263 746 -66 34 281 -618 -1518 150 2334 978 -2680 -2501 2204 3983 -248 -4427 -1420 3932
2435C932n75n495k114M634L786k615m515M18L957R83k638j495J153J264l97m74
$$ 3932 3357 -2138 -4252 382 4168 1553 -2962 -2544 1413 2396 -242 -1737 -584 680 283 -191
2451a91N40j93j221M8K235J057l006k252K420L957j167m641j002M424L044l106
$$ -191 349 156 -1065 -1017 1218 2275 -731 -2983 -563 3394 2227 -2414 -3416 1008 4052 946
2467I46m438R49M737R61l901k285K259K782n19k508k37J253L94l71K88M7q21q53
$$ 946 -3492 -2543 2194 3155 -746 -3031 -772 2010 1491 -1017 -1254 -1 393 22 310 357 -464 -1317
2485a317J783J841j267l202j12L965J549l198l577J955M350K97m300k465L152
$$ -1317 466 2307 1040 -2162 -2274 1691 3240 42 -3535 -1580 2770 3067 -1233 -3698 -546
2500e46L642j323l707o36K864J671j304j726K54P81M64L73k54p19j273O96K419
$$ -546 3096 1773 -1934 -2570 294 1965 661 -1065 -811 -30 434 807 553 -166 -1439 -743 1676
2517A676L73k883k034K478L504r43m466r54L812K951k390m134K92M114J591k648
$$ 1676 2049 -834 -2868 -390 3114 2171 -2295 -3249 563 3514 1124 -3010 -2718 1396 2987 339
2533C39k864J160K640L35j293j478K76Q58R58N0r64j322J47K079J283j722k980
$$ 339 -2525 -1365 1275 1610 317 -1161 -885 -27 931 981 17 -1305 -1158 921 2204 482 -2498
2550b498M10L844J263l461l068J986L915M83l815k517K655L416n67l277j113K113
$$ -2498 -2088 1756 3019 -442 -3510 -1524 2391 2874 -941 -3458 -803 2613 2046 -1231 -2344 -231
2566b31J920k64j778q67O31J246P55q86j623l86J499J980m96k999j053K777K617
$$ -231 1689 1425 -353 -1220 -589 657 1412 526 -1097 -1483 16 1996 1500 -1499 -2552 225 2842
2583B842j448l675m26L350K383k140l284J35L320J480k097k329N69K079R64j031
$$ 2842 1394 -2281 -2707 643 3026 886 -2398 -2263 1057 2537 440 -1889 -1320 759 1723 692
2599F92j602l64J114J518o0j542j397O45K304P00k402k192J213L330K86l019k090
$$ 692 -910 -1274 -160 1358 1298 -244 -1641 -996 1308 2008 -394 -2586 -1373 1957 2243 -776 -2866
2616b866K057K878r5k842j348J933K154n06k076q70J380J326j14q11j156p8J426
$$ -2866 -809 2069 1974 -868 -2216 -283 1871 1365 -711 -1581 -201 1125 1011 200 -956 -1034 392
2633C92J252r03j928n40J816J871r43k663o77K713K052j728k607L4K763J189j753
$$ 392 1644 741 -1187 -1727 89 1960 1017 -1646 -2323 390 2442 714 -1893 -1859 904 2093 340
2650C40j963K88K200O63j345j186K72Q61N61J31q79j171L47J570Q14j435j810
$$ 340 -1623 -1335 865 1528 183 -1003 -731 130 691 822 -57 -1228 -881 689 1503 68 -1742
2667a742M42K544Q08k294k128J209K934J71k654j406J873K183n08k185n41J042
$$ -1742 -1300 1244 2052 -242 -2370 -1161 1773 1944 -710 -2116 -243 1940 1432 -753 -1294 -252
2683b52J355m28q17n06P7N60P97jj373j069J128J965r4k361j192J854K595o09
$$ -252 1103 675 -142 -648 -571 -11 786 785 -588 -1657 -529 1436 1342 -1019 -2211 -357 2238 1629
2701A629l151p22K708K027j597k692J16K552R54j532j688N24J227P59o84q17j87
$$ 1629 -1522 -2244 464 2491 894 -1798 -1682 870 1824 292 -1396 -872 355 1114 430 -387 -574
2718e74O4P83R10o44j809k50K013J603j465k677L01L112J386k635k917J468L492
$$ -574 -510 273 1183 539 -1270 -1520 493 2096 631 -2046 -1745 1367 2753 118 -2799 -1331 2161
2735B161J46l208j422J951K329o32k255o15J455R97m21p36k09j78K68J123K96
$$ 2161 2307 -901 -2323 -372 1957 1325 -930 -1545 -90 907 486 -250 -459 -637 -369 754 1050
2752A050j178j541Q65K600L1k779j684K270L058q88l702p25L329K232k245l014
$$ 1050 -128 -1669 -804 1796 1827 -952 -2636 -366 2692 1804 -1898 -2623 706 2938 693 -2321
2768b321N52K865Q97k115j692R30J568K52j160l22J97L0L54R71l79j699l74J974
$$ -2321 -1769 1096 1993 -122 -1814 -884 684 936 -224 -546 -349 -319 35 1006 627 -1072 -1446 528
2786E28J816j682k681J89L332J323k766l069J821L502J09l642j488K510K369r79
$$ 528 2344 662 -2019 -1830 1502 2825 59 -3010 -1189 2313 2422 -1220 -2708 -198 2171 1192
2802A192k790n5K079Q53j219p18M05J82NL34O05o62j520N54K179N18k510j946
$$ 1192 -1598 -1653 426 1279 60 -658 -253 -71 -66 268 873 211 -1309 -755 1424 1942 -568 -2514
2820b514J967L179q71l537q89L328K326k391l124O90L378N65k544j470J463J671
$$ -2514 -547 2632 1761 -1776 -2665 663 2989 598 -2526 -1836 1542 2107 -437 -1907 -444 1227
2836A227m89j190L7O16j65l40Q06K51j110r47J311J823p66k631n71L054J710k441
$$ 1227 738 -452 -415 201 36 -304 502 753 -357 -1304 7 1830 1064 -1567 -2138 916 2626 185
2854A85k922J315L415K39l335j525K389K452j190k613J40K112N77j329p61R05
$$ 185 -2737 -1422 1993 2232 -1103 -2628 -239 2213 1023 -1590 -1450 662 1239 -90 -851 54
2870E4J26m72M9J031j63j668j08J849J242j899k448J321L193O4l603j424K968
$$ 54 180 -292 -243 788 625 -1043 -1151 698 1940 41 -2407 -1086 2107 2171 -1432 -2856 112
2887A12K823j941l150K26L008J100k257j801J314J825n19j339P7Q92j67o66Q55
$$ 112 2935 994 -2156 -1930 1078 2178 -79 -1880 -566 1259 740 -599 -522 370 203 -463 392
2904C92O48j148j428R90K185j05k993q57K643K465k013l422O69L607R96l138k149
$$ 392 1040 -108 -1536 -546 1639 1534 -1459 -2316 327 2792 779 -2643 -1974 1633 2629 -509 -2658
2921b658J876K909n28k565p98K136J161j129j020L62M47k74N5Q00j53j428n11
$$ -2658 -782 2127 1599 -966 -1764 372 1533 404 -616 -254 193 -81 -26 774 621 -807 -1318
2938a318J909J274j640k529Q25L269P99l505k005K551L101r57l665m65L064J867
$$ -1318 591 1865 225 -2304 -1479 1790 2589 -916 -2921 -370 2731 1774 -1891 -2356 708 2575
2954B575k014k461O09K342K26j545m88N99L62l01K14M55p46j005M77K097n4k399
$$ 2575 561 -1900 -1291 1051 1277 -268 -756 -157 205 -96 118 573 -173 -1178 -701 1396 1342 -1057
2972a057j276K441K520j427l508J77L354J671k870k702J543L224R8l049j239J897
$$ -1057 -2333 108 2628 1201 -2307 -2130 1224 2895 25 -2677 -1134 2090 2188 -861 -2100 -203
2988b03J775p65j719O4R30K43l08J49J47q35k07J098J172j193k176M54K859O37
$$ -203 1572 807 -912 -848 82 325 17 166 313 -522 -729 369 1541 348 -1828 -1374 1485 2122
3006B122k538k103J929K890m91l281r47K844J988j630k638M38K347N28j637j037
$$ 2122 -416 -2519 -590 2300 1809 -1472 -2419 425 2413 783 -1855 -1417 930 1458 -179 -1216
3022a216R31O40j72l09K04j91m99J61J077M88j473j181J432J975p87k530m02K659
$$ -1216 -285 355 183 -126 78 -113 -612 -451 626 1114 -359 -1540 -108 1867 1080 -1450 -1852 807
3040H07J478j905k459P30K759M48k477j285J451J789o14j688J63R12L88l93k66
$$ 807 2285 380 -2079 -1349 1410 1858 -619 -1904 -453 1336 722 -966 -803 109 497 104 -162
3057a62L80k53n14N48R79m56j469j89J844J116j833j861R10K530K2k437j218J810
$$ -162 218 -35 -549 -1 978 522 -947 -1136 708 1824 -9 -1870 -960 1570 1592 -845 -2063 -253
3075b53J910m97k413j98J700J028j096j095M65P51R6l42j41J67m63K3Q44M00r04
$$ -253 1657 1160 -1253 -1451 249 1277 181 -914 -449 302 398 56 -85 82 -381 -358 486 886 -18
3094a8j158P74J820k16k065q66J901J551r49k244l0K120J020j531j694O47J722
$$ -18 -1176 -402 1418 1202 -863 -1729 172 1723 774 -1470 -1500 620 1640 109 -1585 -938 784
3111G84K69j253p55N63R12O4m60j93l27N1O91N10n61j151k24J492R23j188j641
$$ 784 1053 -200 -955 -392 520 584 124 -69 -396 -345 346 856 295 -856 -1080 412 1335 147 -1494
3130a494N63J871O48j772j568J032K067r9j934p08J090J585l69j420m03R48O75
$$ -1494 -931 940 1588 -184 -1752 -720 1347 1248 -686 -1394 -304 1281 912 -508 -911 37 712
3147G12j55o33m79R8P52M83k28q09p13P35J374m07j604n82J337J490o48j747l68
$$ 712 557 -76 -555 -457 295 778 550 -259 -972 -237 1137 730 -874 -1456 -119 1371 723 -1024 -1392
3166a392J627J278r36j763O8J605P96r14j270k5J215O05m55r75m0M96P25j66o61
$$ -1392 235 1513 577 -1186 -1118 487 1283 369 -901 -926 289 894 439 -536 -576 -80 645 479 -182
3185a82q74O48J033K55r92r38N65J326K40j219r91M62J725O7j280j099J078J183
$$ -182 -1056 -408 625 880 -112 -1050 -485 841 1081 -138 -1129 -667 1058 1125 -155 -1254 -176 1007
3203A007j7j189r61P60J176J73j171o28L55R57K66o60p79P7Q35N59o66p67r7J000
$$ 1007 990 -199 -1160 -400 776 949 -222 -850 -495 462 728 68 -711 -634 201 760 94 -673 -770 230
3223B30P55m47j146k98J138Q18n25j116l47J083R87o40j151k26R87P81m20j129
$$ 230 985 538 -608 -906 232 1050 525 -591 -938 145 1132 492 -659 -885 102 883 463 -666
3241f66k57J093N83j24j072k86P85P51k03j019m21O32P44J56q75m87L78P90K28
$$ -666 -923 170 753 629 -443 -729 56 807 604 -415 -836 -204 540 696 -179 -666 -288 502 730
3260G30p17p07K14Q72M73o83r86J55J097M60p93r66J99J103L29o92q59K49Q88
$$ 730 13 -694 -480 392 865 182 -804 -649 448 908 115 -851 -652 451 780 88 -771 -522 366
3279C66M65p86o16J71P49K69m25o78r0P36L01r6o41l45L26Q05J88q84o68L23J179
$$ 366 831 45 -571 -400 349 618 193 -485 -575 161 462 366 -275 -620 -294 511 699 -185 -853 -530 649
3300F49J52j061p81O37J211m8j049o24Q14J114l77j005l46N79P46r7p44k59K24
$$ 649 801 -260 -1041 -404 807 759 -290 -914 -100 1014 637 -368 -714 -135 611 514 -230 -489 -265
3319b65N54K04l40p14qN69P29l17r27l87J078Q17m72j279j88J263R03o67j371
$$ -265 289 493 153 -561 -569 0 729 412 -515 -902 176 993 521 -758 -946 317 1220 553 -818
3338h18o0J392N60q64j138K63J044L03n34o38m0O31N14k89n13k67J30O98L84p64
$$ -818 -878 514 1074 210 -928 -665 379 682 148 -490 -530 101 615 326 -187 -454 -324 374 758 -6
3358fr64M62J146M51j042j233N87J575K93j457j109R16J364n4j583m10R36Q55
$$ -6 -970 -508 638 1089 47 -1186 -599 976 1269 -188 -1297 -381 983 929 -654 -1064 -128 727
3376G27k38r11l16M86Q20k22m83k68L9N83L67j25q96k60P08J113m41j348m37J245
$$ 727 489 -422 -738 -252 568 346 -137 -405 -366 217 584 459 -437 -697 11 1124 683 -665 -1102 143
3396A43J127o78j501j10J396R90j156j301M60J216M15j066q20L74Q47K58n27l52
$$ 143 1270 592 -909 -1019 377 1367 211 -1090 -630 586 1001 -65 -885 -511 336 594 67 -285
3414b85j8K17L56J55m24o15J53Q13N19q00j085M84J226K94j270j034R02J459j59
$$ -285 -303 -86 270 425 1 -614 -461 352 871 71 -1014 -530 696 990 -280 -1314 -412 1047 888
3433H88j449o16J097J046n54j084o1Q05M63k26n14J8J79J84R9J4l92l67L69P59
$$ 888 -561 -1177 -80 966 412 -672 -733 72 535 309 -205 -187 -8 176 275 289 -103 -470 -101 658
3453F58k3r14o41Q24J095l59j350k90J205P69o81j168Q0J186M68p79p95K70P22
$$ 658 635 -279 -920 -96 999 640 -710 -1000 205 974 293 -875 -795 391 859 80 -715 -445 277
3472B77K50m85l30K63l9K72R8j29m44j86M17P40m32o82l36J109N95p87j242N02
$$ 277 527 42 -288 -25 -64 208 306 177 -267 -453 -36 704 272 -410 -746 363 958 171 -1071 -569
3492e69J220K32j002q63O50R56J75j174k78O40M29Rn47q1K16n9K50J40m31m06
$$ -569 651 883 -119 -982 -332 624 799 -375 -653 -13 416 425 -122 -203 13 -46 204 344 -87 -493
3512d93J86P73K98r78p76N38J265r0j155n39Q25J238n28j084l32R98O76m08r64
$$ -493 -307 466 764 -214 -990 -452 813 723 -432 -971 -146 1092 564 -520 -852 146 822 414 -550
3531e50L4P94K61l51n63L9L20J97kJ4m94j98N88M29r3j087k72J147Q07q25j036
$$ -550 -516 278 539 188 -375 -336 -16 181 179 193 -301 -499 89 518 425 -662 -934 213 1020 195 -841
3552h41J19J236M93j008r06M57J153J59r62p25N28P82R4o28k21R7K87K55j52l77
$$ -841 -722 514 1007 -1 -907 -450 703 862 -100 -825 -297 485 579 -49 -270 -173 114 369 217 -160
3572a60l36K89N89J42o59o44M63J001m7j043n42Q89R05k63j065m09Q97J005n71
$$ -160 -496 -207 382 524 -135 -779 -316 685 638 -405 -947 -58 847 584 -481 -890 7 1012 441
3591D41r40r9Q22M74m93n57PM31K46j42k68l70J50N07K98l92p11R1O81P54p15
$$ 441 -499 -598 224 698 205 -352 -345 86 332 190 -78 -448 -298 209 507 115 -596 -505 176 930 215
3612B15q78N7J103L96q59q43L48J014J95q41o82M74P10N8o76m03M58L73J46k79
$$ 215 -663 -606 497 893 34 -809 -461 553 748 -93 -775 -301 409 467 -209 -612 -154 219 365 86
3632H6l89R3J14M31J31n85m45N38N80j5q08l67O40P17k55q08k83O77N78l44o45
$$ 86 -303 -210 -96 335 466 -119 -564 -26 554 539 -269 -636 4 721 466 -342 -625 52 630 286 -359
3653c59k96P38M19l60n80J57L29K05o6j26k47p4M47J89k65m08m1N34M64m46o55
$$ -359 -655 83 502 142 -438 -281 48 253 187 61 -186 -260 187 376 111 -297 -338 196 660 214 -441
3674d41j67Q75L38o11n59K5Q32M01p39m37N2O74J01l86k35jL78J21Mm75m6K86
$$ -441 -608 267 605 -6 -565 -540 292 693 -46 -483 -431 243 344 -42 -277 -278 100 221 225 -250 -296 -10
3696a0L26M2n41k48K34N93J28p58l54L70P29o1p68m01N18O60qo94k11M68M60k13
$$ -10 316 358 -183 -431 -197 396 524 -234 -588 -218 511 450 -318 -719 -201 459 451 -243 -454 14 474 261
3718B61m03k16J84M63J36l28m28J35L02L81k63p03q2P61K25k68o44o2P80L64m10
$$ 261 -142 -358 -174 289 425 97 -331 -196 106 487 224 -479 -561 200 425 157 -487 -549 231 595 185
3739A85p80J58P28L28m89o09J43N61L58m25l98j67M61L86l21l13l13M30N88j06
$$ 185 -595 -437 291 619 130 -479 -336 225 583 158 -240 -407 54 440 119 -194 -507 -77 511 405
3759D05n58l80M04N94L1q23k23L65O27l2n63m11M19O96j19p51k41N90M37r4m83
$$ 405 -153 -533 -129 465 496 -327 -550 -185 442 410 -153 -564 -145 551 432 -319 -560 30 467 373 -110
3780a10k91K77N22M5n12k36q9N93J75k81m88k52Q03N74n74o35L1O28L55n35n44
$$ -110 -401 -124 398 443 -69 -305 -394 199 374 93 -395 -647 156 730 156 -479 -448 180 535 0 -544
3801e44J24P19L04n12o61L39M21K40l36m19l3N06K87l55l61p8K59M73N5n94k88
$$ -544 -420 299 603 91 -570 -231 190 430 94 -325 -358 148 435 80 -281 -359 -100 373 428 -166 -454
3822d54L59N49K3p70k12L03P31j06q70NM25M91o4o38k16L05M92N1m95k87K50M40
$$ -454 -95 454 477 -293 -505 -202 529 423 -447 -442 -17 474 410 -228 -444 -139 353 404 -91 -378 -128 312
3844C12O1l72l24l6M34K41k86l55p3N80L85m36m40P9M18K99k85n02jN11K33k22
$$ 312 373 1 -323 -359 75 316 30 -325 -398 182 567 131 -309 -230 188 487 202 -300 -301 210 443 221
3866B21n88J50J90K65p4m57pL80R5J01l80k42K75K56K20m62l58J73N20Q7n59k81
$$ 221 -367 -217 -27 238 164 -293 -300 80 175 276 -104 -346 -71 185 405 -57 -415 -242 278 365 -194 -475
3888d75L86M47J16m82j81j1N54P6n64j24J48K86K6k13j39j8K97N9j14k92p9N22
$$ -475 -89 358 474 -8 -189 -200 354 430 -134 -258 -110 176 202 -11 -150 -168 129 188 74 -218 -297 225
3910B25J00p3m94j53N06L55j76n63r9L95L63k48l35j75L56M14j24n96k3M78J04
$$ 225 325 252 -242 -395 111 466 290 -273 -372 23 386 138 -197 -372 -16 398 274 -322 -345 133 237
3931B37j40k75j15K65J56R3l32j29L4L54J07l52j91L3M89J09k29n30K97L95R5
$$ 237 97 -178 -293 -28 128 221 -111 -240 -206 148 255 -97 -288 -255 234 343 114 -416 -119 276 371
3952C71l82m35Q3P63o5m28j70r0M78J63l26k90P6M64nj07k80M0K14L55l77k81
$$ 371 -11 -446 -363 400 335 -93 -263 -353 125 288 -38 -328 -252 212 207 100 -180 -140 74 429 52 -229
3974b29j08M30J75m9l67n9L31J86j81l11j67M75J56j78k69q9L31J82m7l00j50
$$ -229 -337 93 268 219 -148 -207 124 310 129 -182 -349 126 282 104 -165 -254 77 259 212 -88 -238
3995b38K47K10j9l42n0J09K74N1k61l50L10L99j54j48k78N7L82J45l95k48J11
$$ -238 9 219 200 -142 -192 -83 191 242 -19 -369 -59 340 186 38 -240 -183 199 344 -51 -299 -188
4016a88L81J8k04l66J98K85J35j69l23J28K73L8j37l36NM66J03j72m21J9L82J10
$$ -188 193 211 7 -359 -161 124 259 90 -233 -105 168 206 69 -267 -262 204 307 135 -286 -267 115 225
4038B25j43l53J00L13P3j43k95M2J51J48J35m46O3J52J69J7k48k94J88M51j79
$$ 225 82 -271 -171 142 215 72 -223 -181 -30 118 253 -193 -130 22 191 208 -40 -334 -146 305 126
4059A26k79qJ39K21M6l47j03Q5L81r9k10j57P4L62l9l01j17J02K95j40Kj55r9
$$ 126 -153 -161 -22 199 245 -102 -205 -120 261 162 -48 -205 -131 231 192 -109 -226 -124 171 31 33 -122 -221
4082b21J93L81l48j76N0L08l9p0k77j37M24J66j22l59mK52O5jl44o1K37K87k78
$$ -221 -28 353 5 -171 -121 187 148 78 -199 -336 88 254 132 -227 -231 21 86 85 -259 -320 -83 204 -74
4105g4o3R2J24JJ70k97k10J46J85J73k13k47J05K42J57l29j78J05L16K5k27k68
$$ -74 -137 -45 79 80 250 -47 -257 -111 74 247 34 -213 -108 134 291 -38 -216 -111 205 230 3 -265
4127b65J02L95M8k53k40J39L68p0n6m30J86J49N1r9N0k03RK44n9j60r4K9K87N7
$$ -265 -163 232 280 27 -213 -74 294 224 168 -262 -76 73 124 25 75 -128 -119 125 66 -94 -188 -159 128 185
4151A85l09p0J27L14j38k61j43L03L74j77k76n9J74J80j16k58j9J61N4M3j20r2
$$ 185 -124 -194 -67 247 109 -152 -295 8 382 205 -71 -130 44 224 108 -150 -169 -8 46 89 -31 -123
4173a23J18J14P6q9l51J70J61J45k24k01N3L64Q8j84l81J71K33J83k76k14J0K09
$$ -123 -5 109 185 96 -255 -85 76 221 -3 -204 -151 213 301 117 -264 -93 140 323 47 -167 -157 52
4195E2M8n6k45J05J50%Jk10L5j7L35j46p9j92J81K26L7l02j28K23K96j81j93k54
$$ 52 100 44 -201 -96 54 54 55 -155 -120 -137 198 52 -27 -219 -38 188 225 -77 -205 18 314 133 -60 -314
4219c14K90K13L9k69o6J26J56j42j79K2Q8J98j60n4j18R7J35l7j14o7J01R9J87
$$ -314 -24 189 228 -41 -107 19 175 33 -146 -124 -36 162 2 -52 -170 -73 62 25 -89 -156 -55 44 231
4242B31j91j95l1K57J89k28j57MK16O1j55k62J47J84J91j84j48L2J39m2j15j05
$$ 231 40 -155 -186 71 260 32 -125 -121 95 156 1 -261 -114 70 261 77 -71 -39 100 58 -57 -162
4264a62J41M0O5Q3j49r9O7J3J80j50l51L41J49m6j67k25K35P0J48k16j19J20Q5
$$ -162 -21 19 84 167 18 -81 -14 -1 179 29 -322 19 168 122 -45 -270 -35 35 183 -33 -152 -32 53
4287E3O4k54K23k42J97J11j09k05R2J80j74J69k51k2J04K29j06k38o1K54K07l1
$$ 53 117 -137 86 -156 41 152 43 -162 -70 110 -64 105 -146 -168 -64 165 59 -179 -240 14 221 190
4309A90m10M7K27L3q3j44J74MJ8o8j11j2K25l1r7K3m6J31L8l7j45Q3mJ01L0j33
$$ 190 -220 -173 54 87 4 -140 34 38 56 -12 -123 -135 90 59 -38 -15 -61 70 108 71 -74 9 5 106 136 3
4335Cr5m6O7J33j47O5n3J01P1p8l3j06K46n4k06LR3J00J4k1l3j24Q0P4k8p2k26
$$ 3 -92 -138 -71 62 -85 -20 -73 28 99 21 -12 -118 128 74 -132 -129 -36 64 78 57 24 -100 -20 54 26 -46 -272
4362b72K54O8k4j47j64L77n8P5j91K9o2L52j78j5k20K31j22J54j62lJ13P5Mjj68
$$ -272 -18 50 26 -121 -285 92 34 109 -82 -53 -115 237 59 44 -176 55 -67 87 -75 -78 35 110 114 113 -55
4387e5L3m9K10j00l6o1J15M3j17m4j45J94J34k14K7l1Q3P7J4k26P6P4J78k23L7
$$ -55 -22 -71 139 39 3 -58 57 100 -17 -61 -206 -12 122 -92 -65 -96 -13 64 78 -148 -72 2 180 -43 -6
4412fK1j02K59j09j10o5Q9O9j97J17l4Q8J8P6j21j46K98k7j52n4J9J6J16R2j28
$$ -6 15 -87 172 63 -47 -112 -23 46 -151 -34 -68 20 38 114 -7 -153 145 118 -34 -88 -69 -53 63 155 27
4437B7m5R0o2J58k82O9Q3q9L8Km5O9RK7j57K13j16K2n1L4n0r4J10J54p2m3o8P5
$$ 27 -18 72 10 168 -114 -45 38 -51 -13 -11 -56 13 22 49 -108 105 -11 11 -40 -6 -56 -150 -40 114 42 -1 -69 6
4465FJ3oM1j09J63j0j4j8j38O5j1j7M6k01K33L7P6j18K6j99J73N0l6mm2l0KO7
$$ 6 19 13 54 -55 108 98 84 66 -72 -7 -18 -35 11 -190 43 80 156 38 64 -135 38 88 52 48 6 -24 -22 45
4493D5r6q1J90J72j33j83R2m6J45j49L6n9L4M5j18J13m7R3R7n8j55N3P5Ppj52
$$ 45 -51 -132 58 230 97 -86 6 -40 105 -44 -8 -67 -33 12 -106 7 -40 53 150 92 -63 -10 65 72 65 -87
4519h7K3Q5j07K05j75L5J31P5j30J7q8J44q0K2K2k00J03M1m1N7j91J48O1k09J16
$$ -87 -64 21 -86 119 -56 -21 110 185 55 72 -16 128 48 70 92 -108 -5 36 -5 52 -139 9 70 -139 -23
4544b3j43J84R8r0r0K1K1L3k1L6q6k9NL3J35rq8J09q7N1q6j27J32Q4m0j8L6l8
$$ -23 -166 18 116 26 -64 -43 -22 11 -10 26 -60 -89 -84 -51 84 75 -13 96 9 60 -26 -153 -21 63 23 5 41 3
4572CJ75j22n8O2q7R6j3o0N7p0k7J40l3o5k42L13K1r4j56R0J13O4pk07mN9J16
$$ 3 178 56 -2 60 -27 69 56 -4 53 -17 -44 96 63 -2 -244 69 90 -4 -160 -70 43 107 100 -107 -111 -52 64
4599F4o8K8O5k7j6j03l9Q9m4L4L6L6j16l6J66J03k72k3J07M7R2q3j24n7Q7J06
$$ 64 -4 24 89 62 46 -57 -96 -7 -51 -17 19 55 -61 -97 69 172 -100 -123 -16 31 123 40 -84 -141 -54 52
4625E2K0k03QJ90l2P3m2j72Q8J87j32l1k8l4K57k06k1rP3K6j52R2m3O8L3m3j07
$$ 52 72 -131 -123 67 35 108 66 -106 -18 169 37 6 -22 -56 201 -5 -26 -35 38 64 -88 4 -39 29 62 19 -88
4652h8p9J78J23k46K2M1P5M8k3n6k2PJ34mj44J29r0N3J5o0j6k8K7J46k46Q0J74
$$ -88 -167 11 134 -112 -90 -49 26 74 51 -5 -27 -20 114 110 -34 95 5 58 73 13 -3 -31 -4 142 -104 -24 150
4679A50j25N3m2l6j84L73j92k8j12J47J13n5j19P0j12K07n0p1Mp8O0N9o1j9n4
$$ 150 25 78 36 0 -184 189 -3 -31 -143 4 117 62 -57 13 -99 108 58 -13 -9 -87 -27 32 -29 -48 -102
4704a02K9O4O5o5Rq2J16n8M9k7N8Mm1p7o5K02k5j6q6N4j06J83k7q7J18k30J89
$$ -102 -73 -9 56 -9 0 -82 34 -24 25 -2 56 60 19 -58 -123 79 54 38 -48 6 -100 83 56 -31 87 -143 46
4731D6J13j25q5N0R5m1j4On0R1j3L3l00J50J02J03j69l6j2J06Q7j42m8j03J30
$$ 46 159 34 -51 -1 94 53 39 45 -5 86 73 106 -194 -44 58 161 -8 -44 -56 50 137 -5 -53 -156 -26
4756b6L0Q0p1j83kJ63M4q3KN2J13Q2k42l9M6L1J60k45j5J52q5J06j46j27J08J29
$$ -26 4 84 13 -170 -172 -9 35 -48 -46 6 119 201 -41 -80 -34 -3 157 -88 -103 49 -36 70 -76 -203 -95 34
4782C4P8j13L4j38L8J82l5j00k8J01l2R0j36p3J79N3j24mm5O6K5j0j57l9K11J7
$$ 34 112 -1 33 -105 -67 115 80 -20 -48 53 21 111 -25 -98 81 134 10 6 -39 27 52 42 -115 -154 57 74
4808G4qj70j1L9K9P5K6j55R1J91l3p9j69LJ35J5j1j67N0P5R9j43k8O9PM7p1J6
$$ 74 66 -104 -115 -76 -47 28 54 -101 -10 181 148 69 -100 -97 38 53 42 -125 -75 0 99 -44 -72 -3 4 51 -20 -4
4836dj00J76N1j16qj71Q1J63m9o7r4J44J56n6k72J0K2M06j69k24RK17nr5r7q6
$$ -4 -104 72 123 7 -1 -172 -91 72 23 -44 -138 6 162 106 -166 -156 -134 272 103 -121 -112 105 100 5 -92 -178
4862a78Q4J78o3j47R4J41j29J47j22j79J22J01O0j43m1L1J58O3j66j57qK19M0
$$ -178 -94 84 21 -126 -32 109 -20 127 5 -174 -52 49 109 -34 -75 -44 114 177 11 -146 -154 65 105
4885A05q1k16J12J01J8p4p2J29J36k27R3q0m8M3K11j79R4j36l2Q7K3k2j68J58
$$ 105 24 -192 -80 21 39 -35 -107 22 158 -69 24 -56 -104 -61 150 -29 65 -71 -103 -16 7 -15 -183 -25
4909b5kL7j88P6J88l3l5J3k08K42O6q3j16j0P5J75j03p3j22J50M1m6j7r1kJ18
$$ -25 -27 10 -178 -102 86 53 18 31 -177 65 131 48 -68 -78 -3 172 69 -4 -126 24 65 19 2 -89 -91 27
4935B7J67k33J0p4J29J39j21j11j77J59K37j20k25Q4K41J00l80N6lK12q0Mr9J12
$$ 27 194 -39 -29 -103 26 165 44 -67 -244 -85 152 32 -193 -109 132 232 -148 -92 -95 117 37 41 -58 54
4959E4j20J41m2o2n1o0K32Mj19n7O6P9J56k79j44L4K75O6j43k33K13J85k03jR
$$ 54 -66 75 33 -29 -80 -140 92 96 -23 -80 -14 65 221 -58 -202 -168 107 173 30 -203 10 195 -8 -9 0
4984@o0J69L3k57j9J49K6MrKl4J70q9j68q0J18L1L25k13j08j01J11O0n5n6M9P6
$$ 0 -60 109 142 -115 -134 15 41 45 36 38 4 174 85 -83 -163 -45 -14 311 98 -10 -111 0 60 5 -51 -2 74
5011G4Q3j32m8o5qK82k35Q7j43J18J88j71m5n5k8J09Q5p6m9p9J80J38j35k13J44
$$ 74 157 25 -23 -88 -96 186 -49 38 -105 13 201 30 -15 -70 -98 11 96 20 -29 -108 72 210 75 -138 6
5036FO2J08j02l15J26L53m7k38PM1J3J38k27p2M6J03J3O9k09N5k3J07pk7k6oK10
$$ 6 68 176 74 -241 -115 238 191 -47 -40 1 14 152 -75 -147 -101 2 15 84 -125 -70 -93 14 7 -20 -46 -52 158
5063A58n5j06k36J88L38k88m8r2J68J09o7k88N5J41J67n8j89k2J02L6N9r7l3j4
$$ 158 103 -3 -239 -51 287 -1 -49 -141 27 136 69 -219 -164 -23 144 86 -103 -125 -23 13 72 -25 -58 -72
5087g2J57K4q1j72j0J90J87j35k30P5K65l1q6k22j15M16M9k13k09j5K28J08j13
$$ -72 85 109 28 -144 -154 36 223 88 -142 -67 198 167 81 -141 -256 160 209 -4 -213 -228 0 108 -5
5110eo3p0K25j07J23k58M2M7K19p9o0j46K04J75m2k45q7L3K96j20k21j19K23K27
$$ -5 -68 -138 87 -20 103 -155 -113 -66 153 74 14 -132 72 247 205 -40 -127 -94 202 82 -139 -258 -35 192
5134A92Q5m45k4J93J38j48L1j77J64J10o7o1p7L5J4J49m3j06j29J01K68j35j79
$$ 192 277 -168 -192 1 139 -9 22 -155 9 119 52 -9 -86 -51 -37 112 69 -37 -166 -65 203 68 -111
5157a11Q1K02J06l05k26P3K62J29k10j24p1J80L8m3j02R0R4Q2l4j21j15K29p9
$$ -111 -30 172 278 -27 -253 -180 82 211 1 -123 -194 -14 24 -19 -121 -31 63 145 111 -10 -125 104 25
5180B5n3q1j4J53J63O2l23j33J79L21r6k36k81J19L35r2o9k56J73L69r0j99j92
$$ 25 -28 -109 -123 30 193 255 -68 -201 -22 299 203 -33 -314 -195 140 48 -21 -277 -104 265 175 -24 -216
5203b16J80Q7L5n4r8ML5J17K5k84P5Q0K43j11j30j88K20J89p2m41P6K19K91j29
$$ -216 -36 51 86 32 -66 -62 -27 90 115 -169 -94 -14 229 118 -12 -200 20 209 137 -304 -228 -9 282 153
5227A53k81O1R6J30m8k84J97O5R9q2k15L0J62K0r4M4j91R3K07M2k76p4l9L38R5
$$ 153 -128 -67 29 159 111 -173 24 89 188 106 -109 -79 83 103 9 53 -138 -45 162 204 -72 -146 -185 153 248
5252B48l23j79J47L38j09j91M6m9J43Q6j45j49K6K56j20lq7j20K03J02j0j99p5
$$ 248 -75 -254 -107 231 122 -69 -23 -72 71 157 12 -137 -111 145 25 22 -65 -185 18 120 110 -89 -164
5275a64K54O1qk46p1J90K42j89j49m4L60K7j28k21j22L17mLj11o6J2K39j27Nk23
$$ -164 90 151 143 -103 -174 16 258 69 -80 -124 236 263 135 -86 -208 109 105 108 -3 -69 -57 182 55 60 -163
5300a63J40J67Q3k37k43K15K41j6l59k2L6K45J37k70j90J82L27r0l22J5J67R9
$$ -163 -23 144 227 -10 -253 -38 203 187 -172 -194 -158 87 224 -46 -236 -54 273 183 -139 -124 43 142
5322A42M1k74m5J11Q1M5q1j41j65L98J08j33k60nK36J88j54k86q9J24M41k62l09
$$ 142 183 -91 -136 -25 56 101 20 -121 -286 112 220 87 -173 -178 58 246 92 -194 -283 -159 282 20 -289
5345b89O4L37J75j84k03j09K56NP9l42%J72J17K4k22r0J1M27j98n7j04n8L18J1
$$ -289 -225 112 287 103 -100 -209 47 52 131 -211 -211 -39 78 102 -120 -210 -199 228 30 -27 -131 -189 129 140
5369A40j20k96K85J66p7k29k05K84J34O0k10j38KL93n8j08j86L7J17Q3K9k65J3
$$ 140 20 -276 9 175 98 -131 -336 -52 82 142 -68 -206 -204 189 131 23 -163 -126 -9 74 103 -162 -149
5392a49L7M09j76j78o6J50J50o8k65P3P3K80n4l42M8N2J82n6l19J05L3J82O0k50
$$ -149 -112 297 121 -57 -123 27 177 109 -156 -83 -10 270 216 -126 -78 -26 156 100 -219 -114 -81 101 161 -89
5416h9q0J96J20L4k17j96J36J61R8j72k65L4N65j42k68j21J01L17kk19k63J53
$$ -89 -169 27 147 181 -36 -232 -96 65 163 -9 -274 -240 325 183 -85 -206 -105 212 210 -9 -272 -119
5438a19L52r3j53m2N4M9O2j3k08m5J59J58k3l28j8J97L12o5l67j71K45L30j41
$$ -119 233 140 -13 -55 -1 48 110 97 -111 -156 3 161 138 -190 -208 -11 301 236 -131 -302 -57 273 132
5461A32l40O7J90L05j63k68j41K24K50j29k62p2J82J82qk24j42J65K47k7o4l98
$$ 132 -208 -141 49 354 191 -77 -218 6 256 127 -135 -207 -25 157 149 -75 -217 -52 195 168 104 -294
5483b94J25K17K53k63l18pM34J32l69k38Q2L72K77l89k69j1M73p3j87j63J15K85
$$ -294 -169 48 301 38 -280 -287 147 279 -90 -328 -246 126 403 14 -255 -266 207 134 -53 -216 -101 184
5505A84P3k30k10O4J27J22Lk78p7K44K60j68k49j32L46J63p6l69j60L40L18n3
$$ 184 257 27 -183 -119 8 130 133 -145 -222 22 282 114 -135 -267 79 242 166 -203 -363 -23 295 242
5527B42n25k3K89J83M2l43j64L65kJ17k83Jm1K66J02k37j36l5K84K11l54k64J94
$$ 242 -283 -306 -17 166 208 -135 -299 66 64 181 -102 -101 -142 124 226 -11 -147 -182 102 313 -41 -305 -111
5550a11L74M6l34j62n5M69J1j95k61J69K81r1l07n0K19oJ67r9j22j38J74J65Q6
$$ -111 263 309 -25 -187 -242 227 238 43 -218 -49 232 141 -166 -216 3 -3 164 65 -57 -195 -21 144 230
5573B30l09j69J01L80j09l53p5K24L56l5m07m9K91J10m4k92k3J76L14k13j20j58
$$ 230 -79 -248 -147 233 124 -229 -304 -80 276 241 -166 -215 76 186 142 -150 -173 3 317 104 -16 -174
5595a74L8K50L3j27l45L23L9J78k13k28P2J66K92k15m79J20L68L00m68k20J26
$$ -174 -136 114 147 20 -325 -2 37 215 2 -226 -154 12 304 89 -390 -270 98 398 -70 -290 -164
5616a64M31ql20j86K72N7J33j20l24J03J45J55j41r2j25L0J99L9k21j88K05K53
$$ -164 267 259 -61 -247 25 82 215 95 -229 -126 19 174 33 -59 -184 -154 45 84 -137 -325 -120 133
5638A33J15l37l68M10K71J5l44k07K89K62M0m32k61L74L56j59k64k1Q7J51Q3p8
$$ 133 248 -89 -457 -47 224 239 -105 -312 -23 239 279 -153 -414 -40 316 157 -107 -128 -41 110 193 115
5660A15j90K4J25J12k1l94o6M42J10j67l55k1L62K82l38m77K14M43N5k62k73K7
$$ 115 -75 -51 74 186 165 -229 -295 147 257 90 -265 -286 76 358 20 -457 -243 200 255 -7 -280 -253
5682b53L92Q8k84n0j42K79J27j54j03j18J05K02J75k71k26J43L21O8m47k97L20
$$ -253 139 227 -57 -107 -249 30 157 3 -100 -218 -113 89 264 -7 -233 -90 231 299 -148 -445 -125
5703a25L08L5l97j59K76L38j74k45nj0M76k90j32o1J17O6J69j28k30k5R0L81k15
$$ -125 183 218 -179 -338 -62 276 102 -143 -148 -158 318 28 -104 -165 -48 18 187 59 -171 -196 -106 275 60
5726F0k85r1L97L72k84m57p6N32J64j86m96J81L67K22l83l01O3L86Lj04l03P9
$$ 60 -225 -316 81 453 169 -288 -364 168 332 146 -350 -169 198 420 37 -264 -201 185 188 84 -219 -140
5748a40J29K15j49L4k63P2L90j56p9m47K65L13P2l82l07L12M97k0o34p0L68L32
$$ -140 -11 204 55 89 -174 -102 288 132 53 -394 -129 184 256 -126 -433 -121 376 356 -278 -348 20 352
5770C52k04l52l6K78J70q1l01j16L34J22j1k03p7o4K24J53J6l97j2K31K60r5m07
$$ 352 148 -204 -240 38 208 127 -174 -290 44 166 155 -48 -125 -189 35 188 204 -193 -205 26 286 191 -216
5793b16r7K62M07j84n09p9N13K79k85n25J61M10M0j73j58M5J57K1j5j17k4M4L17
$$ -216 -313 -51 356 172 -337 -416 97 376 91 -434 -273 137 177 4 -154 -109 48 69 54 -63 -87 -43 274
5816B74o3j75k57p9N03P6k66m44J77O24K0n01j77N7N22o1n38k47M98L62o0k98
$$ 274 211 36 -221 -300 203 279 13 -431 -254 370 390 -111 -288 -231 291 230 -308 -555 -57 305 245 -53
5838e3r5J31J16K3n4l41J41P1K79k06k49j85L28M78j42m86j46L12M76l62l07q0
$$ -53 -148 -17 99 122 68 -273 -132 -61 218 12 -237 -422 -94 384 242 -244 -390 -78 398 36 -271 -351
5860c51M71L28l62l68j5M15K82k98l88O6J50K01o6j22k53J65L21J05k49m81K98
$$ -351 120 448 86 -282 -297 118 400 102 -286 -220 -70 131 65 -57 -310 -145 176 281 32 -449 -151
5881a51M31J20l41m63J56N66J53m67m91L04N02k4m49k77L40L81j1l16k79K64J83
$$ -151 280 400 59 -404 -248 318 471 4 -487 -183 319 295 -154 -431 -91 290 279 -37 -316 -52 131
5902A31P5j38k30Q9l6L97o4l94m7K45L24k73l77j78M46M58k71m05k45M35M36k54
$$ 131 206 68 -162 -73 -109 288 224 -170 -217 28 352 79 -298 -476 -30 428 157 -248 -493 -58 378 124
5924A24m84J29K11K13K2m25M7J78L26k21k22j69K37J93J8j83l15J7M72K66m10
$$ 124 -360 -231 -20 193 215 -210 -163 15 341 120 -102 -271 -34 159 177 -6 -321 -304 168 434 24
5945B4l31Q9M59J13m11m11K34N91l1m73k19K05L54J08k74l54K55J81J46k57k52
$$ 24 -307 -218 241 354 -57 -468 -234 357 326 -147 -366 -161 193 301 27 -327 -72 109 255 -2 -254
5966b54P7J58L64j03l18k03K30L67j31m30j36M24J91j32k58k09M13L68k92l29
$$ -254 -177 -19 345 242 -76 -279 -49 318 187 -243 -379 45 236 104 -154 -363 50 418 126 -203
5986b03n6L44J44N1m44j89K74K23M2l11j10N4M08J02m48k61J27M49N8j98l94J22
$$ -203 -259 85 229 280 -164 -353 -79 144 186 -125 -235 -181 227 329 -119 -380 -253 196 254 56 -338 -216
6008b16L87J08k31l72J85K04L14n14j25l5L79R2l6l08n1K42K93o9n00R9R5L69
$$ -216 171 279 48 -324 -139 65 379 -135 -260 -295 84 176 140 -168 -219 23 316 247 -253 -154 -59 310
6030C10j22m67k56M14M27q8l11l50L07M62j15n23j22N01M06j98l70k69K95L35
$$ 310 188 -279 -535 -121 306 218 -93 -443 -136 326 211 -312 -434 67 473 275 -95 -364 -69 266
6050B66j3l75j50J49L07J17k16m93K54M36J58m95k68J67M69P5l80l27j4N34J29
$$ 266 253 -122 -272 -123 184 301 85 -408 -154 282 440 -55 -323 -156 313 388 8 -319 -333 201 330
6071C30k89m86K36L14K17l22k29J0K73J61Qn38K5L43K76j92l57o7J99L87j26l30
$$ 330 41 -445 -209 105 322 0 -229 -219 54 215 223 -315 -290 53 329 137 -220 -287 -88 299 173 -157
6093a57k25L36M54p0o02k03L66N49l10l17k41N00K93k62l22l8l1N28M3l60j94
$$ -157 -382 -46 408 338 -264 -467 -101 448 138 -179 -420 80 373 111 -211 -249 -280 248 291 -69 -263
6114b63P0M88Q8m73j25k09N47K44l47m02K19M30K05n23l61K94M36N5l68l89L6
$$ -263 -193 295 383 -90 -215 -424 123 367 20 -382 -163 267 472 -51 -412 -118 318 373 5 -384 -348
6135c48N03O6j37m08J81M55Q2k86m64J07L00N2J43m73j09L08L08P0n91r7L46L19
$$ -348 155 221 84 -324 -143 312 394 108 -356 -249 51 103 246 -227 -336 -28 280 350 -241 -338 8 327
6157C27n6p08R9L14L36l5m19k10L94K60q6l48j11K17J58Q0k53j67J05J65R5p4
$$ 327 271 -437 -338 -24 312 277 -142 -352 42 302 216 -132 -243 -26 132 212 -41 -208 -103 62 157 83
6179H3k60n5L70J55k22l63q1P08N3m41k76K2O61l9l13k94J03M37O2k82k44L6K52
$$ 83 -177 -232 138 293 71 -292 -373 335 388 -53 -329 -307 354 315 2 -292 -189 248 310 28 -216 -180 72
6202G2J36Jl34r4K00K93nl15l90K78M71K7m38m01M26M42On06k75M49K95n0l36
$$ 72 208 209 -125 -219 -19 274 269 -46 -436 -158 313 340 -98 -499 -73 369 375 -131 -406 43 338 288 -48
6225d8k25K21J81J59m82j30K90K25j7j55l20N8L06K34j58m01n3L57M33l58m06
$$ -48 -273 -52 129 288 -194 -324 -34 191 174 19 -301 -243 63 297 139 -262 -315 42 475 117 -289
6246b89o4M23K87k46o16K09N48K38m42l76m2N14J12k96j71OK81K91j44m94j36
$$ -289 -353 70 357 111 -505 -296 252 490 48 -328 -370 144 256 -40 -211 -205 76 367 223 -271 -407
6267d07L56L01R7n04k64L38M53J03n49m56M32M23J2m54l94M57L54Jm72m9J19L90
$$ -407 -51 250 347 -157 -421 -83 370 473 -76 -532 -100 323 335 -119 -513 -56 298 299 -173 -222 -103 287
6289B87Ll64k21J56M36K8l56k46J00J85K09r2m90J27M31K09l20n31N2O04L07k42
$$ 287 290 -74 -295 -139 297 325 -31 -277 -177 8 217 125 -365 -238 193 402 82 -449 -397 207 514 272
6311B72o11p6O55J12k24m18KM37K27l33l48J79K16K39q9l41k73K34L13J8j92l65
$$ 272 -339 -415 240 352 128 -290 -288 149 376 43 -305 -126 90 329 240 -101 -374 -140 173 191 -1 -366
6333c66L54L34L9n05l98M64M02l0m33k40L97L99k14n02m4L26L39q1l38k16J31
$$ -366 -12 322 361 -144 -542 -78 324 294 -139 -379 18 417 203 -299 -343 -17 322 241 -97 -313 -182
6354a82L06n6r6j45M7K20K67l47k20j93N75J68k02m55O3M79J72l81l43M5N43R9
$$ -182 124 68 -28 -173 -126 94 361 14 -206 -399 176 344 142 -313 -250 229 401 20 -323 -278 265 364
6376C64k50l41pM38J0p2k36j68L53K10j60k75k05L37J45P6l61l10M20J88K61n20
$$ 364 114 -227 -234 204 214 142 -94 -262 91 301 141 -134 -339 -2 143 219 -142 -452 -32 156 417 -103
6398a03k80J72N70J17m73m34L82L85j05l89k84L72L55l1k28k13L6L10J93l96k1
$$ -103 -383 -211 359 476 3 -431 -49 336 231 -158 -442 -70 285 254 26 -187 -151 159 352 -44 -65
6419f5r2J86L12n7m52k31M71L66j27o26j32M71M63m03m52M6L73L82k59l85l1K57
$$ -65 -157 29 341 284 -168 -399 72 438 311 -315 -447 24 487 84 -368 -322 51 433 174 -211 -242 15
6441A5K53j07k39j16J32J92J12k43k83P6M38M4k46m47K22M25J95l92l50N3N62
$$ 15 268 161 -78 -194 -62 130 242 -1 -284 -208 230 274 28 -419 -197 228 423 31 -319 -266 296
6462B96K15n28m30K90O11j01l94k44J10M38N0l17l02J22K79K24j58k97j43L34
$$ 296 511 -17 -447 -157 454 353 -41 -285 -175 263 313 -4 -306 -184 95 319 161 -136 -279 55
6482E5L18j12m76j69M78L39j32n87j81O05M13l03o25p5N07L85k69n04J07M09K19
$$ 55 373 261 -215 -384 94 433 301 -286 -467 138 551 248 -377 -452 55 440 171 -333 -226 183 402
6503D02k66l12q9K80L13q2k99k36Q5N34l3l55m42K76O36ll82n89K79M94K12m61
$$ 402 136 -176 -265 15 328 246 -53 -289 -204 330 297 -58 -500 -224 412 409 27 -562 -283 211 423 -38
6525c8m51L72M69l9m90k80M01L06o8j12m19L41J48K13k00k99j16J36M69p7m78
$$ -38 -489 -117 352 313 -177 -457 -56 250 182 70 -349 -8 140 353 153 -146 -262 -126 343 266 -212
6546b12l06M69M05j28n50p5N31L42l05n29j2M64L70l58m07o6M64L08k31m01L1
$$ -212 -518 -49 356 228 -322 -397 134 476 171 -358 -370 94 464 106 -301 -367 97 405 174 -227 -196
6567a96L34P1Pk11k19N5K49K73l23l42K5N20J16l73l95K14M94J72m81l74J5P28
$$ -196 138 209 216 5 -214 -159 90 363 40 -302 -277 243 359 -14 -409 -195 299 471 -10 -384 -369 359
6589C59l2l68k54K39K65J99l31m13K20K28L0j57k08l0J59L09M0m93j13K31M79
$$ 359 327 -41 -295 -56 209 408 77 -336 -116 112 142 -15 -223 -253 -94 215 255 -238 -351 -120 359
6610C59j29l96k66L26O24k36n32j16L04M05j29l43k21L73K53n5l31j67L81J30
$$ 359 230 -166 -432 -106 518 282 -250 -366 -62 343 214 -129 -350 23 276 221 -110 -277 104 234
6630B34j05j76k34R7K50K02j54n43K19L05L55l16n08J34M05L81n51l08lN60J25
$$ 234 129 -47 -281 -184 66 268 114 -429 -210 95 450 134 -374 -240 165 546 -5 -313 -316 244 369
6651C69l71k71Q0L19K20k60l97n5M74K39j30l54k03J88N04j70k41l67L08M19l4
$$ 369 -2 -273 -193 126 346 86 -311 -366 108 347 217 -137 -340 -152 352 182 -59 -426 -118 301 267
6672B67m16k67L71M49m6o61j85M36M48j64l63k73K69M38m7m31j22J80L71Q6k65
$$ 267 -149 -416 -45 404 358 -303 -488 -52 396 232 -131 -404 -135 303 256 -175 -297 -117 254 340 75
6693G5l21J6L35L34m43m05K02M14L02m41m45M9N10K19l33n05J68N80O9l47m71
$$ 75 -246 -230 105 439 -4 -409 -207 207 509 68 -377 -328 182 401 68 -437 -269 311 380 33 -438
6714d38J31N78J42m69k49K10J14J31K9m12j17M83K52k07l40k10M10M28j92l52
$$ -438 -307 271 413 -56 -305 -95 19 150 179 -233 -350 133 385 178 -162 -372 38 466 274 -78
6734g8j61J34N08j47n54j94M15M34j33m99J8J54L84M0m08k31K72K56J0k10k52
$$ -78 -239 -105 403 256 -298 -492 -77 357 224 -275 -257 -103 281 321 -87 -318 -46 210 220 10 -242
6755b42J75J98P2k16l27O8N25J68l46m18N4N29L4l20m28J92M15J46l94j41m1L88
$$ -242 -67 131 203 -13 -340 -272 253 421 75 -343 -289 240 274 -46 -474 -282 133 279 -115 -256 -297 91
6777I1J64j38l88m7L64J97K5l81l03M36K58j47l14j60K83L71j03l57l69M53M04
$$ 91 255 117 -271 -318 46 243 268 -113 -416 20 278 131 -183 -343 -60 311 208 -149 -518 -65 339
6798C39K5m24r6j3M01R5l58m51L79K98J52m05k99K03K73K18l07k80m0L99K67l10
$$ 339 364 -60 -156 -169 232 327 -31 -482 -103 195 347 -58 -357 -154 119 337 30 -250 -290 109 376 66
6820F6l69J21K79L55l34l45j84N43K59k42n46J10L38K75k22l72q0M15K92m6m17
$$ 66 -303 -182 97 452 118 -227 -411 132 391 149 -397 -287 51 326 104 -268 -348 67 359 313 -104
6841a04k05K56M19o5m41k05K58L32O3m99j56J10N36J3m89j67L29K95l6l35l10
$$ -104 -309 -53 366 301 -140 -345 -87 245 308 -191 -347 -237 299 312 -177 -344 -15 280 244 -91 -401
6862d01J23M01K28l94l08K15L46Q1j64m76J03L71L03k17n29r2K94M65j94n89P2
$$ -401 -278 123 351 -43 -351 -136 210 291 127 -349 -246 125 428 211 -318 -410 -116 349 155 -434 -362
6883c62N88K17l23n40J28L53L55k63m24L5K45L23j19l78j06K32L91r1l86r9P4
$$ -362 226 443 120 -420 -292 61 416 153 -271 -236 9 332 213 -165 -271 -39 352 261 -125 -224 -150
6904a50N14k73k05l20J64N49M3m08l96L92L58K04n26m18L49M73K3m57k19K50L85
$$ -150 364 91 -114 -434 -270 279 322 -86 -482 -90 268 472 -54 -472 -123 350 373 -84 -303 -53 332
6925C32j22j67k92P0M79Ql70j09j06M38J96j81m99l1M65K33j71n49LN39K81l70
$$ 332 210 43 -249 -179 300 308 -62 -171 -277 161 357 176 -323 -354 111 344 173 -376 -373 166 447 77
6947G7l72J03L45K79l14l69m2M05N7j31p4k61K98J82J4l31k36L31K07P9l08k50
$$ 77 -295 -192 153 432 118 -251 -293 112 169 38 -36 -297 1 183 197 -134 -370 -39 168 247 -61 -311
6969c11J90L83R9m82k14J78M77mo32j00L64L76Q1n13k37K77L49k5l46o5k5K90
$$ -311 -121 262 361 -121 -335 -157 320 316 -316 -416 -52 324 405 -108 -345 -68 281 256 -90 -155 -180 110
6991A10J7j52j36l3K93K04j00m52k5M11J97k08m49n4M28L35k63l11n9L85K09k16
$$ 110 127 -25 -161 -194 99 303 203 -249 -274 137 334 126 -323 -377 51 386 123 -188 -247 138 347 131
7013A31l29N1J14K10j10j58J9m8L03L9k17k80J12K90J57k34m03K19L92J00l95
$$ 131 -198 -147 -33 177 67 -91 -72 -120 183 222 5 -275 -163 127 284 50 -353 -134 258 358 -37
7034c7l33J31M95J49k58m82J07O27k6n47j49K06L87k2k72k10K9J69J87k6k90j61
$$ -37 -370 -239 256 405 147 -335 -228 399 373 -174 -323 -117 270 248 -24 -234 -205 -36 151 125 -165 -326
7056c26L35L09k39l85j06M63L84k23n40j30M50M29k78m12j58N19K29k66l95M3
$$ -326 9 318 79 -306 -412 51 435 212 -328 -458 -8 421 143 -269 -427 92 321 55 -340 -297
7076b97L31K03o9l94l8J21M23m8l08l19K89L04K12l91m14J01N15K19n65l12K06
$$ -297 34 237 168 -226 -264 -143 280 232 -76 -395 -106 198 410 19 -395 -294 221 440 -125 -437 -231
7097b31O23L0n53m48M37M61O5n59k37L20L13J0k56l09J69L06O1j61k99k8M20K54
$$ -231 392 422 -131 -579 -142 319 384 -175 -412 -92 221 231 -25 -334 -165 141 202 41 -258 -286 134 388
7119C88k10m09j48K54N26j55o43Q9K44M45k21o02K2N95K59k99m60Q5K39K70m2
$$ 388 178 -231 -379 -125 401 246 -397 -308 -64 381 160 -442 -420 175 434 135 -325 -240 -1 269 227
7140B27l21j35K83K58j00k77k43K51K52J38l18m21J06N74J36m45k63J26M62J32
$$ 227 -94 -229 54 312 212 -65 -308 -57 195 333 15 -406 -300 274 410 -35 -298 -172 290 422
7160D22n80k61K37M98L0l94j13J04L59j90l1k43O4L28j20J5m22J08K81K10j13
$$ 422 -158 -419 -182 316 346 -48 -161 -57 302 112 81 -162 -98 230 110 125 -297 -189 92 302 189
7181A89m42j61M26K94j45n39r2O08J96j00m84j39M54K64j27m34l9K83K24M1m33
$$ 189 -253 -414 12 306 161 -378 -470 138 334 234 -250 -389 65 329 202 -232 -271 12 236 277 -156
7202a56j05J72K72l8M5m44N3K15L65m48k44O4L50K37l49l12qO00K37n44l11L31
$$ -156 -261 -89 183 145 190 -254 -201 14 379 -69 -313 -249 101 338 -11 -323 -331 269 506 -38 -349 -18
7224a8L00P0m02k47R3L38K09k86l24J6L68J56n1m25j53L11L24N2n61k04K85M47
$$ -18 282 352 -50 -297 -204 134 343 57 -267 -251 117 273 222 -203 -356 -45 279 331 -230 -434 -149 298
7246B98Nn56k22M28M10q1n63o5L51M56k40m32j32L71J41P9l58j38K09K15J35k46
$$ 298 303 -253 -475 -47 363 282 -281 -346 5 461 221 -211 -343 28 169 248 -110 -248 -39 176 311 65
7268F5l14NM18M6p7n27J36M03J91k92n30J00P20L1l42m01m9O08K53m27l82J14
$$ 65 -249 -244 174 220 143 -384 -248 155 346 54 -476 -376 344 375 33 -368 -417 191 444 17 -365 -251
7290b51L30J69j97k50QL14K34k28k89k28K75M41j60l57k59N31K75n3l46m69M54
$$ -251 79 248 51 -199 -191 123 357 129 -160 -388 -113 328 168 -189 -448 83 358 305 -41 -510 -56
7311e6M26j80m14j81M79L64k81m29j46M16K12L0l08k31K79J98N6k00l18J20L33
$$ -56 370 190 -224 -405 74 438 157 -272 -418 -2 210 240 -68 -299 -20 178 234 34 -284 -164 169
7332A69J6j89l23N3M55J29l54l55J95N68p8k97l24J26M22P4j83m69J82K69J34
$$ 169 185 -4 -327 -274 181 310 -44 -399 -204 364 286 -11 -335 -209 213 287 104 -365 -183 86 220
7353B20k05k53J9K21K19j8l41j35K54J53O3j84l33L44J98M9l80k23J57M55Q2o61
$$ 220 15 -238 -219 2 221 203 -138 -273 -19 134 197 13 -320 24 222 271 -109 -332 -175 280 362 -299
7375b99j42L41L23J16m68j76K15K99K6j65l31J03M20L6j50k93Q5K24K23k79m13
$$ -299 -441 -100 223 339 -129 -305 -90 209 235 70 -261 -158 262 298 148 -145 -60 164 387 108 -305
7396c05J31K57K03k07l19m2L28L74l38l80P4K01K51j55l32J09J30K76j48k16p
$$ -305 -174 83 286 79 -240 -282 46 420 82 -298 -224 -23 228 73 -259 -150 -20 256 108 -108 -115
7417a15P8K18jk13j49J92J95ml91j84L12L99r2m29j81K56K59J66m58j68K10K87
$$ -115 -37 181 180 -33 -182 10 205 201 -190 -374 -62 337 245 -184 -365 -109 150 316 -142 -310 -100 187
7439A87O6m00o9J15M97J8m48k21L1K84J13r4k75q4L25K45j84l37j10N07K06k96
$$ 187 253 -147 -216 -101 396 414 -34 -255 -224 60 173 79 -196 -280 45 290 106 -231 -341 166 372 76
7461G6m28l2N99Q4k42l36L5L91J56j73l11j20L97J86o0m07o7K27K55m1l74j03
$$ 76 -352 -384 215 299 57 -279 -244 147 303 130 -181 -301 96 282 222 -185 -252 -25 230 189 -185 -288
7483b88J42M06j25l66l9J38M63n8l83k20O0O47j77m63m7L04K47J09m95q9K05J35
$$ -288 -146 260 135 -231 -270 -132 331 273 -110 -330 -270 377 200 -263 -310 -6 241 350 -145 -234 -29 106
7505A06J71k90l15K08K53J36k51l37k6N85J07k24m57N1M52J46j33m52M1M20J25
$$ 106 277 -13 -328 -120 133 269 18 -319 -345 240 347 123 -334 -283 169 315 182 -270 -229 191 316
7526C16j75m05K0K94K31o6l40j25L37J64j68j81l4J66K34j64k77j81K13M27P0
$$ 316 141 -264 -244 50 281 215 -125 -250 87 251 83 -98 -132 34 268 104 -173 -354 -141 286 356
7547C56n07j77L97J95K6l11k88K26L15J9l17j97J38M23j27l18j67J15L73L1k39
$$ 356 -151 -328 69 264 290 -21 -309 -83 232 251 -66 -263 -125 298 171 -147 -314 -199 174 205 -34
7568c4k71M8L55K37j90k76k22M00K89k99m56R4L88K93k30k70j15K62K59j95k89
$$ -34 -305 -257 98 335 145 -131 -353 47 336 37 -419 -325 63 356 126 -144 -259 3 262 67 -222
7589b22mL00K79j94m69PK67L22j48j94k88J77M61n4k83k20J15L16K20l89l40K91
$$ -222 -226 74 353 159 -310 -303 -36 286 138 -56 -344 -167 294 240 -43 -263 -148 168 388 -1 -341 -50
7611e0L76l2m36l14L94K58J60l13k42MM09J9j91j50o4K21J51o0k70j69L53J47
$$ -50 326 294 -142 -456 -62 196 356 43 -199 -195 214 233 42 -108 -172 49 200 140 -130 -299 54 201
7633B01o4l24q0K74L42j81m77n6L45L61k65k88j03L70K19j09l24j93L26K29j2
$$ 201 137 -187 -267 7 349 168 -309 -365 -20 341 76 -212 -315 55 274 165 -159 -352 -26 203 191
7654A91k50j21P3L26nk95j90K49K63m6j98l79L02L44R2m23l50K76M10j08k97k09
$$ 191 -59 -180 -107 219 214 -81 -271 -22 241 195 -3 -382 -80 264 356 -67 -417 -141 269 161 -136 -345
7676c45J26M38k5m30j23qN24J76k58k93M6L15R0n9m76J00K25M48l25l34j19L74
$$ -345 -219 219 194 -236 -359 -367 157 333 75 -218 -172 143 233 174 -302 -202 23 471 146 -188 -307 67
7698F7K71k12m91P1L53K96k31m38j07N08K32k09k82q1K92K02n9n63J40L02K3J42
$$ 67 338 126 -365 -294 59 355 124 -314 -421 87 319 110 -172 -253 39 241 182 -381 -241 61 84 226
7720B26l15k71L59K79R4m55k51J38N15j3m60j83K74L28J47n48k02M7M33J42l70
$$ 226 -89 -360 -1 278 372 -83 -334 -196 319 306 -154 -337 -63 265 412 -136 -338 -291 142 284 -86
7741h6k71K21K62R2j18k81J6K65N8k02k03o5L05L29j31m03j81L43K72l8m37n8
$$ -86 -357 -136 126 218 100 -181 -165 100 158 -44 -247 -312 -7 322 191 -212 -393 -50 222 184 -253 -311
7763c11M38N1P8l73j74M57L0o1m28J15K47K47r6l40n2JK70Q0j90k70J11K63K03
$$ -311 127 178 256 -117 -291 166 196 135 -293 -178 69 316 220 -120 -172 -171 99 179 -11 -281 -170 93 296
7786B96l02k81L1L38K77m07k89J66L35R2j40m12J29K88J28l10j58m5L21J35l5
$$ 296 -6 -287 -256 82 359 -48 -337 -171 164 256 116 -296 -167 121 249 -61 -219 -264 57 192 157
7807A57k44j24K06J50P5k79j92K41J60%j49l96L84K01m6l37m8K31L04j76k12j40
$$ 157 -87 -211 -5 145 220 -59 -251 -10 150 150 1 -395 -11 190 144 -193 -241 -10 294 118 -94 -234
7829b34K52L90l01k28j29L22J19n3q9k23Q6K78Q6l24j40M7N0L48j98l43nM71J71
$$ -234 18 408 107 -121 -250 72 191 138 49 -174 -88 190 276 -48 -188 -141 -91 257 59 -284 -289 182 353
7852C53m69j87J55K24L38l95l31Q8M84j23j03k63J27K88k0j55k00J15N4J21K5
$$ 353 -116 -303 -148 76 414 19 -312 -224 260 137 34 -229 -102 186 166 11 -189 -74 -20 101 126
7873A26j54k90J83M12j34k48k55K85L56k90r7l38M32K88j27l12j38K96K55k3m77
$$ 126 -28 -318 -135 277 143 -105 -360 -75 281 -9 -106 -444 -12 276 149 -163 -301 -5 250 227 -250
7894b50M7J13L70k90n1j72R7L36J7k21j27j26M61J9k18j21n7L01K80l97k92Q3
$$ -250 -203 -90 280 -10 -61 -233 -136 200 217 -4 -131 -257 204 223 5 -116 -173 128 408 11 -281 -198
7916a98K69K31l31k48R5L72Or8l05O2L53N8k10l77J99K1L53j11k44j0K74J32j51
$$ -198 71 302 -29 -277 -182 190 196 98 -207 -145 208 266 56 -321 -122 -101 252 141 -103 -113 161 293 142
7939A42j52k70K82K73k5m30j33K39L12j8m44j63L42K96j68k31j06K33K20o8k67
$$ 142 -10 -280 2 275 250 -180 -313 -74 238 220 -224 -387 -45 251 83 -148 -254 -21 199 131 -136
7960a36J1Q3J11K58k31k12k4L42J09k77k39k2K51K13j75l24N1L54K17l59l57R8
$$ -136 -125 -42 69 327 96 -116 -140 202 311 34 -205 -227 24 237 62 -262 -211 143 360 1 -356 -258
7982b58L36K45k40j88j8J72K19k10k20N1J72J11o8j73k08L56J85ml53j82L04J98
$$ -258 78 323 83 -105 -123 49 268 58 -162 -111 61 172 104 -69 -277 79 264 260 -93 -275 29 227
8004B27J33m90j55K72K93j23l92J36J47N2m6k52K6J89K90j78k58K4p6L44N7j22
$$ 227 360 -130 -285 -13 280 157 -235 -99 48 100 54 -198 -172 17 307 129 -129 -105 -181 163 220 98
8026I8j99j31L53K03l69k57M7K93K60k28m59K18K35K10k33k58O4L64M6j70k12
$$ 98 -101 -232 121 324 -45 -302 -255 38 298 70 -389 -171 64 274 41 -217 -153 211 257 87 -125
8047a25r0J91K98k08j44JO0L05j9l58M2Q7J18M7l01k36Q0L85J3k28k69K94L80
$$ -125 -215 -24 274 66 -78 -77 -17 288 269 -89 -47 40 158 205 -96 -332 -252 133 146 -82 -351 -57 323
8070C23j12l00j31K20K97j42l27j29J91K78J90m09j97O7L67J2j12l67J19K51K8
$$ 323 211 -89 -220 0 297 155 -172 -301 -110 168 358 -51 -248 -181 186 198 86 -281 -162 89 117
8091A17j21l03J10K65K73j73m28Q9J70K90k36j82k0J52J76n2k55n2K16J40M0m44
$$ 117 -4 -307 -197 68 341 168 -260 -171 -1 289 53 -129 -149 3 179 127 -128 -180 36 176 216 -228
8113b28M2J99J60O6m36J05Q9K55j4m09j34K59K02m1j70l27K61K92N6m49k0R6L05
$$ -228 -186 13 173 239 -197 -92 -3 252 238 -171 -305 -46 156 115 -55 -382 -121 171 227 -222 -242 -146 159
8136A59k2k98j73K14K77M2k72j67J09K65ORl44L9J96J20j67k06O3K17O5j25j46
$$ 159 137 -161 -334 -120 157 199 -73 -240 -131 134 140 149 -195 -156 40 160 -7 -213 -150 67 132 7 -139
8159a39j33L56K92k61k74N6J37K03ol85q2K44K22j04k01j22K22J86l0j65k46P9
$$ -139 -272 84 376 115 -159 -103 34 237 231 -154 -236 8 230 126 -75 -197 25 211 181 16 -230 -151
8181a51L26M7k06l99J67M52m2k51l28J78
$$ -151 175 222 16 -383 -216 236 194 -57 -385 -207
8191b07
$$ Imaginary data points
##PAGE= N=2
##DATA TABLE= (X++(I..I)), XYDATA
0@%%%%%%%%%%L2l2L2o4O4o4R6j28J60j92K24k88L20l52M17n13O08o81P78q98J026
$$ 0 0 0 0 0 0 0 0 0 0 0 32 0 32 -32 32 -32 64 -64 96 -96 128 -160 160 -192 225 -288 320 -361 417 -481 545
31E45j184J353j515J704j928K178k434K716l038L381l749M159m608N095n630O213
$$ 545 -639 714 -801 903 -1025 1153 -1281 1435 -1603 1778 -1971 2188 -2420 2675 -2955 3258
47C258o856P559q316R156j0093J1126j2279J3577j5032J6686j8594K0813k3425
$$ 3258 -3598 3961 -4355 4801 -5292 5834 -6445 7132 -7900 8786 -9808 11005 -12420
60a2420K6556l0409L5276m1625N0315o2983Q3208j20616K12255q34261j230082
$$ -12420 14136 -16273 19003 -22622 27693 -35290 47918 -72698 139557 -694704 -1924786
71a924786J946692J124245j311062j434356J235215J866329m38212j908985m2429
$$ -1924786 21906 1146151 -164911 -1599267 -364052 1502277 1064065 -844920 -887349
80h87349J662916L36255j741962q41439J414841J236088j003087j273187Q29525
$$ -887349 775567 1111822 -630140 -1471579 -56738 1179350 176263 -1096924 -267399
89b67399J617999l95475j745405j73374J595606M57428j583937r68389J340632
$$ -267399 1350600 955125 -790280 -963654 631952 1089380 -494557 -1462946 -122314
98a22314J401777q49920j556443M80538J711270J8134j713974n55933J446813
$$ -122314 1279463 429543 -1126900 -646362 1064908 1083042 -630932 -1186865 259948
107B59948Q90472j193884j185726Q58579J404753m39037j441559Q6354J430864
$$ 259948 1150420 -43464 -1229190 -370611 1034142 595105 -846454 -760100 670764
116F70764K55570j350974n88829J189430Q79643r60588j120426O75370J297097
$$ 670764 926334 -424640 -1013469 175961 1055604 95016 -1025410 -350040 947057
125I47057l49046j418864m8637J409856M49317j263322p73381J068359J092306
$$ 947057 598011 -820853 -869490 540366 989683 -273639 -1047020 21339 1113645
134A113645p33301j287125L30426J310005l175j310662l66602J180562O90326
$$ 1113645 380344 -906781 -576355 733650 730475 -580187 -946789 233773 924099
143I24099r23862q52692P28536J031666m62864j153478J19729J103839R9061j108528
$$ 924099 237 -852455 -123919 907747 444883 -708595 -588866 514973 614034 -494494
153d94494l91268J025460P07251p73214q49547N89604J029508l07523j135451
$$ -494494 -885762 139698 846949 73735 -775812 -186208 843300 535777 -599674
162e99674o4444J039941L08698r50778n62892P91956Q05536m97568q68292K75680
$$ -599674 -664118 375823 684521 -266257 -829149 -37193 768343 270775 -597517 -321837
172c21837R09464n9900r36023k19670Q15041L86002p10210n36798O03295P25124
$$ -321837 587627 527727 -408296 -627966 187075 573077 -137133 -673931 -70636 654488
182F54488l78294p93461J85329Q40206J8062q69911k91008P58111M81225o21169
$$ 654488 276194 -517267 -331938 508268 526330 -343581 -634589 123522 604747 -16422
192a6422o41470M44785P73795j89752p80295j9576P48218K13908o73942l98342
$$ -16422 -657892 -213107 560688 370936 -409359 -428935 319283 533191 -140751 -539093
202e39093N22632M91577l92764n63198K59973O25567q5184o07818l9032O02198
$$ -539093 -16461 475116 82352 -480846 -220873 404694 319510 -288308 -327340 274858
212B74858J79296n78676l54960M62377M56647l57974n60243K14297O41745k367
$$ 274858 454154 -124522 -479482 -17105 439542 81568 -478675 -264378 377367 375000
222C75000o08711j58407N49545L03902m58250m44706K87310M85328j43593m86679
$$ 375000 -233711 -392118 157427 461329 3079 -441627 -154317 331011 187418 -299261
232b99261K6032M80397J08030m10779j84968L45436K37484k96551l04199K19490
$$ -299261 -273229 207168 315198 -95581 -280549 64887 302371 5820 -298379 -78889
242g8889L46983j41620l79348O1120M12333M9841m08650j67222L62661K69012
$$ -78889 268094 126474 -252874 -191754 220579 270420 -138230 -305452 57209 326221
252C26221k87832l56084J73122L98803m6424l97085p5597L52836J74870k75079
$$ 326221 38389 -317695 -144573 254230 207806 -189279 -264876 87960 262830 -12249
262a2249k29348J99345K63600j16032k61608N0839K41360j5938k41309l3172K27587
$$ -12249 -241597 -42252 221348 105316 -156292 -105453 135907 119969 -121340 -154512 73075
273G3075P4486k12748j10660K10972J78177j70134k31454J06454K58622m3325
$$ 73075 147561 -65187 -175847 35125 213302 43168 -188286 -81832 176790 133465
283A33465k83595n2079K59644J35613j96432j78202J40030K14713o2856k13469
$$ 133465 -150130 -202209 57435 193048 -3384 -181586 -41556 173157 110301 -103168
293a03168o566J76267L3770j54723o0661J26009P4172r7286o8002R9810Q8499
$$ -103168 -109734 66533 100303 -54420 -115081 10928 85100 -12186 -80188 19622 108121
304A08121q9879j13467O7964J30738n0717j61994L991J69699M9642j51170q8780
$$ 108121 18242 -95225 -27261 103477 52760 -109234 -105243 64456 114098 -37072 -125852
315a25852J26108J28369p8596j44615K6023J34227Q376j19177l4708R7610M7857
$$ -125852 256 128625 50029 -94586 -68563 65664 74040 -45137 -79845 17765 65622
326F5622p5029m3372P0804M6177o9991n5743O7564O8515o7945r7484M7284J21009
$$ 65622 -9407 -52779 18025 64202 -5789 -61532 6032 74547 6602 -90882 -43598 77411
338G7411j5388j33189k1803J35244O7053j12558r7340Q0342J14186m5735j19575
$$ 77411 62023 -71166 -92969 42275 109328 -3230 -100570 -20228 93958 48223 -71352
349g1352R879J08532J2202r6679k5322R0509L7097q5422m5695Q7588O2985q8324
$$ -71352 -61473 47059 59261 -37418 -62740 27769 64866 -20556 -66251 21337 84322 -4002
361d002r1602P3223J18117m7385j42141P599J54722M3806j43997q9191J18061
$$ -4002 -95604 -22381 95736 48351 -93790 -86191 68531 112337 -31660 -120851 -2790
372b790J24201q0517j45302L4905J44638K807j33488l1172J20325N4416j03939
$$ -2790 121411 40894 -104408 -69503 75135 77942 -55546 -86718 33607 88023 -15916
383a5916o8662R5307Q6773q7240j11969P0262J36423m6533j62496N595J77200
$$ -15916 -84578 10729 97502 10262 -101707 -31445 104978 58445 -104051 -98456 78744
394G8744M8567j71391j04162J45164J54313r8238j87570L8935J96458K0193j83223
$$ 78744 127311 -44080 -148242 -3078 151235 52997 -134573 -95638 100820 121013 -62210
405f2210o9083J56431J05046j20312j24848Q6231J34969n8708j43754L2710J53204
$$ -62210 -131293 25138 130184 9872 -114976 -28745 106224 47516 -96238 -63528 89676
416H9676o852j64795k7832J71898P1691j67723j23997J42887J74347r5183k10169
$$ 89676 82824 -81971 -109803 62095 133786 -33937 -157934 -15047 159300 64117 -146052
427a46052L3045K27656M2033k14956j10771J75854J59678j24495j90544O3115
$$ -146052 -113007 114649 156682 -58274 -169045 6809 166487 41992 -148552 -85437
437h5437J96014p272j81355l2992J65118O6389j44904r3825J24788J14744j10340
$$ -85437 110577 103305 -78050 -111042 54076 120465 -24439 -118264 6524 121268 10928
448A0928j44321Q6657J76154m7548j98500j143K12296O4862k04517j35556J64666
$$ 10928 -133393 -46736 129418 81870 -116630 -117773 94523 159385 -45132 -180688 -16022
459a6022J89560j07680k25555L8138K38197M0051k14898r8665J76318J40379j31320
$$ -16022 173538 65858 -159697 -121559 116638 156689 -58209 -156874 19444 159823 28503
470B8503j68052P8319J72496l8677j73348N634J75036L0090j71649o3652J67948
$$ 28503 -139549 -61230 111266 72589 -100759 -95125 79911 110001 -61648 -125300 42648
481D2648J05120j53976j52957J20404J94891o9651k25346K961K33931P2648k12885
$$ 42648 147768 -6208 -159165 -38761 156130 86479 -138867 -135906 98025 170673 -42212
492d2212j38642J69468J88985j08071k15622L9289K12729J8828j96679o9249J67832
$$ -42212 -180854 -11386 177599 69528 -146094 -106805 105924 124752 -71927 -141176 26656
503B6656J06034j33245j27077J06655J48799p6149j66547M1507J78837m647j90349
$$ 26656 132690 -555 -127632 -20977 127822 51673 -114874 -73367 105470 100823 -89526
514h9526m5266J87782J02388j63141j53044J22953J95280o6108k19666l470K14992
$$ -89526 -134792 52990 155378 -7763 -160807 -37854 157426 91318 -128348 -131818 83174
525H3174O7270j89421j18997J49723J56964r7365j74122M7333J74684o071j71750
$$ 83174 150444 -38977 -157974 -8251 148713 51348 -122774 -75441 99243 93172 -78578
536g8578l2548J60744O5967j46573r6005J30790J29641j04051j60651O6702J86426
$$ -78578 -111126 49618 115585 -30988 -126993 3797 133438 29387 -131264 -64562 121864
547A21864j5310j97294m2522J89975J01230j62824j53578J12446J82739n7082
$$ 121864 106554 -90740 -133262 56713 157943 -4881 -158459 -46013 136726 79644
557G9644j94089j28J87213N4609j59195r0551J28375J15780r8351j35505O4204
$$ 79644 -114445 -114573 72640 127249 -31946 -122497 5878 121658 23307 -112198 -47994
568d7994J44227l5584j51464O426J60395L4120j55195p5179J40118J15708j14722
$$ -47994 96233 60649 -90815 -84389 76006 110126 -45069 -120248 19870 135578 20856
579B0856j57805O6470J79725j1434j81905m1733J69701R5266j32493j29656Q6976
$$ 20856 -136949 -70479 109246 97812 -84093 -125826 43875 139141 6648 -123008 -36032
590c6032J44297m5314j50153K324J40757L1083j24965n1965J15035P6054j00211
$$ -36032 108265 62951 -87202 -84878 55879 86962 -38003 -89968 25067 101121 910
601I10r9002P9509J16580n9588j40365K3974J56377K3870j51631o7933J38511
$$ 910 -98092 -18583 97997 38409 -101956 -77982 78395 102265 -49366 -117299 21212
612B1212J13528j05855j50531N3092J59712n452j55719l9968J37923Q0724j01745
$$ 21212 134740 28885 -121646 -68554 91158 85706 -70013 -109981 27942 108666 6921
623F921r9106P0712J07981m3825j12952J8206J10656J441j09629k0546J10249
$$ 6921 -92185 -21473 86508 42683 -70269 -52063 58593 60034 -49595 -70141 40108
634D0108M5892j06344p7124Q9744J05647o4440j30880K7660J46401K0532j40406
$$ 40108 86000 -20344 -97468 -7724 97923 33483 -97397 -69737 76664 97196 -43210
645d3210o5475J17024R9886q2598j22363L9791J27544K540j14913l1866R7520
$$ -43210 -108685 8339 108225 25627 -96736 -56945 70599 73139 -41774 -73640 23880
656B3880N1543p9617o5347N9712P0239m6874p5134L7437Q6998j9717r6674l260
$$ 23880 75423 -4194 -69541 -9829 60410 13536 -61598 -24161 62837 43120 -53554 -56814
668e6814J01679L0373j02743o5973Q7384R8267n6125j16997J9491J23237K1467
$$ -56814 44865 75238 -27505 -93478 -6094 92173 36048 -80949 -61458 61779 83246
679H3246j13683n9433Q7010Q2599n4994r1067K6165R0559j149q2077j5627P0935
$$ 83246 -30437 -89870 -2860 79739 24745 -66322 -40157 50402 49253 -32824 -48451 22484
691B2484K4126o4323l1864O1623M4811n5638o0056M4990P4996l0742r3473K475
$$ 22484 46610 -17713 -49577 12046 56857 1219 -58837 -13847 61149 30407 -63066 -60591
703f0591J00319L2425q9098n8699P3295Q4855m2926r8498M057R0062K1536p8288
$$ -60591 39728 72153 -16945 -75644 -2349 82506 39580 -58918 -54861 35201 56737 -21551
715b1551m3135O1160N8323l6769n6923K2689N3491j5834n6283M335N4809L356
$$ -21551 -64686 -3526 54797 18028 -38895 -16206 37285 21451 -34832 -30497 24312 27668
727B7668n6114j2080O3089L4057n7249n3765M3807O8140k7295q3144j611Q2358
$$ 27668 -28446 -40526 22563 56620 -629 -54394 -10587 57553 30258 -52886 -54497 27861
739B7861L1733o6937n0574M9060O5594k4096o9493j237N9182J3785n0382k2911
$$ 27861 59594 -7343 -57917 -8857 56737 32641 -36852 -38089 21093 34878 -15504 -38415
751c8415M0659K8253l0207k6990K8570L1569k6510m1441J8450M8854q973n8169
$$ -38415 2244 30497 290 -26700 1870 33439 6929 -34512 -16062 32792 23819 -34350
763c4350p445O2636L1479n2696m9045L6932O1205j5722o7290j1198N7937L0285
$$ -34350 -41795 20841 52320 -376 -49421 -12489 48716 32994 -34296 -45494 12443 42728
775D2728m2652l9113K8231M3708j2771l9608J566L0725j134k9618q92L1272O904
$$ 42728 76 -39037 -10806 32902 20131 -19477 -17911 12814 11680 -17938 -18830 12442 19346
788A9346l0796j0006L6259K3121l5903m0276K2825M8572q863n4675r990N3211
$$ 19346 -11450 -21456 14803 37924 2021 -38255 -15430 33142 24279 -30396 -40386 12825
800A2825L2355l7013m4241J7660M6427k166m4438j4103L4089K1944j9895j8768
$$ 12825 45180 8167 -36074 -18414 28013 25847 -18591 -32694 1395 23339 3444 -15324
812a5324J4994J6563j2173j5852J1010J4225j5092k1648J4436L3081m072l8336
$$ -15324 -330 16233 4060 -11792 -782 13443 -1649 -23297 -8861 24220 20148 -18188
824a8188q127M0526K3065l5821m0089J8818M6902M55m4322j7237L5831L0972k0474
$$ -18188 -26315 14211 37276 1455 -38634 -19816 27086 27541 -16781 -34018 1813 32785 12311
837A2311l4799M620K9309M369k1117p335J3592N820q844q38J0912j310j7093k625
$$ 12311 -22488 -17868 11441 15810 -5307 -12642 950 6770 -2074 -2912 8000 6690 -10403 -13028
851a3028K3264J1948k4247k4556J8435L5162o266m0752j1677L6040K7416k3223
$$ -13028 10236 22184 -2063 -26619 -8184 26978 20712 -20040 -31717 4323 31739 8516
863H516l6014P103L7709Q900l0106k0131J7307K1970n443j6806p53J0131K549
$$ 8516 -27498 -20395 17314 26214 -3892 -24023 -6716 15254 9811 -6995 -7748 2383 4932
876D932k846K094R40r679q509J1221J6858q132k5032n93L0858J5509k5941k8294
$$ 4932 2086 4180 5120 -4559 -13068 -1847 15011 6879 -18153 -18746 12112 27621 1680 -26614
890b6614J3353L4225J537l3772j7564K4782K8260r690k8343k642K2313J0687j2913
$$ -26614 -13261 20964 22501 -11271 -28835 -4053 24207 14517 -13826 -16468 5845 16532 3619
903C619j3157K481P778J838o82R51l205o656L083J3907L622j8433j4785J4251
$$ 3619 -9538 -7057 721 2559 1877 2828 -377 -7033 -3950 9957 13579 -4854 -19639 -5388
917e388K3834n356k8046p502K5860K0836j5403k7690K218K7683R864k1378j7993
$$ -5388 18446 13090 -14956 -22458 3402 24238 8835 -18855 -16637 11046 20910 -468 -18461
930a8461J0619J8979Jj3465n424O294N550m24j704j976m889k681P634J0070n907
$$ -18461 -7842 11137 11138 -2327 -7751 -1457 4093 3669 1965 -11 -4900 -7581 53 10123 4216
945D216j6695j68K0413J0774j7319k0014Q333K4602L732k2700j4721J5603K1357
$$ 4216 -12479 -12647 7766 18540 1221 -18793 -10460 14142 17874 -4826 -19547 -3944 17413
958A7413m864k1327n125J5197R699o847j0484k68O035L634L48j020l935m899K432
$$ 17413 12549 -8778 -13903 1294 10993 4146 -6338 -6606 -571 3063 3411 2391 -1544 -6443 -4011
973d011J0610L082j3158j1176J0551J8491j927k0665q313J6856J6932q610k1582
$$ -4011 6599 9681 -3477 -14653 -4102 14389 12462 -8203 -16516 340 17272 8662 -12920
986a2920k417J9566J1599j2117j4930L177J3665L985p860p116M11M603L441K62
$$ -12920 -15337 4229 15828 3711 -11219 -8042 5623 9608 1748 -5368 -4957 -354 3087 3349
1000C349k949n876j826P859R381m601j4963k022J6467J1406j1586j8301K537J9938
$$ 3349 400 -5476 -7302 557 9938 5337 -9626 -11648 4819 16225 4639 -13662 -11125 8813
1014H813P751j6260j6259P797J8858J713j5796q856Q740J1084n18q922n341K147
$$ 8813 16564 304 -15955 -8158 10700 12413 -3383 -12239 -3499 7585 7067 -1855 -7196 -5049
1028e049O087L669j011o000n024M276J1491K697j3079j1468Q657J7149p26j8840
$$ -5049 1038 4707 3696 -2304 -7328 -3052 8439 11136 -1943 -13411 -4754 12395 11669 -7171
1042g171r373J4186J7838m443k0238n664J6422J3320q962j6384r69J2593P966
$$ -7171 -16544 -2358 15480 11037 -9201 -14865 1557 14877 5915 -10469 -11438 1155 9121
1055I121n216q987j816O441O774L55o167p404M4R480P439o990j4088J91J6632
$$ 9121 3905 -5082 -6898 -457 6317 6672 505 -6899 -6855 2625 10064 3074 -11014 -10823 5809
1070E809R839j1999j6574L037J8882O886j5930j5976O853J8596K884j5327j0078
$$ 5809 15648 3649 -12925 -9888 8994 15880 -50 -16026 -9173 9423 12307 -3020 -13098
1083a3098P974J3257J030j0267p429L228Q496L672m117o996k421O218R675r8j2716
$$ -13098 -5124 8133 9163 -1104 -8533 -5305 3191 6863 2746 -4250 -6671 -453 9222 9124 -3592
1098c592q420R452J4211k601j7289p417J3987J5971n311j8587m031J6003J1774
$$ -3592 -12012 -2560 11651 9050 -8239 -15656 -1669 14302 8991 -9596 -13627 2376 14150
1111A4150r110j5005q2J2469P122n884r127r62P289N467j234o109n050J301P860
$$ 14150 5040 -9965 -10047 2422 9544 3660 -5467 -6429 860 6327 5093 -1016 -6066 -4765 3095
1126C095N354o331j0917P93J3461O553j0417j3688L132J5801N539j3684j2179
$$ 3095 8449 2118 -8799 -8006 5455 12008 1591 -12097 -8965 6836 12375 -1309 -13488
1139a3488P494J5772R93j3501p433P334R683p79q433m610L889O202J884k555m310
$$ -13488 -5994 9778 10771 -2730 -10163 -2829 6854 6075 -2358 -6968 -3079 3123 5007 2452 -1858
1154a858k357L614O894K04r680p242O893J1860q41j3245o393J0644J3420l986
$$ -1858 -4215 -601 6293 6497 -3183 -10425 -3532 8328 7487 -5758 -12151 -1507 11913 7927
1168G927j5592l874J3059R902p432j2072N22J0545N358n000o948k24M283L140
$$ 7927 -7665 -11539 1520 11422 3990 -8082 -7560 2985 8343 3343 -3605 -3829 454 3594
1182C594o08l161m628j321O128P234l259j0825j620J1793Q701q346j3800M13J4651
$$ 3594 2986 -175 -4803 -6124 4 7238 3979 -6846 -8466 3327 12028 3682 -10118 -9705 4946
1197D946O966j1344j2640M942J4596K833j0818p795M983Q919P87o638m868J742
$$ 4946 11912 568 -12072 -7130 7466 10299 -519 -8314 -3331 5588 6375 -263 -5131 -3389
1211c389M326K476o76m032m367K024Q296L657q855r856M883J3393K237j3548r795
$$ -3389 937 3413 2737 -1295 -5662 -3638 4658 8315 -540 -10396 -5513 7880 10117 -3431 -13226
1226a3226Q991J5465j145j5698o601J2260J1737n313j2986k346R419O826l246
$$ -13226 -4235 11230 10085 -5613 -12214 46 11783 6470 -6516 -8862 557 7383 4137
1239D137p557k061M583M557O00l367n667k099O315P787k891j1309k729J1998J0695
$$ 4137 -3420 -5481 -898 3659 4259 892 -4775 -6874 -559 7228 4337 -6972 -9701 2297 12992
1254A2992o834j5611j660J5688R377j1540j5400M065J6736M773j2456j0291M891
$$ 12992 6158 -9453 -11113 4575 13952 2412 -12988 -8923 7813 12586 130 -10161 -5270
1267e270J1036J456q684o044K861O636L166j690m700l992K503P942K210r616r120
$$ -5270 5766 7222 -1462 -7506 -4645 1991 5157 3467 -1233 -5225 -2722 5220 7430 -2186 -11306
1282a1306N595J3811K750j2791r965Q816J5414j418j7010q099J2286J3441m708
$$ -11306 -5711 8100 10850 -1941 -11906 -3090 12324 10906 -6104 -14203 -1917 11524 6816
1295F816j4109k747J1029Q866m577j0195k210N985N153q77m207l589K70O260N997
$$ 6816 -7293 -10040 989 9855 5278 -4917 -7127 -1142 4011 3134 -1073 -4662 -4392 1868 7865
1310G865l473j0100k512R809Q814n890j3459j251J4073R425r746j4423K391J4766
$$ 7865 4392 -5708 -8220 1589 10403 4513 -8946 -10197 3876 13301 3555 -10868 -8477 6289
1324F289M875j1396j0270M175J1461K651q490o575L395O980J737k981m139j566
$$ 6289 11164 -232 -10502 -6327 5134 7785 -705 -7280 -3885 3095 4832 1851 -2288 -3854
1338c854K746N561J390o645o614L266R899K541r656q710N836J2790N94j3170p341
$$ -3854 -1108 4453 5843 -802 -7416 -4150 5749 8290 -1366 -10076 -4240 8550 9144 -4026 -11367
1353a1367R049J1543k557j1631l913Q379Q175k922q516k591N434M904l22l895
$$ -11367 -2318 9225 6668 -4963 -8876 -497 7678 4756 -3760 -6351 -917 3987 3665 -230
1367b30l378L97N113M063k771p600k206P048P257l292j0451k344J0104Q233o091
$$ -230 -3608 -3211 1902 5965 3194 -4406 -6612 436 7693 4401 -6050 -8394 1710 9943 3852
1382C852j1792m65J0995N919o728r204J193R176M706n357p141J78N648L794j728
$$ 3852 -7940 -8405 2590 8509 1781 -7423 -6230 2946 7652 2295 -4846 -4668 980 4774 3046
1397C046n000l037L155O669J406o778o062K756Q514K137p783p715L902J0566K260
$$ 3046 -1954 -4991 -1836 4833 6239 -539 -6601 -3845 4669 6806 -977 -8692 -4790 5776 8036
1412H036r365p338M893R282J084p962n771M058Q456J536o679n783K077O313K710
$$ 8036 -1329 -8667 -3774 5508 6592 -1370 -7141 -3083 5373 6909 230 -5553 -3476 2837 5547
1427E547m470o441m39P336N754l734q289j629P335O104l966r395j721Q734P371
$$ 5547 1077 -5364 -5803 1533 7287 3553 -4736 -6365 970 7074 3108 -6287 -8008 726 8097
1442H097m248q979j083P747N573l782q284k002O519O835j799p305k859M944O677
$$ 8097 3849 -5130 -6213 1534 7107 3325 -4959 -6961 -442 6393 4594 -2711 -5570 -626 6051
1457F051l85p878n490M493Q743Q02q795n378N478R046P1r109o011N111Q911N7
$$ 6051 5666 -2212 -7702 -3209 5534 6336 -2459 -7837 -2359 6687 6758 -2351 -8362 -3251 5660 5717
1473E717q000m446M869P076Q54o159m977J585O471K928m952o500K38P324N049
$$ 5717 -2283 -6729 -1860 5216 6070 -89 -5066 -3481 2990 5918 966 -5534 -5296 2028 7077
1488G077m093q960j323R219O421n938j0100M72J0328N422o419r111J348R293L926
$$ 7077 2984 -5976 -7299 1920 8341 2403 -7697 -7225 3103 8525 2106 -7005 -5657 3636 7562
1503G562o569o650J452O550K770l178m689j395L411M775K00n435m694K948P310
$$ 7562 993 -5657 -4205 2345 5115 1937 -2752 -4147 -736 4039 4239 -1196 -5890 -2942 4368
1518D368K213p632p561M619J0671J082j0669o461P175J0146j563j0353m259P717
$$ 4368 6581 -1051 -8612 -3993 6678 7760 -2909 -9370 -2195 7951 6388 -3965 -8224 -507
1532e07P713l256p812j171N575L724j620l444j905N46K895K669j268n109k449
$$ -507 7206 3950 -3862 -5033 542 4266 2646 -798 -2703 -2157 738 3407 2139 -2970 -5419
1547e419M565O937j631r304l523Q898Q511n157j1125k47J1104N955p745r710K869
$$ -5419 -854 6083 4452 -4852 -8375 523 9034 3877 -7248 -7495 3609 9564 1819 -7891 -5022
1562e022J0083K002p902n324M093N617l42l389j817J98Q91K021J540k044m584
$$ -5022 5061 7063 -839 -6163 -2070 3547 3205 -184 -2001 -1803 -912 1109 2649 605 -3979
1577c979n87O662N141n497r365J958J1297L605j0463q886O496J1930l66j1778
$$ -3979 -4566 2096 7237 1740 -7625 -5667 5630 9235 -1228 -10114 -3618 8312 7946 -3832
1591c832n399Q918Q645m250r272n42O970L189l360k935J70J076M45J640J009k925
$$ -3832 -9231 -313 8332 4082 -5190 -5732 1238 4427 1067 -1868 -1698 -622 -177 1463 2472 -453
1607d53m740K115Q079J674r158o502P628J0731l033j2982k971J1762Q577p255
$$ -453 -5193 -3078 5001 6675 -2483 -8985 -1357 9374 6341 -6641 -9612 2150 10727 3472
1621C472j1816J506J1825L651r117o832M304O838p13m694j213J752J039L62J620
$$ 3472 -8344 -6838 4987 8638 -479 -7311 -3007 3831 3118 -1576 -2789 -1037 2 364 1984
1636A984k2l944k667M996O704l396j0315p98J1569O035r371j0827M295J3194J905
$$ 1984 1962 -1982 -4649 347 7051 3655 -6660 -7458 4111 10146 775 -10052 -5757 7437 9342
1651I342j2464p511Q349J0945l310j0817j685Q154M516m042m390O72K670L81Q2
$$ 9342 -3122 -10633 -2284 8661 5351 -5466 -7151 1003 5519 1477 -2913 -2241 429 810 892
1666H92R13j376l984L45O757K869p339p428N700J1168r26j2617n405J0627J0319
$$ 892 1805 429 -3555 -3210 3547 6416 -923 -8351 -2651 8517 7591 -5026 -10431 196 10515
1681A0515n868j3248k44J2694N741q997q580L975Q507M21o099k718K671K442k17
$$ 10515 4647 -8601 -8845 3849 9590 593 -7987 -4012 4495 4916 -1183 -3901 -1230 1212 995
1696I95j1K14k212k502L464N797j853r054k004R364O836p043j1138K169J2585
$$ 995 984 1198 -1014 -3516 -52 5745 3892 -5162 -7166 2198 9034 1991 -9147 -6978 5607
1711E607M205j1153r186O787J1732j156j1018l597P735O130l130n766j33L603
$$ 5607 9812 -1341 -10527 -3740 7992 6836 -4182 -7779 -44 6086 2956 -2810 -2943 660
1725F60J281q81k50o32k635j48M948L060n700o620L565R607J020j0499o368P958
$$ 660 1941 1060 810 178 -2457 -2605 2343 5403 -297 -6917 -3352 6255 7275 -3224 -9592 -1634
1741a634J0405l257j2126k202J0832O944o656q944J836Q116K342n364m200K039
$$ -1634 8771 5514 -6612 -8814 2018 8962 2306 -6638 -4802 3314 5656 292 -3908 -1869
1755a869L478M86j239m04j460j539K312M505j332o752k498P122O564m817r293
$$ -1869 1609 2095 856 452 -1008 -2547 -235 4270 2938 -3814 -6312 810 7374 2557 -6736
1770f736J60J0397M975q348q935L934J0452J151q935n123N407O931j108n945j939
$$ -6736 -6576 3821 8796 448 -8487 -4553 5899 7050 -1885 -7008 -1601 5330 4222 -1723 -3662
1785c662L070K807l52j644j415j237Q17L685J875m333n181K647P547J210p866
$$ -3662 -592 2215 1863 219 -1196 -2433 -1616 2069 3944 -389 -5570 -2923 4624 5834 -2032
1800b032n735N650R063j074r894l501Q146P057m014q381o80O554L804l469m881
$$ -2032 -7767 -2117 6946 5872 -4022 -7523 623 7680 3666 -4715 -5395 1159 4963 1494 -3387
1815c387J05L752K166q49k012j717k63K673K962j803n402j172N742M959l188p448
$$ -3387 -3282 470 2636 1787 -225 -1942 -2205 468 3430 1627 -3775 -4947 795 5754 2566 -4882
1831d882m24P827M849n862p907J834Q176K471o298n180K791O170J038m698l764
$$ -4882 -5306 2521 7370 1508 -6399 -4565 3611 6082 -216 -5396 -2605 3565 4603 -95 -3859
1846c859J446L729J202j981k522j037K132L923L65m464l395K898N507L56o068
$$ -3859 -2413 1316 2518 537 -1985 -3022 -890 3033 3398 -1066 -4461 -1563 3944 4300 -1768
1861a768l951M186O703l71p075l315N154N923j836o446k254M404M459j116m712
$$ -1768 -5719 -1533 5170 4799 -2276 -5591 -437 5486 3650 -2796 -5050 -646 3813 2697 -2015
1876b015j976L134L642R6l383k681P73M117K355l128m710M59N116L067l561n234
$$ -2015 -3991 -857 2785 2881 -502 -3183 -2410 1707 4062 934 -3776 -3317 1799 4866 1305 -3929
1892c929R1N890L202m124n643R74N579K491l644m701L28M722K930k740m620n44
$$ -3929 -3838 2052 5254 1130 -4513 -3539 2040 4531 887 -3814 -3486 1236 4166 1426 -3194 -3738
1908c738M158L252j529m584j607L544M586q07n390k292M201M589r62n480k454
$$ -3738 420 3672 2143 -2441 -4048 -504 4082 3275 -2115 -4407 -206 4383 3421 -2059 -4513
1923d513L605M896o54n049k316L112M111l56l972k870J964M195J449l786l747
$$ -4513 -908 3988 3334 -1715 -4031 -919 3192 2836 -1136 -4006 -2042 2153 3602 -184 -3931
1938c931J417N049J933l862m870R76N899K452m771m957J968N573J743m628m036
$$ -3931 -2514 2535 4468 606 -4264 -3288 2611 5063 292 -4665 -2697 2876 4619 -9 -4045
1953d045J444M670J547l684l370Q62L670J674j678l030j168K946L610n92m701
$$ -4045 -2601 2069 3616 -68 -3438 -2576 1094 2768 1090 -1940 -3108 -162 3448 2856 -1845
1968a845k412L468N050o59n828k929M615N732j783o575j748N443M311k647n472
$$ -1845 -4257 -789 4261 3602 -2226 -5155 -540 5192 3409 -3166 -4914 529 4840 2193 -3279
1983c279o89M390L093j835l746p00K585K008J26k173k387L11L418K490k428m544
$$ -3279 -3968 422 3515 1680 -2066 -2766 -181 1827 1953 -220 -2607 -2296 1122 3612 1184 -3360
1999c360j13N429L523l941o408O99P052K914n802n817K907O945N16n740l623L103
$$ -3360 -3473 1956 5479 1538 -4870 -4171 2881 5795 -7 -5824 -2917 4028 4544 -1196 -4819 -1716
2015a716M703m24l640j710J761K197M31m93j438j825R68L351J251l839l985K344
$$ -1716 2987 2563 -1077 -2787 -1026 1171 1602 1109 -329 -2154 -1186 2165 3416 -423 -4408 -2064
2031b064O116Q76o322m634M673O988j658p911j965O513M738l410n878L40N201
$$ -2064 4052 4928 -1394 -6028 -1355 5633 3975 -3936 -5901 612 5350 1940 -3938 -3598 1603
2046A603J957l035k914P63K305J90j22j09j292j331J600L474l58n109k117M615
$$ 1603 3560 525 -2389 -1626 679 869 747 638 -654 -1985 -385 3089 2731 -2378 -4495 120
2062A20N171k767p146n42P583L957o012o535K779P380Q10o201l508L898M717j136
$$ 120 5291 2524 -4622 -5164 2419 6376 364 -6171 -3392 3988 4798 -1403 -4911 -1013 3704 2568
2078B568m260n71K359R92o19J49Oj844o59K831K678k753n025O98O460K387o321
$$ 2568 -1692 -2263 96 1088 469 618 624 -1220 -1879 952 3630 877 -4148 -3450 3010 5397 -924
2095i24n582M187P913o81q340l039O680N639l322o676K19N684K321l628k963J438
$$ -924 -6506 -2319 5594 4913 -3427 -6466 214 5853 2531 -4145 -3926 1758 4079 451 -2512 -1074
2111a074K171m86m14N51p57k218P73M027Q52n032l491M248O213j669q085j759
$$ -1074 1097 611 197 748 -9 -2227 -1454 2573 3425 -1607 -5098 -850 5363 3694 -4391 -6150
2127f150P776N428n748p613K037Q240J783o717m243L879N244j128m403o43K560
$$ -6150 1626 7054 1306 -6307 -4270 3970 5753 -964 -5207 -1328 3916 2788 -1615 -2258 302
2142C02Q97j113J82N03j842j302K558L395k062n499j69O554L477o017o657L587
$$ 302 1199 86 268 771 -1071 -2373 185 3580 1518 -3981 -4150 2404 5881 -136 -6793 -3206
2158c206Q609L04q517l870O488O494l141p199l25O243K624m091l399J726K618
$$ -3206 5403 5707 -2810 -6680 -192 6302 3161 -4038 -4363 1880 4504 413 -2986 -1260 1358
2173A358n95j051N51j09k019J84L565J352m230l986L582O488j110p783k371P678
$$ 1358 763 -288 263 154 -1865 -1681 1884 3236 -994 -4980 -1398 5090 3980 -3803 -6174 1504
2189A504N706n181p968J455Q408K020o748m774M014N765j339m943o11L138J005
$$ 1504 7210 2029 -5939 -4484 3924 5944 -804 -5578 -1564 4201 2862 -2081 -2692 446 1451
2204A451j459l54P45r48j446J671L351j229m875r54N950L765n196o490K704Q308
$$ 1451 -8 -362 383 -565 -2011 -340 3011 1782 -3093 -4047 1903 5668 472 -6018 -3314 4994
2220D994O37p920m121N805O617k917p167l10N975K715m190l381K027K869r68j443
$$ 4994 5631 -2289 -6410 -605 6012 3095 -4072 -4382 1593 4308 118 -3263 -1236 1633 665 -778
2236g78P59N30j742o47L078K021l197m172K310O193O5p149l100O469N664l879
$$ -778 -19 511 -1231 -1878 1200 3221 24 -4148 -1838 4355 4420 -2729 -5829 640 6304 2425
2252B425p462P26P397K352n816m735L363N301j144m440m52L183R03j952j94J456
$$ 2425 -5037 -4311 3086 5438 -378 -5113 -1750 3551 2407 -2033 -2485 698 1601 -351 -545 911
2268I11o83k024Q50L560k11m764j739N116M315l925o486J453P455J580o808m506
$$ 911 228 -1796 -946 2614 2403 -2361 -4100 1016 5331 1406 -5080 -3627 3828 5408 -1400 -5906
2284e906M659O181j786o413r85N231K812l419l134J725K410r19j083R26P18j870
$$ -5906 -1247 4934 3148 -3265 -4250 981 3793 374 -2760 -1035 1375 456 -627 299 1017 -853
2300h53r34K706K431k751m451J525O117Q80o791l769N416O086k655p403l54O840
$$ -853 -1787 919 3350 599 -3852 -2327 3790 4670 -2121 -5890 -474 5612 2957 -4446 -4800 2040
2316B040L046m830m821K435N018k30m054j096K611J081j284o8J005o75j919R72
$$ 2040 5086 256 -4565 -2130 2888 2658 -1396 -2492 119 1200 -84 -152 853 178 -1741 -769
2332g69L274Q8m468k265M615M481l244o419P52P019K302o124m964L852O279p54
$$ -769 2505 2593 -1875 -4140 475 4956 1712 -4707 -3955 3064 5366 -758 -5722 -1870 4409 3655
2348C655o293j600M773L130k559l550J106K425j92j167M83L26j509o27K382K084
$$ 3655 -2638 -4238 535 3665 1106 -2444 -1338 1087 895 -272 211 537 -972 -1599 783 2867
2364B867k364m082J315N316Q46n831l524M868N626k224o758o06O104L441m305
$$ 2867 503 -3579 -2264 3052 3898 -1933 -5457 -589 5037 2813 -3945 -4551 1553 4994 689
2379F89m981K064M952K51l882j474K434J427r69p98N53j64j288O33K359M0l555
$$ 689 -4292 -2228 2724 2975 -907 -2381 53 1480 511 -287 266 102 -1186 -553 1806 1846 -1709
2396a709j571L745L739k947n388P07O109K035n359m340L303N779o94n456j821
$$ -1709 -3280 465 4204 1257 -4131 -3424 2685 4720 -639 -4979 -1676 4103 3409 -2047 -3868
2411c868M256L281k452l485P34K503K92j429j73M05n85o83J658J519j869k903
$$ -3868 388 3669 1217 -2268 -1534 969 1261 -168 -341 64 -521 -1204 454 1973 104 -2799
2427b799R31M237R93m936k832L889M762j665n662q06N207L042l599m269J450M381
$$ -2799 -1868 2369 3362 -1574 -4406 -517 4245 2580 -3082 -3888 1319 4361 762 -3507 -2057 2324
2443B324K63l204j707K082J448p90o21J39P6p68J23J877K14k730j397K914L084
$$ 2324 2587 -617 -2324 -242 1206 416 -205 -66 10 -758 -635 1242 1456 -1274 -2671 243 3327
2460C327k011m289J16M712K088l936l828K100M790R4m565j922L297K709j588k769
$$ 3327 1316 -2973 -2857 1855 3943 7 -3821 -1721 3069 3163 -1402 -3324 -27 2682 1094 -1675
2476a675L08J801K52o25k43J74o01k96J412J212j502k555P04L659R06l685k731
$$ -1675 -1367 434 686 61 -182 -8 -609 -905 507 1719 217 -2338 -1634 2025 2931 -754 -3485
2493c485K803M102p66m713j214L587L210k306l993M38L375J159k172j626P74J257
$$ -3485 -682 3420 2654 -2059 -3273 314 3524 1218 -2775 -2337 1038 2197 25 -1601 -827 430
2509D30J33j77l04o57n57R55J677j65k672j140K799L005j954m209n6M327K088
$$ 430 563 386 82 -575 -1132 -177 1500 1335 -1337 -2477 322 3327 1373 -2836 -2892 1435 3523
2526C523l057l915J419M031J052l535k560K114K772l41k253q98Q18J482K87l10
$$ 3523 466 -3449 -2030 2001 3053 -482 -3042 -928 1844 1503 -750 -1648 -830 652 939 629
2542F29j220p28R19J616O05k079k180J332L339N10l816k225K776L588p05m241
$$ 629 -591 -1319 -400 1216 1821 -258 -2438 -1106 2233 2743 -1073 -3298 -522 3066 2361 -1880
2558a880j311L238K944j671l478l07K764J703j290j870k56J264J153R6j172j233
$$ -1880 -3191 47 2991 1320 -2158 -2465 299 2002 712 -1158 -1414 -150 1003 1099 -73 -1306
2574a306K03J708J416j145k641j41K846J963k249l432N66L773J448l124k869J328
$$ -1306 -1103 605 2021 876 -1765 -1906 940 2903 654 -2778 -2212 1561 3009 -115 -2984 -1656
2590a656L488O13k792k148J474K436L13j879j302N19J462J006o11j617q45J364
$$ -1656 1832 2445 -347 -2495 -1021 1415 1728 -151 -1453 -934 528 1534 923 -694 -1539 -175
2606a75J949j87k280j715J832L058o44l383j151K659K609j221l127n78K527K046
$$ -175 1774 1587 -693 -2408 -576 2482 1838 -1545 -2696 -37 2572 1351 -1776 -2354 173 2219
2622B219j279k337k95J945J100o02j130o86O50J183O72j139j670J42J947J392
$$ 2219 940 -1397 -1692 253 1353 751 -379 -1065 -415 768 1440 301 -1369 -1227 720 2112
2638B112j491k585L52K822J201k262k598J065K773N12k200j776J114K299K20j767
$$ 2112 621 -1964 -1612 1210 2411 149 -2449 -1384 1389 1901 -299 -2075 -961 1338 1558 -209
2654b09j036P09J028K99l03r04n39P17J273K40j598j380J031K191K38k515j639
$$ -209 -1245 -536 492 791 488 -416 -955 -238 1035 1275 -323 -1703 -672 1519 1757 -758 -2397
2671b397J936K482n43k895q80K368J840j004k228k31J784J105p92j016j69O00
$$ -2397 -461 2021 1478 -1417 -2297 71 1911 907 -1321 -1552 232 1337 545 -471 -640 -40
2687d0N96K22k16j226n11J186J582p31k214n99K305J924j400k819j14L158J438
$$ -40 556 778 562 -664 -1175 11 1593 862 -1352 -1951 354 2278 878 -1941 -2055 1103 2541
2704B541k380k527J028K752N42k092j459J049J586J1r56o16j4N36N53L61q38j357
$$ 2541 161 -2366 -1338 1414 1956 -136 -1595 -546 1040 1051 95 -521 -535 1 554 915 77 -1280
2722a280J93J977Q74j767k309J155K838O55k962k367K185L087n15l143j053K451
$$ -1280 -1087 890 1764 -3 -2312 -1157 1681 2336 -626 -2993 -808 2279 1764 -1379 -2432 19
2738A9K243j332k296m6J798Q60q58j014K4L35M26O55L1j374r94J241K071m88k716
$$ 19 2262 930 -1366 -1412 386 1246 388 -626 -602 -267 159 814 845 -529 -1523 -282 1789 1301 -1415
2757a415r66K593K419j557l405J06L575J601k790k774J319L191J76k656j347J635
$$ -1415 -2381 212 2631 1074 -2331 -2225 1350 2951 161 -2613 -1294 1897 2073 -583 -1930 -295
2773b95J637l28j412k75M80K83P6M89l76j503J86J809J058j791k301R98L176N25
$$ -295 1342 1014 -398 -673 -193 90 166 655 279 -1224 -1038 771 1829 38 -2263 -1265 1911 2436
2791B436l292k097K463L369j019l652o91L304J819j820k718L69K566K69j392q50
$$ 2436 -856 -2953 -490 2879 1860 -1792 -2483 821 2640 820 -1898 -1529 1037 1306 -86 -936
2807i36N08O23j59K77K05o84r63P12J895j92k293j209K358K367j378l284r0L654
$$ -936 -428 195 36 313 518 -166 -1129 -417 1478 1286 -1007 -2216 142 2509 1131 -2153 -2243 1411
2825A411J474k892k744J576L204j21k782j161J893J754r53j613L37J016l04l90
$$ 1411 2885 -7 -2751 -1175 2029 1908 -874 -2035 -142 1612 659 -954 -617 399 95 -295
2841b95O34J01r78n27J386J385j171k277J67K947R76k686k432J997L365p33l398
$$ -295 339 440 -538 -1065 321 1706 535 -1742 -1575 1372 2348 -338 -2770 -773 2592 1859 -1539
2858a539j035L040K046j938k590P16K250M36j782o73R68M11n81M8O62j07j267
$$ -1539 -2574 466 2512 574 -2016 -1300 950 1386 -396 -1069 -101 310 -271 -223 439 332 -935
2875i35M0J826P44k165j664J664K899o31l618o39L213K228k511k976Q85L154N55
$$ -935 -895 931 1675 -490 -2154 -490 2409 1778 -1840 -2479 734 2962 451 -2525 -1640 1514 2069
2892B069k658j625J929J928r44j642J21J241k17m80N83M28q93r93J217J680p16
$$ 2069 -589 -2214 -285 1643 699 -943 -822 419 202 -278 305 733 -160 -1153 64 1744 1028
2909A028k551m01K913J673k419l068J310L638K43l510j723K535K740j239k851
$$ 1028 -1523 -1924 989 2662 243 -2825 -1515 2123 2366 -1144 -2867 -332 2408 1169 -1682
2924a682q2K227J118j528j110P10R04n76n8N67L2j390lJ595R52j853k115J363
$$ -1682 -1764 463 1581 53 -1057 -347 557 -19 -77 490 522 -868 -871 724 1676 -177 -2292 -929
2942i29L180k93l441j452L126K805j966l443K28L424J190k504k310J562K265L0
$$ -929 2251 1958 -1483 -2935 191 2996 1030 -2413 -2185 1239 2429 -75 -2385 -823 1442 1472
2958A472k052l92J011N23l41j30K52o51n10Q10J431m56k261o20K598J896k100
$$ 1472 -580 -972 39 562 221 91 343 -308 -818 -8 1423 967 -1294 -1914 684 2580 480
2975D80l076P95L660P17l291k076K187K981o54l141o58K545J464j358j714M06
$$ 480 -2596 -1801 1859 2576 -715 -2791 -604 2377 1723 -1418 -2076 469 1933 575 -1139 -733
2991g33J320K2o36M1K0n48o8J026N65j146j622J017K377J6k796j286K466K511
$$ -733 587 609 -27 14 34 -514 -582 444 1009 -137 -1759 -742 1635 1651 -1145 -2431 35 2546
3009B546j326l098k78L217J528k215k459J024K541J37k030j020J287R33l35n80
$$ 2546 1220 -1878 -2156 1061 2589 374 -2085 -1061 1480 1617 -413 -1433 -146 787 452 -128
3025a28o7J7l23L35R50j24j422p13J613J642j233k379L38K602J171k459k073J416
$$ -128 -195 -178 -501 -166 784 660 -762 -1475 138 1780 547 -1832 -1494 1108 2279 -180 -2253 -837
3043h37K823k01k817r35J962J746j033j732Q4J396L52p27k88R9J6j97L13P51n56
$$ -837 1986 1785 -1032 -1967 -5 1741 708 -1024 -940 456 808 81 -207 -108 -92 -289 24 775 219
3062B19j254K30J762O44j981j485J442K228m51k599n34K036J727j242k152L9K002
$$ 219 -1035 -805 957 1601 -380 -1865 -423 1805 1354 -1245 -1779 257 1984 742 -1410 -1371 631
3079F31Q67j618j046O42J004N8o64j54K01k13J51O06Kp22q10R22J610p34j804
$$ 631 1498 -120 -1166 -524 480 538 -126 -280 -79 -292 -141 465 467 -255 -1065 -143 1467 733 -1071
3098a071l22K097J050j380k002M13K268O12j920j376J070J800k47j483o39Q59
$$ -1071 -1393 704 1754 374 -1628 -1215 1053 1665 -255 -1631 -561 1239 992 -491 -1130 -271
3114b71R95l08n40l16Q6K64L65K61n29p00J82J407L33j365j322Q88J830K02k075
$$ -271 724 416 -124 -440 -354 -90 275 536 7 -693 -511 896 1229 -136 -1458 -570 1260 1462 -613
3133f13j158J373J959n92k035n06J651J164p18j514l1J168O30m62q17k9K89N36
$$ -613 -1771 -398 1561 969 -1066 -1572 79 1243 525 -989 -1020 148 778 316 -501 -530 -241 295
3151B95K76k76r70j31J085Q70m99j542j89J533R49r20j738j02K033Q33j357j524
$$ 295 571 295 -675 -806 279 1149 650 -892 -1081 452 1401 481 -1257 -1359 674 1507 150 -1374
3169a374K89J884M58j364j041N17J283M04j064q18L52Q72L03k81p78l97O92R21
$$ -1374 -1085 799 1257 -107 -1148 -631 652 1056 -8 -826 -474 398 701 420 -358 -755 -63 858
3187H58k11j007q00Q22J237q9j330q89J121J409q2j724p32J427J195m27j381m65
$$ 858 647 -360 -1160 -338 899 810 -520 -1409 -288 1121 1039 -685 -1417 10 1205 778 -603 -1068
3205a068J037J069k56j281m81R33O81nq37o07M11R54L41r97o87K83R19M60o39
$$ -1068 -31 1038 782 -499 -980 -47 634 629 -208 -815 -404 550 891 -106 -793 -510 409 869 230
3224B30j218K67J122M56o86j005L7J403L76p43j148K15J127N59p91j030J92J087
$$ 230 -988 -721 401 857 171 -834 -797 606 982 239 -909 -694 433 992 201 -829 -637 450
3242D50L94o39q90j81J153O03o45q90j1O73Q01m33p87l23O76P51rr39m52O24Q60
$$ 450 844 205 -685 -866 287 890 245 -645 -656 17 818 385 -402 -725 -49 702 693 -246 -698 -74 786
3263G86m5q23p06M66R71L14j084p71N23J037K82j209o82N24J044K20r79q28P15
$$ 786 741 -82 -788 -322 649 963 -121 -892 -369 668 950 -259 -941 -417 627 847 -132 -960 -245
3282b45P86K00q14m33J13N90L61l66n81r4N29N69k0q93m33P41P92k63j106m46
$$ -245 541 741 -73 -506 -393 197 558 192 -389 -483 46 615 595 -298 -731 10 802 539 -567 -1013
3302a013R37J044m94j148k03Q58J008n43j255J76Q63L88k25q19j20M98M64%o20
$$ -1013 -76 968 474 -674 -877 -19 989 446 -809 -633 230 618 393 -426 -546 -48 416 416 -204
3321b04n8o8O67K88m15r94qJ142O44p76j271K37J295O12r79j245L95J350M05j086
$$ -204 -262 -330 337 625 210 -784 -792 350 994 218 -1053 -816 479 1091 112 -1133 -738 612 1017 -69
3341f9j010N26J274J06j046l64K36Q55J12n80m53L6L97N03L1q85m68M58J065R1
$$ -69 -1079 -553 721 827 -219 -583 -347 508 620 40 -413 -377 20 523 554 -331 -799 -341 724 815
3361H15j243q93J038J211r3j431o33J219J326n15j612j48J171Q77p23r00j10P49
$$ 815 -428 -1321 -283 928 835 -596 -1229 -10 1316 801 -811 -959 212 1089 366 -534 -644 105
3379A05N97m72n55j18K87L68J75l45o21M4P60P78p11j194J40J203P84j017j301
$$ 105 702 230 -325 -443 -156 212 387 42 -579 -535 225 1003 292 -902 -762 441 1225 208 -1093
3398a093K36J665M08j278j125O36J375R1j242o14P76O36R2q06k74K94L72K51r0
$$ -1093 -857 808 1216 -62 -1187 -551 824 915 -327 -941 -165 471 563 -243 -517 -223 149 400 310
3417C10m54n55N39O70K60r14q29O68J383k88j260o92J092J178m88j316l13J188
$$ 310 -144 -699 -160 510 770 -144 -973 -305 1078 790 -470 -1162 -70 1108 620 -696 -1009 179
3435A79Q05p49j071J92Q28M55l95o96J42L67Q8J2n8m37j27N17N55p3j081p3Q00
$$ 179 984 235 -836 -644 184 639 244 -452 -310 57 145 157 99 -338 -465 52 607 534 -547 -620 180
3456A80P99m92j268k1J298O40j122r70L86J308J16j065p32O88O91M5p13j69M34
$$ 180 979 487 -781 -802 496 1136 14 -956 -570 738 854 -211 -943 -255 436 481 -232 -401 33
3475C3R3L7j0k02l13J52M26M79n28q77K85J104J41r63q06N03J318j2j200o13P58
$$ 33 126 163 153 -49 -362 -210 216 695 167 -710 -425 679 820 -143 -949 -446 872 860 -340 -953 -195
3496a95R56l84j044Q1N99N83n05m27R4K37K67n6j8l18l31L43O58j11o43n67O91
$$ -195 761 377 -667 -586 13 596 91 -336 -242 -5 262 206 188 -130 -461 -118 540 429 -214 -781 -90
3517i0Q73o1j431l05J366P68p85j255K17J012N78p58p75J30Q66K47n89l73O2L27
$$ -90 783 722 -709 -1014 352 1120 335 -920 -703 309 887 129 -646 -516 350 597 8 -365 -303 24
3537B4K74j7l78k56K2N69K63l36p19M9R69L35q60q85L46J196K50j256o93O91J151
$$ 24 298 281 -97 -353 -331 238 501 165 -554 -505 464 799 -61 -946 -600 596 846 -410 -1103 -412 739
3558G39o9j194l98R70O07j52q51n7N53J21J64n09j99m6L04M94r8o49m23O48Q46
$$ 739 670 -524 -922 48 655 503 -348 -405 148 269 433 -76 -275 -321 -17 477 379 -270 -693 -45 801
3579H01k39j097m16J069Q81n67j274l6J189O24q24q58J97Q74L56o58m91J53N34
$$ 801 562 -535 -951 118 999 432 -842 -878 311 935 111 -747 -550 324 680 22 -469 -316 218
3598B18J32l07k58j47K69M19L2m51k78l1P92J99n89p75L45J012K51r22o78N63
$$ 218 350 43 -215 -362 -93 326 358 -93 -371 -402 390 589 0 -775 -430 582 833 -89 -767 -204
3618b04J022j77r41l19N42P30k56n52k20L95K86m6k96l07J13L46K18j27n51j41
$$ -204 818 641 -300 -619 -77 653 397 -155 -375 20 306 260 -36 -343 -230 116 334 207 -344 -485
3638d85M73O06l70p01j55O85O68l75q64J0P54L52m88p45J22Q09K96n32n79J57
$$ -485 -12 594 224 -477 -632 53 721 346 -518 -508 246 598 110 -635 -513 296 592 60 -519 -362
3658c62O05J02k40l31j43K22M79k34j69k94J54M40J76l50n00J01O26L01o60n00
$$ -362 243 345 105 -226 -369 -147 332 98 -71 -365 -211 229 405 55 -445 -344 282 583 -77 -577
3678e77L50O58P2p11k93L61N03O8n85l29L87L17O3k36m64K68K14J92j24l04j78
$$ -577 -227 431 503 -208 -501 -140 363 431 -154 -483 -96 221 284 48 -416 -148 66 258 134 -170 -348
3699c48K86M59j3p22l48P67N29k14q67k25P85N26l60p39n8O55L39k71n30O7K01
$$ -348 -62 397 384 -338 -686 81 610 396 -471 -696 89 615 255 -484 -542 113 452 181 -349 -282 -81
3720h1K91Kl70j84L00L04J38l25m54O6O18K39m73n43K70N73J80o24o12L69P97
$$ -81 210 212 -158 -342 -42 262 400 75 -379 -313 305 544 71 -472 -202 371 551 -73 -685 -316 481
3741D81J22p12m53K29O75J06m44m03P6N52J68m03l48J15L04L87j62m79k89M71
$$ 481 603 -109 -562 -333 342 448 4 -399 -323 229 397 -6 -354 -239 65 452 290 -189 -478 -7
3761gN39k35n08m40P51M90k15p99j08N31O51k26q40q4N40M19k55n35l4L73K37
$$ -7 532 297 -211 -651 100 590 375 -424 -532 -1 650 424 -416 -500 40 459 204 -331 -365 8 245
3782B45J68m92k92L95M35m8l32n63J68N52J36l54p00L28P70R9o03n45K60Q88J6
$$ 245 413 -79 -371 24 459 411 79 -484 -316 236 372 18 -682 -354 416 515 -88 -633 -373 515 531
3803E31o28m03L37O16l0m89m34K25M35J24k18l63j31M58K92j68m50q4M31M57k34
$$ 531 -97 -500 -163 453 423 -66 -500 -275 160 284 66 -297 -428 30 322 154 -296 -380 51 508 274
3824B74o42k70O21O56l16o65k39O24M37j05p47j13M89L99k64l00j12K62K93l9
$$ 274 -368 -638 -17 639 323 -342 -581 43 480 375 -372 -485 4 403 139 -161 -273 -11 282 243
3844B43m22k0O2L77J03l38l16J26L76L07n15m80K47M35K79m81m99K07N01K74n15
$$ 243 -179 -199 -137 240 343 5 -311 -185 191 498 -17 -497 -250 185 464 -17 -516 -309 192 466 -49
3865d9l70K55M34L2k70l67P2M80R7k54k95N1K12J86Q0n33j72L82L58k21l73j78
$$ -49 -419 -164 270 302 32 -335 -263 217 314 60 -235 -184 28 214 294 -239 -411 -29 329 108 -265 -443
3887d43L50M99r8m55k15L90L69k15m82o9L05M06r7k51k72ON24p2l05k42J21M23
$$ -443 -93 406 308 -147 -362 28 397 182 -300 -369 -64 342 245 -6 -278 -272 252 180 -125 -367 -246 177
3909A77J35j31o27N3O18L15m54m62K98J41M06m14n88K20M89K11l26l37L1M44R3
$$ 177 312 181 -446 -393 225 540 86 -376 -78 63 469 55 -533 -313 176 387 61 -276 -245 199 292
3930B92j93l74J21J36M04k68m79m4L99M22K3n22l75L68N78j22n25j82M15L97j27
$$ 292 99 -275 -154 -18 386 118 -361 -405 -6 416 439 -83 -458 -90 488 366 -159 -341 74 471 344
3951C44m05l25K91L59o6m78j52L37L70N2m16k39J04M10L6l57m0K0L46J51k24l25
$$ 344 -61 -386 -95 264 198 -280 -432 -95 275 327 -89 -328 -224 186 222 -135 -175 -155 191 342 118 -207
3973b07M4L07K99k93m29R5L04K35j33n46J39L77K26l33l39r9M55K57l59l25p2
$$ -207 -163 144 443 150 -279 -184 120 355 222 -324 -185 192 418 85 -254 -353 102 359 0 -325 -397
3994c97L48L52j07m19l0K68K13j62l36M2J99K15n0l01j54K89K50L8l27k40K41
$$ -397 -49 303 196 -223 -253 15 228 66 -270 -228 -29 186 136 -165 -319 -30 220 258 -69 -309 -68
4015f8L10n2l06j81J35K98m1j62j14%L59O5k90k42J38K37K62l29l35K68J96R5
$$ -68 242 190 -116 -297 -162 136 95 -67 -181 -181 178 243 -47 -289 -151 86 348 19 -316 -48 148 243
4037B43k57k46J94Q3J59j05l06p8M44K0j64k31JK29K56j87k68N2J41L63j64l40
$$ 243 -14 -260 -66 17 176 71 -235 -313 131 151 -13 -244 -243 -14 242 55 -213 -161 -20 343 179 -161
4059a61j37L55M07l40k05j53J72K72K0l37j99K70J06O8k15o3J19J84J11m11j12
$$ -161 -298 57 464 124 -81 -234 -62 210 230 -107 -306 -36 70 138 -77 -140 -21 163 274 -137 -249
4080b49J49J83l0o0k24P0K35J70j68l34J57K63J98k08l88J08K47R7k54k13O0L34
$$ -249 -100 83 53 -7 -231 -161 74 244 76 -258 -101 162 360 152 -236 -128 119 216 -38 -251 -191 143
4102A43j4j94k29J90J58K08j71k56j00K33K28M1k93j42J63K44p9k36j94L06K91
$$ 143 129 -65 -294 -104 54 262 91 -165 -265 -32 196 237 -56 -198 -35 209 130 -106 -300 6 297
4123B97q1l87j49K37M12k82j69k7J77K44j65k12m8J43R9R7l01j77K65J19R6l6
$$ 297 216 -171 -320 -83 329 47 -122 -149 28 272 107 -105 -153 -10 89 186 -115 -292 -27 92 188 152
4145A52k64n3K12J05p0k66L7L32M1j84k78K8K60K73l31k36M1K83P2j92n5J8J52
$$ 152 -112 -165 47 152 82 -184 -147 185 226 42 -236 -208 52 325 -6 -242 -201 82 154 -38 -93 -75 77
4168G7L8j12j34k3K49j6O1k80kMK56L2k28k68J61L08P5m37j85M98K01j10l61p
$$ 77 115 3 -131 -154 95 79 140 -140 -142 -138 118 150 -78 -346 -185 123 198 -239 -424 74 275 165 -196 -203
4192b03K11J67j18k24M1J30P9M2n5k66O7R4J22k8j91k1J10J59j09k22k5J60J79
$$ -203 8 175 57 -167 -126 4 83 125 70 -196 -129 -35 87 59 -132 -153 -43 116 7 -215 -240 -80 99
4215I9N3l12m0K15K02j07k93K9J96P7j49j15J33K16p1j4k58pJ54J25n0Jk29N6
$$ 99 152 -160 -200 15 217 110 -183 -154 42 119 -30 -145 -12 204 133 119 -139 -146 8 133 83 84 -145 -89
4239h9J84O9k58j74J04K36L7j94j43K28J97J9k96j89J77K47q5j72j57K19J8R9
$$ -89 95 164 -94 -268 -164 72 109 -85 -228 0 197 216 -80 -269 -92 155 70 -102 -259 -40 -22 77
4261G7j78o6J08p4J91r5m4r5QJ80J0p4p5l2L93k12L8k16J13L76l04j54j13L23
$$ 77 -101 -167 -59 -133 58 -37 -81 -176 -168 12 22 -52 -127 -159 234 22 60 -156 -43 333 29 -125 -238 85
4285H5K40l90m6L5J46m3q9Q0o0QO4M3k8j60M5J26O1P6k67J5K4J64o6j50j8K18
$$ 85 325 -65 -111 -76 70 27 -62 18 -42 -34 30 73 45 -115 -70 56 117 193 -74 -59 -35 129 63 -87 -105 113
4311A13m8p7j25J2K08ml8j79o5L26p8j37J80loM7n0j35J55l5M3l0lj85J40P6r6
$$ 113 65 -12 -137 -125 83 79 41 -138 -203 123 45 -92 88 85 79 126 76 -59 96 61 104 74 71 -114 26 102 6
4338FP9j45JK43M0k70j02J60J28q2j22j23J39Q5L9j52J2JM9J10p2jo9J30o5J8
$$ 6 85 -60 -59 184 224 -46 -148 12 140 58 -64 -187 -48 37 76 -76 -64 -63 -14 96 24 23 -46 84 19 37
4364C7j03n7J44k6K9j75L4L3J38j04o7R1K0l5%n5O0j6M4J75k01m8J22K6M9Qk42
$$ 37 -66 -123 21 -5 24 -151 -117 -84 54 -50 -117 -26 -6 -41 -41 -96 -36 -52 -8 167 -34 -82 40 66 115 123 -119
4391a19J13J02q5L0j09J6J39n1K1j91J46K0q8N0k13J10J46M7r1o6kL8J48j42j5
$$ -119 -6 96 11 41 -68 -52 87 36 57 -134 12 32 -56 -6 -219 -109 37 84 -7 -73 -75 -37 111 -31 -46
4416d6p1J48J60j86J3r2M5J71k52Q3n5KJ64j11rq4J09J72j25o8j50J56K77k67
$$ -46 -117 31 191 5 18 -74 -29 142 -110 -27 -82 -80 84 -27 -36 -120 -11 161 36 -32 -182 -26 251 -16
4440a6k3LM7J26q9L8j13J16q4j01J05j02J13j02J29rj28o7J77m8N3r8k0NJ91m9
$$ -16 -39 -36 11 137 48 86 -27 89 5 -96 9 -93 20 -82 47 38 -90 -157 20 -28 25 -73 -93 -88 103 54
4466E4j31P0NN1q8j11kP7kP5o7J71j46Q8j50J0J16n5J00Qk40M8J27J06o1qp1j7
$$ 54 -77 -7 -2 49 -39 -150 -152 -75 -77 -2 -69 102 -44 44 -106 -96 20 -35 65 73 -167 -119 8 114 53 45 -26 -43
4494d3J76Q3k41J45r8k4n5O9r2M4Q1o3R3n7p6J24r9J24k11N2J18m5M5J3j45J13
$$ -43 133 216 -25 120 22 -2 -57 12 -80 -36 45 -18 75 18 -58 66 -33 91 -120 -68 50 5 50 63 -82 31
4520C1m8k5J53j12M9J7o9l4l2O7L7m7p5J3J00r6O7K6j33J00R0M8n6j56J0J45j28
$$ 31 -17 -42 111 -1 48 65 -4 -38 -70 -3 34 -13 -88 -75 25 -71 -4 22 -111 -11 79 127 71 -85 -75 70 -58
4547e8J68j19J6Q1q8J50k12o4J79q1k1MM7k0O4rj14o9J58P2M1j59m6%O9m5L4m3
$$ -58 110 -9 7 88 0 150 -62 -126 53 -28 -49 -45 2 -18 46 37 -77 -146 12 84 125 -34 -80 -80 -11 -56 -22 -65
4575f5K8L6%j47R9n8QK9L6P2j71K78n6j25j17J01J65p4j28k6J69q7K10qj18qr
$$ -65 -37 -1 -1 -148 -49 -107 -99 -70 -34 38 -133 145 89 -36 -153 -52 113 39 -89 -115 54 -33 177 169 51 43 34
4602C4J3J11j28q3J0J07n5J4m8p5K34m9j19J1j2O9q6j6m2O3mJ82l21J23LJ14o1
$$ 34 47 158 30 -53 -43 64 9 23 -25 -100 134 85 -34 -23 -35 34 -52 -68 -110 -47 -51 131 -190 -67 -64 50 -11
$$ [...]
8191C71
##END NTUPLES=NMR FID
##END=
