##TITLE=1H ikalashn
2B1d -1
25.10.2024
##JCAMPDX= 6.0         $$ Bruker NMR JCAMP-DX V2.0
##DATA TYPE= NMR FID
##DATA CLASS= NTUPLES
##ORIGIN= UXNMR, Bruker Analytische Messtechnik GmbH
##OWNER= root
$$ TOPSPIN		Version 1.3
$$ 2024-10-25 10:38:22.500 +0400  Irina@DPX200
$$ Compression mode = diff/dup
##.OBSERVE FREQUENCY= 200.131300845
##.OBSERVE NUCLEUS= ^1H
##.DELAY= (6, 6)
##.ACQUISITION MODE= SIMULTANEOUS
##.ACQUISITION SCHEME= undefined
##.AVERAGES= 48
##.DIGITISER RES= 18
##SPECTROMETER/DATA SYSTEM= spect
##.PULSE SEQUENCE= zg
##.SOLVENT NAME= CDCl3
##.SHIFT REFERENCE= INTERNAL, CDCl3, 1, 17.49637
##AUDIT TRAIL= $$ (NUMBER, WHEN, WHO, WHERE, WHAT)
$$ ##TITLE= Audit trail, TOPSPIN		Version 1.3
$$ ##JCAMPDX= 5.01
$$ ##ORIGIN= Bruker BioSpin GmbH
$$ ##OWNER= Irina
$$ $$ F:/spectra/data/iren/nmr/1H/4/audita.txt
$$ ##AUDIT TRAIL=  $$ (NUMBER, WHEN, WHO, WHERE, VERSION, WHAT)
(   1,<2024-10-25 10:38:07.453 +0400>,<Irina>,<DPX200>,<TOPSPIN 1.3>,
      <created by zg
	started at 2024-10-25 10:34:55.031 +0400,
	POWCHK disabled, PULCHK disabled
       terminated by command 'halt'
       configuration hash MD5:
       BE 6D 3F 07 2A EA 11 49 91 17 2B D3 AF B3 58 0D
       data hash MD5: 16K
       5A 4B 82 21 D8 CB F0 17 4C 42 37 56 98 10 46 62>)
$$ ##END=
$$ 
$$ $$ hash MD5
$$ $$ 45 5B 1D 54 4F FE 83 91 F8 37 E3 68 BB EE 9D 8D
##$RELAX= 
##$RELAX= 
##$RELAX= 
##$RELAX= 
##$RELAX= 
##$RELAX= 
##$RELAX= 
##$RELAX= 
##$RELAX= 
$$ Bruker specific parameters
$$ --------------------------
##$DU= <F:/spectra>
##$EXPNO= 4
##$NAME= <1H>
##$PROCNO= 1
##$TYPE= <nmr>
##$USER= <iren>
##$AMP= (0..31)
100 100 100 100 100 100 100 100 100 100 100 100 100 100 100 100 100 100 
100 100 100 100 100 100 100 100 100 100 100 100 100 100 
##$ANAVPT= -1
##$AQSEQ= 0
##$AQ_mod= 1
##$AUNM= <au_zg>
##$AUTOPOS= <>
##$BF1= 200.13
##$BF2= 200.13
##$BF3= 200.13
##$BF4= 200.13
##$BF5= 200.13
##$BF6= 200.13
##$BF7= 200.13
##$BF8= 200.13
##$BYTORDA= 1
##$CFDGTYP= 0
##$CFRGTYP= 5
##$CHEMSTR= <none>
##$CNST= (0..63)
1 1 145 1 1 1 1 1 1 1 1 1 1 1 1 1 1 1 1 1 1 1 1 1 1 1 1 1 1 1 1 1 1 1 
1 1 1 1 1 1 1 1 1 1 1 1 1 1 1 1 1 1 1 1 1 1 1 1 1 1 1 1 1 1 
##$CPDPRG= <>
##$CPDPRG1= <>
##$CPDPRG2= <>
##$CPDPRG3= <>
##$CPDPRG4= <mlev>
##$CPDPRG5= <mlev>
##$CPDPRG6= <mlev>
##$CPDPRG7= <mlev>
##$CPDPRG8= <mlev>
##$CPDPRGB= <>
##$CPDPRGT= <>
##$D= (0..63)
0 2 0 0 0 0 0 0 0 0.06 0 0.03 0 0 0 0 0.0002 0 0 0 0 0 0 0 0 0 0 0 0 0 
0 0 0 0 0 0 0 0 0 0 0 0 0 0 0 0 0 0 0 0 0 0 0 0 0 0 0 0 0 0 0 0 0 0 
##$DATE= 1729838284
##$DBL= (0..7)
120 120 120 120 120 120 120 120 
##$DBP= (0..7)
150 150 150 150 150 150 150 150 
##$DBP07= 0
##$DBPNAM0= <>
##$DBPNAM1= <>
##$DBPNAM2= <>
##$DBPNAM3= <>
##$DBPNAM4= <>
##$DBPNAM5= <>
##$DBPNAM6= <>
##$DBPNAM7= <>
##$DBPOAL= (0..7)
0.5 0.5 0.5 0.5 0.5 0.5 0.5 0.5 
##$DBPOFFS= (0..7)
0 0 0 0 0 0 0 0 
##$DE= 6
##$DECBNUC= <off>
##$DECIM= 32
##$DECNUC= <off>
##$DECSTAT= 4
##$DIGMOD= 1
##$DIGTYP= 9
##$DL= (0..7)
0 120 120 120 120 120 120 120 
##$DP= (0..7)
$$ [...]
##$SW= 21.9926040160658
##$SWIBOX= (0..15)
0 0 2 0 0 0 0 0 0 0 0 0 0 0 0 0 
##$SW_h= 4401.40845070422
##$TD= 16384
##$TD0= 1
##$TE= 300
##$TE2= 300
##$TE3= 300
##$TEG= 300
##$TL= (0..7)
0 120 120 120 120 120 120 120 
##$TP= (0..7)
150 150 150 150 150 150 150 150 
##$TP07= 0
##$TPNAME0= <>
##$TPNAME1= <>
##$TPNAME2= <>
##$TPNAME3= <>
##$TPNAME4= <>
##$TPNAME5= <>
##$TPNAME6= <>
##$TPNAME7= <>
##$TPOAL= (0..7)
0.5 0.5 0.5 0.5 0.5 0.5 0.5 0.5 
##$TPOFFS= (0..7)
0 0 0 0 0 0 0 0 
##$TUNHIN= 0
##$TUNHOUT= 0
##$TUNXOUT= 0
##$USERA1= <user>
##$USERA2= <user>
##$USERA3= <user>
##$USERA4= <user>
##$USERA5= <user>
##$V9= 5
##$VALIST= <valist>
##$VCLIST= <CCCCCCCCCCCCCCC>
##$VD= 0
##$VDLIST= <DDDDDDDDDDDDDDD>
##$VPLIST= <PPPPPPPPPPPPPPP>
##$VTLIST= <TTTTTTTTTTTTTTT>
##$WBST= 1024
##$WBSW= 25
##$XGAIN= (0..3)
0 0 0 0 
##$XL= 0
##$YL= 0
##$YMAX_a= 2550617
##$YMIN_a= -2463029
##$ZGOPTNS= <>
##$ZL1= 120
##$ZL2= 120
##$ZL3= 120
##$ZL4= 120
##$ABSF1= 10
##$ABSF2= 0
##$ABSG= 5
##$ABSL= 3
##$ALPHA= 0
##$AQORDER= 0
##$ASSFAC= 0
##$ASSFACI= 0
##$ASSFACX= 0
##$ASSWID= 0
##$AUNMP= <proc_1d>
##$AXLEFT= 0
##$AXRIGHT= 0
##$AXTYPE= 0
##$AXUNIT= <>
##$AZFE= 0.1
##$AZFW= 0.1
##$BCFW= 1
##$BC_mod= 2
##$BYTORDP= 1
##$COROFFS= 0
##$CY= 7568.61572265625
##$DATMOD= 1
##$DC= 2
##$DFILT= <>
##$DTYPP= 0
##$F1P= 17.9538593292236
##$F2P= -4.03888763876832
##$FCOR= 0.5
##$FTSIZE= 32768
##$FT_mod= 4
##$GAMMA= 1
##$GB= 1
##$INTBC= 1
##$INTSCL= 1
##$ISEN= 128
##$LB= 0.05
##$LEV0= 0
##$LPBIN= 0
##$MAXI= 945.577
##$MC2= 0
##$MEAN= 0
##$ME_mod= 0
##$MI= -402.1523
##$NCOEF= 0
##$NC_proc= 0
##$NLEV= 6
##$NOISF1= 8.587773
##$NOISF2= 6.764455
##$NSP= 1
##$NTH_PI= 0
##$NZP= 0
##$OFFSET= 17.49637
##$PC= 1
##$PHC0= 110.5135
##$PHC1= 14.96867
##$PH_mod= 0
##$PKNL= yes
##$PPARMOD= 0
##$PPDIAG= 0
##$PPIPTYP= 0
##$PPMPNUM= 100
##$PPRESOL= 1
##$PSCAL= 0
##$PSIGN= 0
##$REVERSE= no
##$SF= 200.13
##$SI= 32768
##$SIGF1= 18.5376
##$SIGF2= -6.396296
##$SINO= 400
##$SIOLD= 32768
##$SREGLST= <1H.CDCl3>
##$SSB= 3
##$STSI= 0
##$STSR= 0
##$SW_p= 4401.40845070422
##$SYMM= 0
##$S_DEV= 0
##$TDeff= 0
##$TDoff= 0
##$TI= <>
##$TILT= no
##$TM1= 0
##$TM2= 0
##$TOPLEV= 0
##$USERP1= <user>
##$USERP2= <user>
##$USERP3= <user>
##$USERP4= <user>
##$USERP5= <user>
##$WDW= 1
##$XDIM= 8192
##$YMAX_p= 0
##$YMIN_p= 0
$$ End of Bruker specific parameters
$$ ---------------------------------
##NTUPLES= NMR FID
##VAR_NAME=  TIME,          FID/REAL,        FID/IMAG
##SYMBOL=    X,             R,               I
##VAR_TYPE=  INDEPENDENT,   DEPENDENT,       DEPENDENT
##VAR_FORM=  AFFN,          ASDF,            ASDF
##VAR_DIM=   8192,          8192,            8192
##UNITS=     SECONDS,       ARBITRARY UNITS, ARBITRARY UNITS
##FACTOR=    0.0002272,     1,               1
##FIRST=     0,             0,               0
##LAST=      1.8609952,     110,             32
##MIN=       0,             -2463029,        -2463029
##MAX=       1.8609952,     2550617,         2550617
$$ Real data points
##PAGE= N=1
##DATA TABLE= (X++(R..R)), XYDATA
$$ [...]
2512h3l96q04J406N97n81l73n91P27J40K28r93J119J04j86n42l31J292j147m6
2531d60M9M99M40o39j13j90J295p95p90N21R16K4j158L37j01Q09o31n84N02J236
2551A167j533k58L74J227j75j459P97N72N7m81j311J31J633j02j032o74O57Q85
2569D75j121K1N90N2M71o59j56R24m33k76k88R52j16l44m30l71Q59M62j683KJ350
2590B81M39p35n93P33O09K31j952L66O51P70q41m76Q94M83p62l59J90J431p21
2609F39L5o29K50K4M0j53q71J332j64n15p43Q66O75r37k17M01Q23n91j13l23L17
2630A46O63j555k81R20P79m92n92N13M43k04j059J46J182j595J193k83o02R58
2648B80j17q23L78Q59O02j920M52M01N31q85n19K44O19J37n00n75R19k71n39p5
$$ y = [-83, -479, -1283, 123, 720, 139, -234, -825, -98, 42, 270, -723, 396, 500, 314, -228, -559, 733, -414, -460, -411, 88, 528, -111, -224, -414, 881, 86, -704, -183, 733, 757, -401, -64, -165, 644, 13, -571, -69, 1167, -366, -624, -250, 977, 802, -657, 140, 712, 769, 288, -1023, -892, 741, 639, -393, -1067, -410, 475, -646, -625, -35, 17, 488, -171, -327, 597, 164, -112, -400, 552, 436, 92, -338, -709, 150, 612, -1071, -1069, 281, 720, -15, -608, 125, 734, 965, -987, -621, 30, 800, -41, -517, 377, 860, 98, -261, -71, 1360, 639, 674, 45, 295, 319, 359, 206, -665, 667, 503, -12, -755, 111, 786, -151, -368, 33, 856, 265, 152, -171, 146, 809, -746, -1027, -107, 672, 180, -412, 101, 544, 340, -719, -573, 609, -986, 207, -76, -678, 280, 163, -660, -282, 577, 1179, -741, -289, 112, 643, -242, -761, -517, 102, 239, -261, -836, 83, -188, -727, -802]
2668h02R94m63N21q22K39N51p5r03l81J212R80r21j179O12J926r55j141j8M01
2687b24K77J23m93O94M24k78r32L75Q68o55m83J45L38J040j194q12O24M06J49
2706C92j090M63J054j35o84m79P44P00r75o51J015P06j122j61j83Q39J153j872
2724b86n14L85J297r74q77M48J147K49j522K83n0M85k83n9n10J275Q0q44l46P85
2744A69N41l3j064O41N57j285N0J01R55m08l82q47Q52Q92j524j85O84J320j110
2763g6j55K28p9O83j711L65R21Q74m71j058O80N21o4r55m76J322J96j257n08L07
2783g13R92M43j313Q26L51P1j677M48n2J588o32n52o1P12m81k28j56J043K31j117
2803b77r08J329Q61j719k15L93J451k59j000n83J141L49j167J96rJ456o96j113
$$ y = [-802, 192, -271, 250, -572, -333, 218, 143, -760, -1141, 71, 1051, 130, -1049, -437, 1489, 534, -607, -625, -224, 53, 176, -317, 377, 801, 523, -409, -34, 834, 179, -304, -159, 179, 1219, 25, -787, -163, 243, 392, -698, -235, 819, 684, 0, -479, 265, 965, -10, -661, 354, 1060, -62, -223, -406, 433, 1586, -286, -800, -415, 882, -92, -969, -521, 626, 875, -647, -364, -414, 71, -212, -271, -781, 494, 574, -270, -616, 169, 710, 677, -387, 254, 811, -474, -424, -323, 632, 224, -158, -1005, -153, 739, -785, -970, -286, 1034, -76, -231, -3, -82, 601, -1110, -745, 176, 1050, 579, -479, 201, 722, 658, -297, -773, 549, 745, -512, -1020, -713, 279, 722, -591, 235, 586, 657, -1020, -572, -624, 964, 332, -220, -281, 431, -50, -278, -434, 609, 840, -277, -1185, 144, 1005, -714, -929, -536, 915, 656, -344, -927, 214, 563, -604, -408, -417, 1039, 343, -770]
2821g70K32N26J33k15q30J072Q36p23j405R29Q08k23r29o28J277J57r55m61P33
2840d36K50O82j015L76J403j225j98q77J645N63j022o58l40J144R2o54n92J401
2858E39m43j56j482J101P49k85m86j69Q65L4m10n31J049o01k86n77J386J90j46
2877C41j025j63J365Q40k143k01J255K33k06k037J705N22P6j743J292K65N3q78
2895d49o21J155J187j332o97q6J660l78j198n50J717L39m36q12P9J568m62o02
2913H2j007K016j104P4o31j46J290o54o68O07N43P33j316n46J578%r73n61O22
2932f1J197q23j450R54Q89n33m89j74P53L70j309j53L95J473j551qkO73K3m79
2952c05m75N72L78m63j084P57J187K65j358k82J982n60n31j028P05P19j37j422
$$ y = [-770, -538, -12, 121, -94, -924, 148, 984, 261, -1144, -215, 593, 370, -559, -1187, 90, 247, -708, -1169, -436, -186, 496, -519, -143, 1260, 35, -163, -1040, 605, 1168, 146, -512, -852, 292, 384, -270, -862, 539, 96, -60, -1542, -441, 308, 23, -463, -632, 233, 267, -143, -674, 375, -226, -512, -1089, 297, 487, 341, -684, -847, 518, 1358, -785, -986, 269, 502, 296, -1741, -36, 486, 562, -1181, 111, 376, 429, -449, -1070, 85, 1272, -60, -757, -843, 817, 439, -759, -1309, 408, 747, 311, -501, -422, 1146, 684, 82, -925, 1091, -13, 61, -570, -716, 574, -80, -748, -141, 402, 1135, -181, -727, 851, 851, -122, -683, -61, 1136, 313, -1137, -183, 706, 173, -316, -490, 263, 633, -676, -829, -434, 1039, -512, -520, -522, 151, 174, -305, -780, -208, 170, -293, -1377, -620, 567, 832, -526, -808, 1174, 614, 83, -945, -240, 479, 342, -1080]
2970a080M83J252q07J15j033M11J281j45j197Q36O70l34j361M20J150K85j297
2987c51j289J673J182j075j152O29J040j39n09r37J520K68j244L21l57J060o64
3004b4j633J541L60M18o21o23N93J547j672p75N50J069N91j846j066K166M32j490
3022d83LJ8O13m76q82L6K023n43j032p9J129J39n20j260J476Q05O26k475L18J377
3042H13J45r00r03R41R99r12j004k23J694K83k328M57R79R29j282p35R3K471j356
3061A61j497L01K700n41j902o89K152O19j310j34J97O40K76j208j048K215k43
3078F89j100j382J624J350j512r91J380M43l31j135J86J446M76j479l85L24J194
3095G97l54j188L44J287k89j574K46Q24P02p70j222K01J749J36j681q49K117n6
$$ y = [-1080, -597, 655, -152, -37, -1070, -659, 622, 477, -720, 116, 786, 452, -909, -489, 661, 946, -351, -1640, 33, 1215, 140, -1012, -383, 657, 518, 9, -928, 592, 860, -384, -63, -420, 640, -24, -1657, -116, 244, 662, 41, -582, 11, 1558, -114, -889, -339, 730, 1321, -525, -1591, 575, 1007, -483, -480, -462, 151, -325, -1207, -1171, 852, 309, -723, -802, 327, 466, -54, -1314, 162, 967, 1593, -882, -564, 813, 958, 58, -845, 96, 1095, 183, -821, -1044, 650, 933, -1395, -938, 41, 970, -312, -1047, -954, 1517, 161, -1336, -1035, 1665, 1124, -778, -1467, 685, 1304, -6, -140, 57, 697, 973, -235, -1283, 932, 689, -411, -1793, -169, 1181, -331, -1322, 58, 501, 170, -965, -779, 667, 1143, -336, -721, -397, 797, 443, -745, -401, 886, 597, -977, -731, 93, 795, 25, -1197, -996, 753, 889, -792, -1641, 476, 420]
3113D20m62k00M15J71n05r02P72N62O00j586r5J504O60j581l18J062r9l81j075
3132a038m72J886P11j714q66J272O50L42j451J20J280p2l91q68J263J47j191j41
3150e33O80Q24q37r68O03J363l85j497k30J075J020j218p84J211M25l35l52j223
3168a161J124J119j284q2l43J863m09j920J294Q63r73r09M11N25J005j483j452
3185a812J752M65J46j621N68J313p91r10l03J508L22l63j117M14J063J57j662
3202h71P89J053m38q53q25K165k37j48p37K31M23l34j021J73J438Q0j558k30J287
3221C87J69K45j519P37K81R43j979J99L38J523j040j232Q09J088N33k322n8J388
3239D90k75m85o87J044R58j342j428N42K632q72j473j95J103J031j255n23J485
$$ y = [420, -42, -242, 173, 344, -161, -1063, -291, 271, 871, -715, -810, 694, 1354, -227, -545, 517, 418, 37, -1038, -1510, 376, 1087, -627, -1493, -221, 429, 771, -680, -560, 720, 648, 257, -611, 652, 799, -392, -533, 147, 971, 134, -834, -231, 1132, 747, -750, -980, 95, 1115, -103, -887, 324, 749, 414, 62, -1161, -37, 1082, -202, -284, -627, 1236, 827, -1093, 201, 1064, 91, -818, -407, 118, 1123, -360, -1812, -60, 405, 551, -1070, -502, 811, 20, -890, -1193, 315, 637, 274, -843, -429, 634, 791, -871, -82, 971, 533, -320, -1145, 1020, 783, 635, -102, 129, 552, 218, -803, -630, 808, 888, -670, -900, 387, 556, 801, -718, 19, 300, 1243, -736, -537, -199, 1324, 284, -948, -139, 949, 1482, -840, -898, 490, 215, -270, -957, 87, 1045, -297, -1725, -1183, 1449, 577, -896, -1091, 12, 1043, -212, -735, 750]
3256G50k9K32j047n87P54J061k218P88J26J228o51m51P1O01j95j547L77J431P28
3275A422k034K33M74J428j283j076N34R9L11l48l59J373m5k29j686J256J244j256
3293E8j404L57J609k65l19l43L94Q13l17j242J033M45k05j577j06Q68R68j498
3311g31k13J026O32p29m66o58J880l74k92o51Q92R15j557q54J104J508j759q74
3329a201J275K51k2k68j234J483M09j090n30j31J529N94k035L5J422O53j079k76
3347b15R0J361j089K16r80J484n70j118p23J021J045l55k84k62J388r05j82p31
3365h09J709R5j879L11J287N15j494q92P63J425O7j597o80J136P97j005q58J205
3383I6J393j224j048J97J396K68j493l01J813o46l10m16M97J399j391r11m22J489
$$ y = [750, 721, 953, -94, -681, 73, 1134, -1084, -296, -170, 1058, 407, -44, 27, 628, 433, -1114, -737, 694, 1422, -612, -379, 95, 1523, 240, -836, -302, -203, 108, -240, -599, 774, 729, 500, -1186, 70, 1314, 58, -1346, -989, 620, 355, 36, -307, 87, 900, 583, -659, 374, 819, 614, -963, -1069, -201, 767, -731, -944, 82, 714, -15, -481, -1139, 741, 367, 75, -576, 316, 1231, -326, -1180, -76, 1432, -327, -1201, 74, 325, 303, 35, -1199, 284, 693, -397, -927, -1058, 471, 1065, -970, -935, 487, 1140, 61, -215, -125, 1236, 147, 363, -617, 867, 297, -821, -1544, -523, 522, 167, -117, -379, 1009, 104, -78, -809, 900, 995, -884, -573, 714, 1229, -265, -1157, -394, 1031, 1098, -499, -1179, -43, 754, -251, -1109, 96, 1489, 265, -783, -586, 810, 1078, -415, -716, 1097, 451, 141, -275, 222, 1621, 230, -681, -1103, 386]
3401C86L49j305q8P12J232p91j461R30K55N39n10j341J644L43p56p04K54J563
3419A251q68o59P67k83K57p19n84J123J306j730o27P30J442j354o86n82J346J116
3437A246j552j244R34J362l09j625M67J991j018q80L75R60n44j313P18L47Q69
3454G84k67j873P34J257L23j912J23J108O99p09q31j17J534N74j312q80P98J482
3472A515k213o97J452Q28k49j546M32J757r62p01J65P18M51m45j161R11O50m51
3490D54j673P61P52Q41j154m23j22J021Q94j325r53J663o0j027J64J31R91j426
3508d91Q8K59J090m40j152P5J029l34o25m57R35R34p44j683J912K50J34r55o30
3527h05J589n53M28j607R62P20l20r40PJ219L2j442N18K15K60J5r34k1Q82K31
$$ y = [386, 735, -570, -658, 54, 1286, 495, -966, -36, 219, 758, 248, -1093, 551, 894, 138, -566, -312, 1251, 383, -276, 491, 208, 465, -254, -838, 285, 1591, -139, -766, -36, 1406, 52, -634, -1216, 130, 1246, -306, -1550, -616, 746, 437, -1188, -721, 1270, 252, -628, -253, 707, 163, -1150, -432, -85, 784, 517, -1356, -622, 635, 958, -954, -831, 277, 976, 267, -564, -681, 853, 1427, 115, -765, 33, 1515, -698, -1395, 57, 885, 636, -910, -478, 1279, 317, -384, -219, 499, 950, 505, -656, 255, 905, 454, -1219, -458, 294, 1135, -19, -442, -564, 457, 1351, 26, -927, 736, 676, -351, -187, -56, 935, -491, -403, -144, 946, 506, -646, -571, 458, 124, -501, -958, -23, 911, 167, -1516, 396, 646, 780, -175, -805, 784, 231, 659, -948, 14, 734, 414, -526, -519, 700, 732, -710, -192, 23, 283, 298, -636, -657, 225, 456]
3547D56j427k39J180L87l57o26P70J317r78j183P68M02J037j844j52R16O65j230
3565a38m38N76J392p66j811J237K31p73l58J85L79R41p16o90N13J801o50j817
3583i02M21J355o71k66M0K14J95l40q63J66J294l27o51m13J392P3o03r68Q28M49
3603D23m56K37n30N60Q63k169L74N10J465j223p15Q41R30n56j623k81J229O12
3621D91m71m17P80p0O04k252Q14J277L61j918Q5M22N88j11p18O15N95K6j085K01
3641a83L79J163j930j334J981Q58r41n3L34l48J452j996m33Q35J022j376o9J056
3659D17K27o54Q6o26J080o41p6JJ56Q11j312N59l41J680o01r23r7N97M05q08l22
3680c82k16J151n27o62M46N10k2q04J86O10l4n94m6L26J04M91n14r49J828M28
$$ y = [456, -971, -1210, -30, 357, 0, -626, 144, 1461, 483, -700, 68, 470, 1507, -337, -489, 427, 1092, -138, -576, 0, 1392, 626, -1185, 52, 283, -490, -848, -663, -284, 657, -59, -749, -236, 1565, 915, -902, -481, 874, 203, -63, -23, 191, 386, 46, -817, -651, 643, 316, -335, -748, 644, 717, 114, -854, -26, 423, -33, 204, -326, 234, 1097, -1072, -698, -188, 1277, 54, -661, 180, 1110, 554, -1069, -1350, -121, 491, 20, -397, 383, 313, 917, -1335, -521, 756, 1117, -801, -716, -294, 294, 183, -535, 80, 675, 701, -384, -183, 196, 1359, -571, -1905, 76, 934, -7, -60, 274, -74, 1378, -618, -1051, -216, 806, -570, -639, 417, 644, -10, 76, -550, 530, -111, -187, -186, -30, 781, -531, 28, -313, 1367, 766, -157, -254, 343, 748, -60, -382, -598, 553, 26, -636, -190, 320, 298, -506, -320, 290, 256, -338, -384, -58, 46, 537, 23, -926, 902, 1330]
3700A330j152j342J508O65j225O70p48P36o1j170M14L43k24K05n49J208k23j70
3718B15j07o73J207K09q33q63J111J61j014Lk04J791k37j648P50N2L63j155N42
3737c30j84K37j04q42N02J142l00o22M15m43J037J23q93R48m13o73N1N73R6Qj083
3758g55J295k43P61j025r34N50P10n19o76k36J314K78J83r54l83J169n91M61k06
3777A99l35k74M5L38o3j07O24l63j69P08l40j059N75K00N22m67l96P55Q8k79o26
3798d24N28j49O28o45M64J89o65K14m9n14J116j44j497Q80O96o08l11n59K72J014
3818D36p30m16O00M33M18j437n50J886J60j40j474K00J660j193k79K81K83K15
3836C53o02k41O74R98j413K8k00O31q23J47P72K77Q1q46m44R18K75k60k3q97J635
$$ y = [1330, 178, -1164, 344, 1009, -216, 454, -294, 442, 381, -789, -375, -32, -256, -51, -600, 608, 385, 215, 108, -565, 642, 851, 18, -845, 266, 427, -587, -584, -788, 1003, 766, -882, -132, -80, 283, -872, -330, -514, -277, -381, -1223, -721, 421, 121, -501, -86, -529, 508, 631, -262, 686, 273, -400, -349, 224, 320, 328, -755, 540, 297, 1058, 33, -901, -351, 359, -160, -836, -1072, 242, 520, 703, -251, -634, 535, -56, 405, 199, -136, -410, -365, -27, -90, -197, 427, 64, -105, 603, 263, -796, -221, -21, 501, 34, -362, 393, 481, 202, -424, 104, -45, 583, -62, 402, 591, -74, 140, 91, -423, 693, 549, -948, -68, 628, 20, -291, -850, -578, 436, -294, -710, -110, 323, 741, -696, -1246, 640, 800, 660, -814, -614, 1046, -147, -426, -145, 138, 353, -249, -490, 184, 1182, -231, -203, -403, 228, -595, -448, 324, 601, 682, -164, -608, 310, 585, 325, 302, -595, 1040]
3857A040r28p68Q61J69j95j79L91q33O94P49p58P0l16O58p54o12R88j82P8j150
3877i77O38J060r58n18Q33o31J111j175N9Q02N0m90j75p6N58j96M65l90J32K95
3897D17k90n77K89J251j509j04N76j86L31k77l20L47Q50p15p74M76P10j79o49
3916c33m8J73J9k45N82q3j02R8nj097J260q86J49N20l49R04j456l43Q29Q69n00
3937d4n53J128k72K1n64l38R35L38p77m40M72P21j81m51O4r42L48n66Q12j38L74
3958e3r45N82Q40k9l42k10J39O87l54j231P72K01P99l22p89R10L0l07j476K29
3978h69J255m30m30p08J188J60o10N75j00L72q70R00j064M51Q73n34p87N43N00
3997D15p07Q58l95l96Q37p07Q8r7j00N92l82j088N55O73k37o71K32L71K55R3L2
$$ y = [1040, 112, -656, 205, 374, 179, 0, 391, -442, 252, 1001, 243, 313, -3, 655, -99, -711, 277, 95, 173, -977, -339, 721, -237, -755, 78, -553, 558, -617, -558, 244, 294, -196, -371, -447, 111, -85, 380, -10, 122, 417, 127, -450, -161, 1090, -419, -523, 53, -133, 198, -79, -399, -52, 798, 83, -691, -215, 495, 316, -333, -381, -208, -189, -434, 148, 65, -37, 61, 56, -1041, 219, -667, -518, 2, -347, 557, -899, -1242, -413, 456, -44, -597, 531, 259, 280, -284, -622, 313, 651, -126, -566, -94, 627, 446, -5, 59, -883, -535, -1101, -289, -427, -53, -998, -416, 424, 395, 53, -157, -18, 669, 315, -916, -144, 57, 856, 534, -255, 655, 685, 378, -1098, -869, 386, -44, -474, -1182, 6, 166, -444, 131, 31, 403, -467, 433, -631, -180, 693, 159, -628, -85, 415, -292, 566, 171, -225, 612, -95, -7, -104, -204, 388, 6, -1082, -527, 146, -91, -762, -530, -159, 96, 189, 221]
4018B21L81m80q04M38p7O48n36L1O49K56j109m80R54q50P39j49n06J188o8p89
4038c43M79j97O11n57k40M53n6M05n47q14J464p53J20o37L98J031j074J78J62
4057H3N0J76k13n94K70K06l46K34n61J97O18m11J27K36q43N47M1L39O54n52K11
4078D69j492J130K43k52p79j13N02J207m6j359J058k31j092N20J62J065j180l71
4096e59j41J09J051n73R96m71m41j62K78K0J94n01j4P93R6l70o46J7N73n34J38
4117a47N47k63J28n13p30N48P21j48o33O45K29l45l44o60O18J079m89q42L46Q5
4137a68O81m08p8Q2K32m53q0R66j36j173J22J84K8M90o02l26O38J24j17p96L77
4158d13K62k1j29k55K81j62J005q57J004o81K75j095M69N45o70K53m04j83J242
$$ y = [221, 602, 122, -682, -244, -321, 327, -209, -178, 471, 727, -382, -862, 92, -758, -19, -168, -674, 514, 446, -343, 136, -61, 550, -7, -247, 206, 150, 555, 8, -806, 658, -95, 25, -612, -214, 817, -257, -79, 83, 133, 309, 96, -498, -228, -22, -368, -134, -695, -498, 120, -291, -164, 72, -771, -224, -183, 156, 810, 258, 469, -1023, 107, 350, 98, -681, -794, -292, 915, 869, -490, 568, 337, -755, -235, -73, 992, -188, -559, -700, -591, 460, -113, 883, 412, -29, -191, 87, 107, 301, -200, -214, 579, 675, 305, -341, -324, 249, -285, -147, 400, 137, 265, -248, -978, -430, 291, 143, -490, 155, 384, 39, -305, -965, -347, 732, 243, -599, -253, -168, 513, 105, 27, 109, 341, -112, -192, 774, 638, -535, -413, -229, -201, 289, -313, -639, -1, 123, 6, -790, -413, -151, -172, -301, -556, -275, -437, 568, -289, 715, 34, 309, -786, -317, 228, -442, -189, -593, -776, 466]
4177D66K94r44p42J229K26q73o00J163M43q83j57K0P73K37j631J927J62k32j025
4196a47k05K80K99m60R4J45N71j128K08n56P47R02n96k1J68K59j51p86J85l54
4216e46Q91r02k47K101o60r60N28J74j01q56L14N27o26r2j85Q52J24l45r30R38
4236am49Q15k84m10l45J031J55m56m02P88l24M75j45l79N24l33l99k49J59M2j80
4257c67j72N43M34n59R0j40L83q4k67m14j32P62q21K1R29p1N13r45L34k49J110
4278H98j513m8K39N94p90L54oR52o05o30O63O8j14l27J340o89p23J73k78N35J22
4299B15m49P76q91k23O68N15j207N52M09q74K02k94Qj07M06J96m6o54N07j60N54
4320A03L13l45l81N3O43J1m24m32J524m30k13q06Q26m71m80O76J25m68L33m97
$$ y = [466, 760, -184, -926, 303, 529, -344, -944, 219, 662, -221, -378, -358, 415, 652, -979, 948, 1110, 878, -147, -352, -72, 227, -233, -139, 6, 577, -551, -343, -899, -152, 750, 154, 133, 301, 560, 409, -377, -192, -546, 345, -557, -804, 1297, 637, -323, 205, 379, 278, -578, -264, 263, -363, -455, -640, 212, 336, -9, -939, -1, -450, 365, 81, -329, -674, 357, 512, 56, -346, 442, 118, 593, 448, 69, 593, 260, -139, -388, -229, -187, -367, -539, 4, 438, -121, -31, -171, 212, 128, -139, -553, -685, 77, -744, -723, 206, 135, 648, -297, 37, -212, 898, -615, -663, -424, 170, -620, -266, -272, 680, 75, -555, 108, 176, 62, -265, 1075, 386, -337, -164, -442, 93, 215, -234, 542, -349, -572, 96, 611, -596, -44, 365, -509, -307, -601, -593, -700, -294, -98, -144, -798, -291, -451, 103, 416, 71, -310, -257, 386, 397, -27, -459, 1065, 635, 422, -384, 442, -29, -509, 167, 292, -176, 157, -340]
4340c40M71K45n85K97r26J464o29M58k38J6K23n12O02q08K76J98n48N12k85j34
4360b43L13L41J36n72l56J77j74l28J849n07o86o1k43LJ87M69l59M27q78M45q4
4381a44l8l93M98j48J32L20n06p33J43P34j82l98J480r59J012r17J60q00J001
4400B62m52N35l46QK60m31o2N64j66j25N3L75j56j67j43r39R59k92L10p41J266
4421E72j10n04l23R19n8l30j54k82n2P74j51n52j65Q80m77K21L36m95J74k66l48
4442c91M22m90J181r94O6R41p28m56LP13L5q80J070r19P7N64O7n9J3J69k39m98
4464c33J222p11Q7K62j020n9J149p36k65J007p59O0L60m39m04O93q73M93M93l11
4484h4k04M2l31J166k24k64o04J752j070k62m67K01J162j323K83J75j99j13J2
$$ y = [-340, 131, 376, -209, 88, -838, 626, -3, 455, 217, 233, 456, -56, 546, -262, 14, 212, -336, 176, -109, -243, 70, 411, 547, -25, -381, -204, -378, -706, 1143, 636, -50, -111, -354, -351, -164, 305, -54, 373, -505, -60, -144, -182, -575, -77, -225, -93, 227, -279, -1012, -869, -135, -317, -715, 765, -194, 818, -99, 61, -739, 262, -190, 345, -1, 7, 267, -164, -226, 338, 172, 47, 100, 475, 319, 152, 9, -930, 29, -263, 47, -694, 572, 462, -42, -365, 554, 496, 166, 12, -270, -322, 452, 301, -251, -416, 464, -13, 208, 544, 49, 223, -43, -391, 31, -459, 722, -272, -206, 735, 7, -449, -446, 267, 302, -578, 492, -427, -350, 214, 281, 222, 235, 404, 165, -333, 889, 178, 265, 527, -493, -552, 597, -139, -404, 603, -156, -96, 264, -175, -579, 114, -759, -266, 227, -84, -288, -246, -577, 589, 365, 101, -503, 1249, 179, -83, -550, -349, 813, -510, -227, -52, -251, -364, -352]
4503c52R8N05k70n5k89O62M3o15L05n33K14P12j429Q96K43m95M16N98j126M15
4523e7J33k9j54n49Q10l38L44K6l74K78m54q6N33k4K79j144J446o43M26q56J001
4544E68m14l36P32j263O27l85K98m46P89l92l2l39J039l24p20O09N26p80j7L27
4564F7N01n59k36L52o09K19Q12o99J22k33j50P06n44j27J263j119j55J18k9n2
4584c52M71p97M34L09P59j038j91K15M04L29j099M35M40o84k04J154q3N54j249
4603a93j0M86n91j47L52j79N71j52O44j57j082M46L14n84L31O39j220J50rJ86
4623b05o2O50R2l86j78J09j14j52O32o60qj86K54k21J52j82K56O48o80R7j071
4644a215P83K09J05j36J43O44n90l60L97J133m22n93n52L36J18J37p02k3J204
$$ y = [-352, -254, 251, -19, -74, -363, 299, 342, -273, 32, -501, -287, 425, -1004, -108, 135, -360, 56, 654, -472, -57, 76, 47, -107, -656, 154, -184, 160, 186, -188, 90, -364, -450, 83, 59, 338, -806, 640, -3, 423, -433, 568, 154, -182, 550, -713, -86, -471, -173, -619, 170, -222, -254, -593, 446, 122, -598, 11, 537, -243, -260, 67, 568, 9, -227, 125, -484, -265, 547, -152, -30, -263, -413, 293, -251, -378, 885, -234, -389, -271, -300, -352, 119, -678, -244, 65, 824, -214, -405, -190, 214, 543, -556, -121, 319, -365, -569, 585, 502, 1056, -193, -203, 283, -308, -455, -103, -282, 289, 137, 781, 624, -458, -12, 302, -282, 49, 688, -532, -382, -391, -205, -267, 383, 475, 89, -89, 20, -94, -246, 386, -274, -282, -468, -214, -435, -283, -465, -209, 439, -241, -144, -1215, -432, -223, -118, -254, -111, 533, -57, -417, -20, 1113, 691, 98, -454, -118, 0, 137, -565, -588, 616]
4663F16l79l18K76m67N25n97J42o71R10n53J27R53l00m26O11o60K03p0M5K47k94
4684h0m67J088K16k24l05p6l99O54r90J075n92J96k41Q83r63m94Q85r73P47O51
4704E91r33O63n92P11j193J307K08l73l83m89N00j44M8K14L75q30P72j323J340
4723D69p80L30l12M45m37R69p85J47Q2M8K09p38n2P25q42J279j034j02J165p32
4743E4J96q48J258m25m05j48J064n5n96N7J66J7j69J45m35k13M70k5l42n5M17
4764A28r69J014m72N89l20o4J77O44m23m50p53R53P8N27o26m69R38k4p58n8P79
4785D41m57N48p45K55l62P77p11q6L87O29o10K45m43m91P94J05n09m2K2J82M1
4806c0o67P63m86Q15q93k50N70k63N65N18r34Q55p9l48K64r95M31N86j40l87l69
$$ y = [616, 237, -81, 195, -272, 253, -344, -202, -873, 37, -516, -389, 564, 264, -162, 449, -211, -8, -78, -33, 214, -80, -547, 541, 757, 533, 228, 152, -247, 407, -583, 492, -100, 96, -145, 738, -225, -719, 166, -807, -60, 591, -342, 321, -271, 440, -753, 554, 762, 389, 6, -483, 17, -127, -79, 135, 510, -320, 452, -871, 469, -311, 19, -293, 152, -285, 684, -101, 46, 128, 176, 385, -353, -405, 320, -522, 757, -277, -379, 786, 54, 250, -598, 660, 235, -170, -318, 746, 691, 95, 152, 318, 335, 166, 311, -124, -337, 133, 108, -234, -289, 128, -841, 173, -299, 290, -30, -94, 83, 727, 304, -146, -899, 54, 132, 659, 33, -436, 502, 478, -280, -338, 441, -16, 532, -213, 42, -320, 457, -254, -340, 47, 676, 66, 311, -132, -623, 171, 276, -233, -275, -253, -71, -30, -697, 66, -420, 395, -498, -748, -178, -441, 124, 642, -292, 563, 484, 136, 400, -595, -164, 422, 282, -105, -474]
4827d74q3J141M9j004K70k98J97P4R86n71k80L90k92J0L17L15j9k26L0m76N5k75
4849a64J70k9m6J01j74o48J355j98L53n85o2K66l03J21l45K09N10l23p89P24j9
4870A24J53p3J13k72m59j2J193p03O90j302J86N42j14O3k38L36j97O31m38J47
4890C70n39K04K33q73O12K52m2r32J236j385P98O80k52k44J13l19J28N94r22K55
4910c3K8K31q30J96O85o40n6rN20L43L72j350M61K0l5K86l71O49l25k54o21R43
4932B10k02M23m76M2j9N25J59q41k85K34P74m93p83P54n21M38j63N35J13L98j021
4953a99N09k14l71O02m53j05p1K09O13O2l40k14J275j164L04J01n29K16k18r16
4973i03J096L79j108L21K47l4N18n28k19Q85o87p50J290j78n46O7l7N76q25p9
$$ y = [-474, -557, 584, 633, -371, -101, -399, -202, -128, 858, 287, 7, 397, 105, 115, 432, 747, 728, 502, 532, 56, 111, -164, 6, -23, -69, 32, -142, -790, 565, 367, 720, 135, 73, 339, 36, 157, -188, 21, 531, 208, -581, 143, 124, 277, 204, 317, 45, -414, -426, 767, 64, 754, -548, -362, 180, 66, 129, -109, 227, 30, 661, 223, 370, -169, 35, 268, -605, 7, 259, 217, -715, 521, -864, -66, 614, 362, 118, 231, -88, 40, 634, -288, -33, -5, 226, -604, -408, 277, -363, -419, -428, 92, 435, 807, -543, -82, -62, -97, 189, -182, 467, 142, -112, -733, 210, 8, 431, -45, -3, -22, 503, 662, -179, -464, -230, 544, 51, -732, 22, -499, -61, -224, 311, 424, 822, -199, 310, 96, -275, 327, -126, -231, -302, -93, 520, 582, 242, 28, 1303, 139, 443, 544, 15, 231, 13, -903, 193, 572, -536, -215, 32, -2, 516, -12, -231, 654, -33, -783, 507, 329, -217, -150, -187, 389, -436, -515]
4993e15Q73k63n1M60j37p22N23LQ81j344K28PM11k05K96m10l51K38R79n42j022
5014f63N42m81P17N75q51p0M78q97J390o52M5o93k24N22k74J51Q5N97j30m98l51
5035f82O66m92Q40k62j25N31j3j51k48O63j351M93K67l85m21J94P54q22O3M68
5055a3L43j018L0J310l56k95n35J056m12o35K49M43M26o06L3l14Q15j063M00l69
5075e11l39R41l3J21m63M00n50P71l98R0l86L91L84q08J69q6K40N05j026R43j47
5096B08J00o72j82p6P35O3k36R24j008j56j98M62O50q04N63q07J75o0J114m82
5116C13n9l58j71Q04o50N37l97J93q54J168k62o21J29J190k86k78J45j279N82
5135a54M23j30Or1P02o31L22m0K66n36m25J06J41j35L75M13r47K18N49L42n7m03
$$ y = [-515, 358, 95, 44, 504, 367, -355, 168, 171, 1052, -292, -64, -57, 354, 149, 445, 35, -316, -78, 901, 359, -663, -121, -602, 115, 690, -161, -231, 247, -650, 740, 88, 133, -560, -784, -262, -536, -385, -300, 297, 167, -331, -682, -16, -508, 332, 70, -55, 476, 463, 312, 64, 727, -624, -131, 136, -249, -670, -476, 278, -544, -481, -13, 330, -688, -658, 652, 296, 1, -534, 522, 110, -525, -276, 167, 593, -13, 20, -294, 521, -542, -142, -511, -850, 91, 58, 179, -284, 116, -434, 337, -61, 29, -357, 34, 418, -390, -221, -307, -67, 438, -588, 355, 208, 308, -364, -546, -622, 113, 176, -60, 864, -144, -300, -498, -36, 614, -190, 373, -434, -259, -319, 795, 313, 254, -104, -275, 529, -121, 416, 19, 212, -642, 526, 264, -357, -228, 962, 676, 398, 543, -736, -154, 269, 139, 145, 54, 756, 125, 447, 407, 673, 137, -288, -182, -41, -176, 199, 612, -335, -117, 432, 774, 717, 314]
5157C14k29P0J1q21R33j25L12p45M76k33r21Q65L72l3q55N81K6K75j33l41q7L89
5179A01p8L36PQ8j69k15m44O54k95J16k32L45j15M19k65n35Q52o86Q03j342L41
5200c14M01o59O08n12L10J02O61p83L6O78j007P77m30j42M68o03n21P5M20q7J071
5221E49k85m67L66n56O50m08N63j31K66j69m29P9M15j063R36j95K91n36K79m03
5241b48K41J80J86q64m7O53k01J84m55J240r12j26O03k90q51J133m70K36J31k21
5261A02l75L7M58j243J870p36n80Q41m45J4J037r19k12J18O42m57m55N41k0j59
5281E9k97l72R53p47K65K21l87K91l56N35n84L04k04J64M59o12P39j204P26j47
5301a94O24p03L92m61J26K14M42l29p16K80p59K694j885J28J1K27k35o64J231
$$ y = [314, 85, 155, 166, -655, 278, 153, 465, -280, 196, -37, -958, -93, 279, 246, -609, -28, -2, 273, 140, -201, -288, 101, 23, 359, 366, 454, 285, 70, -374, 280, -15, 101, -131, 214, 99, 518, 253, -282, 570, -116, 687, -655, -314, 87, -572, 36, -476, -166, -64, 597, -186, -150, 528, -479, 298, -132, -274, 194, -409, -930, -855, -435, -522, 549, 264, -203, 163, -393, 257, -151, 412, 281, 547, 378, -51, 28, 443, -620, 316, 121, 412, -124, 155, -248, -7, 173, 359, -505, -552, 101, -100, 84, -371, 869, -43, -169, 434, 144, -707, 426, -44, 192, 323, 102, -273, -236, 222, -1021, 849, 113, -467, 374, -71, -57, 980, 61, -151, -33, 609, 152, -303, 238, 218, 59, -238, -610, 343, -404, -139, 82, -305, -14, -370, 165, -419, -115, -319, -155, 304, -308, 431, -773, -47, -194, 430, -273, 119, -342, -216, -2, 440, 111, -605, -325, -1084, 1610, -275, -147, -136, 91, -144, -808, 423]
5320D23q59N71P21j108K89l6k39k65l05J280j48p2m56l64J098q23M33j06K29k29
5340C4j2Q29l15l87o71N53j04N35j03r4o70k14M37j45P81j334P42N24n23m4j21
5361c02L49n9M69k51l03N83m86m50Q45k12m94J131J57j221K01J98m4O57n29p1
5381A68p61R90j055J256m57k41Q64J12r46j21k36j26M72L20p99O64N94o58L51
5400C91k9k66K00p39l64R89k51rL45l67J51L07m57k38K91K2p37P29Q30q77n42
5421f21P18N66j208M94N26k81J27j87n4r8n19O02k59P29q55O35O70j322K26K03
5441I2j46n06N5L09J196l40l15k59n11M56j7n1j99J76m94O98j140J112k20N78
5461D74k60j81n5K24Q94j030r1j46O33j074J5M88k37N44q15R81n10M62K42j032
$$ y = [423, -436, 135, 856, -252, 37, 1, -238, -503, -808, 472, 324, 252, -204, -568, 530, -293, 140, 34, 263, 34, 22, 851, 536, 149, -522, 31, -73, 462, 359, 265, -405, -619, -182, -327, 454, -880, -138, 386, -137, -181, -302, 47, -12, 457, 206, -97, 486, 0, -450, 395, 183, -311, 820, 977, -244, -43, 155, 111, 768, 239, 168, -593, 397, -658, 598, 141, -100, 764, 876, -70, -191, -427, -553, -81, 239, -560, 104, 698, 40, 391, 362, 96, 296, -443, -807, 182, -69, -78, 267, -100, 51, 358, -99, -337, -46, -24, -761, -32, 798, -79, -621, 97, 663, -545, -51, 475, 194, 321, 134, 80, -18, -537, 65, -194, 535, -320, 315, 985, -337, -111, 92, -54, -560, -505, -196, 1000, 660, 345, 86, -425, 31, 14, -37, -236, -60, -554, 144, -996, 116, -104, 474, 214, 33, -22, 202, 1096, 66, -25, -171, 462, -612, -597, -109, -346, 198, -617, 364, -146, 316, 558, -474]
5481d74J62M91m99N40j07j00N2k07M48j06N11n35K67p94kJ10K54j90M35r1j73
5502hP32p85J02J79J3m69R9J48N95q38oN95r65J191l4J5p09K99m79J132l10m71
5524B6M16k11R9n38P63p69J26k21N74m91J02M95n01J26k76P62n10j48P1j4K61
5545A42l86J24M4k76N10n3l00L87j87L20j97m88j03N75J96R6m99L31J06r77J095
5566D60N2l36k35j2K65N89j065m49K18O38N21r52K73j81K11L4n07M59l79R75k81
5587B98Pn23N19m96M79j92j12L20m91R54j628O58J70J89L16j37p09N89m44J64
5607f9k02n5M72j028Q75m87P09m47P07o67N52n43M12J44q42O08J34k85n87J249
5627F50p44l25K49K23k15j08J30K04j40L08k16N79k15L09r00R36p84r1L4P92q44
$$ y = [-474, -312, 179, -320, 220, 113, 13, 65, -142, 306, 200, 711, 176, 443, -351, -353, -243, 11, -179, 256, 165, -8, 724, -61, 41, 220, 233, -236, -137, 11, 606, -232, -238, 357, -608, 583, 549, 564, -145, 154, -325, 807, 497, 26, 442, 231, 330, -208, 555, -214, -88, -309, 265, -226, -124, 371, -130, -4, -280, 482, -28, -176, -105, -119, 142, -244, -120, -76, -352, 158, 105, -195, 192, 5, 325, 128, -360, -463, 112, 308, 404, -95, 236, 342, -635, 460, 512, 176, -59, -71, 194, 783, -282, -731, -513, 125, 646, -306, -33, -214, -3, 31, -476, -17, -396, 579, 298, 305, -218, 301, -195, 284, 92, -20, 300, -191, 763, -865, -207, -37, 152, 468, 331, -378, 211, -233, -69, -271, -326, 146, -882, -7, -494, 215, -232, 475, -192, 360, -183, 229, 373, -469, 139, 273, -12, -599, 650, -94, -419, -170, 53, -162, -270, -140, 64, -76, 232, 16, 595, 380, 689, -211, 725, -59, -150, -116, 676, -168]
5648a68k6K48K86L0o08N86o42qnK65L90m11K27k32M87K33m29O63j004N24j97o08
5670c99P55n45L68j94L19j34o07k56k59J281m03J45j5K03p7m44L44j28J75P92
5690I21j397Q33p56J28M08j47n59P49L16J97p83N78o25K35ml77N71n24O59J92
5710F15q07K90Q6n19R66n61q49Q57J9K72Q51j518p01O61l05R78k01q82O79j19
5730a88J25n69K78M31n6K04M8p91P13l50M62K77j424O2Q66J60K54l83M27j013
5750d67Q65n7j97n96P19K76n67P80m03m30M45J85n38J27N48q23K05l53j56J82
5770b55J38M43L89q92N11n46O15N5n83l74J002j102J55O17o85P31J08l9j62K1
5790A47p19Q09M10M58j671J174p14j2N14l57l23J092m04k87q9M19k84k65J28o18
$$ y = [-168, -194, 54, 340, 370, -238, 348, -294, -302, -307, -42, 348, -63, 164, -68, 419, 652, 223, 886, -118, 406, 209, -399, 356, -189, 179, -15, 304, 170, -437, -693, -952, 329, -74, 71, 56, 259, 182, -262, 82, -46, 129, 921, -476, 357, -399, -271, 137, -10, -569, 180, 496, 693, -90, 488, -137, 98, 94, -283, 288, -236, 423, 615, -192, 98, 184, -335, 631, 70, -779, 78, 97, 369, 1220, -298, -999, -338, -643, 335, 134, -748, -69, -188, -63, -632, -354, 77, 21, 225, 273, -518, 195, -155, 307, 584, -840, -778, 88, 248, 502, 119, 546, -467, 398, 341, 144, -452, 267, 543, -24, 756, 353, -77, 368, 553, 15, 142, 690, -133, 72, -281, -437, -255, -117, 326, 715, -177, 334, -212, 403, 458, -125, -499, 503, -599, -444, 173, -512, 219, 327, 288, 126, 147, -572, 237, 647, 1105, -566, 608, -106, -118, 396, 39, -284, 808, 404, 117, 28, 447, 163, -102, 26, -592]
5810e92L68M78J65o60l27O24n97Q14p47J33L39m5m94R2P26L29r10O2J01O11k75
5831A95l45n61P84l25l41P09j42N35k61m6k34N72L17j484J030m56k72K18O81q81
5851c07q6j45R10k73n87R3j39K88L40N3j53k53L37l49J99n30N10P11L0m01n76
5872c28J097l62l88p5o09N7M47k45K23j15L83O82m34m80M93m58J97L97l4n90L60
5893B18m77M12r02J162j696R86L66m69M50n32K19J25N88r89L90n80J006m33R38
5912G82j317j27O77L74p73J99qj69R83n65O50p13k91R93n14q2k95k33R15j52K26
5933E60q29Q5Q00l98l41K46q47M95R13j448P31J00m21M55M26n7p26Q76j032K26
5953a86K32n49L35K06r1l05L01r7l29M67p00J481o34pj94k40o4k6K59l73J411
$$ y = [-592, -224, 254, 419, -241, -568, 56, -541, 273, -474, -341, -2, -47, -541, -449, 277, 606, -304, -242, -141, 470, 195, -150, -711, 73, -252, -593, 116, -26, 509, 248, 202, -32, 540, 857, -627, 403, -53, -325, -107, 574, -307, -393, -538, 372, 99, -488, -395, -534, -246, 94, 147, -6, -259, 78, -271, -72, -602, -92, 619, 649, 248, -328, 769, 407, 19, -56, -665, -608, -161, -406, -183, -298, 85, 767, 333, -147, 346, -112, 85, 482, 448, -142, 218, -259, 153, -749, 413, -1283, -297, 69, -400, 50, -482, -263, -138, 450, -539, -149, -729, 277, -156, 782, -535, -662, 15, 389, -384, -185, -193, -362, 621, 56, 706, -7, -298, 695, 181, 99, -196, -429, 486, 334, 560, -269, -184, 616, 218, -123, 123, -724, -229, 684, -764, -33, 67, -354, 101, 527, 470, -256, 620, -412, -186, 46, -503, -168, 38, -53, -358, -57, -154, -483, -16, -716, 765, 131, 124, -70, -310, -374, -400, -141, -514, 897]
5974H97j274K96k78O03n0p00M17k21L20n80K10J76K15k24N99m63J1k02O56p01
5994b93R67p98p7J60q0j81k28L61M58k21k13P60j344J032l82N5K99j104J479j428
6014g78N55O49j70lK01k46n21M77o24L81j36P83q78J041J73o59n69J88O80r43
6034c99M82k34K4O93n66J66l86L72N2K06n16l14OL9O49J31m94j58O32k77N4j05
6056E7M35p53k45R11m62Q8l67J92o93J424j169N27k08N32n14N56Q3o1L3J52o18
6077a00l47o34J553k66l63K67m68R00o02N98m55n21M36L88n46L23k54l51J61O68
6097C87j088M48M4K09n21M74l78k9P52l26Jk45N59j210J236j365J306l51R2O51
6117F46n87k17M35k06K50l15o76l1P83OM92p80K63N81p35N5j29K3j92K58k37O48
$$ y = [897, -377, -81, -359, 244, 194, -506, -89, -310, 10, -570, -360, -184, 31, -193, 406, -57, -46, -248, 408, -293, 674, -124, -201, -41, -121, -302, -530, -169, 289, 68, -145, 615, -729, 303, -79, -24, 275, -829, 650, -778, -223, 426, 256, 253, 454, 208, -313, 164, -460, -79, -215, 568, -310, 731, 904, 245, -324, -136, 544, -399, 83, -151, -127, 566, 0, 166, -220, 152, 204, 410, -106, -420, -414, -375, 274, 405, -89, -247, 385, 108, 162, 57, 492, -261, -506, 405, -57, 31, -336, -144, -837, 587, -582, -55, -263, 269, -245, 311, 394, 333, 366, 518, -100, -447, -1081, 472, 206, -157, 110, -358, 542, -60, 538, 83, -438, -2, 386, -160, 163, -91, -442, -281, 387, -701, -253, -209, 0, -521, -47, -425, -454, 298, -28, -27, -272, 287, -923, 313, -1052, 254, -97, -5, 646, 59, -158, 277, 71, 321, 6, -670, -701, 82, 88, 580, -200, 63, 644, -91, -36, -165, -142, -334, -76, -313, 335]
6139C35J41j83n74M67l02%L35j22m05J88l33P75M58q93N24q31j8K97k19j16J215
6160G39r93j99j21O78M5L83k67m39j67K26K61r7K58j75k49J386j505O2L28l38
6180a84N40o69M95J85n71K59m1k0o76Q47K01j15L95q79rm64Q89k11M28j58Q3k23
6202A02k29Q73n73o12P10J79O65q72J79j150N35m84J208M6l19J8k93n29J557n94
6222D17p45K7O42j26l36K24J76K9J30m56m8N94o20N2l69J424j014l23L76m8l31
6243c25l49P94m27M14m91J53k22O47J47j036J175l25p41k91Q60m11l91N28K05
6262h6m40m82Q50J57O94k28l4k42m37L76k14K02j88k38J82M54j91P35r22M64p81
6283c69j17O29J1k80j70j41J62n2K5N34L65j592J463j012L14N37p13L16l5N52
$$ y = [335, 476, 293, -281, 186, -116, -116, 219, 97, -308, -120, -453, 322, 780, -113, 411, -420, -438, -141, -360, -476, 739, -254, -453, -574, 104, 149, 532, 265, -174, -341, -115, 146, 49, 307, 132, -117, 1269, -236, -174, 154, -184, 356, -313, 182, 367, -204, 55, 14, -6, -682, 165, 366, 251, 646, -233, -242, -706, 183, -28, 400, 242, 325, 102, -127, 746, 173, -439, 271, 450, 1115, 243, 422, -728, -193, -677, 531, 577, 258, 276, -17, -546, 1011, 417, -328, -301, 341, 215, -121, 103, 279, 308, 438, -18, -66, 528, -92, -40, -409, 1015, 1, -322, 54, 6, -325, -674, 120, -307, 107, -384, -231, -453, 194, 341, -695, 480, 155, -586, -877, -17, -428, -819, -291, -86, -526, -1008, -158, -1, 693, 465, 431, 189, -248, 128, -86, 116, -72, -310, -128, 326, 135, 870, -52, 412, -369, -486, 143, 154, -126, -296, -437, -275, -327, -302, 232, 597, -995, 468, -544, -230, 307, -406, -90, -125, 427]
6303D27j236R98J02k21q40K64L91K54o86O01m43O85n3L47j482J320j15j05j59
6322D9k80P73r14N03m43P14p25J32k42J12j9K23O2M73o78k20M00M46j51o81O40
6343A74K87l85K1j9j82j09n4N23J7Q5n78Rn26R36O05j8o53L6j10k42P00o06J27
6366C8m02N85N2j327P52K69N06M02o17Qn35L93j84L23l15L63n47K46L10q36O04
6387H8j56m29J33O65r90J198n95p0L6M53k43J19J67M4p85M99j88pJ91m01O2L39
6409A30l76M62k47K34K29J58p18k0j00K35M74lN23k6p92J90k37J97l22K67R8p95
6431d39J232r99M73k01p6j68N8J083j113L91k98P21p54J59J36j38k07J89K6k29
6451a54N11j254M69P49q8n20L75l55J78R0p9K7O5n73L48k13O95o91J92o00J234
$$ y = [427, -809, 189, 291, 70, -770, -506, -115, 139, -547, 54, -389, 296, 243, 590, -892, 428, 313, 208, 49, -231, 542, -372, 131, -312, 402, -323, -191, -433, -321, -340, -117, -55, 418, -260, -480, -80, 366, 215, -466, 174, 461, 76, 97, 78, -104, -213, -267, 256, 273, 358, -220, -211, -737, 199, 804, 786, 133, 169, 59, -183, 517, -89, 38, -364, 221, 273, -1054, -302, -33, 473, 875, 258, 266, -269, 124, -60, 263, -52, 311, -236, 10, 320, -516, 88, -68, -497, -364, 301, -689, 509, -86, -156, -120, 333, 90, 209, 376, 420, -365, 134, -54, -61, 130, -271, -209, 130, -246, 216, -31, 203, 432, 590, -128, -148, -248, -13, 461, 458, 981, 955, 163, 353, 116, 313, -9, 258, 356, -439, 793, -206, 267, 66, -10, -178, -120, 963, -150, 241, -57, 664, -90, 69, 205, 67, -140, 49, 75, -154, 357, -897, -428, 321, 233, -287, 88, -267, -89, 1, -78, -51, 14, -559, -211, -424, 271, -420, -228, -828, 406]
6472D06p03m7k72R78K13M46j462M03J084p10L42r77J89K88N78r74N96k83j8k54
6492a77K36M87k2q16L61M19j45j20n10M74l16O0j09L32K96q9q63J78o7P11M0p03
6514c43nl8K75N98o46K76p05N87l31l7j62P34l46j69M92n54Q87k45L78o48n02
6535e04M60J17k67N70j84l27L09j94K48p95rN54L0r4p82J198j71l27l47Q85m96
6556a26N00l26l68N36o33P99o15O89p29lO79p02K66mL66k60K3nn0O25q66K86l0
6579E2m46N88k57n23O38J48n89N5P69m85Q46j446Q12Pq16O49p06J227m91J8O90
6600G40j194K87j87o07J424m23J0m21N48N7n93M40o4K59j80J24Ln33J61J39L82
6621C72L2j45J83l21J33J28m83O95j131N91K6P98q51K55J57m83j64j84k9K93J5
$$ y = [406, -297, -344, -616, 362, 575, 1021, -441, -38, 1046, 336, 678, -299, -110, 178, 756, -218, 378, 95, 77, -177, 59, 546, 524, -292, 69, 488, 343, 223, -287, 187, -129, -69, -178, 154, 450, 361, -502, -324, -391, 320, 360, -343, -348, -386, -111, 487, -159, 117, -588, -1, -332, -369, -531, 203, -143, -312, 180, -374, 513, 268, 646, -2, -504, -44, 73, -194, 376, 192, -135, 174, -20, 228, -567, -576, -22, 8, -86, -868, 330, 159, -168, -515, 370, -126, 374, 48, -320, 216, -417, 382, -233, 456, -273, -276, 403, -299, -33, -37, 329, 69, 92, 87, 37, 662, -204, 82, 52, -394, 194, -63, -586, 52, 200, -389, -334, 435, -50, 796, -650, 162, 169, -647, 2, -704, 523, 32, 50, 740, -454, -167, -354, -961, 463, 40, 50, -371, 177, 234, -359, 81, 17, 276, 96, 220, 223, -310, -149, -10, 372, 404, 259, 442, 121, 254, 382, -101, 594, -537, 54, 80, 878, 27, 282, 439, -44, -208, -392, -421, -128, -113]
6642a13K33J38n7K85k59l76J32J79n80L64l86J092l23k16N37m11n37J116j272
6661d54N18k04K21J91k05j44k33O48r66J295j347J85J192l28m58M03q52L82p60
6680i16Q17K91K02j497O71l4Q08n92K81j13k19N8p6P37n95P70q24L41m62M54j46
6701d4l35P82n42N14k56m85N40l00L05o62O18l91J35J30p26M38o87R22j45m6M24
6722A89k95Q09m63n48K81J33L00m40L8K89k82j51M16O6k54L39o75k50P20n98L71
6743eJ03k71l6J019p89m26j51J078j73o18L47k02O21j018R23L65p41m38O20m9
6763A59O7L47o44j98K04J81q16Q89J79q63J15O07r2L45j4p05Q39r02P07p06J40
6784a61r9O61m63j121M17N52K53j4K84l84J7j5n85J474q29p24P52J81q10R14l37
$$ y = [-113, 120, 258, 201, 486, 227, -149, -17, 162, -418, -54, -440, 652, 329, 113, 650, 239, -298, 818, -454, 64, -140, 81, 272, 67, -77, -310, 338, -628, 667, -680, -495, 697, 369, -89, 314, -538, -156, -916, -99, 192, 394, -1103, -432, -466, 342, -250, 31, -82, -301, -243, -319, 418, -177, 593, -231, 110, -352, 102, -44, -379, 403, -139, 375, 119, -366, 174, -126, 179, -483, 135, -256, -121, 9, -717, -279, -966, -44, -189, -235, 189, -106, 703, 240, -308, -27, 106, 406, -34, 4, 293, 11, -140, 276, 342, 88, 427, -248, -498, 222, -376, -5, 98, -173, -209, 810, 21, -405, -556, 522, 349, -269, 78, -124, 497, -521, 402, 767, 26, -412, 208, 159, 226, 573, -71, -269, -65, 116, -700, 189, 368, -495, -380, 227, 135, 480, 466, -239, 600, -302, 405, -301, -161, -260, 401, -62, -1183, -766, -214, 39, 25, 309, -75, -58, -73, -658, 816, -13, -737, 15, 196, -614, 300, -37]
6805c7n71Q5N44L4N6j49n40J95O46l71L48J97l99p18R65k16J14M23q12P41j174
6826f39M49O81k79j12k00N09j192J42L39N95n8p22J54M95j28J56L79j072O13m1
6846F9l2K08p80P48l36K29L74p94M00r07J371j55q48P35j93O5L33j275J133m2
6866C03k66P5k54K10kp74J101k84k47j42R3K38m92m10R86l66J00R18r90M18k50
6887c5l40n35P98K22l22q97J264O4O59j117N8r6R93j095N14o49M82M10p01L13
6907a0J61k86L15k58o49J411p61J06n65P25n35M20l89J73R40j101k71O81L71l14
6927A64r1O15j705R14K91p9k65P2l48N32L34p76N00m69l85R64J41l28M48j00j013
6948e84J19M14q7J198j867M37l29R75l33L08j57k30L12J96q42j20M15R93q24o28
$$ y = [-37, -608, -523, 21, 55, 111, -38, -578, -383, 263, -108, 240, 437, 38, -680, 285, 69, 183, 606, -206, 535, -639, -190, 491, 212, 100, -100, 409, -783, -641, -302, 293, 235, -487, -333, 162, 34, 190, 569, -503, 110, 69, 37, 245, -535, 213, -123, 106, 480, -314, 86, -821, 550, 395, -453, 282, 89, 154, 487, -788, 345, 303, 37, 112, -142, 68, 66, -708, 393, 109, -138, -280, -187, 51, -441, -851, 135, -231, -131, 787, -203, 215, -35, -375, -910, -112, 110, -212, -1109, 155, 219, 878, -239, -181, -277, 716, -379, 135, -514, -32, 378, -323, -10, 151, -135, 180, -78, -727, 684, -77, 29, -536, 189, -346, 74, -315, -142, 798, -303, -574, 107, 478, 164, 73, 688, -1017, -103, 188, 109, -156, -84, -432, 100, 434, -342, 158, -311, -696, 268, 409, 81, 529, 429, -584, -465, -51, -138, 1060, -807, -370, -699, 276, -57, 251, 94, -136, 176, 372, -470, -590, -175, 818, -6, -634]
6968f34J508j021p91J207K02k82J51J91K57n00o2J95L76q31P61j281K89K37k19
6987b47K41j91J215o72j449J341Q8k58n13K37L25K91n50N14p92J8P02j05K84k22
7007B57l02L38m73O80j179N07Kj61M88k80l23N04M84p10j25l58N50N30K6K85k49
7028D91m57k23k84J264p75K2j82N57j198N58K70j63K22J57P1L4n90j3k53O17L65
7049D90j087P82k66K69P33j101L88l92L85j09o8j05N7j30M6Q33r40Q32p69P50
7069E98l41n77K38L88n11M44n23K52L3l04K72k70M15k40L76k45M65o8j377R16
7089e9O3Q56j010J23J78q7l18M91l70O3P50l33J80j388J344L12p02K43m40m7K05
7110E4M8m24L65O0r4L16l95j93M15k03J67m45O01qn25K80n21L96K49m12N78mq63
$$ y = [-634, 874, -147, -938, 269, 471, 189, 340, 531, 788, 288, 226, 421, 797, -34, 727, -554, -265, -28, -247, -6, -197, 1018, 346, -1103, 238, 326, 68, -445, -208, 117, 408, -142, 372, -420, -402, 300, 195, 479, 257, -45, 293, -180, 500, -679, -172, -170, -331, 157, -123, -446, 58, 542, -168, -293, -651, -101, 429, 455, 740, 491, 34, -189, -473, 791, 16, 38, -144, 413, -785, -227, 43, -120, 102, 259, 330, 364, -226, -239, -492, 125, 490, -597, 185, -81, 188, 921, -180, 208, -184, 201, 92, 24, -81, -24, -154, -108, 725, -215, 617, -152, 598, 257, -320, -82, 306, -205, 239, -284, -32, 1, -303, -31, -301, 114, -126, 250, 5, 470, 402, -975, -59, 4, 860, -150, -27, 151, 64, -254, 237, -133, -70, 680, 347, 527, -861, 483, 795, 93, 336, -104, -151, 54, 102, -322, 43, 103, 9, 325, -70, -263, 152, -51, 116, -329, 272, 264, -261, 19, -502, -106, 143, -269, 309, 305, -558]
7133e58M07J05k61j64J024O1j37q50K85l8m4J85k92n0M12j65r0M1O0O64p64J27
7155d2J66k16J34R8J97m47K60m50K18O64P9m39o23P01m09n07N35J84p01M03k17
7176d12O14O5n38J80K44m80K20J20j89O89j60K28k74q43M39o93J275o71j32P16
7196C98q95R78n65l27j80M82M24l89N9m0L92r12N34L84n08j62P88p00O21l7p51
7217d06M44j91k02O35j352J530j77K67m47L95q78R23q30q2n7L27j25M41k09l24
7237c18j49L20o1J77j67M4L7J74P77o39k69R7j31K21o03M18p4L9K39j58n62N28
7259f0J294j384L35J41J57q1p94M66p58N64R1l5lJ49L32r33Q97j52r9K37J1q47
7281d72J060j427j23J029J09L62n87L40j12o76n2N52k93J001o20k3Q63o05J1p05
$$ y = [-558, -151, -46, -307, -471, 553, 614, 477, -373, -88, -126, -170, 15, -277, -327, 85, -80, -170, -129, -69, 595, -169, -42, 124, -92, 42, 140, 337, -110, 150, -300, -82, 582, 661, 222, -401, 300, -109, -616, -81, 103, -598, -195, -412, 202, 267, -271, -91, 153, -327, -107, 13, -176, 513, 353, 581, 307, -536, -97, -790, 485, -186, -318, 398, -497, 481, -84, -411, -591, -109, 315, -74, -15, -55, 337, -575, -41, 343, -165, -327, 461, -239, 382, 345, -406, 38, -153, -355, 280, -1072, 458, 281, 548, 101, 496, -382, 541, -289, -371, -428, -101, -226, 215, 6, -318, -467, -147, -208, -31, -198, -154, -117, 57, 834, 195, -74, 23, -108, 113, -490, -72, -146, -107, 132, -26, -588, -60, 1234, -150, 185, 326, 483, 402, -392, 74, -684, -120, -29, -64, -67, 82, 414, -519, 378, 226, 127, 364, 375, -472, 588, -839, -962, 67, 176, 538, -49, 291, 179, -497, -549, 3, -290, 711, 91, 68, 931, 326, 337, -368]
7301c68M64K32l74l87K78K31k58P44q21j61K71k05k01L03K63J250q78j91m75J014
7321G31o52j86O82L3p13L86K24l00j81K02P42j234m38O35n6j14J072j336J335
7340H32r96K80L37l58Q0j95l57K95P2j026O93L56k87M2K86N20m87N5L93q17K28
7361e4K04o0l34P39l15M20j286M75k53K17r3l09P49q42j46n0J174m22O13o59q1
7382c13M00L10O2k63J24R37j688J345r01j04L71n32K37k98nj21O02m67M16N40
7402F52n90l27M31M63j1j471Q44K37k33m05P55q02p07J101M07j87n86L49J09l91
7422c62N94O51p13j06J73n0M94o93L62N16o62j26l58R03r81j87P35k80J038j014
7442f6n43L24Q45K67r62l07J58qL16l54M64K31n20R8l71Q17n3l28r44J329n95
$$ y = [-368, 96, 328, -46, -433, -155, 76, -182, 562, -259, -420, -149, -354, -555, -252, 11, 1261, 383, 192, -283, 731, 79, -107, 575, 608, -105, 281, 505, 205, 24, 226, 968, -266, -704, -69, -125, -239, 833, -503, 832, -164, 116, 453, 95, 175, -20, -377, -82, -10, -1036, -343, 13, -274, -232, 54, 574, 87, 142, 535, -282, -54, 150, 90, -244, 495, 180, 600, -686, -211, -464, -247, -340, -649, 100, -742, -888, -938, 236, -186, 427, -232, -313, 87, 397, 459, 196, 320, 1257, -431, 914, 13, -91, 280, -252, -15, -313, -318, -439, 163, -304, 112, 652, 62, -265, 166, 629, 618, -853, -9, 228, -5, -410, 345, -457, -1164, -63, 344, 157, -429, -80, 29, -362, 232, 883, 170, 64, 237, 187, 681, -12, 350, 866, 204, 78, -280, 623, -358, -545, 190, -90, 948, -66, -609, -285, 560, 827, -135, -442, -284, -292, 24, -330, 134, 365, -155, -57, -428, 389, 336, 8, -936, 393, -202]
7463b02L32j43J07L69p63o1N08M40n6o60O69l68k3q72R31P6q76P28l82PoN2P57
7486E64j224M20O49rp13K52m18J356k03j114L18K04Q95j095K60j34j89K88N2J83
7506C42j24L24n38R05j296n0M89r0M55o78N99R5m02O30k58q73P41n01N54m52O87
7527E59M3n94J21m4N05l97k37L3k46L70L59j32k82qN2j213P49P21K94q75M75k67
7549a4J59l37K97R1l49N09o2l78L04n17K30L17k36q8l49J27K23J135j030j74O67
7570E25o84M94j84Oo75K71J15l12J166q45L02K30L86o02M13o69K36l00N74j071
7590f24L83L12j60o18Q93j97K88J01m48M69J99p04J10m70P95r84N26r2L5r8l66
7611f50J547p56j19K99m95j76K56m82J175j154R66o05N26J44o09K47k20o2P19
$$ y = [-202, 130, -13, 94, 463, -300, -361, 147, 587, 531, -129, 540, 172, 149, -723, 208, 284, -592, 136, -246, -239, -245, -193, 564, -660, -240, 409, 400, -313, -61, -479, 877, 674, -440, -122, 82, 977, -118, 142, 8, -181, 107, 159, 342, 218, 542, 4, 909, -387, -437, 52, -38, 417, -261, 338, 433, 31, 661, 403, -470, 271, -230, 324, -128, 559, 602, 8, 129, 85, 590, 193, -44, -11, -257, 113, 472, 340, 58, 50, 102, -1111, -362, 359, 653, -222, 253, -14, 145, -192, 105, 196, -153, 356, 294, -84, 220, -297, -67, 250, 14, -74, -423, -296, -73, 1062, 32, -142, 525, -159, 335, 151, 157, -518, -247, -132, -444, 722, -123, 179, 409, 795, 193, 606, -63, 173, -127, 447, -624, -241, 71, -89, -707, 186, -11, 277, 378, -70, 399, 598, -106, 4, -466, 329, -655, -129, -221, -186, -284, -650, 897, 141, 22, 321, -174, -350, -94, -576, 599, -555, 411, -194, 332, 476, -133, 114, -106, -168, 551]
7630E51m75N5R46n05K25j130N00K12j200M73M83m04N84l25J25p77J148q01O17
7649C02j08l97J71J06q08P04O16k28K15k09n17M81O8j95j81m38N07o3p20M89L78
7670A73m25J45K60p8m97K61r20J100K05j74K68l12J36p7M30k56j049P21L78m24
7690a35k65J82r53J131J39M34n69j72r5Q37%j23j34j04j60k19L6J78N77o47q4
7711a46L4M35n01M28k13k6p41J382m22j55K92l67n47N76M31q01N50o63M98J06
7731A50J49k93L34q02j57O80j9k37l23J220o79l05j01O78j99l13r22R23o97J393
7751D80k18J32k20n87O05L14m92l81mN04j48m20J84j20N19K14r7n30N9P8o5n5
7773b48L81K77m20k30N40K01j66m53O7n64R37L90j021O03n78J89j14M99k68K7
$$ y = [551, 76, 131, 1077, 572, 797, -333, 167, 379, -821, -348, 135, -269, 315, -10, 115, -662, 486, -315, 302, 194, -203, -32, 74, -734, -30, 586, 358, 573, 364, -153, 328, 396, 201, 20, -418, 89, 26, -694, -205, 173, -252, -107, 153, 75, -422, -161, -1081, 19, 224, 50, 318, 6, 142, 65, 495, 239, -810, -89, 289, -135, -400, -218, -1171, -40, 99, 533, -36, -208, -303, 534, 534, 411, 277, 173, 13, -206, -170, 8, 585, -62, -146, -112, 323, -178, 250, 37, 11, -730, 652, 230, 75, 367, 0, -547, 29, 460, -341, 209, -454, 44, 150, 299, 6, 340, -462, -619, 61, 42, -195, -518, 702, 23, -282, -383, 295, 96, -217, -1139, -216, -913, 480, 262, 394, 174, -413, 192, 506, 14, -367, -371, 133, -15, -435, -251, -371, 148, 362, 265, -265, -206, -128, -193, -248, 133, 410, -10, -240, 300, 501, 335, -118, -51, -615, 322, 712, -309, 294, -284, -95, -209, 290, 22, 49]
7793D9Q66L2l40o75M37n83M39n84L45l60j1M80m77j73O31K15Q5q68J247l31k63
7814A61J54m69O7K79l79M50r67Q36Q20j288N23j94j98N95N04o50L64p48O92r78
7834d26M11K63o47r5L38j54K87m37R75p00o5M50K8j003N65k32R75p79j30N02o00
7855d74R14k93l47Q28r39N84k06m11N28J49K64j155R45k85p83J612r88l11K63
7874a05L07q8J98j35k17q33O61j34n72R56J56m73Q16l99p91K16M57Q34j190O35
7894B99l32P91q33L61j44M59p01Q32q28J58N84q64J24j13j69M80m77m98J328m77
7914b0l69R2O80q65N95n80N69k7m06O47l28m93J63J80O05n92j05k49L73J12o52
7935f70M24j03l15M07P09q6j26m0m07j16K10M42l15p21L94J70L48n41j06J116
$$ y = [49, 915, 947, 607, -68, 369, -214, 225, -359, -14, -374, -385, 95, -382, -555, 76, 291, 376, -492, 755, 424, 161, 315, -154, -87, 192, -187, 263, -704, 132, 952, -336, 187, -7, -205, 390, 894, 244, 608, -140, 552, -426, -15, 248, -399, -494, -156, -310, -23, -460, 515, -185, -250, 200, 228, -775, -210, -442, 533, -246, -376, 126, -474, 440, 147, -200, 628, -311, 273, 67, -344, 184, 333, 597, -558, 387, 102, -681, 931, -57, -368, -105, 202, 114, 312, 177, -40, -873, -212, -346, -918, 38, 194, -279, 537, 138, -653, -437, 20, 854, -336, 299, -33, 758, -75, 286, 142, 601, -100, 732, -96, 62, 646, -218, -94, -207, -376, 104, -373, -871, 457, -20, -389, -297, 383, -482, 113, -467, 102, 75, -331, 316, -12, -505, -342, -162, 443, -149, -254, -503, -130, -18, -670, -246, -349, -664, -257, 452, 366, 240, 200, -207, -323, -113, 329, 14, -707, -313, -143, 205, -336, -442, 674]
7955F74o58N13p62r0J01L80o01R47n50R5K87n2K02j41m96j1p7L70J09k17L28p88
7977d37p63Q49O79k73K19M7J06l81l5M1K90o03N20j074P84m74P48j083J220J92
7997E72j004M34M16Q5k73l7J10l82L79q81L36m31J096k53n51M53j097J638j412
8016h02J178n79O8RL6p3j3J99j58n7J282q16n7J20m23J63j19M17k71k83L82M07
8038F10j494J291j105J137j376J395M8r80p2M67K31J04l5l26j51O53m8m85n9J61
8058c4L89n57Q26n54r4K37O9l37N09p14J53p4P06o39l60J95J81o27N32j0P6M28
8080C01j83K47K92q55K18mj09L51J6j74P6l80p5O46k35L5k73n06J00J10N45K20
8102C63q97N40K13K55J96j210N73O68J9j078j41O62N6n48L59O43o09p1o9M48l33
$$ y = [674, 16, 529, -233, -323, -222, 158, -443, 504, -46, 49, 336, 284, 486, 345, -151, -162, -239, 131, 240, 23, 351, -437, -1200, -351, 328, 55, 274, 321, 427, 46, 11, 52, 342, -261, 259, -815, -31, -505, 243, -840, 380, 572, -432, 2, 418, 503, 230, 193, 303, -79, 300, -581, -245, -676, 420, 167, -384, 69, -1028, 610, -802, 376, -203, -135, -126, -90, -163, -176, 23, -135, -192, 1090, 274, 217, 337, -86, 77, -42, 375, 104, -179, 203, 610, -884, 407, -698, 439, -937, 458, 506, -474, -546, -79, 152, 256, 221, -105, -256, 397, 349, -136, -195, -34, 355, -202, 624, 70, -24, 213, 282, -55, 454, -260, -107, -181, 525, -114, -474, -279, -98, -725, -193, -203, -127, 301, 118, 365, 657, -198, 20, 16, -93, 258, 274, 100, 176, -204, -279, 367, 132, 167, -106, -612, -512, -402, 143, 363, -534, 6, 219, 474, 670, -540, 33, 701, 720, -358, -499, 163, 219, -329, 30, 673, 64, -7, -76, 372, 39]
8123C9n42q4k85J203o07Q55k77q00J107k97n55j9M74L67o04k6l44N26J22Jq24
8144e70N54j91L9J631j424J17j152Q87L7O75j094P33p29J47qm55J201n02m74J211
8164F33j189J104l09o56l42N94N68p35J00L25k5J17j73L48j33N3p83l4P51r7O9
8185A86j27M12l05m08l00O52
$$ y = [39, -503, -587, -872, 331, -276, 579, 302, -498, 609, 312, -243, -262, 212, 579, -25, -51, -395, 131, 253, 254, -570, -16, -207, -168, 1463, 39, 156, -996, -109, -72, 603, -491, 242, -487, -340, -348, -803, 398, -104, -578, 633, -556, 548, 239, -417, -759, -165, 403, -332, -232, 93, 68, 185, 12, 360, 227, 280, -503, -537, 214, 117, 186, 59, 471, 166, -242, -542, 110]
8191A10
$$ Imaginary data points
##PAGE= N=2
##DATA TABLE= (X++(I..I)), XYDATA
0@%%%%%%%%%%m8R6r6R6j44J92j93K41l36L88m43N83p20Q16r60J145j303J497j736
29i25J982k259K589k965L356l778M256m791N367n996O696p465Q295r199J0199
44E362j1283J2459j3757J5178j6721J8416k0299K2374k4651K7191l0049L3257
56A7477l6884M1054m5895N1574n8368O6669p7074R0549j08786J35008j76122K50180
68A49382m24614J556060J079547l510023m52181K579789J265412k739129j967272
77b463029J862762K646883j147729k694003L66931K878969K50512k828019j209928
86b336651K430228J764766j749158k044875J441414K579551n26391k691110k75263
95a407489K407050P73887k358270j469523J929859K049681j278639k261655O60473
$$ y = [0, 0, 0, 0, 0, 0, 0, 0, 0, 0, 0, -48, 48, -48, 48, -96, 96, -97, 144, -192, 196, -247, 336, -384, 432, -528, 617, -686, 811, -925, 1057, -1202, 1387, -1578, 1778, -2000, 2256, -2535, 2832, -3164, 3532, -3933, 4362, -4837, 5362, -5921, 6538, -7219, 7959, -8762, 9654, -10645, 11729, -12922, 14269, -15780, 17477, -19407, 21647, -24248, 27326, -31042, 35627, -41447, 49102, -59684, 75324, -100798, 149382, -275232, 1280828, 2360375, -1149648, -1601829, 977960, 2243372, -495757, -2463029, -600267, 2046616, 898887, -1795116, -1428185, 1450784, 1701296, -1126723, -2336651, 93577, 1858343, 109185, -1935690, -494276, 2085275, 1558884, -1132226, -1407489, 999561, 1773448, -584822, -2054345, -124486, 1925195, 646556, -1615099, -954626]
104i54626K349240j43833k477538o68333K209956J291170j718428j585228J465717
113b31903K101882q37237k328086J32822K212197L45370k146338r08930J940121
122B79898J534013j414500j888168Q43735K021493m29509k280148k87975K169563
131E48402R28511j778271j250706J541835J733056j026881k046227L51440K033318
140A034477J63799j978333o55389J872898J237400j473810j616527R62448J736549
149A283512o00131j962219P775J948092O10373j642170r53469J439559J367283
158A498605j088790j719469N32703J777321p3853j735046l25800J689212Q46113
167A400996j396098j242274R61928J396441o65115j632611K11200J720651L22520
$$ y = [-954626, 1394614, 1250781, -1226757, -1895090, 314866, 1606036, -112392, -1697620, -231903, 1869979, 1032742, -1295344, -1162522, 1049675, 1395045, -751293, -1660223, 279898, 1813911, 399411, -1488757, -645022, 1376471, 946962, -1333186, -1621161, 548402, 1476913, -301358, -1552064, -10229, 1722827, 695946, -1350281, -998841, 1034477, 1198276, -780057, -1435446, 437452, 1674852, 201042, -1415485, -453037, 1283512, 683381, -1278838, -1271063, 677029, 1287402, -354768, -1308237, 131322, 1498605, 409815, -1309654, -776951, 1000370, 926517, -808529, -1134329, 554883, 1400996, 4898, -1237376, -275448, 1120993, 455878, -1176733, -965533, 755118, 1077638]
176A077638j529586o39088J384736R88522j146881j348216P02211J492460k81885
185F99911j524103p6440J564429N43593j416457r57705J084685J159440q27884
194B49469j393765M49255J536822M0773j441961m00106J330571P44389j164012
203d8565j102090Q37582J319802m57440j382316J42849J440573K54188j372327
212c67744o74912J106513R18413q77176j166584N75460J362360j54661j359880
221f38211j97016J278016M99586j158274q26686R01386J070682n49857j153365
230g73739K68121J239105P3573j237728m47871J062148O81920q92993r00617O72177
240b55904J095610l38153j155803J4233J126146K64898j079191n81686R20850
$$ y = [1077638, -451948, -1091036, 293700, 1282222, 135341, -1212875, -510664, 981796, 699911, -824192, -900632, 663797, 1207390, -209067, -1166772, -82087, 1077353, 249469, -1144296, -695041, 841781, 882554, -559407, -959513, 371058, 1115447, -48565, -1150655, -313073, 1006729, 549289, -833027, -690178, 750395, 1004583, -367744, -1042656, 63857, 982270, 105094, -1061490, -486030, 876330, 721669, -638211, -835227, 442789, 942375, -215899, -1042585, -141199, 929483, 379626, -773739, -505618, 733487, 807060, -430668, -878539, 183609, 865529, -27464, -928081, -255904, 839706, 501553, -654250, -640017, 486129, 751027, -328164, -909850, 11000]
249A1000Q51950o56897r86732M24600J104586j35680j144587k01750J044327M64852
259G75669r05831o97574P32353R18335m68706j042013J80506J066079P1279j064006
269d33909l54625R64458O25116p62523q05940N47207R55281k88079j052857k1323
279f27194J035054L00640r47975n34762Q15330P59988n92565r08715L25113R63973
289E88887o9108r79335k03981R23186M68596p81262o64695O04831Q12655l99420
299C00354r22268J41991R39040J10767q86522l41611P93469N68997o30174p46441
309f72398M18718Q52527j95593r01361l8909Q89239K83571p94365m85863O48404
319C970O49353m70577p83995K44868Q47365j6577q50821k03645Q02443M12743
$$ y = [11000, 862950, 206053, -780679, -356079, 748507, 612827, -531760, -733510, 310817, 775669, -130162, -827736, -95383, 822952, 354246, -687767, -507261, 558818, 630097, -433909, -788534, 175924, 801040, 38517, -767423, -220216, 735065, 446986, -605871, -627194, 407860, 708500, -239475, -774237, 41093, 801081, 208516, -700199, -375086, 588887, 519779, -459556, -663537, 259649, 728245, -53017, -717712, -112881, 699774, 300354, -621914, -479923, 459117, 569884, -316638, -658249, 135220, 704217, 74043, -672398, -253680, 598847, 403254, -498107, -537016, 352223, 635794, -158571, -644434, 3970, 653323, 182746, -601249, -356381, 490984, 474407, -376414, -580059, 222384, 635127]
329F35127o94371n93476N27153P25424l27343q06503J07644Q42057J34485q00135
339b49938l54330P07833N43807n66574o97422L76985P88444j61922q20024o1725
349d94866P89948K75954p08374m76847N71621O30455m02369p37380K08254P94822
359D51218L622p83853k07937P19003M01128n99717n61037M37840O82653k42378
369C00542p49847L5069P60061J67066p13824l56316O08202N09812m63774o27526
379e30535K84333O95559r0500p14904j07060O85616K92884o07806m54355M92394
389e4374N83800l37112o64507J59329P04190L4007o88468k24555O23310L99266
399E34886n15102n44992L66833O44150j96714o96400J0305O90816J69880o36153
$$ y = [635127, -59244, -652720, -125567, 599857, 272514, -533989, -426345, 415712, 550197, -249938, -604268, 103565, 647372, 80798, -616624, -239639, 548805, 386883, -433141, -494866, 295082, 571036, -137338, -614185, -42564, 587891, 185522, -551858, -343604, 451218, 454840, -329013, -536950, 182053, 583181, -16536, -577573, -139733, 542920, 300542, -449305, -414236, 345825, 512891, -200933, -557249, 50953, 560765, 96991, -530535, -246202, 449357, 358857, -356047, -463107, 222509, 515393, -92413, -546768, -54374, 529426, 192314, -472193, -312864, 391326, 425333, -263135, -487690, 135620, 534886, 19784, -525208, -158375, 485775, 289061, -407339, -397034, 293782, 463662, -172491]
409a72491l40627N34956M84659l97472n91630K35947O58649n6380o75810j17155
419d37354O45683K88801n64984m34784M43967N49524k87099o26006J06146O53066
429C36960P4849o32468k53432N64233M02793m55404n20816L09901N93335j46904
439B73047o21771k4720O06714J94612n43563l41242M51370M66586l26958n53433
449d19358J81303N98699k3811n98620j34299N55785K85560m73224m18485L49514
459i6936N12988k10309n75716N3407N92283J05515n59123k49515M87822L74370
469D34786l81391m73914K45692N37875r2918n57452n5325N50427K05716m97444
479h3948l39990M04783M39240k92144n14700J51673N53281M795n44493j57114
$$ y = [-172491, -513118, 21838, 506497, 109025, -482605, -246658, 411991, 355611, -320199, -437354, 208329, 497130, -67854, -502638, -58671, 490853, 203754, -422252, -316106, 336960, 411809, -220659, -474091, 90142, 492935, 37531, -483285, -173384, 419951, 273047, -348724, -373444, 233270, 427882, -115681, -456923, -5553, 461033, 134075, -419358, -238055, 360644, 336833, -261787, -396086, 159699, 445259, -27965, -446450, -96936, 416052, 205743, -369973, -316566, 275717, 381232, -177891, -427406, 60416, 434786, 53395, -420519, -174827, 363048, 270130, -287322, -342647, 207780, 413496, -83948, -423938, -19155, 420085, 127941, -386759, -235086, 318195, 322990, -221503, -378617]
489c78617M96515K92055m22810m15859L07817M96838j69185n31860L5385N38382
499B48661J11830m97058k49378M17715L57381l17742m42768K00607N04684n9942
509B73990n18614p6020M91678J96027m45007l18474L47824M10027k23853m64243
519c26665J00299M94406M0210m89631j79949M35361K89349l55387l74530K61908
529a04629M47373j29781m71530j127M58674J19914m35932k45524L70199L50770
539C58407k72154m14109J70593M59030n5541m78519q4758M40918K01315l78800
549e3618l00390L05346L96847j88872m48233O3861M56323M6107m46766j63881
559c33276L99950K78347l08064l47129K12641M01303j09074m43396k4362M29818
$$ y = [-378617, 117898, 409953, -12857, -428716, -120899, 375939, 206754, -325106, -289721, 248661, 360491, -136567, -385945, 31770, 389151, 71409, -371359, -170752, 333932, 273990, -244624, -320644, 171034, 367061, -77946, -396420, -48596, 361431, 137578, -326665, -226366, 268040, 308250, -181381, -361330, 74031, 363380, 7993, -366537, -104629, 342744, 212963, -258567, -259694, 198980, 318894, -117038, -362562, 7637, 358407, 86253, -327856, -157263, 301767, 246226, -232293, -317051, 123867, 325182, -53618, -354008, -48662, 348185, 159313, -288920, -225059, 231264, 277371, -169395, -333276, 66674, 345021, 36957, -310172, -97531, 303772, 194698, -248698, -273060, 156758]
569A56758J36841l90244k28299L40476L24681k47761l91904J28202M09455k2973
579B15232m17374r2804L99207K20410l25969k98186K47709L56872j63987m07179
589b66069M3441M07321O8748l71006j55994L34796K53991k66359l38538J60715
599a28954L69469p7955l92462j9848L99446J37865l43979k24953K79565K90166
609B88360k08350l59596R9796L90689J7473l72490j03750L57072J96032l07436
619b200k87404K12231L24425j28747l52853L8075L75715P6776l47070j73230K94429
630C0147K38364k47667l11156J63054L59412n1569l53140l0256L46283J25215
640B68687l17702k30659K38150K88667j60106l22765Q6867L61241J7245l47854
$$ y = [156758, 293599, -96645, -324944, 15532, 340213, 92452, -299452, -171250, 238205, 215232, -202142, -294946, 104261, 324671, -1298, -299484, -51775, 305097, 141110, -266069, -222628, 184693, 253441, -117565, -273559, 61237, 315228, 48869, -289669, -128954, 240515, 162560, -229902, -249750, 149696, 287561, -56418, -281371, -1806, 288360, 80010, -279586, -179790, 210899, 228372, -144118, -247868, 109204, 305236, -2200, -289604, -77373, 247052, 118305, -234548, -196473, 179242, 256018, -91052, -264282, 30147, 268511, 20844, -290312, -127258, 232154, 180585, -172555, -202811, 143472, 268687, -49015, -279674, -41524, 247143, 87037, -235728, -148861, 212380, 229625, -118229]
650a18229j15772K94945J74711k57704k49386J86883L12816q5357l21064R790
660a68367L27103O8796l23759j68430K66696K32057j94588k67932J35677L18016
670B25269l5759l29479o6814K94312J31950k70963k08164K23156K77997j33304
680A08201k97562N8194L02246J1093l11038j11342K70022J88430k10460k29660
690b21876J67627K88537q9900l17149o801K97992P3200k80104j43341K47175K27872
701B43232j67633k65880R0416K80941k9498l06240o3292K83712J41148k30131
711b3225j83254J90078K37475j25321k78815L2581K72663L5435k63103r8552K53973
722D9935J83237j94331k29475J28305K48490p6273k77474r402K72637R7069k31538
$$ y = [-118229, -234001, 60944, 235655, -22049, -271435, -84552, 228264, 142907, -178157, -168367, 158736, 227532, -96227, -264657, 2039, 234096, 39508, -228424, -92747, 225269, 189510, -139969, -206783, 87529, 219479, -51484, -259648, -36492, 241505, 108201, -189361, -131167, 171079, 182172, -128866, -240208, 29814, 218244, 7784, -221876, -54249, 234288, 144388, -172761, -179562, 118430, 191630, -88474, -231815, 15360, 243232, 75599, -190281, -99865, 181076, 151578, -154662, -217954, 65758, 206906, -23225, -206479, -16401, 221074, 95753, -183062, -150481, 122182, 157617, -105486, -204038, 49935, 233172, 38841, -190634, -62329, 186161, 109888, -167586, -176988, 95649, 192718, -38820]
733c8820j49879J97746K03437j50697k58568P0433K61619m882k55445m9591K52084
744G7437J30345k06049j85636J46278K13178r9395k52577L2701K70621N0884k44716
755f6929j02438K18019J55360j84870k17904J08087K38245l9414k42540j7110
765a51494K50502R3904k23110j57771J70979J87825j29267k20905P1146K47588
775A39397P963k28372o4362K09637J17515j90996j81179J35159K15982p6235k24948
786a40439K6550K36956M1891k26273j12087J78581J52625j40280j92287R2634
796h2129K28748k1188k25211l4721K11534Q0987j96735j37556J51721J80350r3213
807F2587j95106M9817K13017J0755k20899p8273J90994J20558j63141j59765J26542
$$ y = [-38820, -188699, 9047, 212484, 61787, -196781, -126348, 135271, 130389, -125056, -174647, 77437, 207782, 1733, -183903, -37625, 175553, 76158, -176419, -143718, 126903, 177787, -66929, -169367, 48652, 204012, 19142, -198762, -90675, 147570, 108156, -134384, -151494, 99008, 192912, -30198, -187969, -16990, 170835, 41568, -179337, -108191, 139397, 147360, -81012, -145374, 64263, 181778, -9218, -190397, -55238, 160744, 84509, -140439, -113889, 123067, 164958, -61315, -173402, 5179, 157804, 17524, -174763, -82129, 146619, 125431, -99780, -134501, 77033, 158020, -38715, -176271, -24550, 155800, 62587, -132519, -82702, 130315, 141070, -79829, -158102, 32892, 153450, -9691, -169456, -42914]
818d2914K00301o3455k11120K786K02221M7224j97181j08476J68381J60691j18261
829D0197j80527P8855K00589k6316k11902l7330J91169Q4651j64784j25558J37046
840a3910J71056q7037j96577L1994J97386J1198k00969o5322J81420J19278j37951
851A0566j49874R7193J78014n1480j96319r803J90203O1095j70699r8149J50408
862A1155J42364j09298j69466N7364J74913j4993j81660l7363J75582R0642j46454
873g214j29119J15177J56288p9187j82352K6517J84997K5904j70243o8017J54945
884B7696J15685j20866j51804P6220J68312l5404j78440r454J78060N8101j55464
895b7358r7344J26299J26327r4630j58283M7472J72170j49j69557m0925J62793
$$ y = [-42914, 157387, 93932, -117188, -114402, 87819, 135043, -62138, -170614, -2233, 158458, 40197, -140330, -61475, 139114, 112798, -99104, -136434, 54735, 139386, -25398, -150956, -13910, 157146, 70109, -126468, -94474, 102912, 114110, -86859, -152181, 29239, 148517, 10566, -139308, -42115, 135899, 84419, -111900, -121703, 68500, 129595, -41104, -139253, 11155, 153519, 44221, -125245, -67881, 107032, 92039, -89621, -126984, 48598, 139240, -7214, -136333, -21156, 135132, 55945, -126407, -99890, 85107, 111011, -59232, -127249, 27696, 143381, 22515, -129289, -53069, 115243, 79839, -98601, -108055, 70005, 128106, -27358, -124702, 1597, 127924, 33294, -124989, -77517, 94653, 94504, -75053, -115978, 46815]
906D6815Q6256j40951j25228J03034J48108o1388j61701J7463J69237L4670j55943
917c9628p8797J34619J10946j09037j40446P0120J56259k7238j58202j4467J53488
928E7617N4930j37407r8047J08714J27173p6061j46816L8727J62786N042j57703
939f1045m6811J42178Q2680j16809j16122Q2809J40306m0273j51404O92J51887
950F8088L7868j44989p6168J21371J03618r2740j25916N8637J42432j7870j46912
961g2581k3659J41788O1907j27215r6412J03960J24541o8071j40546L1488J45549
972H0749R190j40980n0903J24471Q6438j00721j14248P0264J32743l6078j42246
983h1321k065J39660L5177j26555o8868J06687R8364p6756j19083M4570J33144
$$ y = [46815, 133071, -7880, -133108, -30074, 118034, 56646, -105055, -87592, 81645, 116315, -39628, -118425, 16194, 127140, 18103, -122343, -52223, 104036, 76798, -81404, -95871, 57617, 112547, -24860, -122907, -14193, 112980, 36919, -109897, -71170, 91616, 96658, -61045, -107856, 34322, 117002, 193, -115929, -33120, 107186, 66913, -84491, -83799, 68088, 105956, -39033, -115201, 6170, 109788, 17048, -108868, -50231, 92201, 74331, -72581, -96240, 45548, 107455, -19760, -116172, -12212, 112329, 44258, -96288, -64800, 80749, 89939, -51041, -101944, 22527, 108965, 8244, -106004, -35740, 97003, 60925, -81321, -83386, 56274, 91451, -35104, -103972, 2715, 101079, 24323, -94760, -50190, 82954]
994H2954q373j37217k7726J30995O1923j12788q9711Q6266J11681n3696j26330
1005h2022J5900J29259J9652j24262n5000J10970Q3377q9859j04608O1104J18836
1016H3347k8574j24788n137J22762L9375j09998p0634R2752R7748o6949j16559
1027h6655L6763J26171m290j26273k9339J14758O0652r5776q8805O9921J07073
1038H4200m0349j19669Q843J21667K3302j14716n0869J00147P6453p7872r5313
1049h4176N0590J10474j9824j15413j2107J12987M2726j02040p1565Q4185R2326
1060H8163o0249j06211K8492J11690J971j08411l4536R7711O3653q1976q5624
1071h5327O0458J00775l3728j07629O616J08207K2046r9061m8291Q4884P2259
$$ y = [82954, 74581, -62636, -90362, 40633, 102556, -10232, -99943, -13677, 98004, 44308, -82022, -66122, 63137, 82789, -41473, -96473, 14497, 97874, 8015, -96593, -35489, 83347, 54773, -70015, -75152, 47610, 86985, -23013, -93647, -895, 96853, 29904, -86655, -49892, 76279, 71989, -54284, -83623, 31135, 91787, -3989, -92794, -22873, 84200, 43851, -75818, -66975, 54692, 77994, -36722, -87591, 12556, 89009, 11137, -84176, -33586, 76888, 57064, -58349, -70456, 42531, 85257, -16783, -88348, -4163, 88163, 27914, -78297, -49805, 61885, 63856, -44555, -79091, 18620, 82273, 297, -85327, -24869, 75906, 42178, -65451, -58835, 49372, 71418, -27643, -75934, 8950, 81209]
1082H1209o4861r1816L9913J03899j2270j08987j6735J03820M3064r1947o6034
1093h0745P1044Q4289m5813r7182J8367J02194R981r9337l6489R0879O0426p5147
1105B467p6716N4451R0358k9891r6137K871R5830K4372r0238n0616P6629P2265
1117G5645n9728q7136L5316R6993j1083r7914j6931R0929M1481p5577o3800N9263
1129a2542Q0646l5806r0549J3003R3273J0432r0565l1696Q0115N3075o4345o9227
1141f4186M3095Q1750k1005r0695m196Q8799K9246q3713m8518O9294O8289n1640
1153A6520p9529K7664Q5103k279q5413k0783Q0310M5280o8427o1690N2863P3700
1165F3319l4852q2647J1343Q5079J0070p9317l2145O9879N3292n7235p0520L7698
$$ y = [81209, 16348, -75468, -35555, 68344, 56074, -52913, -69648, 34172, 77236, -14711, -80745, -9701, 74588, 28775, -68407, -50040, 52154, 62135, -37202, -73691, 17188, 77614, 2467, -74249, -19798, 70560, 40669, -55468, -52597, 43233, 67605, -22633, -73249, 3380, 75645, 15917, -71219, -35903, 61090, 50007, -47907, -64838, 26091, 67572, -8005, -71805, -12542, 68104, 32298, -58251, -45248, 48025, 58457, -32108, -63804, 16311, 69386, 5041, -64186, -21091, 60659, 39654, -51041, -55237, 33562, 62808, -20905, -69423, -129, 68160, 16520, -63009, -35345, 49758, 47479, -37934, -58717, 21593, 66873, -1554, -63244, -10381, 63319, 28467, -54180, -42837, 42242, 52312, -27005, -59150, 10729, 64021, 6786, -63734, -26036]
1177b6036P8834j5631q5942m379Q5749K6877p3539m6967O0039O2464m2497p3293
1189e4321K0221P9756K949p9746k1258P3785L9189o3525n6876M6778O7022k9425
1201B4549p4144Q736P6766J4280p2293l5720O4088N1809n0926o7284L4721P5140
1213D9722j1046p5364p103P1750K7149o3139m8146M9400O0379l2733p0471J8218
1225c1384P4861J427p3872k1335O5331L6710n6537n2309M0447O6466k0194p1531
1237d1920J479P4578J5790p0446l5650N9820N0154m3354n9188K7687O7819o890
1249C9879p1037j3716O3038L0256n7078m6057M7459N8364l1340o3681J4451O5900
1261C6438K057o5629k3550N8958M1802m6860n2740L5725O4097j8327o9806j031
$$ y = [-26036, 52798, 37167, -48775, -53154, 32595, 59472, -14067, -61034, -995, 61469, 18972, -54321, -34100, 45656, 48605, -31141, -52399, 21386, 60575, -2950, -59826, -13048, 53974, 24549, -49595, -40859, 35907, 50187, -22106, -57826, 6262, 58071, 7145, -60139, -25418, 49722, 38676, -36688, -43791, 27959, 55108, -8031, -56177, -6777, 53602, 20869, -49602, -31384, 43477, 44904, -28968, -50303, 15028, 51738, -4799, -57108, -16661, 49805, 29611, -41920, -40441, 34137, 49927, -20519, -56169, 3651, 53805, 10451, -48737, -21050, 46769, 39879, -31158, -44874, 18164, 48420, -8658, -54715, -7256, 51108, 19768, -43913, -29462, 36438, 38495, -27134, -50684, 8274, 50076, 3216, -49524, -13799, 50298, 31971, -37835, -38866]
1273c8866O5760J7312n9308l3881N0504M9041l4005n8734J8062O1440l945o5782
1285c2402j4946O0984L1291n1270m0388M1385N2369k6208o0515O589O2040R876
1297C8805n9139k6066N5962M2840m3786n2738K8389N6529j4118o1353n006N8894
1309A9213K2371m9973l5011M1961M6382l1399n6634J5567N8193J90n7387j2231
1321c8758N6291K8178m4751m2497L2180M9896k0638n6644L758O0752J2897n5080
1333a4416k4710M6853L6155l7740m8762K1008N2504n393n2904p089N2988K2711
1345D1205m6992l5707L7095M2133k7095m8422J3762N4380K795m9666j7187M5861
1357A2162K8748m0147m2684K7114N0494j4745n1441J248N2924J2487m7500k7484
$$ y = [-38866, 26894, 44206, -15102, -48983, 1521, 50562, 16557, -42177, -24115, 37325, 33380, -32402, -47348, 13636, 44927, -6343, -46731, -5346, 47023, 20815, -39700, -33111, 28929, 38805, -20334, -46400, 9562, 52402, 8616, -44122, -15733, 40796, 26678, -34675, -39681, 19213, 41584, -8389, -43400, -1439, 44943, 13544, -43090, -27523, 30670, 30860, -26527, -38758, 17533, 45711, 960, -41537, -9357, 40539, 19901, -36743, -32985, 27767, 40664, -14416, -39126, 7727, 43882, 6142, -42620, -21612, 30892, 25499, -27405, -34494, 18494, 41205, -5787, -41494, -4399, 37734, 10639, -37783, -24021, 30359, 33154, -16512, -33699, 12162, 40910, 763, -41921, -14807, 35687, 20942, -30499, -29251, 23673, 36160, -11340, -38824]
1369c8824L8162L4859k7647m3873J7402N0958k282m9066r338M6115J9112m2968
1381g390l0881L2443M0527j9280m4441P952M9206M908m9103k0883M1455L0062
1393C4575l3980l8088K5021M5146j1186m5312l217M4196J3100m1401k5717L4591
1405b272L6436k3286m0225J5445M3695m142m5422j0555M0369K1031l4457k9155
1417c2538K6679L9563j5478m5587K941M4179O878m3689j7611L7453K9484k7191
1429E083l3351J7603L7711o107m2252n937M0049J6350l5915k3315L1669L1705
1441C3293k2363l7382J0034L8039q04l8898j1761L7190K3515k9503l1665K2933
1453g372L5991j3838m1422L100L9501Q810l4401j6733L0043K7209k2863l3272
$$ y = [-38824, -662, 34197, 6550, -37323, -19921, 31037, 28755, -20311, -29649, 16466, 35578, -7390, -38271, -5828, 34699, 15419, -29022, -21070, 28136, 33044, -16059, -36942, 4513, 34575, 595, -37493, -12472, 32674, 21488, -23824, -27041, 17155, 30255, -11146, -36863, -2272, 34164, 10878, -29347, -13902, 29793, 25651, -19771, -30326, 10043, 31074, -3383, -32538, -5859, 33704, 18226, -27361, -24420, 19759, 26637, -17052, -34663, 2790, 32274, 5083, -28268, -10665, 27046, 20939, -21313, -27250, 12799, 29149, -6766, -30081, 1588, 33293, 10930, -26452, -16418, 21621, 20817, -18081, -29842, 7348, 30863, 1360, -30305, -7372, 28619, 14781, -26641, -23541, 15960, 24770, -9631, -26364, 3679, 30888, 8025, -25247]
1465b5247J2535L6265n762l7991l440L7335J3525l2226k1165K5432K6497j7384
1477H374l4604O843L6882L845l5011j1746L2868K0642k6909k9041J8378L1552
1489B2073p881l2990k20L4256J0148l0847j9107K6282K4278k1541k9936J2348
1501a3137L3784m147l3023l722L0457J4343k7789k2767K0232K8950j2845l2686
1513b2350O566L4098M270l2126j2669K8067J7977k1931k4989J3678L0213n621
1525A5183l0770j912L1073Q140k9858j6496K4693K1490j8597k4644J0842K9206
1537A8350j073k9890q325K7784J4745k4242k0907J9766K7067j2250k8182M166
1549a2991K7949L647k7265j2303K2856J8377j8891k2101J2510K8205o803l0113
$$ y = [-25247, -12712, 23553, 17791, -20200, -23640, 13695, 27220, -5006, -26171, -739, 25758, 8374, -26230, -19387, 17495, 21340, -13671, -25417, 7451, 28093, 1184, -27857, -9479, 22073, 14192, -18798, -19018, 15238, 25386, -5461, -24568, 1714, 25992, 4451, -25485, -13137, 20647, 16500, -16523, -20245, 10212, 24555, -3234, -26001, -5769, 23181, 10336, -22350, -15784, 18314, 22584, -9542, -22211, 5856, 23833, 1902, -23087, -9409, 20804, 15183, -15587, -17499, 13574, 21714, -8144, -24640, 53, 21543, 2946, -21698, -10856, 18350, 17277, -12613, -20938, 6846, 21591, -2651, -23558, -3792, 23275, 11025, -17157, -12991, 14958, 18605, -8660, -20963, 1893, 20270, 1379, -20722, -8212, 19993, 13190, -16923]
1561a6923m06K7524P293k4308j4844K1416K1687j4397k4593O885K7026R9k7946
1574a1487q406K6315J4722k1387j9205J6428K1415r046k5355J322K5435N936k5000
1587h313j1861K2242J7784j6943k2599J2078K4044m975k5820j744K5367R487k1529
1600b782j5419J7303K0777j1534k4673M854K5541Q25k4602p465K1381J2516j6344
1613C78j7832J2509K0516o915k3218O41K3463N588k2817j0006J9814J6525j5308
1626C338j9904Q946K3193l002k3394l268K1572J1044j9979j7364J6164J9484j0310
1639F520k1978M895K1410J553k0077q172J9294J2338j5240j8115J2067K0828n989
1652I334k2391J375K1953N167k0236j1194J6510J5794j1627j9861P014K0997n95
$$ y = [-16923, -17329, 10195, 17488, -6820, -21664, -248, 21439, 7042, -17551, -10666, 16360, 16459, -11487, -19893, 6422, 21144, -243, -19448, -3020, 18395, 9349, -16006, -14684, 10751, 16687, -8313, -20174, 2068, 19852, 2909, -19690, -7612, 16432, 11457, -14363, -16107, 9260, 18747, -2782, -18201, -898, 19879, 8345, -16328, -11474, 14067, 14892, -9710, -17175, 4206, 16722, 378, -17454, -4945, 15571, 8656, -14562, -13921, 9542, 15130, -7687, -17693, 2121, 18646, 3338, -16566, -7620, 15573, 12571, -10823, -14091, 7481, 18525, -1454, -18818, -2654, 16830, 6520, -15458, -10563, 10847, 12400, -7677, -15849, 3445, 15783, 543, -17572, -5505, 15323, 9334, -13057, -11682, 10271, 15438, -4798, -15992, 518, 16312, 4685, -15176, -8162, 12835, 12240]
1665A2240k2341n284K0556J0363j7644j3629J2973J6010o733j9011K287J9452
1677I239M130j9787p720J7647J1916j4380j5551J0364J7932m288k0182N87J7107
1690G014O762j7454j1245J4433J4988j0457j7801N186J9534m02j8645m992J6690
1703C611R978j4754j1796R546J6254n762j8194J840J8853L609j8946p017J5685
1716B907J0605j2207j4550P919J6547k159j8599k673J7543P239j5421j1056J1955
1729a950J4667q477j5914M781J6093Q35j5368n709J4121R888j2502j3111Q885
1742c761J6308n174j8107J506J8074K126j5524p719J3047J0638r196j4627N825
1755f584J6209j038j6620k184J6037O357j4616q801J0422J2170p160j3960K105
$$ y = [12240, -10101, -15385, 5171, 15534, -2110, -15739, -2766, 13244, 6511, -12500, -10213, 9239, 13369, -6418, -14138, 3509, 15425, 1045, -14506, -4142, 13790, 9502, -10680, -10093, 7014, 13776, -3678, -14923, -490, 14498, 4041, -13760, -8574, 10960, 10558, -8087, -13079, 3611, 13589, -1165, -12961, -3415, 12839, 7077, -11117, -9277, 9576, 13185, -5761, -12778, 2907, 13512, 1305, -13245, -5326, 11221, 9062, -9537, -12210, 5333, 12572, -2849, -13905, -1950, 12717, 4240, -11674, -6893, 9200, 10035, -5333, -11042, 3079, 12967, 465, -12646, -3761, 12547, 7373, -10734, -9228, 8846, 10972, -4552, -12271, 776, 11414, 2218, -12409, -6584, 9625, 8587, -8033, -10217, 5820, 12177, -2439, -11240, -818, 11352, 4192, -9768, -7663]
1768g663J6130K028j6682n094J3942R750j3218j1359R153J3595n336j4277M5J4594
1782E608M757j3587q752J1167J2950r454j3259M901J4353j183j3301k148J2517
1795D569O081j1420r593R054J2169o548j3679J644J5038J195j4038m883J1619
1808A208Q772r315j1272O008J3231k616j2793j651J2685M618j1044p985R771J0519
1822A0136p310j0773L642J2495j301j1565l299J0550N930r426r482P695J1496
1835H788m511j2843J847J2424K664j2084n704J0492R262q207j0426N011J2286
1848H999j860j2524j347J0770M096j0427n980P907Q784n465j0892K290J1352O69
1862F372j2171l471J1456O510r050q023O317J0228l589j0815n73J2300K728j0145
$$ y = [-7663, 8467, 10495, -6187, -11281, 2661, 12411, -807, -12166, -3013, 10582, 5246, -9031, -8986, 5608, 10365, -3222, -11974, -807, 12143, 2689, -10570, -5669, 8684, 7501, -5800, -7948, 4569, 10650, -770, -10363, -1309, 10860, 4312, -9367, -7723, 7315, 8510, -5528, -10411, 1208, 9980, 665, -10607, -4599, 8632, 6016, -6777, -8428, 4257, 8875, -2169, -10154, -383, 10136, 2826, -7947, -4305, 8190, 6889, -4676, -7975, 2575, 8505, -921, -10403, -2708, 8788, 4277, -8566, -6719, 5705, 8369, -3715, -9419, 1073, 10335, 2128, -8298, -3287, 8999, 7139, -5385, -6732, 4038, 8134, -2293, -8273, -366, 8418, 2953, -7939, -5649, 5703, 6372, -5799, -9270, 2186, 8696, -354, -8377, -2060, 8168, 4579, -6236, -6809, 5491, 8219, -1926]
1876a926o058P747Q672o745r174L663J0314j106j0481k633J0877M017p887p338
1890h058O510R550o025r792K756J0131J265j0607l515J0382N966p581q010M342
1904b686R600k123j0113o79R616M111r596n733P814P159o150q682L697Q332j36
1919D431r545j762R377M438p141p268P037Q666m607r854J628R060K714q949m125
1934e900O677O719o075q428K884Q977p16r040r54R094K776p233n498O482O938
1949F703n101p790K393Q437J617r221k616P839M824o956n930L853P744j830q644
1964d678k80Q535J421o900m489O245O387n592p437L742Q250j208p054j560P034
1979B416L155o466n158N520P054m043o953N55R115L22p621l318O138M509l880
$$ y = [-1926, -7984, -237, 8435, 1690, -7484, -3821, 6493, 5387, -5094, -7727, 3150, 7167, -720, -8058, -1548, 8002, 1977, -7815, -5059, 5072, 6337, -4270, -7785, 2597, 8563, 982, -7028, -2686, 6914, 4791, -5322, -6001, 3615, 7726, -1870, -7603, 211, 7370, 1220, -7462, -3765, 4567, 4431, -5114, -6876, 2501, 6939, -202, -7470, -433, 8233, 3626, -6228, -4600, 4460, 7174, -1775, -5900, 777, 7496, 1421, -7007, -4123, 4854, 4138, -4902, -5856, 3238, 6014, -1219, -6717, -235, 6703, 1602, -6188, -3795, 4642, 6259, -2962, -5578, 2261, 7085, 129, -5801, -1948, 5796, 3966, -4678, -4958, 3577, 4998, -1902, -6391, -146, 6241, 649, -6788, -3046, 5204, 3996, -3058, -4618, 2416, 5571, -895, -6053, -533, 6521, 2478, -4475, -3920, 5195, 5517, -2104, -5422, 716, 5225, 1345]
1994A345o645K336P892j071q033o14P443K102o229m407N212O201l499n967J491
2009b443O694K69p697j324N772M199n670n009M937N298k298o778o2O338J817o130
2025b087m250O416M234k869o797K693P003j192n715j201O019K178m547m395M687
2040A77N334l095o237P20O190L68o577j934N679M536n834m384L204N625j231o618
2056d077j11O362J395m378k921L722M452k838o106L290M452j2n519j049N153K435
2072D250m518k894K969L918k148n740J138N837J020n854j866M691L158l300m116
2087c455J468M967K97n404j173N067K017l530l982M408K662j998m850J203M927
2102B624k45m559k039N391K866m550l310K874L627j164m564K41N025J243m325
$$ y = [1345, -5300, -2964, 4928, 3857, -4176, -4790, 2653, 4755, -1474, -5881, -669, 5532, 2033, -3934, -2443, 4251, 4520, -3177, -4501, 1271, 5470, -200, -5209, -272, 5026, 2728, -4050, -4112, 2226, 4043, -2087, -6337, 79, 4313, 1444, -5353, -2660, 4343, 3151, -2564, -3765, 2254, 4432, -115, -4510, 177, 5511, 2416, -3821, -3101, 3089, 3457, -3120, -5054, 625, 5161, -673, -5057, -1853, 3772, 2541, -4077, -4188, 2174, 3569, -809, -3730, -8, 4444, 1606, -4500, -1210, 3242, 3230, -2289, -3338, 1815, 4250, -268, -3162, -193, 3725, 1577, -4163, -3025, 2812, 3832, -2022, -3888, 803, 3961, 661, -3455, -1987, 2980, 3277, -2127, -3300, 1767, 3784, 254, -3728, 680, 3342, 1344, -3506, -2303, 2624, 2379, -2180, -4219, 1172, 4038, -512, -3822, -948, 2679, 1515, -3049, -2808, 2217, 3460, -865]
2117h65j980K827L407k250m401J852M538j09m702q86L757K063l293k917J975L825
2133B841j712m159J235L702J258m250j850L964J720k561l380K340M244j367l387
2148a362j088M036K447m005l879L786K445j390m164K175M019j366l662n66L491
2163I17J923l058l132L021L540j060n443J415M332L76m220r12K291L314l160k526
2179b382R07L617j38l794p84L864J431l832j683K080L175j699k810l5M122Q4l669
2196a546j357K794L405l193k911K299L500q95l879j08M133M69l253j982L160J477
2212B113j621k648M76L128J21k285r83K602R56k110j933J738K459j17m147Q81
2228a370L009J146l985p60K842J503j834k713O42L030k06k884K34J633J712k499
$$ y = [-865, -2845, -18, 3389, 1139, -3262, -1410, 3128, 3019, -1683, -2569, 1188, 3251, -42, -2959, -984, 2841, 1129, -3030, -1795, 1907, 3165, -1085, -2935, 1029, 2749, 188, -3192, -852, 3392, 2025, -1362, -2450, 1586, 4033, 28, -3851, -65, 2380, 990, -3174, -999, 3020, 1654, -2008, -2574, 917, 2840, -218, -3350, -329, 3211, 2151, -3292, -1877, 2455, 2831, -1389, -2301, -10, 3304, 144, -2382, -1475, 2142, 2004, -1790, -2574, 1290, 2721, -1111, -2794, -714, 2461, 762, -2048, -2083, 2039, 2123, -1546, -2903, -109, 3296, 103, -2808, -509, 2991, 2096, -1783, -1891, 2242, 2711, -542, -2524, 636, 2113, 492, -2156, -1680, 1448, 1569, -716, -1699, 903, 1859, -251, -2184, -446, 2013, 1896, -2251, -1370, 1639, 2785, -1200, -1960, 882, 2385, 551, -2162, -1520, 1510, 1304, -1580, -1346, 287, 1999, -500]
2244e00j730J681K738j648k289L75K829k53j559j355K798N00o56k956J343K655
2260A973l73k137j030K711O03k334j875K941J543k076k230Q62L109q73j688p10
2276a584K769J457k863r29M90K059o03k267L50K500R65l346n43K211J637k123
2292A80j140L87K138n65k679Q4K055O54o86k100J336J464j370j495J041J656J48
2309A108k138L12J254O94n41k561J712J134n84k061M85K020P44k082j185J515
2325a74P34k35j767J087J325n2j432n91J223J103j391j081R35J704j662j281L48
2342a207K424N24k114j162J543N91p83j126J251J612r52j366l43J830J13j349
2358e14j090K420O4o36j442J183Q93L50j770n08K123M37k001Q0J84J095o43j602
$$ y = [-500, -2230, -549, 2189, 541, -1748, -1373, 1456, 1203, -356, -1711, 1087, 1587, 931, -2025, -682, 1973, 1600, -537, -1567, 1144, 1747, -587, -2462, 479, 2022, -54, -2284, -1422, 1687, 814, -874, -1584, 1185, 2642, -221, -1150, -660, 1399, 796, -1471, -1121, 1379, 2344, -1002, -1545, 666, 2303, 180, -960, -573, 1565, 1000, -1679, -1595, 460, 1114, 428, -1672, -336, 1128, -242, -1737, -696, 960, 1108, -1030, -718, 536, 1230, 689, -1872, -160, 974, 390, -1671, -1186, 834, 1578, -504, -1689, -174, 560, 325, -1442, -355, 970, 918, -514, -1105, 118, 1221, -170, -1251, -316, 1388, -274, -1555, -1207, 1217, 1741, -373, -1535, 8, 599, -184, -1310, -59, 1553, 601, -765, -1108, 722, 835, -514, -1604, 816, 880, 244, -1198, -15, 878, 1228, -542, -1050, 1073, 1510, -491, -411, -227, 868, 225, -1377]
2376a377O53J645K94k068o04J463J215l57j770o32K092K14j423k14J569J54n67
2393B87j421L18J349M6n62r35J777j75j689J85J024J88J32j242M37J192q83p19
2411f91J69O04R50j786l52P45J301j133J43q3O3L98q4k86O9R41p92j433J283N04
2431E30J18j221k22J029J017j701j329J183J235m43r65J94J179m09m39n86Q98
2448F8L65M16r55k23K94R38j473M52P12J58n84j643N65J494p20m75J58Q95J26
2467E68k49j635J430J378j754j45L51O30q98J40K22j97Q83m29j386M82J458j158
2485c09R5q59R66N24q65o00N26J202m72j006O76M27P19j131j252J740J93L12j616
2504g30O30N74K80q46J99N62j56p60j23P39Q5m33j048L92J002qp55j09O20L75
$$ y = [-1377, -724, 921, 1215, -853, -1457, 6, 1221, 864, -906, -1538, 554, 768, -655, -869, 700, 854, 287, -1134, -816, 533, 579, 17, -918, 859, 684, -1005, -820, 204, 392, 524, -718, -281, 911, 28, -691, -522, 82, 1032, -754, -1106, -361, 940, -193, -50, -133, -70, 328, 244, -42, 27, 968, 176, -1257, 26, 530, 648, -573, -795, 234, 1251, -450, -1779, -596, 639, 196, -769, -575, 604, 195, -244, -830, 68, 433, 849, -106, -329, -35, 903, -570, -118, 594, 752, 168, -1475, -910, 584, -136, -611, -453, 442, 568, 319, -1316, 114, 1492, -262, -407, -56, 574, -324, -184, 38, -159, 724, 295, -1091, -609, 849, -309, -214, -1073, -107, 417, -448, -1048, -522, 680, 208, -798, -122, 305, 1024, -107, -1359, 381, 574, 886, -730, -100, 474, 754, -92, 107, 669, 513, -247, -370, 369, 454, 21, -1027, -635, 367, 359, -396, -505, 115, 490]
2524D90o38o46M84L92O95r99j010J321R26n92j090K78J016K01j728O0J272o4j043
2543f75o76J789n72m33P0O68P35n36r31O60L10k75J41J19j90J031j128p78N65
2562a06N77N68q05o07L48L83m15k46R7P80M11j489M18k17P52k74j63k16J9L91
2582B06l00j51R98m10p74j59R14P47j322p34L76J571j222j85rJ086l98m40m39
2601f45J071j55J86o25o27J130K89j85j160L64J184o30j17L03M07o43Q6m45j36
2620c48J289p83r41Q23Q69j001n76j49Q05j71j64j86J236r0j001o40Q68Q34r5
2639E79j048P72o01P16M71k445J359K96M36j978R22J271n11p53M19L34J20q42
2657d83n03R76M7j96K79J36L79j13m3o51K62J021j372p27J143O51k53j091n43
$$ y = [490, -148, -794, -310, 82, 777, -222, -1232, 89, 1015, 423, -667, -389, 627, 828, -900, -840, 432, 368, -675, -1351, 438, -134, -567, -497, 171, 906, 370, -561, 99, 409, 134, 275, 394, 204, 1235, 107, -671, -106, 471, 1039, 234, -373, -25, 358, -57, -303, -206, 574, 985, -504, -86, -303, 449, 175, 12, -204, -185, 206, -94, -245, 753, 343, -431, -590, 324, 1071, -251, -985, -609, 962, -260, -445, -454, 632, 234, -206, -645, 426, 271, 457, -168, -795, 335, 624, 439, -721, -357, 827, 197, 80, 383, 790, 147, 233, -212, -348, 941, 158, -783, 40, 909, -92, -668, -817, -12, -183, -347, -533, 703, 613, -388, -1028, -160, 674, 579, -469, 303, -298, 418, 889, -1556, -197, 99, 535, -1443, -521, 750, 239, -514, -95, 239, 359, -483, -986, -10, 37, -159, 120, 256, 635, 522, 479, -172, 90, 1111, -261, -988, 155, 806, 553, -538, -1081]
2676a081P11J097n2j568Q60P75j018o93J50R10Lo9m77M99L95m5j61p14J103k17
2696D08j107J227k65M16l36q10J32J114N0j204k1O40n4l89o84Q60J74n3n23N49
2716A24O24k93o30l69J164l77o70k09O63J039p45q49J80J283J46k157M54J059
2734D37K86j341o12J004J163n36o39n39J713m93n39o41J121Qq8r14O56q8J65n83
2754d60r93J185J100n58p26P66j44L06j379M88R18j78o57o88P94J100n53j146
2772h25J033J77J53n59q75J065K65p55n6N31p4k6n75K77Q25J03j609P00k57J257
2792G75q73l03Q37J34l33n69qM49P46j334j69J383j79o80p18J079K97k83p02K1
2812d30N57K87o12r78J201K45k22j07K9J79M20j091l3J414L0j482j25N78J065
$$ y = [-1081, -370, 727, 675, -893, -33, 742, -276, -969, -819, 91, 94, 25, -452, 47, 442, 397, 236, -478, 625, 408, -699, 528, 263, 679, 343, -467, -335, 779, 829, -375, -396, 244, 190, -199, -883, -23, 151, 98, -425, 124, 748, 455, -175, -544, 620, 243, -427, -636, 27, 1066, 321, -528, -348, 935, 1081, -1076, -622, 437, 723, -618, -1230, -226, 937, 401, -238, -777, 936, 443, -96, -737, 384, 392, 304, -610, 46, -42, 123, -460, -1453, -268, 832, 274, -452, 314, 170, 476, -903, -415, 503, 325, -332, -1020, -226, 874, 321, -825, 208, 385, 538, -21, -896, 169, 434, -321, -377, 154, 80, 54, -521, -244, 581, 684, -925, -225, -482, 775, -98, -401, 436, 570, 237, -332, -340, 109, 855, -479, -648, 735, 556, -124, -842, 237, 534, 251, -451, -430, 127, 414, -198, -1176, 25, 270, 48, -59, -30, 149, 569, -522, -555, 859, 889, -593, -718, -140, 925]
2831I25n37j713J82J766O38j341j13K92P74j033m76L34P84k50m61L26O63p20J61
2850B01m87j13J577j350r71J173R83O5j452j69Q05M40o23q40J75R86K22j707N74
2869e11P61k24n88K60K62O16j19r77L67O20K16j957Q20J106L58q97j157J102O64
2888G22P7j356k02J803j94o34q03R0J265K97j723j29J850L6j141q20Q48P59r00
2907a55p64O98J036n15j263P87O81J12r13k73M90J495j050j639J000O90K98j485
2925g70k97K052m44j161k8N21J001j86j524Q75K50K62j171QJ150L82j257P2L70
2944A05J027j172j215N01J664J05j358j364J504J236q11j680J584O97k89j676
2960a142L25J339N2o17j045Q84Q97M21k104M26J032P50k112n70J611Q73j586j09
$$ y = [925, 388, -1325, -1143, 623, 1261, -80, -193, 99, 873, -160, -636, -302, 482, 232, -229, 97, 760, 40, 201, -286, -399, 1178, -172, -1143, 30, 1013, 1078, -374, -543, 262, 702, 79, -761, -586, 400, 622, -1085, -511, 250, 26, -562, -302, -40, 576, 457, -520, -153, 467, 683, -1274, -454, 652, 1010, 113, -1044, 58, 722, 799, -557, -759, 1044, 850, 216, -587, -497, 768, 1065, -658, -787, 1063, 1099, -42, -862, -14, 745, -155, -919, -221, 815, 300, -963, -176, 505, 617, -296, -569, -79, 1416, 366, -1273, -273, 417, 715, -770, -1067, 985, 541, -620, -648, -127, 874, 688, -836, 39, 289, 551, -620, -612, 538, 920, -337, -265, 105, 1132, -40, -1255, -754, 910, 1015, -343, -1707, -203, 1033, 222, -1458, 126, 823, 534, -1142, -817, 522, 574, -43, -1088, -204, 693, 1114, -990, -564, 468, 1218, -894, -1464, 147, 1020, -566, -675]
2978f75M83J087j342m42K29Q94J295j302j717J784N11J37k406J607K97o7m60j54
2996b41L06N6k4q95O60J123n87j971Q89O77O54q68n80R28O38q57p47%J339k95
3016B05m80l87K028o83j441m36J462R78k18j625N20O67o66o14l88J157R85j122
3034e8j301J676N62m48p12j85M99N80p16q53R52J574j237p24j00P27J04j714Q96
3053d78J075J4j462j69R21J406n38j565j10J685n30p69k99M23J219r94q84J374
3071C19J652k003r35K6J469J69j190o27J408R73j424m97Q98j5M81r38o07J172
3089C31O6j257l79O32J772n59j754L99J925p03j035j00M51J535j641n81N13J504
3107A119j89j171k03Q47l13l51q42J026P33m5j954J088R34K87j700k32K111m67
$$ y = [-675, -192, 895, -447, -889, -660, 234, 1529, 227, -1490, 294, 805, 942, -1464, 143, 440, 373, -87, -241, 65, 121, 97, -798, -138, 985, 398, -1573, -684, -7, 647, -221, -801, 127, 765, -92, -839, -839, 500, 205, -275, -662, 1366, 683, -758, -1194, 268, 1246, 1028, -597, -77, 590, -76, -690, -1078, 79, 1064, -58, -1359, 317, 879, 431, -281, -466, 33, 613, -103, -956, -4, 1570, 333, -391, -491, 236, 340, -1374, -478, 597, 611, -851, -1020, -99, 1307, 769, -796, -906, 779, 249, -520, -819, -396, 823, -171, -1055, 319, 1971, -32, -967, -941, 528, 697, -493, -1120, 288, 1261, -163, -660, 238, 223, 704, -234, -841, 331, 397, -860, -1239, -607, 1165, 606, -1148, -749, 1176, 473, -562, -662, -211, 1324, -317, -898, -385, 1119, 930, -241, -444, 403, 90, -261, -1103, -77, 656, 611, -1343, -255, 679, 966, -734, -966, 1145, 678]
3125F78r61k53q0J418l89j049QJ718m29n12r36J110M19r20k74J91J525j093o16
3144d45m70J189l55j0r06R23O58o31m18m90J953L83k282K88J018J444j885r40
3162i76J509O7M2j513R6J029O83k256R22K47J493j496l4l80J315n86j419O93J404
3181H40K00j747J37R22R65j037p13k3M28Q35j747L12J005M00p4j394P15Q04J50
3200I78k120J375Q74m17n82r28R34R94p39j182L67J540m49j241P58N51K28m68
3218D73j714J382J217j249j063K99M24O40p71J06N80J40r59q14J219Q76k41r76
3236d31M05R67k92j310K94m7J273j182k33L26J260k42j233J90O96O03j738l97
3254a091J914R3k38j487N50Q82K8j273k16J127M32j016n87J176R45j161j036N56
$$ y = [678, -283, -536, -616, 802, 413, -636, -628, 1090, 661, 149, -787, 323, 742, -178, -452, -261, 1264, 171, -445, -915, 274, -81, -91, -997, -74, 584, -47, -465, -955, 998, 1381, -901, -613, 405, 1849, -36, -976, 533, 600, 642, -871, -775, 254, 937, -1319, -397, -150, 1343, -153, -187, -567, 748, 162, -1257, -564, 840, 1040, -707, -570, 352, 1317, 280, -433, -456, -28, 807, -940, -628, 377, 777, 703, -691, 24, 828, 978, -1142, 233, 1107, 690, 108, -820, 114, 1108, 369, -813, -446, 1094, 645, -596, 162, 713, 941, 473, -1241, 141, 1358, 109, -954, -655, -231, 409, -362, -256, 324, 464, -495, -1309, -90, 786, 545, -431, -26, 941, 649, -661, -367, -414, 859, -323, -556, -230, 1030, 788, -445, -255, 441, 1044, -694, -1091, 823, 916, 678, -809, -259, 623, 651, -622, -838, 289, 721, -295, -882, 294, 1239, 78, -958, -402]
3272d02R10L47j060l70M84J777j841o59J007P56q22l21j031J339K86n94p72J491
3290E25K4j88r14M07J948p30j628K97N26k94L36j195J60J632k84j962N60J157
3308C77J134k359J72J085P60j760r2J98J354n01r09n7O07O74m57n88n14J622l35
3327D11r05k33J293J96q98j012J529O77p16j665J905N34r65q50k71J569l65l99
3345a65k67r5K015j260j539J768L43L14p25j301J260j9p21m39N65O14L10j377
3363g19K9J493j33j316l7K242n14k269P90J065j38j02o92l24J048N58n99k109
3381a727J665J268j296k80J56O79K30j416L17R77R4p92m81Q47J398j394j252M25
3399e82J420n23j359j17J504Q8l86k40M36P92j72j577J73M25J543j142j324J511
$$ y = [-402, 508, 855, -205, -575, -91, 1686, -155, -814, 193, 949, 127, -194, -1225, 114, 400, -194, -966, 525, 549, 361, -553, -146, 1802, 1072, -556, -259, 267, -27, 309, -886, -726, 906, 622, -1340, -780, 377, 1511, -848, -676, 409, 1169, -591, -683, -485, 869, 368, -541, -598, 9, 683, 226, -362, -876, 746, 411, -494, -727, 566, 762, -136, -1148, 381, 1058, 342, -1323, 582, 1116, 151, -699, -970, 599, 234, -165, -432, -527, 1488, 228, -1311, 457, 800, 1114, 389, -912, 348, 329, -392, -831, -266, 348, 658, -719, -690, 803, 670, -646, -683, 1559, 1045, -1224, -434, 631, 493, 391, -301, -625, 423, 981, 382, -1727, -62, 1206, -90, -370, -214, 465, 695, -721, -404, 573, 667, -125, -606, 241, 1639, 245, -1007, -582, 838, 315, -1044, -1161, 343, 431, 45, -195, 241, 1033, 861, -716, -543, -118, 1425, 283, -1041, 470]
3417D70R15k030K54J66K9Oo31j67J603J090j457j473P93J004N0j162Q06J18jq21
3437d38p50J074N16l14n29j080K333q31o17L25R15l02j39p5j62N73n01r13O68
3456b47O58o31l45Q8P86M29p13j225K25J544O08k189K66O04R22r91m53k8P54K10
3476B72j939J665M96n41l46M47J15N82q65j256J480J262m64j901L67J927Q0j470
3494h9o31J397m1p88l35k57L23J147j140OO2J373j470m27J038N45r08j63Q7R75
3514G04l98p57j17R31j79J57j685J225J362j60j915J31P50M75p23l27M03J026
3532I03q91m55R1J258p75n70J11J121n96n6p3J04Q18q19q9M2K70O17j664r60J878
3553B65l89M16r21N23J14M18j124K14P79L79j125N10k14M85q5j496K18J581n75
$$ y = [470, 1385, -645, -391, -225, -196, -190, -821, -988, 615, 1705, 248, -1225, -432, 572, 622, -540, 266, 384, 383, -438, -1188, -114, 402, 88, -441, -1521, 812, -19, -636, -311, 604, 302, 163, 88, -74, 499, -2, -915, -247, 411, -220, -565, -477, 309, 738, 25, -1200, -975, 569, 1177, -1012, -746, -142, 780, -211, -664, -692, 62, 272, -1667, -2, 494, -47, -393, 54, 169, 751, -114, -1370, 110, 1372, 908, -993, -626, 1301, 1381, -89, -720, 677, 636, -152, -487, -744, -421, 726, -414, -408, -346, 1027, -443, -870, 168, 713, -195, -358, -271, 704, 306, -451, -568, 363, 184, 341, -1344, -119, 1243, 1083, -832, -701, 49, 524, -199, -526, -123, 903, 12, -443, -352, 906, 131, -439, -328, 793, 197, 141, 68, 172, 990, 171, 82, 124, 394, 1011, -653, -1613, 265, -124, 292, -629, -106, 8, 426, -698, -484, 295, 674, -451, 59, -155, 330, 245, -1251, -1033, 548, -27]
3572b7J37m41K20J438j273q59Q32L31M9j310J10J131N43j701O87M1Q87k88j177
3591f70J161n96J583j219q05Q27M62r96k63R45q1j5J19q96J102m55q30k23J741
3610H91O3o51j428J286Q31l91j230M17N04J139j152r40N20R92n61j000l47J802
3628G45k86o10o0M67m9mm43L4J113o8j515L5R48j05q93M2J669k06q70m14N1J319
3650I00m58p6j197J331j4j195l57J807m71p73Jj79J081L40j519M02M39L92n32
3669g8o85N13J174p39j242Q14J130J06r11Q1K17k18L98j091M06J136j143m65O93
3688I6L79k23j63J08j119J335k47k78p65J386%r49k56P60J179j751l21P83O54
3707F08K40j329J83l9P80q03kK10L38m64J85m45J234Q6j652J82J428k36p33j8
$$ y = [-27, 110, -331, -111, 1327, 54, -805, 27, 358, 407, -903, -793, 338, 881, -820, -133, -92, 795, 507, -670, 491, -105, 1478, 259, -546, 281, 743, -253, -516, 429, 348, 333, 452, -444, 658, 203, -627, -850, 891, 954, 303, -1125, 161, 992, 601, -629, -212, 292, 1431, 279, -661, -141, 851, 290, -710, -1057, 745, 459, -151, -211, 256, 207, 203, -240, -206, 907, 839, -676, -641, 307, 202, -691, -649, 1020, 814, -56, -470, -419, 900, 442, 366, -831, 500, 486, -709, -1066, 741, 270, -503, -502, -681, 400, 740, -779, -377, 62, 454, -78, -763, -250, 924, 185, -1057, -243, 887, 993, 82, 163, 380, 162, 560, -531, -125, 1011, -132, -597, 96, 475, 252, 89, 197, -922, 413, 166, -112, -877, 509, 509, -440, -696, 64, 1243, -508, -829, -46, 608, 848, -481, -298, -337, 443, -360, -362, -152, 186, -278, -93, -538, 696, 782, -870, -688, 740, 504, -229, -247]
3727b47j6J001Rj563Q6J930j501p92M15P88j72r3k20P9Q58k55j44q23L93J194
3747I27j086p70L21R52L85j549J188L21n92J31n42M59O41o59q31N92P43n99j021
3766i89P59L15K01m83n31R82j50j42R9o49J753r21o02N17%K98r42L31K11R27o90
3787B94j082N44R45p99J25l84K21J031j211o00R76j45J95o48L44O01J70n26p72
3806g21J357R2r64J15M34K91q1r79Q05n0M78j022m23R45m51L99q62L79N67q7L37
3827E59r75M64J167j171m77R87J08m95k31j04L16L90k0q09P23J57j159J73K83
3846a14J70k6P2l40j16R14r46l82M92J444n10j142Q9K81R04q77r4J51K35N5m08
3867a48J37J89R9m95O88m64Q7O0l04Nm21J98p73J434j18K2r55J56J452o63k96
$$ y = [-247, -263, 738, 747, -816, -730, 1200, -301, -1093, -678, 110, -62, -155, -375, -296, 562, 307, 163, -660, -267, 927, -159, -929, -608, 344, 729, -820, 368, 689, 97, 228, -314, 145, 786, 127, -704, -112, 631, 32, -989, -230, 85, 286, -197, -728, 254, 104, -38, 61, -588, 1165, 244, -358, 159, 159, 457, -485, -154, 57, 984, 294, -788, -244, 701, -98, 27, -357, -136, 895, -316, -916, 60, -85, 110, -538, -194, 407, 577, 51, -721, 636, 728, -236, -121, 313, 604, 523, -456, 349, 299, 777, -245, -668, 277, -174, 225, -637, -258, 309, 222, 559, -416, 48, 1215, 44, -433, 554, 662, 167, -64, -168, 148, 538, 518, -291, 432, 589, -570, -397, -114, 56, 30, 102, -238, -354, 560, -386, -768, -276, 1168, 658, -484, -395, -114, 790, -87, -181, -30, 205, 260, -148, -11, 178, 277, -218, 470, 6, 93, 153, -151, -146, -567, -369, -1142, 292, 174, 196, -759, -603, 849, 186, -110]
3888a10j27L13J07j38O38q25O00J84j157p3Q16qj112J203l17j49N23m98J95J132
3908A197j365M23k17n60R88j45J18l99N23N09o77o90O99r59J265r05L25k50K6
3927i4J14o19O03M44j234K42N87M18l52o41J014r0K88j086K03Q61k09j141O04
3946h8J28M91q99O13L30o91J33o35K29p2O93m20r82P71N4L05n41L77L20J07j051
3967h28P46l50L38R00j114n0L2J321o56q37O74j5j55j3R0M54k80o7M31l98k43
3988b0k24k67R90Nn82k91J138j30n78j81m46P29J21M27q89R24Q8j025mm86J274
4009E73q81L12q0j64o6O47J9q21M54N8j13J97q0rr25J234qj65n3j9M04n69J02
4032D7l89K4J01L17k12r66J752p8o85K92n34R07n64m37M99l43P30n65p51P51O25
$$ y = [-110, -237, 76, 183, 45, 683, -142, 458, 642, -515, -588, 228, 220, -892, 311, -6, -155, 368, -130, 65, 1197, -168, 255, 38, -522, 466, 321, 439, 40, 563, 1072, 395, -295, 404, -555, 710, -195, 130, -120, -94, 20, -599, 4, 448, -786, -544, 43, 461, 109, -532, 482, 392, 680, -406, -203, 658, 449, -692, -88, 40, 531, -368, 245, 575, -116, 17, -618, -389, -461, 232, -188, -1170, -399, -345, -40, -581, -204, 116, 223, -828, -82, -432, -94, 806, -308, -358, -326, 995, 339, -498, 176, 161, 6, -7, 83, 537, 257, 190, 621, 223, -20, -244, -511, 479, 484, -98, -389, 749, 619, 41, -140, -586, 143, 264, 691, -198, 726, 814, -211, -215, -701, 573, -308, 4, -76, -240, -306, 341, 360, -461, -7, 51, -62, 135, 55, 46, -879, 355, 347, 182, 129, 110, 514, -55, 47, -342, -318, -217, 100, -112, -1078, 674, 596, -89, 203, -331, 576, 12, -425, 74, -269, 461, -104, -855, -104, 521]
4053E21J49j070m6R50Q3j070N94l65M30R2o42L06M14k46o94R2J017mj548J048
4073A1k99J010j128K19L80l00M06n26M34m17Q01Q5j305R52J48p80J89l26R15L88
4093H57l91n92J69P6Q0p23L4L18O83q16j52J023L05r16J97l65N34m25n04N54J019
4114I65r04k02q31J676r87n1j67J192l46n09K08q95J222m5q41N7J98P46o67J77
4134dM26J19o00J04j84m78J109q48j91O93K99p33N5o55J786r35l43J02K56Q60
4154H38j043m99J060r70J463r74K08K32L05j049j75L74P6M27l22K28M95m73j35
4173F6p8J159l24p36p10P28j71Kl5K74n66J46j43K54L56J49M30j576J283n87N86
4194E07n10L37m32K9Q70j321O50Rk93J83L02K42j150K47J28K59Q73r58j296R02
$$ y = [521, 670, -400, -446, 504, 587, -483, 111, -254, 176, 268, -374, -68, 346, 100, -594, -502, 515, 511, -1037, 11, -288, 722, -406, -187, 193, -107, 299, -227, 207, -210, 591, 676, -629, 323, 471, -309, -120, -446, 469, 857, 466, -126, 43, 119, 199, -524, -490, -172, 511, -305, -457, 566, 871, -45, 152, -213, 321, -104, -608, -54, 965, 61, -141, -972, 704, -283, -334, -501, 691, 345, -164, 44, -851, 371, 326, -515, -458, -260, 486, -181, -4, 422, 541, -59, 45, -139, -617, 492, -356, -547, 146, 445, -288, -233, -888, 898, -37, -380, -278, -22, 838, -205, -704, 356, -614, 849, -125, 83, 315, 620, -429, -604, -230, -154, 273, -49, 179, 674, 201, 66, -12, 1147, 823, 87, -623, 105, -66, -64, -99, 175, -391, -245, -388, -134, 222, 371, 801, -775, 508, -79, 507, -3, 334, -98, -69, 801, -520, 130, 139, -154, 29, 331, 573, -577, -330, -202, 57, 930, -28, -1324, -422]
4214d22L19O40q18M63l01M48k32m9j8K4M73p87Q14j97j02l79j002J347N1j76o55
4235e59N74P87q16p17Q4R50j36P2Lq49P65Q65o08p73O37l07K16k52Q63M7q59k44
4257b57m9M59J30n13n3l1k9m08J12N12k24P60j726J138J114j59o51RJ59O27k022
$$ y = [-422, -103, 537, -281, 182, -119, 329, 97, 48, 30, 54, 527, -260, 554, 357, 255, -124, -1126, 221, 272, 96, -559, 15, 802, -14, -731, -647, 303, 167, 239, 242, -607, 158, 1023, 415, -358, 279, -28, 188, -64, 799, 846, -13, -257, -306, 153, 283, -230, -283, -314, -343, -751, -639, -127, -351, 409, -1317, -179, 935, 776, 125, 134, 293, 920, -1102]
$$ [...]
8191C2
##END NTUPLES=NMR FID
##END=
