##TITLE=1H ikalashn
1B1p-1
24.10.2024
##JCAMPDX= 6.0         $$ Bruker NMR JCAMP-DX V2.0
##DATA TYPE= NMR FID
##DATA CLASS= NTUPLES
##ORIGIN= UXNMR, Bruker Analytische Messtechnik GmbH
##OWNER= root
$$ TOPSPIN		Version 1.3
$$ 2024-10-24 15:05:18.656 +0400  Irina@DPX200
$$ Compression mode = diff/dup
##.OBSERVE FREQUENCY= 200.131300845
##.OBSERVE NUCLEUS= ^1H
##.DELAY= (6, 6)
##.ACQUISITION MODE= SIMULTANEOUS
##.ACQUISITION SCHEME= undefined
##.AVERAGES= 16
##.DIGITISER RES= 18
##SPECTROMETER/DATA SYSTEM= spect
##.PULSE SEQUENCE= zg
##.SOLVENT NAME= CDCl3
##.SHIFT REFERENCE= INTERNAL, CDCl3, 1, 17.49637
##AUDIT TRAIL= $$ (NUMBER, WHEN, WHO, WHERE, WHAT)
$$ ##TITLE= Audit trail, TOPSPIN		Version 1.3
$$ ##JCAMPDX= 5.01
$$ ##ORIGIN= Bruker BioSpin GmbH
$$ ##OWNER= Irina
$$ $$ F:/spectra/data/iren/nmr/1H/4/audita.txt
$$ ##AUDIT TRAIL=  $$ (NUMBER, WHEN, WHO, WHERE, VERSION, WHAT)
(   1,<2024-10-24 15:05:00.593 +0400>,<Irina>,<DPX200>,<TOPSPIN 1.3>,
      <created by zg
	started at 2024-10-24 15:03:52.468 +0400,
	POWCHK disabled, PULCHK disabled
       configuration hash MD5:
       BE 6D 3F 07 2A EA 11 49 91 17 2B D3 AF B3 58 0D
       data hash MD5: 16K
       EF B2 51 D1 F8 57 E1 C3 11 F3 15 6E E6 7D D4 7E>)
$$ ##END=
$$ 
$$ $$ hash MD5
$$ $$ EB 28 3D AE E9 D9 AE 19 A2 47 4E 85 D9 B8 0A CD
##$RELAX= 
##$RELAX= 
##$RELAX= 
##$RELAX= 
##$RELAX= 
##$RELAX= 
##$RELAX= 
##$RELAX= 
##$RELAX= 
$$ Bruker specific parameters
$$ --------------------------
##$DU= <F:/spectra>
##$EXPNO= 4
##$NAME= <1H>
##$PROCNO= 1
##$TYPE= <nmr>
##$USER= <iren>
##$AMP= (0..31)
100 100 100 100 100 100 100 100 100 100 100 100 100 100 100 100 100 100 
100 100 100 100 100 100 100 100 100 100 100 100 100 100 
##$ANAVPT= -1
##$AQSEQ= 0
##$AQ_mod= 1
##$AUNM= <au_zg>
##$AUTOPOS= <>
##$BF1= 200.13
##$BF2= 200.13
##$BF3= 200.13
##$BF4= 200.13
##$BF5= 200.13
##$BF6= 200.13
##$BF7= 200.13
##$BF8= 200.13
##$BYTORDA= 1
##$CFDGTYP= 0
##$CFRGTYP= 5
##$CHEMSTR= <none>
##$CNST= (0..63)
1 1 145 1 1 1 1 1 1 1 1 1 1 1 1 1 1 1 1 1 1 1 1 1 1 1 1 1 1 1 1 1 1 1 
1 1 1 1 1 1 1 1 1 1 1 1 1 1 1 1 1 1 1 1 1 1 1 1 1 1 1 1 1 1 
##$CPDPRG= <>
##$CPDPRG1= <>
##$CPDPRG2= <>
##$CPDPRG3= <>
##$CPDPRG4= <mlev>
##$CPDPRG5= <mlev>
##$CPDPRG6= <mlev>
##$CPDPRG7= <mlev>
##$CPDPRG8= <mlev>
##$CPDPRGB= <>
##$CPDPRGT= <>
##$D= (0..63)
0 2 0 0 0 0 0 0 0 0.06 0 0.03 0 0 0 0 0.0002 0 0 0 0 0 0 0 0 0 0 0 0 0 
0 0 0 0 0 0 0 0 0 0 0 0 0 0 0 0 0 0 0 0 0 0 0 0 0 0 0 0 0 0 0 0 0 0 
##$DATE= 1729767897
##$DBL= (0..7)
120 120 120 120 120 120 120 120 
##$DBP= (0..7)
150 150 150 150 150 150 150 150 
##$DBP07= 0
##$DBPNAM0= <>
##$DBPNAM1= <>
##$DBPNAM2= <>
##$DBPNAM3= <>
##$DBPNAM4= <>
##$DBPNAM5= <>
##$DBPNAM6= <>
##$DBPNAM7= <>
##$DBPOAL= (0..7)
0.5 0.5 0.5 0.5 0.5 0.5 0.5 0.5 
##$DBPOFFS= (0..7)
0 0 0 0 0 0 0 0 
##$DE= 6
##$DECBNUC= <off>
##$DECIM= 32
##$DECNUC= <off>
##$DECSTAT= 4
##$DIGMOD= 1
##$DIGTYP= 9
##$DL= (0..7)
0 120 120 120 120 120 120 120 
##$DP= (0..7)
150 150 150 150 150 150 150 150 
##$DP07= 0
##$DPNAME0= <>
$$ [...]
##$SW= 21.9926040160658
##$SWIBOX= (0..15)
0 0 2 0 0 0 0 0 0 0 0 0 0 0 0 0 
##$SW_h= 4401.40845070422
##$TD= 16384
##$TD0= 1
##$TE= 300
##$TE2= 300
##$TE3= 300
##$TEG= 300
##$TL= (0..7)
0 120 120 120 120 120 120 120 
##$TP= (0..7)
150 150 150 150 150 150 150 150 
##$TP07= 0
##$TPNAME0= <>
##$TPNAME1= <>
##$TPNAME2= <>
##$TPNAME3= <>
##$TPNAME4= <>
##$TPNAME5= <>
##$TPNAME6= <>
##$TPNAME7= <>
##$TPOAL= (0..7)
0.5 0.5 0.5 0.5 0.5 0.5 0.5 0.5 
##$TPOFFS= (0..7)
0 0 0 0 0 0 0 0 
##$TUNHIN= 0
##$TUNHOUT= 0
##$TUNXOUT= 0
##$USERA1= <user>
##$USERA2= <user>
##$USERA3= <user>
##$USERA4= <user>
##$USERA5= <user>
##$V9= 5
##$VALIST= <valist>
##$VCLIST= <CCCCCCCCCCCCCCC>
##$VD= 0
##$VDLIST= <DDDDDDDDDDDDDDD>
##$VPLIST= <PPPPPPPPPPPPPPP>
##$VTLIST= <TTTTTTTTTTTTTTT>
##$WBST= 1024
##$WBSW= 25
##$XGAIN= (0..3)
0 0 0 0 
##$XL= 0
##$YL= 0
##$YMAX_a= 744438
##$YMIN_a= -797181
##$ZGOPTNS= <>
##$ZL1= 120
##$ZL2= 120
##$ZL3= 120
##$ZL4= 120
##$ABSF1= 10
##$ABSF2= 0
##$ABSG= 5
##$ABSL= 3
##$ALPHA= 0
##$AQORDER= 0
##$ASSFAC= 0
##$ASSFACI= 0
##$ASSFACX= 0
##$ASSWID= 0
##$AUNMP= <proc_1d>
##$AXLEFT= 0
##$AXRIGHT= 0
##$AXTYPE= 0
##$AXUNIT= <>
##$AZFE= 0.1
##$AZFW= 0.1
##$BCFW= 1
##$BC_mod= 2
##$BYTORDP= 1
##$COROFFS= 0
##$CY= 7568.61572265625
##$DATMOD= 1
##$DC= 2
##$DFILT= <>
##$DTYPP= 0
##$F1P= 17.9538593292236
##$F2P= -4.03888763876832
##$FCOR= 0.5
##$FTSIZE= 32768
##$FT_mod= 4
##$GAMMA= 1
##$GB= 1
##$INTBC= 1
##$INTSCL= 1
##$ISEN= 128
##$LB= 0.02
##$LEV0= 0
##$LPBIN= 0
##$MAXI= 945.577
##$MC2= 0
##$MEAN= 0
##$ME_mod= 0
##$MI= -402.1523
##$NCOEF= 0
##$NC_proc= 0
##$NLEV= 6
##$NOISF1= 8.587773
##$NOISF2= 6.764455
##$NSP= 1
##$NTH_PI= 0
##$NZP= 0
##$OFFSET= 17.49637
##$PC= 1
##$PHC0= -41.51857
##$PHC1= 7.069217
##$PH_mod= 0
##$PKNL= yes
##$PPARMOD= 0
##$PPDIAG= 0
##$PPIPTYP= 0
##$PPMPNUM= 100
##$PPRESOL= 1
##$PSCAL= 0
##$PSIGN= 0
##$REVERSE= no
##$SF= 200.13
##$SI= 32768
##$SIGF1= 18.5376
##$SIGF2= -6.396296
##$SINO= 400
##$SIOLD= 32768
##$SREGLST= <1H.CDCl3>
##$SSB= 3
##$STSI= 0
##$STSR= 0
##$SW_p= 4401.40845070422
##$SYMM= 0
##$S_DEV= 0
##$TDeff= 0
##$TDoff= 0
##$TI= <>
##$TILT= no
##$TM1= 0
##$TM2= 0
##$TOPLEV= 0
##$USERP1= <user>
##$USERP2= <user>
##$USERP3= <user>
##$USERP4= <user>
##$USERP5= <user>
##$WDW= 1
##$XDIM= 8192
##$YMAX_p= 0
##$YMIN_p= 0
$$ End of Bruker specific parameters
$$ ---------------------------------
##NTUPLES= NMR FID
##VAR_NAME=  TIME,          FID/REAL,        FID/IMAG
##SYMBOL=    X,             R,               I
##VAR_TYPE=  INDEPENDENT,   DEPENDENT,       DEPENDENT
##VAR_FORM=  AFFN,          ASDF,            ASDF
##VAR_DIM=   8192,          8192,            8192
##UNITS=     SECONDS,       ARBITRARY UNITS, ARBITRARY UNITS
##FACTOR=    0.0002272,     1,               1
##FIRST=     0,             0,               0
##LAST=      1.8609952,     -222,            -79
##MIN=       0,             -797181,         -797181
##MAX=       1.8609952,     744438,          744438
$$ Real data points
##PAGE= N=1
##DATA TABLE= (X++(R..R)), XYDATA
0 0 0 0 0 0 0 0 0 0 0 0 -1 16 -16 16 -16 32 -32 33 -48 64 -64 81 -97 113 -144 161 -192 224 -256 289 -337 385
32 385 -433 497 -561 625 -706 788 -882 984 -1102 1221 -1349 1503 -1663 1832 -2022 2232
48 2232 -2461 2710 -2983 3290 -3625 4000 -4419 4892 -5425 6038 -6755 7591 -8591 9813
62 9813 -11351 13338 -16027 19894 -25959 36846 -62457 249983 -135085 -695758 97157 587843
74 587843 2308 -757771 -295867 558377 428741 -465067 -530049 284633 557957 -244149
84 -244149 -723452 -69531 634335 220237 -491611 -219949 603330 538934 -320173 -556466
94 -556466 178070 554038 -90012 -633011 -98765 616678 309439 -481564 -405933 348094
104 348094 425227 -344835 -645387 45090 572999 89197 -504620 -141278 563337 376254
114 376254 -407080 -470357 256679 497712 -146107 -523296 52732 611055 200982 -479793
124 -479793 -297373 375112 323001 -394974 -542359 152862 524592 -18629 -489775 -56570
134 -56570 520611 224235 -456201 -373093 309825 420258 -198577 -435919 150332 560347
144 560347 83855 -474285 -190202 390519 226126 -406930 -406173 243955 452249 -102386
154 -102386 -439622 19068 460495 97616 -464462 -269882 340458 329727 -243501 -350156
164 -350156 211800 474794 -18737 -437084 -97431 375457 147810 -383988 -285317 293447
174 293447 374145 -161784 -379711 81625 394982 -4983 -439948 -164964 349545 240395
184 240395 -270331 -273474 248855 393359 -102918 -403595 -15249 367666 79026 -368687
194 -368687 -184519 326478 295831 -211477 -324803 128095 339775 -72635 -401923 -76905
204 -76905 350917 162172 -289394 -203621 271380 304303 -172117 -348264 61236 338966
214 338966 11400 -340354 -94380 335556 213487 -249359 -263732 174042 286546 -128100
224 -128100 -351380 4567 332885 87098 -288092 -140394 268136 222256 -207102 -287623
234 -287623 110561 296276 -41016 -299938 -20934 316776 130474 -258533 -190032 199178
244 199178 224369 -160582 -287836 69050 302626 19798 -281804 -80201 266940 148448
254 148448 -235846 -226330 155650 252465 -90125 -267118 33846 293965 62164 -265328
264 -265328 -129911 223700 175886 -189283 -232971 125518 269828 -42906 -267582 -20977
274 -20977 261833 85398 -249241 -166544 190588 209116 -134385 -237302 80608 266767
284 266767 -1992 -261452 -70186 231856 122424 -202227 -175986 157727 224795 -86499
294 -86499 -236885 29479 242864 28861 -241741 -99536 207294 150832 -163319 -187989
304 -187989 117627 222498 -56270 -239444 -14478 227376 68708 -211463 -123941 181080
314 181080 176239 -126681 -202770 73793 219300 -17355 -225437 -45191 211893 102847
324 102847 -180446 -145183 145775 184885 -97864 -212771 37574 216507 15751 -213114
334 -213114 -72948 193860 126836 -157912 -168546 111478 196333 -61019 -213212 4144
344 4144 213770 54569 -193502 -101637 167395 146475 -126072 -179215 76190 197402 -24541
355 -24541 -203194 -28593 194991 79073 -173879 -125107 137591 157910 -96823 -184258 45527
366 45527 194915 7536 -191325 -57591 176084 105627 -146143 -142362 108471 170832 -61143
377 -61143 -183680 13092 186156 37184 -174270 -83586 150199 122154 -119089 -154801 76911
388 76911 172910 -32971 -181986 -15915 176032 62089 -158817 -104183 130354 139590 -91495
399 -91495 -163039 48903 177375 -496 -175229 -44184 163624 87691 -138576 -122994 104643
410 104643 149030 -64975 -166441 19238 169466 24145 -164335 -68403 145307 105241
420 105241 -117748 -135953 81243 156448 -38706 -165209 -5508 163712 51074 -147782
430 -147782 -89032 124551 123497 -90268 -145728 50947 156864 -9638 -158218 -33108 146692
441 146692 70959 -126933 -105084 97339 128689 -64572 -147158 24699 152534 15432 -146507
452 -146507 -51932 134030 89255 -108036 -117089 76050 137284 -38890 -146765 362 148482
463 148482 40868 -135548 -75762 114285 103235 -89085 -128821 51425 139889 -14124 -142256
474 -142256 -22405 137358 59180 -122308 -92968 95822 116061 -65662 -131918 33259 143740
485 143740 9477 -137114 -44652 123657 76331 -105436 -106995 74503 126306 -39219 -133385
496 -133385 6115 134172 28209 -128206 -65773 104646 89359 -81259 -109360 55104
506 55104 127797 -17381 -129524 -16361 123346 45319 -113815 -76210 93465 103876 -60094
517 -60094 -114272 32341 123747 -528 -128079 -39726 112005 65742 -94548 -87863 74763
528 74763 110635 -42474 -120942 6839 116398 18856 -114906 -50130 104039 83184 -75414
539 -75414 -96554 54025 110981 -27838 -122910 -9886 115911 40445 -101711 -62552 89960
550 89960 90558 -64639 -110920 28421 110199 -6352 -115129 -23600 111734 59213 -88068
561 -88068 -76928 68087 91857 -48505 -110268 14648 113122 18517 -101244 -36826 98623
572 98623 66473 -81226 -92714 47932 96394 -27483 -104895 1336 110410 35581 -95012
583 -95012 -59532 75537 72289 -64326 -95634 35247 105251 -1175 -95043 -14901 96787
594 96787 42365 -88068 -72554 60802 82440 -41618 -90569 24747 105635 10413 -98953
605 -98953 -38428 81368 50295 -77212 -77817 54046 95873 -20228 -92295 2989 95728 20342
617 20342 -96315 -53787 73971 68943 -53341 -75687 42684 96079 -10125 -96970 -20012
628 -20012 83192 31954 -82685 -57194 69338 81789 -38678 -83784 19735 86694 -2947
639 -2947 -96373 -33121 80345 53759 -60363 -60619 54663 83270 -28390 -91506 -2568 80476
651 80476 15224 -79850 -34914 76059 64474 -49031 -71257 30685 74558 -20804 -90709
662 -90709 -11655 83338 35357 -66869 -43522 63346 65093 -46043 -83223 13881 77636 1146
674 1146 -77727 -16717 82420 49185 -60418 -60396 42143 63858 -34657 -81370 7438 82953
686 82953 19948 -68751 -29781 66732 47954 -59321 -72555 29349 71872 -14173 -72743 1722
698 1722 82469 29700 -68205 -48030 49572 52851 -43672 -69851 24216 80628 5933 -68329
710 -68329 -15700 66404 30299 -65381 -57446 39981 61976 -23754 -63470 14888 75800 11224
722 11224 -71981 -34317 54707 39323 -50970 -55630 38395 72763 -8506 -65406 -3846 64705
734 64705 16880 -67743 -43117 50226 54313 -32102 -54995 25804 67651 -5452 -71260 -20307
746 -20307 56054 26718 -54289 -41525 47905 62101 -23117 -62016 9039 61539 905 -68445
758 -68445 -25407 58954 43548 -39921 -45514 35240 59753 -19119 -69252 -7233 58416 16225
770 16225 -55877 -28180 53354 48747 -34483 -55120 17417 53798 -10515 -63590 -10454 60989
782 60989 31214 -45228 -35349 41684 48074 -30491 -60827 7121 56966 6033 -53407 -15846
794 -15846 55194 36342 -41993 -47878 24650 47083 -19434 -57112 2680 59125 17827 -47711
806 -47711 -24874 43272 35741 -37667 -51345 19027 53893 -4119 -50921 -2957 56527 22953
818 22953 -48396 -37551 33124 40113 -26861 -49957 13781 56793 6369 -50298 -17057 45020
830 45020 25163 -43619 -41868 28207 47446 -13283 -46003 6667 52496 10165 -49948 -26210
842 -26210 38859 32729 -32265 -41031 24060 51504 -5915 -49212 -6930 44574 14880 -45053
854 -45053 -31259 33788 40280 -20491 -41845 12932 47098 -777 -48659 -15167 40469 23272
866 23272 -34017 -30341 29539 42601 -14519 -44421 2632 43165 5578 -45263 -19480 39124
878 39124 31135 -27871 -35619 19959 40915 -10437 -46733 -6207 41632 15516 -37001 -23249
890 -23249 33687 35035 -22462 -39502 11142 40130 -2717 -41959 -8786 40674 22056 -32047
902 -32047 -28453 25545 34711 -18426 -42006 4251 40883 5779 -38471 -14436 35618 25544
914 25544 -27957 -33439 17323 35904 -8890 -38724 -391 39975 13131 -33824 -19917 28894
926 28894 26890 -22644 -34334 12213 37066 -1787 -36565 -6761 35633 16641 -32095 -26507
938 -26507 22942 30303 -15868 -34654 6788 37328 4805 -34230 -13464 30549 21110 -25594
950 -25594 -28003 18084 33340 -8375 -33648 1146 34070 7933 -32541 -17850 26316 23765
962 23765 -20939 -29868 12972 33614 -4021 -34802 -5640 32286 13213 -29027 -21149 23125
974 23125 28200 -14011 -30374 7040 32887 2234 -32033 -10813 29022 17914 -23848 -23698 17720
987 17720 28356 -10288 -31095 919 30288 6407 -29652 -14951 25233 21660 -19241 -26249
999 -26249 12539 29548 -4363 -30094 -3684 28978 12115 -24864 -18044 20677 24129 -14002
1011 -14002 -27275 6713 28531 257 -28865 -8073 25954 14444 -22325 -20881 16337 24851
1023 24851 -10080 -28023 2290 28567 5553 -26918 -12203 24002 18738 -18140 -22770 12133
1035 12133 26391 -4507 -27253 -2860 26436 9635 -23999 -15843 19253 20262 -14510 -24239
1047 -24239 7360 25495 -1223 -25962 -6266 24030 12672 -20697 -18093 16188 22915 -9737
1059 -9737 -24849 3495 26010 3983 -24066 -9973 21265 15816 -16740 -20327 10636 22883
1071 22883 -5308 -24539 -1395 23365 7170 -22046 -13109 18100 17658 -13363 -21011 7807 23492
1084 23492 -882 -23314 -4845 22566 11294 -19136 -15656 15106 19914 -9534 -22190 3132
1096 3132 22483 2672 -22076 -8999 19159 13556 -15893 -17878 11048 20347 -6173 -21923 228
1109 228 21669 5757 -19773 -10649 17505 16014 -12327 -19078 7736 21382 -2045 -21813 -3735
1122 -3735 20448 9143 -17682 -13762 13374 17008 -9081 -20255 3018 20159 1663 -19723
1134 -19723 -6769 17941 11813 -14452 -15069 10637 17947 -5416 -19158 533 20096 5355 -17916
1147 -17916 -9686 15559 13642 -12187 -17422 6853 18417 -2213 -18869 -2903 17593 7852 -15756
1160 -15756 -12505 12070 14891 -8447 -17055 4629 19068 1560 -17399 -5204 16500 9865 -13887
1173 -13887 -13914 9784 16464 -5197 -17651 928 18154 3912 -17389 -9228 13585 11590 -10947
1186 -10947 -15054 6739 16993 -1576 -16785 -2476 15997 6266 -14467 -10205 12010 13619 -7417
1199 -7417 -14378 4562 16398 248 -16557 -5358 14125 8415 -12501 -11963 9265 14837 -5209
1212 -5209 -16005 453 14915 2548 -15246 -7184 12652 11012 -8748 -12199 6502 14463 -2455
1225 -2455 -15485 -2043 14348 5172 -12530 -7795 11367 11848 -7462 -14105 3159 13524 -560
1238 -560 -15105 -4053 13768 7964 -10830 -10046 8414 11990 -5577 -14139 891 13775 3094
1251 3094 -11922 -4774 12368 9468 -9188 -11481 5434 12008 -3683 -13486 -233 13391 4925
1264 4925 -11582 -7606 9133 9255 -7822 -12886 3326 13195 331 -11988 -2182 12317 6499
1277 6499 -10066 -9207 6857 10280 -4195 -11183 2048 12978 2514 -11278 -4836 9644 6273
1290 6273 -9268 -10047 5627 11187 -2224 -11015 -144 11556 3507 -11327 -7435 8260 8669 -6091
1304 -6091 -9357 4780 12070 160 -10609 -2655 9408 4507 -9252 -7600 7049 9817 -3788
1317 -3788 -9861 2074 10193 -83 -11495 -4669 8642 5993 -7280 -7607 6194 10641 -2247
1330 -2247 -10691 -619 9659 2446 -9424 -4836 8589 8366 -4906 -8237 3196 8838 -1492
1343 -1492 -10609 -2535 8909 4219 -7658 -5540 6988 8158 -4655 -9366 1046 8471 217 -8924
1357 -8924 -2540 9042 6625 -5833 -6729 4757 7873 -3347 -9575 -44 8873 2764 -7394 -3678
1371 -3678 7246 5798 -5950 -8463 2104 7756 -1621 -8568 -418 9037 3827 -7306 -5146 5767
1385 5767 6253 -4597 -8215 1942 9035 1443 -7377 -1955 7797 4362 -6845 -6986 3520 6450
1399 6450 -2533 -7439 869 8050 1940 -7221 -3994 5390 4442 -5633 -6740 3711 7801 -658 -6793
1414 -6793 -258 7496 2450 -6789 -5196 5026 5974 -3429 -6328 2532 7720 219 -7583 -2687 5537
1429 5537 2800 -5681 -5054 3964 6367 -1844 -6282 691 6532 768 -7091 -3188 5924 4654 -3846
1444 -3846 -4693 3909 6742 -1071 -6974 -1133 5890 2066 -5982 -3690 5189 5284 -3060 -5943 1422 5362
1460 5362 -827 -6613 -1920 5531 3249 -4102 -3555 4120 5467 -2480 -6065 613 5751 744 -5432
1475 -5432 -1691 5601 4214 -3867 -4998 2288 5060 -1843 -6538 -737 5802 2105 -4853 -3110 3981
1490 3981 4000 -3203 -5335 1029 5124 392 -4775 -715 5406 2897 -4049 -3706 3211 4106 -2388 -5100
1506 -5100 861 5330 910 -5014 -2124 4075 2830 -3982 -4665 1954 4525 -999 -4693 138 5102
1521 5102 1608 -4032 -2495 3566 3231 -2369 -4063 1890 4964 93 -4449 -888 4299 1588 -4129
1536 -4129 -3402 2600 3902 -1662 -4238 845 4456 540 -4437 -2059 3661 2540 -2769 -3195 2260
1551 2260 4157 -519 -3576 -215 4018 1183 -3770 -2275 3057 2993 -2110 -3345 1304 3799 -528
1566 -528 -4297 -1233 3142 1614 -3034 -2697 2635 3513 -1284 -3595 321 3756 383 -3346 -1162 3121
1582 3121 2455 -2146 -2459 1735 3127 -710 -3850 -335 3416 798 -3389 -1781 2570 2481 -2135 -3212
1598 -3212 962 2952 -126 -3334 -638 3222 1820 -2421 -1866 2068 2562 -1174 -2848 629 2994
1613 2994 467 -2605 -1015 2560 1734 -2190 -2499 1345 2317 -1066 -2912 35 3045 885 -2645 -1442
1629 -1442 2097 2192 -1528 -2491 1001 2922 27 -2612 -638 2680 1258 -2018 -1651 1544 2115 -1082
1645 -1082 -2399 211 2372 110 -2413 -1041 2019 1352 -1950 -2067 1276 2357 -415 -2113 217
1660 217 2359 899 -1887 -1120 2061 1925 -1174 -1914 827 2310 -296 -2039 -441 1742 768 -1964
1676 -1964 -1511 1093 1546 -1128 -2169 372 1985 180 -2028 -540 1963 1248 -1169 -1290 1060 2084
1692 2084 -192 -1670 -51 1892 647 -1733 -1009 1222 1183 -1085 -1603 324 1617 -325 -1727 -478
1708 -478 1300 818 -1357 -1227 1309 1436 -531 -1362 483 1786 282 -1417 -386 1452 1153 -945
1724 -945 -1089 594 1615 -248 -1642 -200 1344 264 -1500 -939 971 845 -768 -1264 460 1493
1740 1493 111 -1380 -138 1554 669 -1156 -806 951 1311 -400 -1082 376 1361 86 -1125 -706
1756 -706 824 652 -1039 -1316 466 992 -458 -1161 -377 1073 383 -887 -617 923 1020 -333 -873 514
1774 514 1340 219 -1175 -362 960 514 -833 -1074 465 848 -281 -1124 -410 992 22 -1182 -359
1791 -359 896 553 -530 -630 372 939 -13 -659 -64 1000 567 -531 -626 538 882 -382 -882 61
1809 61 836 -57 -934 -573 509 364 -662 -756 377 686 -162 -736 -331 800 353 -246 -426 540 897
1828 897 152 -619 300 872 254 -786 -112 419 374 -511 -659 186 355 -172 -945 -585 496 222 -569 -538
1848 -538 491 585 -33 -577 119 742 299 -323 -112 457 498 -281 -421 187 421 -32 -808 -381 311 146
1868 146 -483 -373 44 198 -224 -321 -156 574 336 -663 -462 525 677 -94 -308 152 706 204 -582 -77
1888 -77 349 540 -257 -704 274 491 -468 -556 -151 441 -38 -586 -462 439 525 -254 -529 226 747 180 -465
1909 -465 -226 766 566 -220 -330 459 718 -152 -613 -284 321 -5 -627 -548 318 466 -303 -700 35 525
1929 525 83 -632 -127 490 443 -135 -409 465 892 12 -602 -175 737 290 -496 -364 369 492 -253 -768
1949 -768 -196 402 -8 -739 -451 510 490 -399 -640 465 796 -10 -734 -89 560 562 -411 -243 622 864 -213
1970 -213 -685 38 648 -68 -1035 -623 628 393 -581 -626 210 700 -132 -991 -346 798 344 -674 -405
1989 -405 719 784 -217 -820 214 898 83 -894 -212 818 500 -540 -680 552 731 -368 -974 -326
2007 -326 788 196 -902 -631 763 755 -425 -880 431 1296 95 -790 -16 958 638 -467 -518 572
2025 572 799 -175 -892 -70 889 -18 -911 -396 731 573 -683 -805 303 860 -213 -824 -8 1055
2043 1055 705 -695 -418 807 952 -368 -712 337 1014 150 -751 -325 885 534 -896 -678 156 722
2061 722 -406 -1176 -95 960 40 -935 -396 753 762 -610 -632 463 1051 -88 -932 111 1016 546
2079 546 -829 -543 564 759 -637 -1208 68 809 106 -1208 -333 878 600 -926 -1098 703 965
2096 965 -472 -971 155 1241 379 -798 -486 1139 852 -688 -1032 442 1165 -112 -1313 -294 1032
2113 1032 411 -966 -714 552 935 -536 -1325 89 1138 144 -1119 -220 1053 697 -903 -739 894
2130 894 1012 -228 -1051 9 1035 229 -1184 -552 856 779 -913 -1296 259 1015 -278 -1310 -289
2147 -289 1025 535 -1166 -799 910 1005 -529 -1082 257 1263 30 -1314 -335 1133 606 -1012 -972
2164 -972 793 992 -480 -1313 -99 1342 217 -1311 -757 881 718 -687 -1071 393 1263 -134 -1189
2181 -1189 78 1295 533 -1060 -703 956 1111 -704 -1117 136 1146 8 -1476 -496 1090 605
2197 605 -1223 -1123 580 1042 -568 -1364 177 1171 349 -1133 -600 1266 988 -694 -1001 573 1313
2214 1313 -14 -1266 99 1268 423 -1126 -943 1004 880 -879 -1452 236 1333 -113 -1441 -318
2230 -318 1289 631 -1052 -1109 787 1221 -507 -1170 212 1533 376 -1247 -570 1091 1048 -1087 -1294
2247 -1294 675 1072 -159 -1464 -113 1263 245 -1338 -890 1015 977 -693 -1277 224 1441 7
2263 7 -1351 -310 1482 920 -944 -917 859 1367 -242 -1411 155 1393 115 -1488 -625 988 713
2280 713 -1059 -1294 556 1184 -367 -1558 -96 1360 488 -1260 -710 1271 1306 -686 -1254 543 1352
2297 1352 134 -1422 -313 1259 660 -1100 -1123 857 1170 -574 -1391 216 1157 117 -1365 -624 1239
2314 1239 930 -858 -1210 671 1636 -316 -1459 116 1301 561 -1444 -918 1179 1190 -986 -1247 257
2331 257 1274 -154 -1607 -348 1295 554 -1270 -995 702 1256 -564 -1261 202 1412 187 -1322
2347 -1322 -528 1411 1108 -943 -1127 724 1382 -229 -1418 -148 1483 327 -1420 -940 861 943 -1082
2364 -1082 -1508 383 1309 -90 -1419 -137 1291 584 -1198 -927 1086 1322 -583 -1334 295 1539
2380 1539 301 -1432 -692 1099 982 -1161 -1332 739 1306 -388 -1472 -63 1161 439 -1360 -804
2396 -804 1045 1002 -959 -1127 560 1404 -72 -1455 -111 1565 637 -1022 -1085 1045 1510 -651 -1376
2413 -1376 105 1446 114 -1457 -507 1169 834 -1108 -1263 671 1249 -430 -1230 62 1334 476
2429 476 -1253 -644 1161 987 -829 -1211 275 1352 9 -1494 -174 1452 612 -1374 -1008 815
2445 815 1234 -676 -1374 133 1260 113 -1327 -507 1276 1107 -930 -1019 831 1470 -283 -1368 307
2462 307 1442 198 -1392 -676 1124 987 -857 -1431 423 1254 -257 -1474 -239 1290 732 -1066
2478 -1066 -818 930 1049 -458 -1096 292 1490 94 -1356 -411 1354 661 -1076 -1065 762 1268 -509
2495 -509 -1540 88 1404 325 -1368 -771 1219 913 -1095 -1086 746 1176 -277 -1294 -200 1228 654
2512 654 -1015 -623 1177 1159 -530 -1201 392 1470 -235 -1386 -411 1239 618 -1115 -1074 995 1277
2529 1277 -489 -1408 85 1478 269 -1398 -394 1082 869 -576 -975 578 1196 -91 -1151 148
2545 148 1448 492 -1104 -813 1044 1037 -984 -1116 378 1101 -159 -1385 -315 1132 624 -1120 -1101 827
2563 827 1171 -554 -1306 237 1501 279 -1220 -539 1240 648 -873 -1046 694 1154 -434 -1261 129
2580 129 1210 261 -1247 -608 960 1022 -738 -1149 363 1318 115 -1353 -210 1356 677 -1105 -633
2597 -633 897 974 -435 -1107 355 1248 139 -1347 -428 1013 626 -1023 -1027 646 1080 -395 -1305 85
2615 85 1145 319 -1238 -737 1107 880 -728 -1103 618 1372 33 -1255 -163 1154 198 -1078 -770
2632 -770 719 1001 -508 -1152 191 1100 -158 -1355 -426 1212 451 -1079 -825 700 1202 -392 -1131
2649 -1131 135 1267 327 -1028 -507 1156 899 -741 -1187 488 910 -353 -1324 -244 1069 542 -986
2666 -986 -708 848 882 -731 -1181 440 1261 44 -1134 -113 1179 667 -860 -828 649 1293 -487
2683 -487 -1236 107 1154 203 -1043 -697 999 536 -826 -959 344 888 -268 -1157 35 1310 286
2700 286 -973 -547 1082 765 -782 -924 553 1322 75 -1187 -347 1271 629 -1015 -918 692 1061
2717 1061 -456 -999 84 949 -42 -1121 -422 750 643 -778 -941 740 888 -67 -865 250 1165
2734 1165 509 -936 -454 816 916 -609 -1048 305 907 -36 -1190 -452 1034 444 -970 -638 623
2751 623 984 -389 -861 225 921 50 -1047 -575 979 680 -737 -608 862 726 -566 -1022 58
2768 58 964 264 -1005 -571 784 907 -547 -1065 263 935 -107 -1079 -209 1069 617 -798 -562 900
2786 900 838 -275 -886 140 999 -35 -953 -142 867 491 -920 -719 708 795 -310 -1223 -33 1086
2804 1086 347 -938 -564 884 630 -774 -873 513 898 -46 -817 -121 892 467 -747 -494 794 648
2822 648 -613 -906 449 886 -111 -1043 -327 815 377 -892 -830 526 756 -177 -1148 246 875 91
2840 91 -943 -216 413 561 -523 -614 643 967 -217 -1003 -160 1039 361 -1110 -475 770 598 -608
2858 -608 -932 195 972 68 -944 -310 994 468 -576 -619 691 1023 -269 -768 121 884 255 -717
2876 -717 -339 736 608 -764 -797 313 636 -433 -948 -370 791 163 -822 -559 663 710 -547 -1032
2894 -1032 252 908 -34 -955 -45 870 396 -574 -540 732 678 -367 -763 -148 688 -55 -889 -386 814
2913 814 510 -516 -653 357 755 -43 -816 -244 829 529 -629 -409 588 494 -510 -542 313 870 -93
2932 -93 -581 -69 728 287 -806 -554 489 496 -496 -710 121 796 -10 -985 -141 924 532 -566 -516 437
2952 437 853 202 -884 94 1091 258 -852 -378 756 536 -428 -536 205 646 -46 -783 -187 767 264
2971 264 -701 -417 584 667 -615 -509 163 805 73 -860 -170 783 687 -322 -550 424 668 -242 -682 193
2991 193 637 18 -693 -584 526 538 -535 -650 434 721 -79 -740 100 668 386 -706 -342 664 593
3010 593 -406 -738 221 780 9 -876 -232 639 474 -407 -432 449 419 -161 -631 115 612 246 -441 -266 703
3031 703 283 -167 -446 369 679 -165 -670 9 910 133 -603 -280 380 625 -484 -916 72 636 45 -767
3051 -767 -168 448 89 -570 -439 557 723 -241 -651 70 762 192 -673 -164 736 318 -445 -771 260 606
3071 606 -105 -678 31 412 249 -578 -502 366 424 -368 -691 210 556 -61 -388 -48 648 287 -508 -242 314
3092 314 417 -351 -539 24 580 44 -698 -92 654 426 -622 -559 274 680 -40 -847 -71 702 112 -469
3112 -469 -536 534 301 -192 -413 353 769 -114 -573 -167 556 88 -632 -263 381 417 -216 -771 82 408
3132 408 -41 -543 -359 427 299 -418 -368 228 498 90 -462 201 534 250 -433 -151 477 535 -487 -585 165
3153 165 582 -291 -635 -35 378 97 -667 -354 391 629 -355 -535 110 657 118 -542 -135 496 271 -474
3173 -474 -341 211 470 -279 -603 -80 498 206 -505 -185 507 374 -407 -316 220 473 -140 -704 -67 439
3193 439 190 -492 -384 450 407 -129 -373 279 536 -70 -461 -29 413 238 -336 -291 336 333 -286 -489 -107
3214 -107 569 -14 -654 -335 501 243 -378 -505 179 381 -35 -302 66 466 82 -453 -127 201 474 -304
3234 -304 -406 113 501 -226 -449 102 268 31 -667 -169 350 334 -350 -591 26 389 256 -195 -70 535
3254 535 259 -338 -403 217 522 115 -360 3 287 -88 -339 -248 218 422 -398 -385 86 337 -98 -472 21
3275 21 381 188 -388 -326 454 393 -210 -382 88 594 227 -438 -70 265 300 -251 -363 271 366 -179 -273 123
3297 123 158 167 -117 -275 328 234 -291 -377 168 590 -34 -339 -74 498 183 -295 -240 198 386 -141 -331 152
3319 152 361 111 -424 -156 377 250 -107 -69 299 183 -87 -299 163 294 36 -287 -187 358 218 -190
3339 -190 -139 226 456 -124 -566 -4 330 68 -346 -400 59 439 -419 -399 16 529 79 -399 -67 208 229
3360 229 -169 -139 75 257 -139 -283 40 493 204 -286 -113 372 189 -400 -409 120 243 -21 -177 -1 281
3381 281 304 -291 -52 37 299 -182 -264 272 185 121 -320 -64 362 128 -209 -257 178 365 -110 -288 135 288
3403 288 181 -326 -129 372 149 -264 -457 -20 236 -85 -460 44 582 122 -176 -18 315 179 -235 -396
3423 -396 -2 432 -98 -293 -112 352 -11 -117 -362 10 118 -57 -227 42 284 85 -233 -34 89 407
3443 407 -25 -103 202 192 36 -287 -60 461 102 -460 -207 159 212 -226 -292 86 374 -127 -403 -109 102
3464 102 131 -240 -182 333 150 49 -336 12 333 67 -180 94 428 324 -258 -93 191 328 -90 -326 26
3485 26 367 68 -356 -136 139 167 -204 -217 197 267 -59 -170 -42 383 174 -152 -172 114 203 18 -184 127
3507 127 295 -64 -134 -184 308 153 -399 -204 40 313 -114 -314 -185 224 128 -242 -305 222 250 -104 -305 97
3529 97 303 -17 -118 -24 113 150 -157 -93 205 78 -177 -230 103 250 140 -293 -41 135 99 -94 -228 74
3551 74 244 -33 -88 199 176 23 -96 -62 212 271 -95 -219 13 1 75 -284 -86 271 72 -167 -144 185 142
3574 142 -102 -209 -68 370 160 -108 -73 90 164 -86 23 250 296 90 -184 -54 112 77 -83 -207 151
3595 151 109 -185 -159 23 204 -66 -304 94 297 126 -237 -48 259 148 -135 -159 99 279 123 -282 -60
3616 -60 79 80 -13 -2 -7 151 -54 -251 -13 91 165 -339 -119 129 279 -342 -120 2 98 62 -206 105 235
3639 235 -4 -98 -231 202 250 -76 -99 198 38 42 -89 -204 68 22 -27 -313 -90 99 -69 -125 -78 248 -80
3662 -80 28 -147 197 160 -65 -156 172 279 204 -200 -149 127 145 -184 -209 26 97 -204 43 -14 -52 33 -79 48
3686 48 133 4 -225 29 75 87 -46 9 45 -48 27 -151 -19 84 27 -277 -271 114 255 -89 -279 -145 113 215
3710 215 43 -175 232 -75 -70 -107 -24 66 -87 -13 -65 199 -20 -176 59 134 112 -247 -337 -7 220 133 -228 -163
3734 -163 73 -15 -26 -171 100 -38 -24 -118 10 33 64 -186 -97 202 64 -118 -33 231 63 41 -230 -94 200
3757 200 39 -121 19 -3 268 60 -185 113 55 177 -156 -177 -129 -30 -82 2 49 219 39 -35 -23 12 10 -288
3781 -288 -22 70 99 -164 -299 129 114 68 -141 -214 86 134 -94 -192 101 72 124 9 67 -86 63 110 -31 76
3805 76 -61 46 -62 38 196 -32 -86 1 -2 158 -102 -131 97 115 -39 -126 -165 209 141 -121 -208 142 177 31
3829 31 -222 151 107 148 102 -31 186 62 27 -36 62 169 -169 -269 41 127 37 -93 -100 171 124 -100 -131 -16
3853 -16 97 165 -24 147 176 102 1 -32 -40 123 68 -239 -100 111 -154 -126 75 50 123 -195 -61 -56 10 -134 -19
3878 -19 -140 168 -107 -3 118 -93 26 -98 -344 85 151 -74 -172 92 46 93 -195 -21 -44 -79 -55 -3 -24
3901 -24 89 188 -233 -42 -84 -77 -21 185 -91 164 -34 -94 149 89 83 -10 -102 85 67 -211 -13 -43 -83 -42 -138 21
3927 21 -50 -108 -101 -96 94 49 -116 -154 46 190 -72 -74 43 46 150 -47 -36 35 -14 97 -119 6 63 -82 -109 -28
3953 -28 173 16 36 -126 21 76 -70 -18 -6 1 7 2 -7 75 311 -100 -94 93 112 206 -141 -118 158 106 -99 -70 -84
3980 -84 36 -217 -160 -94 -99 86 12 -133 136 -114 63 -190 82 128 -186 -46 143 123 -29 71 -70 12 175
4003 175 13 -115 101 -107 83 -31 -53 38 -66 -73 -81 -9 29 101 -114 -177 38 17 -4 -106 154 69 -160 -144 -194
4028 -194 157 -40 -23 44 -33 5 39 -143 34 -21 -39 -109 -110 28 145 -92 -7 19 -35 138 -125 32 -20 94 -96
4053 -96 212 60 44 -34 70 -53 52 -12 -132 -59 125 32 -260 -111 134 -33 -83 -176 -57 6 -22 71 116 -97
4077 -97 133 140 79 196 -114 5 -76 -28 121 -140 -185 154 37 61 -163 -99 100 33 -127 -143 177 145 28 -155
4101 -155 -59 129 110 123 -14 176 84 95 -2 63 116 -49 -1 67 -91 135 -2 -53 40 109 48 30 -129 49 121
4126 121 -32 -167 64 64 157 -69 -139 -3 -90 55 -148 196 -60 -153 -201 113 33 -85 -170 -96 -76 20 -4 69 -20
4151 -20 -13 -73 -186 -13 186 -61 -126 91 49 71 -47 31 51 -74 -32 -5 74 -89 -28 -49 -161 -121 -64 -109 -161 -186
4177 -186 101 -32 -93 -89 62 47 -171 -139 24 56 85 -19 14 165 -42 47 -161 39 174 8 -110 -161 236
4200 236 -50 -298 116 -60 54 -90 12 -29 -76 -126 -121 63 -31 139 44 -103 173 95 -57 -118 57 104 -19
4223 -19 118 56 -35 108 -54 55 99 87 -93 -164 137 97 -1 -103 23 79 -42 -102 -69 50 44 -132 -207 -127 -86
4248 -86 -108 -187 -153 -12 -18 22 -64 170 25 -49 -187 155 76 -53 11 -234 -8 -32 103 -46 14 149 40 99 20
4273 20 91 2 178 -249 124 4 -1 -27 -4 20 90 -199 -147 13 120 -81 -51 32 184 3 -98 -51 145 -44
4297 -44 64 -14 8 73 -238 1 16 171 37 -29 35 360 170 51 55 259 118 -61 9 29 203 26 34 -134
4321 -134 30 91 -98 -58 145 169 -26 -166 11 22 -96 -39 94 52 107 -124 -38 -94 157 -61 -151 -129 2 -27
4345 -27 -8 162 -42 136 -56 -105 17 1 -37 -96 -35 -58 -20 -10 -58 -20 56 -95 -386 74 -59 16 -154 81 1
4370 1 195 -98 -92 8 54 60 9 113 230 15 -41 83 174 151 -101 -106 86 163 31 40 -193 62 -53 -6 60 -228
4396 -228 190 35 -147 72 170 46 -59 51 55 -124 31 27 138 37 -168 76 -22 109 -78 -74 -183 144 -105
4419 -105 175 -177 178 -8 -115 -148 -20 129 250 -126 -21 122 -49 105 -100 -34 171 108 -105 14 60
4440 60 105 40 19 -119 152 -19 19 -104 47 -105 -121 -14 -50 33 -39 -42 -87 83 150 -9 -128 30 108 -173 -68
4465 -68 45 -135 85 -67 -104 31 -40 -141 57 -14 0 -89 6 -68 74 -5 -169 12 116 93 -128 -66 1 36
4489 36 119 -25 -82 10 152 17 -21 104 53 -81 21 99 17 -166 -61 -91 125 -98 -54 22 131 -108 -6 -262
4513 -262 150 220 -51 -159 -231 147 88 -164 -119 159 -33 -71 30 8 30 43 -212 116 -6 -28 -99 -115 -10 145
4537 145 3 -83 -35 28 -78 203 -6 136 118 -106 -176 -36 69 35 -33 126 99 -6 -42 -10 -15 -24 -130 -225 42
4562 42 114 -22 -183 64 26 -144 -197 32 64 100 -68 -165 27 118 -87 -41 -67 3 57 12 -222 22 73 27 -51
4587 -51 33 187 69 -88 -24 -1 96 66 31 165 122 -52 -162 122 -1 197 -97 18 178 77 -35 -126 -42
4610 -42 62 -89 17 -90 -55 113 -93 18 -28 146 50 -4 -104 76 -71 -5 -7 15 113 -7 2 89 -17 -123
4634 -123 -50 15 51 11 32 -153 108 -111 106 -66 28 243 56 -216 82 131 91 -39 -41 88 107 56 -74 -119
4658 -119 81 268 -72 102 161 59 -211 -56 -21 30 51 -88 -72 -114 27 -120 -103 46 213 -61 -93 -89 181
4681 181 173 -55 -22 73 112 -65 -187 -25 43 -20 -208 -56 184 -33 13 -134 165 79 91 -53 -115 93 -104 -239
4705 -239 14 255 105 9 -125 88 114 -47 -2 -61 142 31 -33 -13 -14 -25 -80 -167 -11 275 6 0 107 117 144
4730 144 65 -192 68 -12 -93 -172 96 30 -91 -231 -114 53 133 -166 -53 59 4 -3 30 -56 -45 110 -310 -14
4754 -14 -49 55 -37 -188 44 90 -119 -153 30 140 178 -20 11 -23 26 81 -253 197 67 88 -16 -71 -7 33 92
4779 92 -23 70 169 -90 -33 94 135 89 40 -110 -43 119 50 0 -94 56 -28 -184 124 105 -8 -19 1 133 -51
4804 -51 2 3 36 -14 162 -40 -5 127 132 -122 -187 204 90 -53 -220 104 25 48 -106 173 109 64 -46 33 64
4829 64 27 27 -87 300 -99 20 -49 -118 143 25 -45 -125 215 181 -19 -103 -94 182 23 153 -67 -15 72 -56 10
4854 10 -30 126 -38 -79 -73 124 51 63 -117 118 61 43 -73 -90 140 135 25 -167 65 129 -68 -258 -52 12 -76
4879 -76 -19 -5 114 76 -51 -212 164 -120 -45 -38 -10 63 104 -189 -10 17 58 -136 -41 0 110 -38 -70 -58 70
4904 70 3 -92 -142 49 113 -54 10 47 18 129 90 76 -7 -13 47 -90 180 71 -85 -90 -57 80 -94 -152 -56 -22 58
4931 58 -70 -5 47 108 -49 42 91 317 -2 -79 -41 56 -166 -42 31 107 93 22 44 77 146 -32 -52 14 249 238
4957 238 -108 -216 70 168 -138 -243 -59 119 137 -110 -35 187 113 -143 37 -161 11 -127 -136 81 85 164 -35
4980 -35 21 -22 202 -105 -152 170 53 52 -111 -11 -71 201 -11 -132 -34 174 -12 -158 52 57 47 -59 53 -128
5004 -128 124 157 -122 -12 140 138 -50 -58 -61 -9 23 -56 72 50 -35 -21 -144 16 191 -94 -253 122 176 -89 222
5029 222 -10 79 7 -47 -31 -136 -14 -1 87 168 -68 49 -78 -78 -6 -84 -129 -119 23 -19 -84 -151 218 136 58 -29
5055 -29 -133 102 -53 -216 87 -223 135 -175 -206 83 251 99 18 -2 92 -105 -269 91 -91 55 4 -42
5077 -42 -71 189 -20 -229 -5 -39 59 -163 -40 -85 26 206 -35 -75 211 -42 -6 -38 38 -70 21 155 20
5100 20 128 -76 -208 36 -3 -19 -158 -105 115 149 80 -108 -153 112 194 47 46 0 98 -26 -102 -75 -53 -176 18
5125 18 7 178 -165 -111 36 -8 10 -97 112 -33 70 -178 -173 -39 82 270 36 -34 -8 86 -198 -87 117
5148 117 71 85 -81 202 -67 -146 -27 23 110 75 37 -1 -69 254 27 -351 -10 265 -198 -170 -7 140 -73
5171 -73 -17 -73 7 124 132 8 26 86 31 -76 -58 35 0 32 10 44 11 23 -92 -2 46 57 8 -147 68 160 -118
5198 -118 -62 -35 158 145 -89 -66 -82 -24 134 -39 5 -29 -176 -7 -15 22 -12 -129 -99 -86 -9 -81 -80 -31 -178 -38
5224 -38 53 -129 -42 28 -132 -111 42 183 123 -5 -20 133 -3 8 -166 -40 102 -47 -156 20 113 -96 -176
5247 -176 175 92 -67 36 -56 -42 87 -195 4 -12 33 92 -20 -72 -96 163 60 -106 12 30 -43 170 -95
5270 -95 -7 4 52 -40 79 14 8 -31 3 33 113 -146 97 -10 -12 65 -58 182 161 -85 -26 -55 160 83 -27 24 39
5297 39 106 -47 117 -110 -53 70 41 51 133 -40 51 66 -48 28 -61 -152 127 -20 8 57 30 134 3 -87 -115
5322 -115 86 96 102 -275 -68 154 -17 101 -157 58 -58 -111 -46 -27 104 -86 -126 -95 -1 71 -38 -71 13 -167
5346 -167 197 -56 39 178 -31 -45 52 -38 140 55 83 76 -58 97 -44 -127 141 32 73 -85 129 5 -87 -90
5370 -90 47 -144 43 -18 -201 123 -89 -184 6 -49 84 49 135 28 226 -10 -20 59 188 109 -108 14 191
5393 191 148 37 -86 36 21 83 -87 66 14 56 -76 -82 -5 282 -39 -125 -107 71 16 63 -107 142 114 -37
5417 -37 -16 -38 -36 63 18 132 72 24 27 -128 115 -117 -15 92 -14 -8 78 -346 -28 82 -104 -87 -28 14 264 -103
5443 -103 -34 5 78 135 -26 38 152 -60 -147 35 -155 82 -2 -90 -64 56 -15 -129 -160 26 10 94 52 -3 162
5468 162 23 -108 1 152 92 -1 16 -94 -24 55 37 40 -162 120 -89 -28 -15 -4 -56 -59 64 9 67 -13 -15 -77 -75
5495 -75 -49 27 183 200 -68 -108 177 93 -37 197 -50 72 52 31 33 -36 19 -163 -15 -25 -65 -120 -145 241 -1
5520 -1 4 140 -40 4 7 -19 -78 -123 175 15 -96 -118 19 54 25 96 -73 -22 -3 -107 182 124 96 -76 81 25
5546 25 -105 224 -53 -105 -66 -1 -107 44 48 177 -68 -71 33 -5 112 -72 -70 39 -16 -142 -194 -12 97 171 -30
5571 -30 -37 -112 -52 191 -86 1 -161 66 3 -50 -64 127 -152 111 195 100 -128 6 64 181 37 -107 145 -74
5595 -74 -148 -88 16 10 89 -4 -92 -157 53 -134 242 96 193 7 3 162 -20 14 -87 47 18 49 -192 -33 69
5620 69 85 46 -67 -170 -57 -138 -24 250 -55 -28 -34 24 -4 105 -43 61 172 46 19 63 -46 -89 -16 52 -126
5645 -126 32 -1 64 -166 50 81 40 7 -4 -61 -79 37 4 -40 7 -15 43 27 139 109 -13 13 153 201 -70 -45
5671 -45 120 64 -30 -122 -5 69 67 29 27 -86 153 -32 -57 -165 84 74 122 -337 -143 -105 180 -59 -20 -40 -48 62
5697 62 63 -124 -137 -168 -60 104 -29 52 27 -24 -101 25 -113 12 -197 -46 89 -45 -175 156 71 -131 -76 28
5721 28 88 -31 -140 -30 -97 -100 -268 89 195 -52 -13 -26 2 25 88 -56 -47 26 57 -27 -145 12 44 -4 85 -74
5747 -74 169 175 -97 -58 135 107 118 66 -145 60 2 156 1 15 -45 -27 57 28 265 -22 -7 187 94 77 117 100
5773 100 -2 36 -92 72 -50 -36 65 -125 61 -73 30 -33 -176 123 -152 -16 112 -19 102 -71 -2
5794 -2 -57 192 -129 -97 -81 58 215 -87 77 34 -53 -87 -126 -10 71 -183 -105 -106 -56 47 43 17 170 -1 43 26
5820 26 -1 -63 26 160 43 42 103 90 -47 128 -8 76 -136 -12 44 14 -53 -91 26 170 83 39 -136 -58 -3 -127
5846 -127 -96 2 77 -12 2 181 47 23 70 84 -77 -10 74 -131 148 254 166 142 -46 -64 155 -148 40 -67
5870 -67 8 -1 -206 -24 46 62 103 27 52 77 -120 71 -53 -41 151 -3 46 153 -266 -90 26 86 113 -256 106
5895 106 -6 57 95 13 -120 -107 41 -66 -36 185 -3 -2 -222 113 -12 -83 51 -50 120 92 -24 -9 -30 33
5919 33 94 12 4 160 -5 -62 44 43 55 -88 77 7 -76 123 66 67 50 9 -72 95 -115 22 -171 -29 31 -41
5945 -41 -47 85 -92 20 -77 -91 -175 -22 91 -218 40 -131 -70 -124 -4 -109 40 -88 121 -41 -123 -33 95
5968 95 70 41 16 -15 -79 -86 38 -4 -185 -52 32 29 6 99 -99 -68 89 -149 -105 -70 52 18 -94 -57 -43 82 -57
5995 -57 128 80 -131 -41 -33 86 -33 -117 -131 26 25 63 -24 -76 68 109 27 -82 112 42 106 -113 -102 44 -27 -37
6021 -37 108 -180 30 -109 -91 -75 183 -9 -17 34 38 -64 102 139 20 -143 54 33 95 10 -39 -27 13 13 125 123
6047 123 -58 -45 45 -117 43 37 132 -95 66 -36 -65 -95 44 11 -28 115 -50 -243 21 -64 32 4 -38 -141
6071 -141 8 -144 66 97 162 102 -29 29 261 52 -264 10 107 121 -101 93 80 11 -43 -166 -29 142 -338
6094 -338 -69 50 46 26 114 7 -44 145 -52 -65 -15 40 -48 -59 -109 -31 79 48 -1 -169 -80 80 14 -81 -87 -64 -120
6121 -120 -81 130 -17 14 -77 29 -36 7 84 -79 -127 -1 -69 -48 -171 98 -96 -38 186 -64 -162 16 -124 -93
6145 -93 -87 74 73 87 54 -53 -103 -130 190 -83 -10 0 -47 60 219 18 -112 119 -71 -7 -70 -18 -200 -116 -131 59
6171 59 68 29 -195 -74 -9 26 -46 13 -81 -152 -3 -43 134 222 31 -14 -118 -185 197 -46 -33 149 -69 169 56
6196 56 -76 -117 -170 103 -56 28 -103 -92 -92 -56 -7 -28 -31 -137 6 -25 -93 -83 -87 -37 -148 -93 -26 77 -106 -60 110
6223 110 2 44 -104 2 69 63 53 131 -2 129 118 26 215 -106 8 -63 54 80 -79 108 20 -11 -102 56
6247 56 -42 171 24 42 128 59 1 19 189 -147 -74 -176 33 -117 -49 -50 -24 -47 -92 37 125 26 93 -17 -27 30
6273 30 18 -85 122 -41 207 -89 6 112 121 86 54 41 -79 289 4 -18 76 115 55 90 30 132 -2 171 3
6298 3 -49 15 -23 47 126 -29 -110 -114 58 215 -16 -45 -36 101 -61 47 -44 83 63 -66 -63 -104 75 68 12 -132 80
6325 80 -102 47 21 -147 -70 -45 96 103 -65 59 -146 -23 24 16 -102 -102 61 -124 -47 -171 -19 -7 111 31 -15
6350 -15 78 -116 99 -117 -122 76 3 15 -47 -102 -65 -21 -54 -73 -315 -85 -151 3 -123 -178 3 -29 -87 -2 114 -76
6376 -76 35 68 16 142 -136 -93 -21 -10 -59 165 21 80 -9 77 15 -183 -10 13 -94 -75 73 -165 30 97 -127
6401 -127 129 60 128 101 -77 66 -101 -21 79 37 60 -48 17 135 -39 -127 72 6 187 43 102 19 -42 193
6425 193 108 15 -6 63 35 -5 -7 6 68 79 -153 -50 -105 116 117 -11 153 20 -51 83 87 80 97 -151 -20 70 155
6452 155 93 -133 82 116 -9 -69 43 -89 31 -93 70 -110 45 -98 -85 -13 -225 -31 -102 64 -177 -162
6474 -162 -54 -65 139 -130 -104 -32 -46 -4 -54 142 -62 -99 74 53 59 220 1 47 31 -83 -93 -138 -86 -51 -10 -129
6500 -129 45 230 48 81 101 9 58 -15 50 -90 192 -90 78 47 -147 56 43 18 -74 -79 115 -144 9 -112
6524 -112 73 36 116 -95 14 -167 -17 -36 122 3 -137 145 -95 -108 172 126 -56 -25 101 53 -57 -82 109
6547 109 110 -115 -115 -182 -107 3 -115 -21 -96 113 140 -138 56 10 -92 -11 86 44 -70 -42 18 48 -49 152 -44 203
6573 203 -38 -127 -24 -180 -82 -113 69 -7 -174 48 17 165 94 -108 156 9 33 51 183 -56 60 184 -4
6596 -4 32 54 -67 63 95 -118 7 122 63 -67 -59 28 47 -166 -24 -318 -25 -68 -28 230 36 -48 -59 -3 -122
6621 -122 46 72 4 94 64 -80 -4 58 54 10 -100 -32 -41 -171 -225 89 85 -34 -162 -3 101 -13 16 168 86 173
6647 173 143 -71 140 -42 3 88 36 102 -11 76 -29 -242 -51 -2 -153 -189 103 -35 22 -56 -120 -25 100 -85
6671 -85 -42 -179 -222 10 141 87 45 15 138 -23 21 -167 -147 -116 -76 -107 -50 -129 -63 -78 -46 -65 -85 -21 0 26 -34
6698 -34 -144 15 90 -26 -42 -8 202 -76 166 58 115 -4 44 123 31 -23 116 -175 44 -27 -99 -126 219 -68
6722 -68 -95 -84 -25 -63 104 -73 -51 -47 76 -18 82 176 115 25 23 -23 -5 -64 -136 -27 179 -48 74 -49 -117 0
6748 0 -5 -7 -2 -52 34 44 -163 59 87 19 -4 -12 -59 212 213 15 54 60 -152 65 -66 -24 -113 137 -22 -259 -127 -133 76
6777 76 185 36 68 -94 -51 152 5 2 170 1 -7 121 -123 -25 -87 -84 -39 -19 -95 -167 66 41 25 -81 101 118
6803 118 58 -31 60 -35 148 165 -255 -1 57 -50 130 86 50 -64 11 -83 68 148 -104 -163 -51 98 -168 85
6827 85 -115 -99 5 125 30 -128 35 -16 -59 -14 -3 -15 52 38 -51 19 127 -116 -94 105 -38 -29 -137 63 -220
6852 -220 -43 -6 130 29 -18 134 -63 -87 -63 20 40 74 -147 167 68 -26 -47 -60 4 -104 -161 -43 19 16 -133
6877 -133 58 18 67 49 -8 -145 -137 -9 -41 -60 103 -84 -13 -33 125 -30 143 57 -36 186 90 49 -68 35 -96
6902 -96 70 16 -33 103 -115 52 97 -151 -185 -133 4 40 70 62 -48 -14 -97 -54 -68 127 58 28 55 85 91 111 103 -142
6930 -142 57 136 -52 23 165 56 -29 -25 40 125 -1 -94 131 -147 -22 19 37 90 -77 181 29 104 -8 46
6954 46 -83 240 47 -16 -62 -113 64 -101 138 81 172 -169 95 -36 152 144 99 16 -34 -7 43 130 52 110 -49
6979 -49 -120 -53 -18 -23 -83 54 -31 -1 88 -30 -200 9 -97 -59 -55 -105 -113 -40 -119 -93 -62 51 -65 -129 -204 168 -28
7006 -28 40 -84 -62 -20 -118 65 -152 -73 -76 -248 52 -15 -92 -40 -36 -35 -45 -64 107 -27 -34 -22 -150 -152 -130 -88 -130 42
7034 42 56 45 14 -100 32 -90 -114 -20 -80 -36 -233 -96 -104 -89 20 -24 -89 32 -58 -45 102 11 144 69 31 125
7060 125 -122 157 -20 106 127 -39 -83 52 8 278 65 -46 121 31 -21 110 -44 -67 -102 -55 -77 -29 166
7083 166 -230 133 115 -65 -103 268 -81 -53 -112 -70 -123 -17 53 -50 -113 18 81 -67 -31 27 -41 -83 -39 21 -20
7108 -20 -185 29 -126 152 -39 -44 -49 22 -75 -149 82 -20 -15 -19 252 -52 14 -75 162 54 29 151 -58 41 -161
7133 -161 -139 -26 47 12 -35 -81 -84 -38 62 -16 36 -52 -83 60 -174 -16 -81 117 -56 5 -34 47 11 -42 50 -5 -97
7160 -97 -6 -61 -94 143 -5 -10 145 -21 78 83 185 14 -3 126 20 -26 43 121 3 33 -49 -82 -155 -79 -332 -31
7186 -31 33 -228 -13 -33 -138 -98 -9 82 37 128 47 120 122 -22 6 117 -36 128 41 -28 99 9 -62 42 -39 110
7212 110 -119 108 10 -108 -122 -39 186 -74 81 155 16 146 -54 29 2 94 8 -180 -28 150 -14 57 74
7235 74 36 103 -246 27 -21 -2 118 -189 0 -136 -46 17 139 23 -32 -109 -145 100 -117 46 -195 -55 -1 9
7259 9 -38 -80 88 12 -93 60 130 -51 25 161 -78 151 158 12 117 20 73 62 -36 238 38 52 -57 111 -42
7284 -42 -25 -141 -9 91 58 88 -43 52 48 -62 184 115 -67 41 -46 156 28 8 84 91 106 36 67 -66 -156 41
7310 41 44 -55 -34 3 -61 -103 108 210 18 133 147 -14 -2 12 101 -69 -25 -46 44 212 37 -13 54 -161 59 -61
7336 -61 112 -90 -53 31 -92 147 -57 153 65 -196 102 -83 50 -68 21 -7 40 150 -39 46 -127 -20 57
7359 57 67 -116 61 80 -31 -144 -98 -166 25 -95 -156 -78 84 24 -3 119 -12 85 -80 56 -84 -38 140 -82
7383 -82 42 106 85 -32 -76 -219 -148 29 -57 5 13 -2 41 12 -91 55 -39 18 -175 -159 5 70 -24 -92 41 296
7409 296 161 157 -37 -179 -86 179 -87 76 31 59 -164 -37 54 -321 -51 39 -33 -76 31 114 19 -30 142 -20
7433 -20 -38 -32 -161 -76 46 14 -18 53 27 80 53 -178 -4 147 66 38 -18 -87 -23 -96 -124 -263 -86 94 39 -209
7459 -209 80 -74 -44 112 43 96 51 41 130 -1 171 84 206 183 -130 69 85 87 -110 28 -89 -152 182 -12
7483 -12 22 -86 90 -5 2 3 0 -32 -65 -64 62 27 12 -43 120 -64 15 85 35 -51 126 -8 3 148 55 -113 40
7510 40 36 -95 -46 -34 125 69 70 97 -28 143 70 80 47 -89 -32 -50 97 99 86 6 -148 -70 152 -77 -170 -12 4
7537 4 42 58 -89 85 -75 -28 -1 100 130 43 43 115 156 -7 -97 -10 17 20 -59 29 176 43 -69 -59 125 -56 -39
7564 -39 188 -132 152 109 36 -96 -73 100 -10 -14 4 -43 -57 -38 -126 140 222 192 69 -55 -95 -57 -56 122 43 97
7590 97 -20 83 -114 -32 -61 -19 -87 55 68 80 32 26 1 -86 67 -155 -82 -95 17 57 167 41 -138 -233 -61
7615 -61 70 -94 -15 -121 -68 182 -61 156 -10 91 22 -45 -135 13 39 -28 83 -73 108 154 194 31 151
7638 151 -31 40 96 -40 -98 -187 -75 43 111 -92 -176 94 58 -70 57 -5 -65 -42 -113 49 -64 -8 -122 0
7662 0 9 -97 -139 212 -144 -83 -124 -85 57 -26 -30 10 126 101 -49 14 32 -32 -13 55 -153 130 4 78 75 -29 29
7689 29 9 -1 -214 -82 148 176 9 33 111 14 49 -38 38 31 174 -56 56 72 10 74 137 -97 -28 -110 -106 -4 -239
7716 -239 -135 22 149 93 -98 30 -77 -111 -44 -101 132 -7 32 35 -68 82 -145 -87 -20 -67 34 64 149 -52
7740 -52 34 23 25 71 40 -139 -12 100 -45 6 -33 -12 50 -41 -103 -44 10 30 -62 -122 -145 39 69 -29 3 -46 5 -53
7768 -53 -50 119 -57 69 -22 2 179 -47 -75 34 10 -68 -103 -14 2 140 188 97 107 69 -52 -125 3 18 -25 -11
7794 -11 -27 -80 -8 77 -37 -5 -45 -17 -203 50 -12 -49 -90 177 104 55 -77 60 11 -262 -15 127 -70 -24 -25 84
7820 84 56 -124 -49 96 -6 -72 -2 -127 -59 9 -24 -81 -150 25 120 33 -85 64 -71 344 47 -28 38 -104 -77
7845 -77 -285 122 -11 -4 -49 -24 -2 101 -101 44 74 -48 -117 -153 70 17 67 -47 42 165 -30 190 -22 136
7869 136 21 6 -69 -140 -14 -45 -100 -23 -87 -157 -15 -62 -95 65 147 58 44 -11 -20 -133 -36 161 -41 32 29 192 114
7896 114 -160 -130 -62 212 -5 -87 98 -122 -2 -9 10 43 -87 -16 -23 -57 -49 35 34 33 53 -150 5 -100 -7 91 -68
7923 -68 -86 -18 71 -50 -50 -38 -165 -99 93 61 -70 -71 3 129 104 89 3 69 55 -20 37 -3 3 62 110 9 -27 30 29
7952 29 81 -123 -48 -30 -17 158 -103 -64 -81 -128 -61 -170 31 124 71 -5 155 -85 138 12 72 -22 -13 -83 -53 -108
7978 -108 -119 10 -87 -73 -148 16 -163 44 107 35 110 58 66 -151 -122 -57 -117 74 21 -77 28 -167 -162 -102 75 -144
8004 -144 -164 43 -1 -14 -116 54 160 -145 139 179 -41 31 152 96 132 47 -25 83 154 -77 -91 15 154 -39
8028 -39 106 35 -56 -61 106 191 -118 123 200 41 35 -135 28 17 -7 76 -216 75 -95 10 147 -26 -39 -44 71
8053 71 81 -11 -8 -20 85 6 -73 148 168 64 -20 244 73 -8 79 -138 -8 -115 -211 12 -6 24 68 -57 70
8078 70 -6 -19 -120 87 101 44 -61 -29 -21 36 31 -85 49 1 -13 7 -52 138 -52 26 -180 22 166 -74 -121 -240
8104 -240 -63 179 -114 -7 74 -24 105 31 -107 -47 98 89 -75 -23 -5 -77 126 113 -98 31 64 165 -5 -140
8128 -140 -42 -148 1 79 193 -59 25 0 -50 -63 -55 -153 -6 45 28 -14 -78 102 -71 -66 164 -54 203 122 -35
8153 -35 -4 69 24 -31 -98 37 -113 -21 -107 -187 -247 -79 -26 -132 -67 112 -7 -4 -4 -32 16 33 -141 -83 122 56 43
8180 43 1 -54 -43 -7 -134 -6 177 -118 -41 109 -222
8191b22
$$ Imaginary data points
##PAGE= N=2
##DATA TABLE= (X++(I..I)), XYDATA
0 0 0 0 0 0 0 0 0 0 0 0 0 0 16 -16 16 -16 25 -32 32 -48 48 -64 80 -81 98 -122 140 -160 190 -209 240 -273 311
33 311 -352 394 -448 497 -558 624 -696 772 -857 951 -1053 1162 -1280 1417 -1561 1717 -1893
50 -1893 2085 -2297 2533 -2796 3097 -3431 3812 -4256 4776 -5389 6135 -7061 8245 -9814
64 -9814 12012 -15303 20766 -31471 60275 -297270 -797181 83941 548577 -84275 -724281
75 -724281 -149034 661712 386609 -512270 -474749 370308 551588 -263809 -620982 124957
85 124957 744438 207770 -505881 -181733 571851 371637 -496417 -600056 204646 519735
95 519735 -158933 -610860 -5647 629244 200220 -572268 -387952 386939 394214 -361722
105 -361722 -532066 224874 659960 74329 -495369 -81608 556350 261854 -500771 -443419
115 -443419 322853 484967 -197734 -505852 106772 568980 57106 -582777 -293994 387599
125 387599 277695 -407740 -436526 294306 568729 -52361 -482573 -171 517911 141572
135 141572 -495456 -301007 394629 417447 -234209 -411421 187869 501235 -50056 -551978
145 -551978 -175369 400422 182882 -416302 -319472 338611 448777 -160486 -442390 60940
155 60940 448464 32630 -469954 -180366 421209 326208 -268084 -320131 243492 418155
165 418155 -126481 -479476 -62884 389699 111284 -386591 -214777 349186 339169 -228640
175 -228640 -386936 110107 375914 -56148 -426703 -76887 411944 224902 -291467 -242169
185 -242169 271484 337223 -184487 -413568 33134 382754 47319 -366196 -124870 358031
195 358031 245310 -275087 -323822 156420 320551 -111860 -378405 1034 389491 133703
205 133703 -310819 -176947 284860 252355 -230882 -336590 113096 347360 -19460 -334018
215 -334018 -44425 347562 157024 -299492 -249887 203048 268441 -157521 -321988 71374
225 71374 353006 50010 -307837 -113905 276921 176497 -246762 -263108 158048 297099
235 297099 -70146 -293389 16354 314632 75896 -294816 -168527 224444 205074 -181963
245 -181963 -255302 121846 304807 -19357 -292544 -51902 272781 109782 -258905 -192230
255 -192230 197309 244417 -119395 -257806 64963 282587 11345 -286951 -102624 242327
265 242327 152714 -206962 -202430 163910 258424 -81701 -270236 9732 264499 51028 -259433
276 -259433 -126960 224015 193206 -160500 -222792 108851 252566 -45354 -271108 -38847
286 -38847 245717 96083 -218150 -148784 183651 203882 -122357 -233366 56762 240244
296 240244 -1158 -243865 -62767 229843 130190 -183654 -168904 142382 206114 -89520
306 -89520 -235387 18606 234103 41788 -221012 -96575 198140 150941 -156664 -193502
316 -193502 98538 210884 -46846 -224228 -12710 222441 77069 -195470 -123568 165085
326 165085 166753 -122922 -200521 68757 217321 -10043 -215723 -44057 205376 99904
336 99904 -178797 -151028 133724 182295 -88226 -207512 32702 215682 25867 -205605
346 -205605 -78874 181965 125275 -147706 -163883 102740 191490 -49001 -200466 -652
356 -652 201899 54968 -186010 -103299 156519 142259 -119037 -173250 71194 190553 -20076
367 -20076 -195851 -34186 184255 81802 -163349 -125794 128329 158339 -84946 -178009 38387
378 38387 187435 13188 -180630 -60051 164656 104736 -135176 -139136 98882 165416 -55680
389 -55680 -179519 7876 179856 38437 -170053 -85094 144805 122161 -112754 -153447 70437
400 70437 171446 -24881 -177557 -21751 171572 67471 -151274 -105098 123652 138220
410 138220 -84493 -158456 42844 169718 2615 -168277 -47095 155816 86926 -133509
420 -133509 -122782 99541 146475 -61515 -163172 16332 165756 28486 -157189 -70694
430 -70694 137682 107825 -107738 -135328 72080 153842 -29429 -158057 -10832 154469 53089
441 53089 -137834 -89080 112129 117383 -82175 -140081 44143 150399 -5078 -151632 -34640
452 -34640 140627 70461 -122935 -104612 92859 128597 -57122 -142065 21029 150184 21724
463 21724 -142833 -58650 126514 90739 -102229 -116570 71313 135950 -32790 -142494 -4897
474 -4897 139656 39472 -132530 -78353 109210 105155 -81300 -124757 50356 139446 -12004
485 -12004 -141856 -27727 131324 61580 -114510 -90959 92744 119613 -55822 -130480 22631
496 22631 134279 9924 -133682 -48464 116986 78447 -93495 -99942 68590 118947 -37730
507 -37730 -131600 -1240 126119 30751 -118803 -59965 106457 92748 -76235 -109546 46555
518 46555 119606 -17293 -127560 -19357 122238 54785 -102649 -76476 85288 99058 -61056
529 -61056 -119133 22625 118180 5556 -116205 -33699 111764 68232 -90594 -91706 63653
540 63653 103108 -42223 -117801 10494 123002 28146 -107407 -50482 96862 76592 -79557
551 -79557 -103562 45326 111385 -16659 -112415 -7361 115443 41851 -102304 -71155 76036
562 76036 82639 -60416 -102068 33250 115065 4593 -106281 -27364 100285 50504 -92466
573 -92466 -81270 65141 96676 -35551 -98699 16955 109749 17099 -105531 -50710 83162
584 83162 64229 -71462 -84029 51982 103324 -16767 -100795 -8126 94486 25913 -95597
595 -95597 -58758 75827 80424 -48323 -83681 35926 99967 -7965 -105066 -26811 89114
606 89114 43884 -79315 -62729 68680 89655 -36654 -95935 9155 91154 5405 -99548
617 -99548 -38469 86779 64061 -61291 -70640 49451 86274 -28334 -99519 -6948 90214
628 90214 27391 -80988 -41849 80166 72571 -54059 -84994 26600 82633 -14316 -94031
639 -94031 -15201 90934 46041 -68943 -56812 57072 70130 -45184 -91468 10920 86469
650 86469 10836 -77473 -21631 81940 51913 -63104 -70118 37632 71065 -27323 -82747 6505
662 6505 90847 26536 -74021 -39931 63733 51380 -59042 -78234 28539 81406 -4570
673 -4570 -75801 -6382 82502 33128 -73757 -57863 49268 61502 -38371 -71277 24633 86424
685 86424 9278 -75097 -25613 66184 36104 -66448 -62791 44485 74194 -19791 -70670 9323
697 9323 78117 12368 -79156 -42723 56716 49811 -46307 -59512 37600 79084 -6929 -74722
709 -74722 -12221 65667 20910 -67869 -44445 54608 63061 -29223 -60976 20371 69311 -4512
721 -4512 -78070 -26191 61911 36572 -52211 -45587 47478 66436 -23243 -70959 120 63050
733 63050 8395 -67271 -29064 61886 52554 -38481 -53174 29602 60760 -18001 -72507 -9491
745 -9491 63358 24514 -53679 -31993 53156 52703 -37159 -65260 13194 59563 -5666 -65788 -11810
758 -11810 66883 37423 -47756 -44238 37434 51733 -29249 -66645 5558 65436 14008 -55003
770 -55003 -19823 56688 38623 -46172 -55080 23224 52936 -15217 -58823 1267 64594 22654
782 22654 -53206 -34208 42100 39766 -38283 -56233 19474 61317 1848 -52813 -9049 55957
794 55957 25895 -50457 -44633 32054 47209 -21915 -51307 12709 60133 8514 -54200 -23277
806 -23277 43472 28296 -42667 -44589 29058 54662 -9740 -51041 1600 54239 12229 -54149
818 -54149 -31646 40668 39780 -28803 -43498 22438 55295 -3092 -54545 -13536 46171 19735
830 19735 -45693 -34093 36865 45972 -19963 -46774 9598 48476 339 -53245 -19419 44500
842 44500 30671 -34196 -35171 30304 47777 -14592 -51114 -1603 46358 10493 -45171 -22527
854 -22527 40847 37154 -26529 -41374 15850 43257 -8507 -49890 -8599 44803 19901 -36553
866 -36553 -26139 32893 36912 -22501 -44638 7959 43930 1566 -43798 -11114 44215 26810
878 26810 -33132 -33786 23500 37703 -16315 -44983 1684 44585 11442 -39153 -19340 35533
890 35533 28651 -29465 -38696 15808 39708 -6880 -40722 -2085 42848 16475 -36056 -25530
902 -25530 28651 31640 -22204 -38755 11995 42639 1503 -39398 -10208 37024 19378 -32948
914 -32948 -30838 21639 34607 -13092 -37499 4793 40008 6860 -37411 -17053 31298 23381
926 23381 -25932 -30468 18431 37049 -6257 -36223 -2044 36499 11430 -34591 -22099 27551
938 27551 28462 -19433 -32885 11286 35947 -1460 -36674 -10310 31923 16967 -28501 -24674 22488
951 22488 31356 -12903 -33067 5078 34325 3545 -33534 -12737 29948 21324 -23365 -26578 17356
964 17356 31925 -9032 -35213 -1355 33158 9159 -31335 -17736 26325 24768 -18855 -29684
976 -29684 10320 31813 -2099 -32736 -6323 31260 15059 -25896 -20387 21321 26534 -13917
988 -13917 -29836 5507 31023 2860 -30396 -10865 27436 18278 -22867 -24676 15577 27837
1000 27837 -9000 -30339 -76 29777 8050 -26853 -15065 23182 21414 -17042 -25554 10905
1012 10905 28721 -2858 -28626 -3869 27816 11497 -24546 -17876 19336 22880 -13662 -27154
1024 -27154 5851 28186 1270 -28514 -9183 25519 15485 -21338 -21094 15424 25025 -8056
1036 -8056 -26530 1231 27365 6577 -24971 -12570 22127 18329 -17042 -22595 11061 25021
1048 25021 -4633 -26435 -3011 24939 8955 -23104 -16046 18387 20603 -13286 -24139 6694
1060 6694 25593 375 -24940 -6782 23335 13452 -18852 -17943 14388 22243 -7916 -23730 1871
1073 1871 24216 4290 -23191 -10369 19847 14987 -16230 -19725 10255 22013 -4744 -23989
1085 -23989 -2114 23326 8111 -21155 -13349 17637 18411 -12080 -20917 6728 22726 -25 -22242
1098 -22242 -5845 20961 11312 -17592 -15993 13300 18923 -8933 -21680 2608 21738 2449
1110 2449 -21294 -8453 18619 13488 -15239 -17672 10471 20768 -4655 -21500 -580 21648
1122 21648 7035 -18926 -11516 16057 15703 -11416 -18614 5935 20119 -720 -20446 -4657 18899
1135 18899 9053 -17005 -13879 12322 16659 -8204 -18607 3501 19957 2791 -18860 -7239
1147 -7239 17213 12237 -13753 -15507 9956 18452 -4097 -18377 -262 18393 5086 -17367 -10707
1160 -10707 13495 13309 -10426 -16467 6441 18168 -1910 -18565 -3461 16852 7468 -15261 -11528
1173 -11528 12441 15827 -7152 -16831 3498 18162 1460 -17960 -6679 15497 10460 -12371
1185 -12371 -13466 8927 15854 -4574 -17385 -1156 15897 4134 -15564 -8585 13489 12223 -9351
1198 -9351 -14042 6244 15468 -2187 -16272 -2635 15752 7434 -12907 -9726 11308 13526 -7544
1211 -7544 -15910 2231 15183 614 -15465 -5135 13985 9074 -10980 -11981 7192 13076 -5044
1224 -5044 -15318 491 15191 4077 -12939 -6179 12634 10014 -9356 -13061 5258 13783 -1648
1237 -1648 -14168 -1552 14661 6207 -12717 -9599 9203 10539 -7604 -13625 2986 14030 1346
1250 1346 -12697 -3682 12238 6982 -10913 -10676 7458 11985 -4064 -12110 2257 14163 2716
1263 2716 -12495 -6380 10130 7905 -9038 -11366 5656 13134 -1539 -12707 -1605 11962 4000
1276 4000 -11794 -8326 8261 10064 -5099 -10267 3818 12782 525 -12182 -3868 10514 5793
1289 5793 -9252 -8059 7853 11245 -3386 -11071 673 10886 991 -12262 -6024 9571 7887
1302 7887 -7057 -8924 5519 11020 -2508 -11838 -1742 9991 3705 -9121 -5431 9041 9368
1315 9368 -5240 -9600 3077 9841 -1160 -11353 -2445 10170 5672 -8071 -7030 6594 8770
1328 8770 -4953 -11380 253 9784 1404 -9682 -3360 9705 7055 -6509 -8056 3931 8564
1341 8564 -2453 -9819 -294 10328 3774 -7833 -4797 7334 6447 -6410 -9350 2282 8645 -742
1355 -742 -8892 -1487 9251 4676 -7811 -7052 5003 7290 -4178 -8715 2167 9995 1991 -7509
1369 -7509 -2774 7583 5143 -6770 -7652 3879 8105 -1643 -7941 741 8993 1931 -8531 -5184
1383 -5184 5753 5181 -5237 -7408 3418 9035 15 -8034 -1558 7775 3316 -7386 -5508 5515
1397 5515 7446 -2654 -6532 1908 7776 534 -7980 -3549 6056 3999 -5615 -5592 4609 7320 -2157
1412 -2157 -7461 -16 6762 904 -7371 -3722 6196 6111 -3586 -5691 3413 7370 -1160 -7687 -1560
1427 -1560 6614 2805 -5630 -3876 5259 5955 -2989 -6733 834 5890 -364 -7275 -2372 6457 4231
1442 4231 -4837 -4452 3845 5641 -2367 -6949 71 6641 1953 -5476 -2324 5951 4957 -4090 -5853
1457 -5853 1995 5367 -1352 -6204 -561 6125 2615 -5019 -3656 4117 4270 -3695 -6088 1412 6122
1472 6122 341 -5399 -840 5757 3264 -4594 -4401 2969 5016 -1941 -5590 690 6047 1684 -5304
1487 -5304 -2840 4285 3221 -4289 -5029 1876 4997 -615 -5311 -338 5308 1797 -5081 -3448 3809
1502 3809 3973 -2397 -4127 1900 5547 390 -4722 -1560 4515 2487 -4249 -3765 2830 4733 -1422
1517 -1422 -4656 431 4596 384 -5033 -2457 3543 3034 -2928 -3685 2415 4691 -575 -4538 -230
1532 -230 4500 1474 -4142 -2456 3647 3939 -2095 -4043 1269 4312 -233 -4819 -1566 3614 2109
1547 2109 -3407 -3167 2558 3658 -1537 -4147 220 3742 586 -3556 -1469 3798 2956 -2307 -3030 1852
1563 1852 3883 -1042 -3864 -444 3876 1516 -3468 -2297 2723 2899 -2310 -3777 645 3514 -170
1578 -170 -3722 -917 3427 2022 -2731 -2296 2161 3045 -1085 -3166 643 3728 742 -3387 -1229 3089
1594 3089 2110 -2424 -2934 1411 2881 -743 -3420 -321 3054 1130 -2852 -2212 2211 2405 -1654 -2965
1610 -2965 872 3060 88 -2540 -447 2661 1592 -2172 -1968 1994 2599 -1050 -2888 731 2797
1625 2797 184 -2963 -1571 2049 1695 -2015 -2434 1098 2635 -511 -3000 -197 2765 993 -2161
1640 -2161 -1411 1848 2141 -1065 -2012 735 2563 153 -2441 -557 2182 920 -2087 -2001 1337 1858
1656 1858 -1201 -2444 138 2039 187 -2315 -1048 1929 1595 -1448 -1777 1123 2357 -169 -1881
1671 -1881 75 2166 846 -1983 -1056 1596 1621 -1308 -1944 279 1741 -189 -2416 -465 1674 792
1687 792 -1818 -1468 1007 1776 -644 -1902 128 1911 611 -1619 -712 1545 1507 -1048 -1371 956 1734
1704 1734 -413 -1839 -334 1541 302 -1560 -1034 909 1230 -1103 -1786 463 1667 62 -1714 -411
1720 -411 1659 1109 -1202 -1087 998 1689 -384 -1415 248 1848 253 -1462 -671 1257 846 -1047
1736 -1047 -1270 280 1188 -500 -1497 -250 1406 319 -1383 -750 910 1160 -625 -871 479 1444 204
1753 204 -1267 -195 1290 736 -917 -1008 544 911 -664 -1285 -4 940 -195 -1082 -668 591 573 -941
1771 -941 -1097 471 1087 -135 -1181 150 1062 764 -782 -485 565 1016 -228 -986 40 885 106
1788 106 -866 -709 790 581 -758 -959 8 892 -229 -995 -129 722 356 -694 -469 857 856 -349 -609
1807 -609 437 960 3 -794 -114 602 593 -483 -499 309 764 -209 -963 -172 772 -18 -643 -608 335 394 -534
1828 -534 -449 222 813 220 -526 -39 903 457 -429 -280 536 758 16 -703 -138 614 111 -734 -624 450
1848 450 346 -309 -989 41 339 -15 -510 -401 590 616 -336 -308 426 752 187 -521 -61 575 435 -504
1868 -504 -282 573 544 -402 -486 -244 354 5 -631 -459 433 424 -265 -594 178 501 -38 -326 41 682 392
1889 392 -229 -220 468 725 -8 -567 224 500 124 -513 -241 249 191 -343 -597 -84 320 -18 -718 -183 444
1910 444 89 -264 -439 392 602 11 -405 52 484 228 -329 -303 518 664 -432 -490 37 457 -116 -822
1930 -822 -347 483 103 -364 -829 90 476 -234 -614 40 821 256 -345 -210 610 760 -110 -431 303 601
1950 601 58 -732 -293 480 386 -562 -642 169 448 -341 -972 -176 572 278 -691 -447 557 872 -260 -650
1970 -650 321 689 124 -588 -186 773 620 -554 -604 308 672 -217 -740 -45 556 66 -876 -625 630 600
1990 600 -663 -847 298 731 1 -720 -178 957 459 -481 -609 654 684 -568 -779 242 907 90
2008 90 -1103 -412 771 362 -901 -815 137 647 -494 -1004 -118 881 462 -697 -592 687 930 -268
2026 -268 -748 285 1212 354 -765 -120 808 350 -612 -819 494 565 -324 -1121 -178 799 17 -1108 -483
2045 -483 820 620 -554 -902 540 1069 142 -597 -212 945 483 -784 -607 772 963 -683 -1017 175
2063 175 971 -6 -1254 -389 793 482 -714 -1013 340 1008 -388 -1078 55 1053 464 -872 -432 988
2081 988 765 -553 -714 286 1285 200 -1161 -129 1194 580 -1021 -824 417 883 -687 -1175 136
2098 136 883 -101 -1113 -383 1062 880 -773 -993 662 1178 -153 -921 162 1361 339 -857 -600
2115 -600 636 819 -663 -904 373 1140 -270 -1217 -371 764 533 -892 -825 805 887 -507 -955 411
2133 411 1314 153 -1237 -312 1173 736 -849 -939 577 1200 -238 -1124 -25 1330 311 -1032 -850
2150 -850 762 822 -851 -1213 295 1004 -238 -1195 -146 1051 739 -808 -739 716 1330 -388 -1164 152
2168 152 1361 152 -1283 -267 1009 620 -935 -1108 454 1015 -452 -1250 -32 965 266 -1148 -637
2185 -637 958 856 -729 -1052 403 1505 -118 -1250 -136 1132 620 -1103 -687 867 1069 -635
2201 -635 -1373 197 1254 -38 -1531 -521 1055 728 -872 -1042 670 1098 -352 -1271 205 1362
2217 1362 319 -1111 -541 1038 1253 -689 -1127 601 1290 -257 -1444 -133 1320 304 -1237 -1045
2233 -1045 1055 958 -802 -1260 201 1370 46 -1391 -466 1018 840 -1126 -921 961 1412 -374 -1280
2250 -1280 176 1366 386 -1417 -762 1305 904 -1053 -1204 400 1316 -228 -1350 -398 1345 476 -1039
2267 -1039 -986 1005 1259 -695 -1178 539 1328 117 -1174 -198 1408 778 -1000 -845 657 1252 -508
2284 -508 -1415 -74 1310 258 -1473 -655 1235 930 -1151 -1252 816 1276 -105 -1302 -17 1357
2300 1357 630 -1109 -572 1086 1056 -572 -1152 473 1355 -115 -1432 -376 1176 592 -1141 -1177 756
2317 756 1122 -527 -1534 83 1399 367 -1254 -656 1133 1132 -889 -1156 706 1638 -50 -1407 -127
2334 -127 1387 494 -1332 -831 927 994 -831 -1256 196 1587 -338 -1653 -293 1457 741 -1081 -1130
2351 -1130 931 1424 -354 -1365 332 1513 327 -1268 -793 1247 1087 -1006 -1243 455 1360 -394
2367 -394 -1584 -119 1247 269 -1458 -848 1092 1022 -892 -1384 491 1504 3 -1333 -392 1415 692
2384 692 -978 -1051 817 1311 -505 -1388 -27 1438 267 -1426 -509 1118 871 -1169 -1308 555 1275
2401 1275 -414 -1655 25 1600 455 -1210 -985 1261 1030 -904 -1412 545 1526 -119 -1327 -474
2417 -474 1209 596 -1147 -1170 747 967 -551 -1457 77 1436 -17 -1355 -578 1232 798 -1028 -1167
2434 -1167 615 1512 -272 -1292 2 1516 537 -1400 -728 1133 1105 -671 -1244 586 1314 -77 -1442
2451 -1442 -293 1122 677 -1380 -1123 822 1280 -667 -1280 345 1388 206 -1401 -527 1343 1043
2467 1043 -1007 -1102 835 1491 -470 -1551 -58 1385 152 -1343 -748 809 957 -806 -1428 311
2483 311 1358 -161 -1381 -305 1135 674 -1197 -770 1006 1045 -923 -1215 178 1363 147 -1516
2499 -1516 -661 1260 749 -1018 -1112 818 1088 -480 -1590 -6 1044 227 -1121 -604 1158 910 -741
2516 -741 -1112 484 1390 -149 -1169 37 1443 604 -1248 -693 939 1101 -749 -1413 103 1271 -9
2533 -9 -1524 -449 1087 753 -964 -1056 612 1034 -500 -1324 88 1237 351 -1217 -660 1076 776 -891
2551 -891 -1148 730 1241 -63 -1176 -26 1422 699 -1234 -1069 888 1111 -676 -1356 293 1202 59
2568 59 -1000 -249 1058 627 -948 -886 759 1098 -293 -1254 207 1444 141 -1219 -422 1190 610
2585 610 -964 -1118 591 1131 -342 -1355 -89 1153 351 -1230 -713 918 949 -818 -970 466 1458
2602 1458 -27 -1185 -192 1221 682 -1064 -790 975 952 -666 -1225 51 1078 -110 -1188 -657 1094
2619 1094 841 -965 -1009 595 1166 -300 -1371 -59 1354 569 -1019 -484 1117 903 -444 -812 480
2636 480 1153 -322 -1323 -153 1039 395 -1161 -835 830 916 -856 -1205 139 1241 156 -1219 -389
2653 -389 980 871 -896 -992 655 1115 -304 -1230 148 1004 361 -1048 -490 1002 717 -883 -1220 285
2671 285 970 -216 -1306 5 1432 387 -989 -769 826 1095 -554 -1151 487 1508 62 -1065
2687 -1065 -246 1072 512 -1095 -767 706 1020 -441 -1148 -22 1088 83 -1255 -475 1111 881 -794
2704 -794 -860 523 1051 -166 -1359 -251 1316 435 -1053 -790 816 981 -401 -959 267 1157 -117
2721 -117 -1182 -290 851 273 -977 -680 590 904 -544 -1072 187 1146 -5 -1106 -317 1144 937
2738 937 -803 -762 390 1080 -196 -1179 -107 919 378 -1016 -727 825 732 -701 -1058 166 936 -142
2756 -142 -1067 -331 961 487 -976 -634 761 855 -436 -1003 160 1037 314 -921 -265 907 901 -704
2774 -704 -999 457 917 -185 -1179 -50 787 121 -927 -446 761 631 -778 -863 296 1008 -57 -968
2792 -968 -13 1132 502 -693 -638 840 817 -309 -959 63 1086 23 -1184 -624 897 632 -780
2809 -780 -829 439 813 -280 -927 -12 954 28 -818 -455 763 712 -410 -698 410 1143 -242 -1046 -172
2828 -172 899 383 -731 -447 651 712 -495 -1010 -146 998 -94 -1001 -370 705 693 -687 -675 450
2846 450 796 -437 -798 175 960 254 -869 -383 870 571 -678 -742 263 879 -47 -1073 -141 830
2864 830 387 -845 -454 629 561 -514 -993 126 914 179 -757 -220 796 561 -588 -509 549 846
2882 846 -252 -926 -104 1001 142 -877 -418 539 683 -705 -755 234 982 -162 -946 -82 810 172 -776
2901 -776 -385 669 781 -296 -739 167 882 -139 -723 -230 787 506 -784 -681 647 572 -520 -721
2919 -721 48 673 -21 -880 -419 493 673 -621 -537 475 877 -198 -870 100 896 290 -635 -549 584
2938 584 584 -335 -941 245 733 -251 -1012 -231 878 160 -841 -708 473 704 -349 -826 52 815 192
2957 192 -737 -363 890 645 -524 -512 341 628 -199 -758 10 644 78 -791 -557 556 553 -774 -841 500
2977 500 875 -249 -865 -208 807 243 -587 -510 451 810 -147 -663 182 745 62 -600 -142 568 285 -563
2997 -563 -456 513 518 -227 -750 -90 828 137 -859 -452 753 629 -645 -582 444 830 -156 -674 17 857
3017 857 363 -652 -337 382 436 -249 -588 284 531 -28 -811 -225 697 392 -456 -547 285 713 -334 -628
3037 -628 107 827 176 -647 -288 682 582 -410 -548 212 572 -76 -623 -39 631 153 -636 -355 552 523
3057 523 -472 -694 208 757 -44 -844 -151 592 434 -550 -420 572 526 -59 -509 45 625 273 -528 -489 575
3078 575 602 -495 -606 164 749 -69 -605 -202 501 152 -427 -246 362 504 -376 -646 304 775 -159 -609
3098 -609 46 656 452 -454 -555 315 501 -260 -639 -155 580 198 -623 -446 477 243 -475 -392 225 529
3118 529 -71 -461 119 613 344 -539 -468 511 572 -603 -520 303 573 102 -450 -1 550 248 -394 -623 431
3139 431 465 -286 -679 12 205 131 -302 3 461 220 -539 -121 572 557 -127 -689 98 761 125 -451 -111
3160 -111 430 277 -514 -517 139 429 35 -565 -308 549 184 -511 -404 358 376 -225 -529 146 626 17 -464
3181 -464 -256 481 418 -437 -451 354 392 -274 -477 -150 545 -151 -654 -360 273 359 -194 -491 197 394 31
3202 31 -601 -22 486 263 -296 -265 594 276 -338 -472 148 435 -45 -405 -85 484 82 -396 -585 228 207
3223 207 -263 -438 -100 462 345 -354 -280 276 418 -461 -170 302 513 -178 -448 166 382 138 -179 -217 501
3244 501 199 -281 -479 114 468 -95 -673 -111 375 46 -314 -306 194 289 1 -464 9 526 178 -440 -324
3265 -324 407 150 -355 -275 174 246 -62 -317 -20 318 -33 -531 -275 417 480 -365 -478 83 483 -81 -407
3286 -407 -87 298 198 -341 -155 150 360 -196 -324 -197 437 -111 -478 -97 244 115 -306 -400 73 280
3306 280 41 -461 -188 388 90 -506 -149 302 240 -112 -331 104 435 -11 -425 31 350 139 -403 -261
3326 -261 220 238 -294 -364 170 491 -112 -422 -82 412 327 -222 -451 168 346 -110 -379 134 469 180 -172
3347 -172 -111 209 156 -227 -371 75 282 -87 -292 89 298 93 -330 -197 184 97 -199 -195 160 443 -80 -378
3369 -378 -178 413 229 -436 -201 148 344 -33 -312 -63 312 128 -440 -188 154 15 -307 -457 115 388
3389 388 -109 -445 -53 311 79 -214 -103 406 257 -293 -604 181 257 -99 -375 -139 108 150 -346 -264 170
3410 170 109 -98 -381 -77 266 -14 -384 -175 351 72 -266 -170 72 327 12 -211 -70 454 78 -197 -273
3431 -273 355 451 -130 -342 51 333 194 -101 -25 324 326 -113 -275 -101 307 -12 -383 213 72 -20 -246 -23
3453 -23 305 356 -373 -256 261 264 -26 -312 106 396 138 -383 -210 163 203 -135 -373 37 435 88 -292 31
3475 31 213 -23 -223 -189 151 341 -323 -163 153 241 127 -98 -292 208 222 -271 -389 256 238 -186 -334 -185
3497 -185 256 132 -177 -203 42 103 -76 -244 184 331 -110 -361 -6 437 118 -136 54 92 116 -149 -239 -6
3519 -6 266 97 -587 -311 364 260 -32 -367 117 229 73 -186 48 155 7 -182 -26 117 147 -16 -111
3540 -111 167 305 -95 -389 115 425 -3 -248 -143 169 229 -171 -352 56 279 -21 -184 -40 73 138 -120
3561 -120 -212 67 152 -92 -241 115 269 199 -268 -22 392 150 -61 -290 140 140 -66 -474 -74 165 245 -276
3583 -276 -80 53 65 138 -138 184 324 55 -200 -118 -38 105 -99 -48 204 208 -39 -166 72 278 38 -226
3605 -226 -202 1 33 -252 -300 218 242 20 -205 -108 314 -12 -193 9 59 223 -11 -18 -50 284 -83 -201 -320
3628 -320 169 114 -231 22 -52 38 -242 -263 -168 155 -46 -178 -198 211 60 -108 -150 -128 321 71 78 151 239 111
3652 111 -60 -194 -67 152 -19 -285 -144 -47 -155 -43 -172 4 25 -72 -271 61 57 -35 -129 -83 -9 -47 -62 -107
3676 -107 165 133 -160 -242 31 234 49 -205 18 9 17 -246 -146 -2 47 -5 -224 -34 218 126 -37 -105 111
3699 111 109 -163 -182 85 183 33 -189 -32 197 211 -68 6 -19 -24 7 -274 -170 4 -77 -141 -68 308 101 -153
3723 -153 -80 -46 113 -37 40 74 157 -16 -190 -39 51 193 -173 11 64 -67 28 -177 -12 36 31 -130 -105 40
3747 40 81 -8 -170 195 -6 -73 -102 113 -11 126 -34 -12 61 235 -10 -100 3 15 -14 -209 -180 162 -16 -200
3771 -200 -33 -33 129 20 -253 -139 236 -110 -120 -33 201 109 -3 -28 89 117 -50 -126 -43 167 29 -108 -209
3794 -209 51 174 -22 -3 42 -51 91 164 0 82 154 -1 -64 5 2 69 -208 58 103 74 -80 2 239 51 -252
3819 -252 20 -38 -19 -167 -118 13 -14 -94 -87 104 66 -18 54 70 31 25 105 6 -7 95 -5 -181 -79 135 101 -6
3845 -6 -56 187 19 28 -144 -170 214 151 -4 -105 33 36 6 -44 -133 74 102 113 29 65 259 142 5 95 192 5
3871 5 -2 -119 51 -20 22 -55 -43 -57 -145 -164 -180 -87 101 -85 -204 37 57 -206 -48 -38 -133 -3 37 1 -3 -45 -106
3898 -106 -109 -59 36 -148 20 -131 -28 -215 -106 -92 138 -72 56 110 -60 232 220 126 21 88 81 -127 0 188
3922 188 106 56 -160 28 16 12 -276 -57 -10 -39 -140 -69 -217 55 87 -125 -10 110 -99 66 108 -56 140
3945 140 -128 -227 -151 -62 24 2 51 31 234 61 73 21 95 32 -8 -30 145 111 -66 -98 81 5 3 -116 223 109
3971 109 -79 -79 -83 64 -133 -146 -196 79 69 -72 -90 203 39 14 -8 -155 63 70 -155 -214 -18 -22 -78 -36 16 76
3997 76 21 -153 -88 181 14 -182 -253 20 95 -53 -64 -88 109 -44 -96 15 191 -108 -163 -54 61 220 19
4020 19 -193 17 16 132 -67 -83 41 39 2 -94 -77 53 97 -51 -135 139 -15 149 -46 110 56 -36 -81 106 60
4045 60 -94 -103 -42 29 3 26 184 93 34 162 -82 24 -112 108 0 98 125 -7 -117 -27 -134 -8 212 -197
4069 -197 -78 107 128 -69 -121 -149 107 15 -94 -155 92 39 -92 -106 8 125 126 -54 65 113 -57 4 -158 110
4093 110 149 6 -46 78 5 20 -92 -192 95 5 -112 -120 92 44 -92 -122 -58 -24 7 -58 -56 -61 -10 -106 -198 -87 -8
4120 -8 -94 -312 40 -19 90 -214 -124 -168 53 -137 -3 158 34 -45 -103 54 81 29 46 -2 -37 152 0 -184
4144 -184 67 173 144 68 -77 -28 -41 -202 -214 85 170 -61 -4 -64 -33 -36 -109 -26 113 66 26 71 12 122 148 -147
4170 -147 15 109 185 -279 -41 57 -49 -156 76 -2 90 -101 -82 -87 -121 79 -9 1 -47 33 214 60 -43 -61 9
4195 9 98 -93 -64 97 -146 -115 -60 -75 -23 -7 98 -1 -55 -188 -54 3 99 36 43 16 274 100 -40 15 25 246
4221 246 -145 -42 45 41 31 -58 158 -1 -77 -169 -50 -87 -29 42 -65 -47 230 47 -137 -14 28 -36 56 200 -6
4246 -6 86 159 103 46 183 -66 -75 -192 -18 184 -55 9 323 33 -107 25 -31 40 -7 -126 -146 86 -169 -151 -153
4271 -153 -20 30 -79 47 -121 51 72 -148 -137 180 220 26 -259 81 186 36 -61 -57 -43 -39 -187 -56 9 89
4295 89 -119 -92 29 88 103 -135 24 157 98 133 -165 60 -85 154 -81 15 73 -105 -156 -78 -86 -86 -8 -293 -80
4320 -80 17 60 -29 -104 -58 35 -125 -96 -123 54 26 49 -28 -114 54 -1 10 -51 14 -32 -146 -57 -53 -101 -110 17 46 47 -20
4349 -20 73 177 -108 15 -21 -7 29 67 35 -55 187 82 -142 -24 -128 94 74 7 97 -29 -96 -47 -34 -110 -159
4374 -159 -5 -163 15 -75 -145 -27 69 92 -17 37 -90 -57 84 -53 -116 -140 118 133 -123 -96 -52 133 2 -292
4398 -292 -42 116 -46 -95 -31 -61 20 20 -36 -239 -60 -86 -97 -129 66 155 -143 52 57 192 -162 -71 46 308 -130
4423 -130 -34 42 150 63 121 -53 60 -50 -36 -67 -5 187 -110 -38 -66 45 115 -12 -134 -6 68 -9 -38 36 22
4448 22 -20 -35 -59 -101 28 75 9 -131 105 -68 156 -42 -7 39 -124 -58 -18 84 -197 -88 -18 -128 -19 -225
4472 -225 -45 107 162 -175 15 79 72 18 35 -178 -65 116 -26 -73 37 88 -56 31 121 171 -1 2 11 29 38 -7
4498 -7 -123 -75 -162 -32 -50 -16 34 -116 -150 -46 184 236 -125 133 -42 34 87 12 -59 -30 88 -226 -47 104 73
4523 73 -42 -118 11 352 84 87 30 42 -25 -185 -144 -64 131 40 -155 187 -143 4 -135 -47 89 62 -17 -222
4547 -222 133 216 67 27 76 89 82 -9 26 -60 55 -33 -202 -124 70 82 -218 4 -148 13 -109 -18 73 98 -38
4572 -38 19 -51 66 -19 -59 -30 28 162 -93 -74 -114 149 108 115 -140 76 37 -99 -6 -9 19 -173 -214 21 -28 -127 -147
4599 -147 45 -27 57 -106 45 48 19 -58 0 -12 190 213 -14 63 -19 105 -123 -29 -23 -99 122 -181 -68 94 128
4624 128 -176 -178 10 -30 -178 -79 72 186 53 -309 -102 226 157 -99 0 -50 22 24 -138 110 -4 -18 43 -26
4648 -26 285 -63 149 -65 105 -28 -84 -44 96 254 -40 211 118 48 46 -73 -73 -82 -10 -12 -92 27 79 286 -88
4673 -88 -8 138 50 12 -37 101 90 -53 -11 -242 205 -94 -160 8 35 -29 -277 -122 -35 228 -23 -137 -3 17
4697 17 16 82 -68 -56 34 76 -9 -35 -16 -26 -79 -71 100 152 -55 -268 -78 -74 -117 -101 31 162 48 -186 -53 77
4723 77 22 -62 -79 177 45 61 -176 -66 -14 77 170 -112 50 273 -81 31 131 243 -56 -46 -24 -133 57
4746 57 -154 -55 74 152 22 9 105 216 91 -216 -74 -117 11 155 -138 -107 48 -134 -92 -150 -6 124 -61
4769 -61 -255 186 75 -7 -56 -57 145 92 0 -166 200 6 111 -283 38 75 -134 -37 -96 120 -15 100 -115
4792 -115 -66 197 -64 -13 -276 -84 -109 -138 -18 88 51 127 -49 -83 2 -179 15 101 109 56 -135 -123 72 18 40
4817 40 86 84 -58 -120 -135 -106 170 65 -47 -79 80 103 -114 -63 20 -95 -136 35 4 33 77 -93 -154 -63 -2 46
4843 46 -106 -158 120 3 -199 -166 140 194 -119 -82 -112 65 -7 -193 37 -72 -145 -122 -83 -55 -3 -169 116 -14
4867 -14 209 -18 -28 -52 -110 87 -17 -259 -32 35 -36 -9 126 108 -52 -60 -46 59 132 0 6 -50 146 -23 -1
4892 -1 -48 -81 165 -85 178 -63 -11 -57 -87 31 74 -49 -135 -65 -81 93 -8 -75 -5 -13 -113 29 -25 -43 26 -19
4918 -19 -104 22 53 -58 -163 165 149 -76 -52 42 128 49 -134 -45 93 175 -13 -77 162 -61 124 50 -61 47
4942 47 -128 -100 -39 68 -4 69 78 63 272 74 -103 83 46 -100 -10 -134 185 74 22 -160 78 -60 203 132
4966 132 -292 -33 43 -55 -74 47 79 9 113 -104 94 51 -59 -138 176 68 -82 -217 -37 131 76 -134 -160
4989 -160 96 4 13 -41 36 65 121 -15 -5 -76 180 -73 49 190 -20 95 -8 84 -56 16 -28 56 2 117 -139
5014 -139 77 46 135 -38 13 -3 -12 208 -80 -183 -89 30 5 9 185 -30 -130 -136 136 88 3 -61 85 -45 74
5039 74 82 -88 14 208 41 -72 59 121 27 -93 51 51 102 -273 -90 -259 88 -120 238 39 62 112 51 33
5063 33 169 113 -97 21 -34 149 170 -144 -172 -51 -67 -111 -224 229 15 76 -76 33 7 170 42 -241 143
5086 143 74 9 -215 40 185 101 82 -74 19 -95 -10 71 144 250 -116 -110 -42 48 -63 -6 -110 -35 -29 -3 -122 -181
5112 -181 184 -202 39 35 139 -110 -88 40 -59 -80 -68 36 -3 66 3 0 193 -59 80 -149 -20 62 214 -61
5136 -61 -9 73 -56 -76 -148 -59 29 -24 53 -247 -49 28 -57 -33 -40 -161 -124 -74 -67 0 8 30 81 133 -12 48 -126 -91 177
5165 177 47 -216 -106 21 -40 -108 32 141 -23 157 -136 -31 241 53 84 -74 166 -91 -154 45 6 16
5187 16 -18 -107 22 191 251 -25 -110 152 137 -143 -133 -40 314 41 -123 -146 7 209 33 -252 -21 -94 -18 -42
5211 -42 -144 37 52 -167 -62 43 -24 7 -17 -257 -93 -54 51 -157 -51 148 -95 -59 -67 96 118 -107 25
5234 25 2 108 68 -124 123 68 -57 52 -6 -6 -119 95 -118 51 65 -54 -138 71 84 -10 49 -58 204 8
5258 8 -179 -1 10 4 -22 72 -100 -93 -173 -209 25 137 30 -49 6 87 -75 -123 -30 84 -93 -101 -74 -111 -30 76 -62
5285 -62 -1 -56 105 -161 -13 -45 28 -13 -79 -29 -20 215 31 -203 -50 117 -14 -19 12 -148 21 102 -130 42 5
5310 5 -8 -108 12 20 44 -136 -49 52 63 -38 -43 103 16 -224 4 30 129 -125 -136 -116 133 112 -171 -79 -112 259
5336 259 -256 -45 59 138 156 -99 -97 5 19 -45 -121 15 95 30 -9 -96 -18 -99 -47 16 -65 116 -38 55 151 39
5362 39 134 -151 -20 82 83 13 -285 -116 -54 -35 -89 197 109 66 -18 -47 77 71 -43 -91 -91 -47 -78 -23 -133 211 -89
5389 -89 -16 -52 75 92 -188 -192 -4 211 -97 -138 -33 82 54 3 1 -95 94 -54 -127 -94 48 21 14 -123 -13 -52
5415 -52 -10 -55 -101 9 -126 -14 -85 202 25 19 -246 87 -102 -202 -90 7 324 -86 -293 44 -140 24 -146
5438 -146 -52 -16 61 85 -127 98 -28 -34 -83 -26 -91 62 -69 99 1 -11 -180 -53 143 -148 -15 96 146 36
5462 36 -114 -100 122 90 -125 119 -113 -3 160 36 65 -103 -82 -141 226 -147 -93 118 -69 34 -125 113
5484 113 -58 -53 116 57 -142 -47 -63 46 106 78 -224 -39 81 -89 -9 6 -80 -22 -56 -95 53 -12 124 62 42
5509 42 -121 49 29 -88 94 56 13 -19 54 3 146 -113 16 -52 -39 -118 -66 110 -127 -58 -179 -176 101 13 55
5534 55 -165 3 37 95 134 2 55 -217 0 13 50 43 -149 -67 17 -45 -22 -64 3 -124 10 -80 -18 -43 152 51
5560 51 -120 -32 79 61 61 92 -62 194 66 -10 156 5 -70 -188 46 38 -102 -136 -125 184 -41 -139 -50 -83 62
5585 62 92 -63 6 56 -74 -86 67 21 76 -136 99 -277 59 -102 -46 17 19 -52 -63 20 -70 -49 -167 -26 40 -34
5611 -34 -82 55 23 108 74 -153 -126 33 68 -28 -107 -67 -19 1 -155 -37 -80 11 26 1 46 -24 -30 -13 77 10 -108 -39
5639 -39 -79 130 -51 -59 -157 34 29 95 -168 -188 43 14 -139 140 26 -117 -155 13 59 -96 142 -35 -58 143
5663 143 -42 -70 16 169 -21 39 -67 135 -95 -39 5 -74 127 113 25 -37 39 -54 111 -181 -38 140 -98 -12
5687 -12 95 -172 29 62 -93 -191 -142 -66 43 113 121 -93 -17 -19 31 -89 -278 46 3 75 -59 77 -23 84 -67
5712 -67 130 -136 151 -18 -23 -89 80 168 -56 7 142 147 68 142 -52 122 -30 -57 -65 164 121 -125 -160 3 -154
5737 -154 -77 -43 -36 -136 -49 -43 6 -116 -44 185 188 23 -29 51 -17 -76 -67 30 63 193 41 19 80 -122 119 43 -23 10
5765 10 -239 -73 -106 24 -43 -195 -121 -53 -121 11 -158 -8 -69 -149 -6 -22 -85 93 25 4 -171 0 -92 20
5789 20 41 -86 -152 142 18 -90 59 -5 -14 70 63 -15 49 65 60 -144 -23 72 -26 -19 61 21 50 -39 158 -3 -23 107
5817 107 115 -165 -108 115 -190 67 -84 51 37 -242 -45 34 161 103 -63 -222 -129 60 -175 -52 24 -61 49
5840 49 93 -83 -53 26 19 213 93 108 -21 -118 163 145 -297 10 13 65 -75 23 -73 -3 96 -67 -7 138 54 77
5866 77 -76 129 -44 -1 58 -7 -20 -70 -197 -82 -172 82 30 185 -15 118 103 28 -101 74 125 127 6 -24 62
5891 62 -163 -160 -261 134 99 27 -43 47 73 60 -147 -11 -40 77 -80 179 147 43 100 -178 -60 -11 101 -116
5915 -116 6 -37 37 38 -64 -133 69 -15 -21 -51 -156 75 -72 -216 -134 116 -78 -70 -38 -133 76 -13 17 -17 27 14
5941 14 -93 160 194 -56 -102 70 174 -46 19 54 -25 19 0 -143 102 -108 84 -15 111 -36 -41 -101 60 -33
5965 -33 -31 -184 113 83 -139 35 85 63 101 10 -147 96 -24 10 -19 -27 -87 198 54 -127 -5 -194 23 -56 -82
5990 -82 62 -30 -91 -28 -61 -72 107 -146 214 -102 -90 -23 39 117 -158 -169 70 -83 -164 1 -77 -7 37 91 77 -97
6016 -97 179 181 -125 77 24 -39 61 99 128 -206 -3 -64 -7 77 114 -94 -55 21 27 2 -99 -29 -54 -127 -61 61 -141
6043 -141 109 -25 -132 -86 -18 33 94 74 -56 45 -161 27 -1 -144 -45 -56 -123 74 15 -93 146 34 110 -80
6067 -80 -37 11 53 75 67 -121 82 -25 -128 59 85 -11 108 -20 -15 -52 -18 -8 8 2 41 -43 48 162 20 -77 -38
6094 -38 103 -55 -16 80 -16 166 12 -85 57 -69 144 186 79 141 162 0 88 -76 189 13 16 63 -101 -139
6118 -139 -18 -9 22 -68 118 68 -96 10 -182 270 126 -27 53 -29 -9 56 72 18 68 -72 -39 -88 66 157 -125
6143 -125 -157 -110 6 -53 -164 8 -34 -95 -87 161 83 -69 -21 109 -27 -139 -12 125 113 143 25 61 28 167
6167 167 5 12 -42 8 47 -29 -52 97 -75 -110 45 -117 38 -80 -85 69 30 102 72 -4 63 63 -48 38 -31 11 -16
6194 -16 9 -116 96 -19 83 -236 -72 -87 -40 -47 -24 102 -91 -26 -56 20 36 11 84 -48 193 -115 -77 121 17
6219 17 47 -16 -16 101 -155 -174 -39 -10 -93 53 -25 54 40 -120 -30 -97 0 78 -44 -40 42 73 67 8 -164 87 178 38
6247 38 -2 77 35 -74 -142 -102 -167 84 -58 46 22 -64 -69 -8 -180 10 199 -83 -56 -14 -135 87 252 161 -72
6272 -72 15 -11 10 22 -10 10 -37 -104 -108 35 202 100 -36 -9 -189 -85 -119 -88 6 -53 -86 72 -90 82 -91 110
6298 110 -178 21 -127 -123 48 -109 29 74 -30 42 -143 18 -88 85 -75 -172 62 21 142 -23 -178 -124
6320 -124 69 -14 -140 -36 71 101 85 142 211 -5 64 159 31 4 3 3 14 -63 -122 -49 47 54 68 8 -56 -147 146 190
6348 190 59 -241 40 31 -66 -45 -45 -33 67 -91 -155 -58 21 2 -161 -41 33 21 4 114 90 -55 15 65 -34 126
6374 126 -139 -57 -10 -25 13 51 21 146 66 150 83 119 15 -32 -23 93 50 -59 31 72 -197 -42 109 -145 50
6399 50 -82 -168 2 -37 84 -81 -3 74 -31 -58 -49 22 -148 27 -47 89 26 115 -232 119 -56 -124 -96 -3 -27
6424 -27 -4 58 -9 -65 117 29 -7 -57 29 -83 -83 18 -25 -98 201 82 -45 -6 2 -22 -29 -73 -51 39 -78 -1 -35 96
6452 96 -73 -132 -103 7 -90 -87 -54 -63 -44 -29 -57 7 -14 -46 -136 -54 114 175 -180 -75 -83 37 -35 -115 41 -60 21 137
6480 137 213 123 53 -81 -20 19 -35 -168 -70 -131 -21 156 -97 -66 -83 -84 -82 -203 -194 -58 109 -164 -64 76 -52
6505 -52 -73 -42 151 -22 100 17 109 168 142 -3 -110 -149 -101 -136 -16 -99 -18 -72 -31 -39 85 -22 -127 48 -81
6530 -81 65 0 57 -127 -157 -59 34 21 65 -46 -19 -42 23 -16 61 -65 -125 67 101 -36 -82 4 -166 10 -18 -67
6556 -67 143 83 -2 73 -93 69 -184 27 30 -56 64 25 -26 -103 -18 57 -9 -99 -67 33 -18 114 49 49 96 65 61 90
6584 90 -85 -34 -80 77 24 8 -148 -37 89 98 -86 -69 82 -53 81 185 -117 184 134 -41 3 -88 39 11
6608 11 -26 74 -90 -64 -156 44 41 -57 186 -6 -145 -212 -19 -135 85 -47 -8 -136 55 198 46 -80 -23
6631 -23 65 39 31 -50 29 118 5 -26 -35 17 81 -36 -68 -8 35 -114 39 48 -36 2 15 60 150 -111 -179 46 64 151 138
6660 138 -19 -68 -21 -134 -50 -4 -198 -247 -199 8 46 144 -92 141 -21 -52 32 -105 -12 -7 8 120 86 59 -119
6685 -119 -2 58 71 227 120 -11 -38 48 -29 19 -98 -164 -135 -104 -100 53 -2 58 -14 -107 35 4 -199 62 56 -44
6711 -44 48 -144 18 -84 191 -159 85 -71 96 -29 -24 44 123 -92 -91 -129 -54 18 205 113 4 -87 -114 15 -63
6736 -63 49 -41 -58 149 48 -68 -64 51 97 109 46 -149 -86 42 29 -100 -148 -189 1 -77 -159 -18 -87 -63 43
6761 43 202 70 -90 16 -29 40 60 11 8 136 46 -91 67 2 124 -63 -46 113 40 -24 -7 132 -42 59
6785 59 37 54 -2 213 56 -13 -56 16 -67 18 -9 10 -57 -71 89 22 -204 12 -34 -61 160 10 81 59 -44 -25
6811 -25 -30 -92 100 -81 66 -93 40 -38 -100 -29 14 9 4 -79 -66 -136 -68 159 -33 179 26 32 -15 71 107 53 60 -82
6839 -82 -208 -29 -158 45 -23 -10 103 112 -163 -17 115 -175 61 239 -12 50 -84 71 71 29 243 37 -54
6862 -54 -61 -29 -119 -23 -38 -23 76 -66 -8 6 5 -4 -209 -37 -8 3 1 -72 97 -81 -24 36 126 -165 -117 119 -193 -60
6890 -60 104 73 -98 43 16 -22 -139 145 -127 -77 128 -2 -51 -66 -128 -51 175 31 184 -119 37 -117 -159
6913 -159 228 10 -128 49 -142 24 -44 74 143 26 114 -238 65 113 -7 -72 81 143 59 -69 -60 -26 -69 210
6937 210 -135 -156 124 5 54 -77 -67 29 -61 96 135 -112 69 -62 1 -35 -69 128 -78 55 -34 -169 10
6960 10 -94 16 -144 -29 -17 131 53 41 -66 -22 -249 -169 -94 -32 -80 -49 59 -69 -22 16 -40 -43 35 14 92 29
6986 29 90 60 61 54 120 65 -132 -156 6 77 -16 -109 -124 16 -73 -246 -78 -60 -69 24 175 -117 -158 18 -47 -77 35
7013 35 -23 19 -50 -31 -85 -39 -20 -6 29 59 64 -239 -105 -62 -49 -161 45 78 -63 -40 -228 197 99 -81 41 -84
7039 -84 -139 -59 113 -9 -22 -7 101 15 -63 45 93 61 -32 -178 -34 21 -87 131 -21 40 137 -126 -119 -17 -30
7064 -30 -171 -88 -137 101 -24 118 117 -23 -152 -108 -90 -86 -33 25 -48 22 -61 -110 -2 14 1 51 -47 -127 -63 129 -68
7091 -68 121 -86 67 90 189 -28 -29 -36 -76 83 146 67 29 129 -62 -138 -166 112 10 -83 -16 29 -68 56 -164 -55
7117 -55 35 -71 211 222 35 41 23 90 195 -49 -143 25 37 -65 -17 -115 -117 -142 81 88 -66 10 52 112 -57 36 122
7144 122 -84 -45 -33 43 140 4 29 -33 48 -70 46 55 -11 29 -49 -42 -105 -54 -28 -18 -21 -17 -71 -43 -90 -96 -99 80 39 73
7174 73 -8 -58 94 127 2 128 78 102 -130 -66 29 -61 -28 44 141 60 -15 -206 -2 -81 32 -94 66 12 4 -70
7200 -70 0 97 71 166 -96 94 11 -62 -66 -13 -110 -57 71 112 -24 -100 19 83 -55 -134 50 11 -43 -37 -20 -43 43 49
7228 49 1 65 -57 21 -70 85 110 93 1 -55 -150 93 -1 66 88 -35 126 -10 52 34 33 94 -107 -15 -121 -37 50
7255 50 -59 193 -6 36 -63 -18 27 -76 57 -86 67 102 -88 -17 1 -88 -68 -55 70 89 -55 -318 -2 26
7279 26 63 75 -10 -6 -95 -103 164 -29 -14 -75 -162 -70 -43 35 125 101 -24 -21 46 52 -117 171 75 3 109 -43 109 -19
7307 -19 -199 -30 38 188 48 -104 50 25 70 -81 -60 120 -102 183 109 -60 -154 24 -74 -299 35 -62 70
7330 70 -227 175 -11 96 -2 54 41 29 48 2 -63 20 16 -107 -219 29 -34 -180 64 28 143 148 10 52 -91
7355 -91 -152 5 -1 -31 -11 71 32 -23 -18 -71 102 86 -9 12 43 176 75 60 60 -51 -187 51 87 106 -176 141 -116
7382 -116 37 -90 21 92 -110 -113 31 213 -73 -28 133 -13 -19 -39 96 30 -62 28 126 21 -109 23 49 0
7406 0 -46 -14 179 -110 108 77 -40 79 -51 -15 -245 131 53 -96 -45 -27 7 30 73 105 247 91 -61 -119 195
7431 195 -57 11 -81 -12 59 57 47 183 -46 -7 -185 -147 86 -93 -41 -107 159 18 137 201 -159 -82 -57 74 112
7456 112 -66 46 99 29 -96 -15 22 -170 -16 18 83 -29 205 23 82 168 -56 130 -47 69 132 26 -101
7479 -101 -99 -36 53 -46 -39 -64 -125 -125 271 -23 -54 -124 -95 89 -1 76 26 18 -4 -100 -45 38 -20 3 -208 -10 94 183 -34
7508 -34 -13 -6 48 34 -29 -66 17 48 0 -14 16 67 -43 101 -67 81 -22 -5 -58 -132 31 105 -53 -105 53 51 -76
7535 -76 -124 103 109 78 50 -13 89 -1 -111 -116 92 65 39 -33 -114 -247 -107 -107 9 -68 -66 174 83 -51 -2 156 80
7562 80 202 -127 124 156 -32 34 -29 20 169 -58 28 20 -61 -132 -138 244 80 -29 -133 -34 16 13 239 -139 221
7587 221 -41 -43 -29 -122 -170 18 118 -26 128 -100 191 -62 8 -34 -60 31 170 -117 66 49 193 118 -80 -35
7611 -35 236 -38 -28 47 -142 156 23 -33 -37 37 -51 35 -200 38 71 -305 2 104 60 5 -104 78 -124 -302
7635 -302 -128 59 -115 -162 214 58 199 -55 -46 -103 -131 140 -15 27 10 -9 -38 -45 -47 -17 106 -107 -106 47 -160
7660 -160 146 110 -75 52 143 -81 -18 137 -31 -12 -98 -197 139 -54 -20 -62 183 25 -177 49 147 -53 -24
7683 -24 -45 32 -5 -18 -61 145 16 -125 7 -63 6 93 147 -8 260 0 -31 111 -12 113 -81 -18 139 -24
7707 -24 -76 74 171 33 -73 67 115 -116 69 -187 -18 22 68 14 -11 -39 -23 -34 -20 52 -108 79 -44 -142 -90
7732 -90 23 149 -116 101 165 57 -36 112 102 46 17 -97 34 182 120 95 29 103 -286 -155 -82 145 228 10
7756 10 202 -71 -64 -61 -18 -123 -96 -43 -108 -3 -71 50 -62 29 -59 -42 37 -50 24 -104 -89 -29 -87 31 189 -10
7782 -10 119 95 186 -30 65 3 -76 63 41 109 -23 -48 -45 48 -102 96 205 -265 57 -17 -55 -51 32 46 20 51 -80
7809 -80 -155 187 49 -78 260 220 83 -6 -38 62 59 -48 -24 -83 -64 11 -6 64 72 3 -114 -14 36 -47 32 3 83
7836 83 123 37 138 -17 -34 18 22 96 -96 176 -107 -93 -29 -89 -9 143 -88 97 -108 -57 14 6 -178 -50 149
7861 149 100 138 -2 -16 49 -6 77 149 -128 28 -14 -20 61 37 -103 46 6 17 -61 5 65 48 93 27 37 3 -3 -62
7889 -62 -146 12 -33 -18 141 -20 62 13 -4 -33 -129 -179 -7 -59 -68 -26 85 -165 -19 115 -75 60 -159 71 85
7914 85 -48 164 79 105 -82 -113 -49 -57 30 -105 -50 32 87 -20 80 11 4 -6 44 -178 -29 -26 71 133 43 42 32 5
7942 5 19 -3 -12 -90 -41 -100 -30 -78 -105 51 -1 8 -55 111 -79 -103 -165 -27 -8 26 -135 18 5 -122 92 -98 -42
7969 -42 -1 206 175 14 79 236 39 37 114 -95 15 19 -25 -213 -34 -125 180 26 -23 -23 61 -38 7 141 -92 150
7995 150 98 13 194 -8 -36 11 24 16 -45 38 54 -57 -3 -18 -60 -37 45 69 -6 156 1 81 -63 -143 -98 113 -20
8022 -20 45 50 -110 -30 -167 28 28 134 -175 144 128 73 -130 14 -34 -85 126 -233 138 14 138 0 -22 10
8046 10 58 175 -40 -68 -48 36 -83 67 78 101 237 22 35 26 -184 -116 98 -23 -21 -196 -75 -81 43 -143 -6
8071 -6 -87 62 -61 80 17 -63 143 -70 66 -39 178 -42 -119 56 191 33 -39 -57 75 -12 176 -144 -50
8094 -50 -23 56 88 -134 -97 -16 -55 -174 66 278 -39 101 95 -52 -53 -147 -9 9 187 46 -35 -64 30 80 122 89
8120 89 -76 9 -27 88 55 101 -49 -150 179 -5 -86 -4 14 40 71 96 -70 38 -38 86 -55 -182 81 92
8144 92 -31 -72 41 -12 25 17 -69 147 -123 147 -91 -41 -15 193 78 108 72 -89 136 35 87 -96 -3 69 -67
8169 -67 -160 -36 -22 -176 -65 -115 144 -102 3 49 89 0 151 118 -32 -41 50 94 27 -29 151 -79
8191g9
##END NTUPLES=NMR FID
##END=
