##TITLE=1H ikalashn
1B1d 1311-2
14.11.2024
##JCAMPDX= 6.0         $$ Bruker NMR JCAMP-DX V2.0
##DATA TYPE= NMR FID
##DATA CLASS= NTUPLES
##ORIGIN= UXNMR, Bruker Analytische Messtechnik GmbH
##OWNER= root
$$ TOPSPIN		Version 1.3
$$ 2024-11-14 14:12:47.312 +0400  Irina@DPX200
$$ Compression mode = diff/dup
##.OBSERVE FREQUENCY= 200.131300845
##.OBSERVE NUCLEUS= ^1H
##.DELAY= (6, 6)
##.ACQUISITION MODE= SIMULTANEOUS
##.ACQUISITION SCHEME= undefined
##.AVERAGES= 32
##.DIGITISER RES= 18
##SPECTROMETER/DATA SYSTEM= spect
##.PULSE SEQUENCE= zg
##.SOLVENT NAME= CDCl3
##.SHIFT REFERENCE= INTERNAL, CDCl3, 1, 17.49637
##AUDIT TRAIL= $$ (NUMBER, WHEN, WHO, WHERE, WHAT)
$$ ##TITLE= Audit trail, TOPSPIN		Version 1.3
$$ ##JCAMPDX= 5.01
$$ ##ORIGIN= Bruker BioSpin GmbH
$$ ##OWNER= Irina
$$ $$ F:/spectra/data/iren/nmr/1H/4/audita.txt
$$ ##AUDIT TRAIL=  $$ (NUMBER, WHEN, WHO, WHERE, VERSION, WHAT)
(   1,<2024-11-14 14:12:33.890 +0400>,<Irina>,<DPX200>,<TOPSPIN 1.3>,
      <created by zg
	started at 2024-11-14 14:10:23.625 +0400,
	POWCHK disabled, PULCHK disabled
       terminated by command 'halt'
       configuration hash MD5:
       BE 6D 3F 07 2A EA 11 49 91 17 2B D3 AF B3 58 0D
       data hash MD5: 16K
       64 5B 24 1C F2 AE E8 B9 7D 5B D4 B5 B9 51 C6 BE>)
$$ ##END=
$$ 
$$ $$ hash MD5
$$ $$ 2D 1F 2E 24 36 FA 5F 8A F0 B1 51 94 D1 59 30 E0
##$RELAX= 
##$RELAX= 
##$RELAX= 
##$RELAX= 
##$RELAX= 
##$RELAX= 
##$RELAX= 
##$RELAX= 
##$RELAX= 
$$ Bruker specific parameters
$$ --------------------------
##$DU= <F:/spectra>
##$EXPNO= 4
##$NAME= <1H>
##$PROCNO= 1
##$TYPE= <nmr>
##$USER= <iren>
##$AMP= (0..31)
100 100 100 100 100 100 100 100 100 100 100 100 100 100 100 100 100 100 
100 100 100 100 100 100 100 100 100 100 100 100 100 100 
##$ANAVPT= -1
##$AQSEQ= 0
##$AQ_mod= 1
##$AUNM= <au_zg>
##$AUTOPOS= <>
##$BF1= 200.13
##$BF2= 200.13
##$BF3= 200.13
##$BF4= 200.13
##$BF5= 200.13
##$BF6= 200.13
##$BF7= 200.13
##$BF8= 200.13
##$BYTORDA= 1
##$CFDGTYP= 0
##$CFRGTYP= 5
##$CHEMSTR= <none>
##$CNST= (0..63)
1 1 145 1 1 1 1 1 1 1 1 1 1 1 1 1 1 1 1 1 1 1 1 1 1 1 1 1 1 1 1 1 1 1 
1 1 1 1 1 1 1 1 1 1 1 1 1 1 1 1 1 1 1 1 1 1 1 1 1 1 1 1 1 1 
##$CPDPRG= <>
##$CPDPRG1= <>
##$CPDPRG2= <>
##$CPDPRG3= <>
##$CPDPRG4= <mlev>
##$CPDPRG5= <mlev>
##$CPDPRG6= <mlev>
##$CPDPRG7= <mlev>
##$CPDPRG8= <mlev>
##$CPDPRGB= <>
##$CPDPRGT= <>
##$D= (0..63)
0 2 0 0 0 0 0 0 0 0.06 0 0.03 0 0 0 0 0.0002 0 0 0 0 0 0 0 0 0 0 0 0 0 
0 0 0 0 0 0 0 0 0 0 0 0 0 0 0 0 0 0 0 0 0 0 0 0 0 0 0 0 0 0 0 0 0 0 
##$DATE= 1731579150
##$DBL= (0..7)
120 120 120 120 120 120 120 120 
##$DBP= (0..7)
150 150 150 150 150 150 150 150 
##$DBP07= 0
##$DBPNAM0= <>
##$DBPNAM1= <>
##$DBPNAM2= <>
##$DBPNAM3= <>
##$DBPNAM4= <>
##$DBPNAM5= <>
##$DBPNAM6= <>
##$DBPNAM7= <>
##$DBPOAL= (0..7)
0.5 0.5 0.5 0.5 0.5 0.5 0.5 0.5 
##$DBPOFFS= (0..7)
0 0 0 0 0 0 0 0 
##$DE= 6
##$DECBNUC= <off>
##$DECIM= 32
##$DECNUC= <off>
##$DECSTAT= 4
##$DIGMOD= 1
##$DIGTYP= 9
##$DL= (0..7)
0 120 120 120 120 120 120 120 
##$DP= (0..7)
$$ [...]
##$SW= 21.9926040160658
##$SWIBOX= (0..15)
0 0 2 0 0 0 0 0 0 0 0 0 0 0 0 0 
##$SW_h= 4401.40845070422
##$TD= 16384
##$TD0= 1
##$TE= 300
##$TE2= 300
##$TE3= 300
##$TEG= 300
##$TL= (0..7)
0 120 120 120 120 120 120 120 
##$TP= (0..7)
150 150 150 150 150 150 150 150 
##$TP07= 0
##$TPNAME0= <>
##$TPNAME1= <>
##$TPNAME2= <>
##$TPNAME3= <>
##$TPNAME4= <>
##$TPNAME5= <>
##$TPNAME6= <>
##$TPNAME7= <>
##$TPOAL= (0..7)
0.5 0.5 0.5 0.5 0.5 0.5 0.5 0.5 
##$TPOFFS= (0..7)
0 0 0 0 0 0 0 0 
##$TUNHIN= 0
##$TUNHOUT= 0
##$TUNXOUT= 0
##$USERA1= <user>
##$USERA2= <user>
##$USERA3= <user>
##$USERA4= <user>
##$USERA5= <user>
##$V9= 5
##$VALIST= <valist>
##$VCLIST= <CCCCCCCCCCCCCCC>
##$VD= 0
##$VDLIST= <DDDDDDDDDDDDDDD>
##$VPLIST= <PPPPPPPPPPPPPPP>
##$VTLIST= <TTTTTTTTTTTTTTT>
##$WBST= 1024
##$WBSW= 25
##$XGAIN= (0..3)
0 0 0 0 
##$XL= 0
##$YL= 0
##$YMAX_a= 1667845
##$YMIN_a= -1536724
##$ZGOPTNS= <>
##$ZL1= 120
##$ZL2= 120
##$ZL3= 120
##$ZL4= 120
##$ABSF1= 10
##$ABSF2= 0
##$ABSG= 5
##$ABSL= 3
##$ALPHA= 0
##$AQORDER= 0
##$ASSFAC= 0
##$ASSFACI= 0
##$ASSFACX= 0
##$ASSWID= 0
##$AUNMP= <proc_1d>
##$AXLEFT= 0
##$AXRIGHT= 0
##$AXTYPE= 0
##$AXUNIT= <>
##$AZFE= 0.1
##$AZFW= 0.1
##$BCFW= 1
##$BC_mod= 2
##$BYTORDP= 1
##$COROFFS= 0
##$CY= 7568.61572265625
##$DATMOD= 1
##$DC= 2
##$DFILT= <>
##$DTYPP= 0
##$F1P= 17.9538593292236
##$F2P= -4.03888763876832
##$FCOR= 0.5
##$FTSIZE= 32768
##$FT_mod= 4
##$GAMMA= 1
##$GB= 1
##$INTBC= 1
##$INTSCL= 1
##$ISEN= 128
##$LB= 0.05
##$LEV0= 0
##$LPBIN= 0
##$MAXI= 945.577
##$MC2= 0
##$MEAN= 0
##$ME_mod= 0
##$MI= -402.1523
##$NCOEF= 0
##$NC_proc= 0
##$NLEV= 6
##$NOISF1= 8.587773
##$NOISF2= 6.764455
##$NSP= 1
##$NTH_PI= 0
##$NZP= 0
##$OFFSET= 17.49637
##$PC= 1
##$PHC0= 119.5545
##$PHC1= 4.959261
##$PH_mod= 0
##$PKNL= yes
##$PPARMOD= 0
##$PPDIAG= 0
##$PPIPTYP= 0
##$PPMPNUM= 100
##$PPRESOL= 1
##$PSCAL= 0
##$PSIGN= 0
##$REVERSE= no
##$SF= 200.13
##$SI= 32768
##$SIGF1= 18.5376
##$SIGF2= -6.396296
##$SINO= 400
##$SIOLD= 32768
##$SREGLST= <1H.CDCl3>
##$SSB= 3
##$STSI= 0
##$STSR= 0
##$SW_p= 4401.40845070422
##$SYMM= 0
##$S_DEV= 0
##$TDeff= 0
##$TDoff= 0
##$TI= <>
##$TILT= no
##$TM1= 0
##$TM2= 0
##$TOPLEV= 0
##$USERP1= <user>
##$USERP2= <user>
##$USERP3= <user>
##$USERP4= <user>
##$USERP5= <user>
##$WDW= 1
##$XDIM= 8192
##$YMAX_p= 0
##$YMIN_p= 0
$$ End of Bruker specific parameters
$$ ---------------------------------
##NTUPLES= NMR FID
##VAR_NAME=  TIME,          FID/REAL,        FID/IMAG
##SYMBOL=    X,             R,               I
##VAR_TYPE=  INDEPENDENT,   DEPENDENT,       DEPENDENT
##VAR_FORM=  AFFN,          ASDF,            ASDF
##VAR_DIM=   8192,          8192,            8192
##UNITS=     SECONDS,       ARBITRARY UNITS, ARBITRARY UNITS
##FACTOR=    0.0002272,     1,               1
##FIRST=     0,             0,               0
##LAST=      1.8609952,     200,             12
##MIN=       0,             -1536724,        -1536724
##MAX=       1.8609952,     1667845,         1667845
$$ Real data points
##PAGE= N=1
##DATA TABLE= (X++(R..R)), XYDATA
0@%%%%%%%%%%%l2O4o4O4o4Q9j21J32j64J93k25K88l52M16m80N60o56P58q72J000
$$ 0 0 0 0 0 0 0 0 0 0 0 0 -32 32 -32 32 -32 57 -64 68 -96 97 -128 160 -192 224 -256 304 -352 406 -466 534
31E34j143J299j474J666j880K125k392K672k984L333l706M111m562N061n595O173
$$ 534 -609 690 -784 882 -998 1127 -1265 1407 -1577 1756 -1950 2161 -2401 2660 -2935 3238
47C238o815P521q283R121j0054J1079j2209J3471j4891J6491j8305K0395k2831
$$ 3238 -3577 3944 -4339 4782 -5272 5807 -6402 7069 -7822 8669 -9636 10759 -12072
60a2072K5702k9151L3399l8763M5778n5418O9568r2554J37583l65674J324460
$$ -12072 13630 -15521 17878 -20885 24893 -30525 39043 -53511 84072 -281602 1042858
71A042858L55603k288077l87602J970877R74186j766002j234994J197247J393243
$$ 1042858 1398461 -889616 -1277218 693659 1667845 -98157 -1333151 -135904 1257339
80A257339q92586j476031L28858J418955P7773j145384m12161R40132P15378n16625
$$ 1257339 364753 -1111278 -782420 636535 714308 -431076 -843237 96895 812273 295648
90B95648q84063J40426R15800K47269r16930o26466P56531R39196n63348j165779
$$ 295648 -588415 -447989 467811 715080 -201850 -828316 -71785 867411 304063 -861716
100h61716L10083J339768k8944j418212k83982J404831N51605j339608q17422
$$ -861716 -551633 788135 759191 -659021 -943003 461828 1013433 -326175 -1143597
109a143597J217687J053088j009123j192708Q23138J326652n66380j374888K99659
$$ -1143597 74090 1127178 118055 -1074653 -251515 1075137 508757 -866131 -566472
118e66472J329524p9211j284075j90400J119969L93003r24300n47621P12947O92748
$$ -566472 763052 683841 -600234 -790634 329335 722338 -201962 -749583 -36636 656112
128F56112m20497p24324J54766P06186J13302o31332l90664M52680N96312k42926
$$ 656112 235615 -488709 -333943 372243 485545 -145787 -536451 -83771 512541 269615
138B69615p64744j1943Q78214L13530q89560n90506Q43438Q60054p20201j099091
$$ 269615 -495129 -507072 371142 684672 -204888 -795394 48044 908098 187897 -911194
148i11194N13817J259734k75830j364680k178J390502K92678j325651n55386J197679
$$ -911194 -397377 862357 586527 -778153 -780331 610171 902849 -422802 -978188 219491
158B19491P84312j003254r61406P51480J055093m80581j077121K00028J026394
$$ 219491 1003803 549 -960857 -209377 845716 365135 -711986 -511958 514436
167E14436P8348q87814l06028P04783M94848m70823o21258K02054O61367N6715
$$ 514436 592784 -295030 -601058 103725 598573 127750 -493508 -291454 369913 426628
177D26628o45202l19455N48944N48764l90992p28460J95470Q63035L9377r27796
$$ 426628 -218574 -538029 10915 559679 168687 -559773 -364303 498732 538109 -389687
187c89687k82095R27091N13913q66461p25829P43657Q98813n71458j016890L71584
$$ -389687 -671782 255309 769222 -97239 -823068 -79411 819402 247944 -768946 -397362
197c97362J084422j47123j088796p4760J032071K77802r29012m56926P73289N85574
$$ -397362 687060 539937 -548859 -623619 408452 686254 -242758 -699684 73605 659179
207F59179n87022o65229L79389O89676j61639o56188m5494N72591K32508m44422
$$ 659179 72157 -593072 -213683 475993 314354 -341834 -387328 185263 417771 -26651
217b6651l85711K80944M95165r3874n51627j00044N58849K96173n10867m73899
$$ -26651 -412362 -131418 363747 269873 -281754 -381798 177051 473224 -37643 -511542
227e11542M16779O25629k86427p45709J23261Q17935M9553q46795k30009Q25231
$$ -511542 -94763 530866 244439 -501270 -378009 439926 489479 -357316 -587325 237906
237B37906M00052p54793n49880O44372O70681m96216p52143L25889P91505j41853
$$ 237906 637958 -116835 -666715 -22343 648338 152122 -600021 -274132 517373 375520
247C75520p82849l8693P29202K06204o28961l45332M92312M48502l27571n07476
$$ 375520 -407329 -446022 283180 489384 -139577 -484909 7403 455905 128334 -379142
257c79142J41463N17724M4556m82381k25245L99096L81411k78404n05264J27300
$$ -379142 -237679 280045 324601 -157780 -383025 16071 397482 119078 -386186 -258886
267b58886N86300M3080o16609k19431N98477L92503n30640n43939M23523O67616
$$ -258886 327414 370494 -246115 -465546 132931 525434 -5206 -549145 -125622 541994
277E41994k82817p50166J23264P87984M4054p78079k06602P20029L49507o22189
$$ 541994 259177 -490989 -367725 420259 464313 -313766 -520368 199661 549168 -73021
287g3021m68811M89042N50101l36163n93130J70908N93304p965n52025j40421
$$ -73021 -541832 -52790 497311 161148 -431982 -261074 332230 324265 -227760 -368181
297c68181M74388K67032l62562l60240K28880M19696p7809m38986p5623M21081
$$ -368181 106207 373239 10677 -349563 -120683 299013 221204 -217782 -293405 127676
307A27676K24172l67875l55148K81189M60920j71434n36602M1521N73317R5098
$$ 127676 351848 -16027 -371175 -89986 370934 199500 -337102 -295581 277736 372834
317C72834n74302k34245N35732L63344m63969m74596L64528N60126k42491o10590
$$ 372834 -201468 -435713 100019 463363 -606 -475202 -110674 449452 206961 -403629
327d03629J09368O26864K9916o01873j61829N41369K80477m46552l75697L25885
$$ -403629 -294261 332603 362519 -239354 -401183 140186 420663 -25889 -401586 -75701
337g5701M39929j88444m70324M1683M61421R8264m16890k26269L35888L29867
$$ -75701 364228 175784 -294540 -252857 208564 306828 -110062 -336331 -443 329424
347C29424k28403m04348R9132M45664M0332m49036j77975M18668L07158l53316
$$ 329424 101021 -303327 -204195 241469 281801 -167235 -345210 73458 380616 27300
357B7300m13785K62257M94167j48612n39964K3294N50747J04880n26994k28019
$$ 27300 -386485 -124228 369939 221327 -318637 -295343 255404 360284 -166710 -394729
367c94729M69084L34653l86391m20788K80642M75402j63215m98719L9507M87802
$$ -394729 74355 409008 22617 -398171 -117529 357873 194658 -304061 -264554 223248
377B23248Q0907m43693j89887L72055K82902k74741l50157J63635L90863m2084
$$ 223248 304155 -139538 -329425 42630 325532 50791 -299366 -135731 255132 213048
387B13048l99085p8389L75999J91744l22670k90546K41374L66568j40449m17644
$$ 213048 -186037 -264426 111573 303317 -19353 -309899 -68525 298043 157594 -260050
397b60050K3363M37498R6057m27633k12846L85648L16037l15991l98657K23826
$$ -260050 -236687 200811 296868 -130765 -343611 42037 358074 42083 -356574 -132748
407a32748M55956j14459m80517j998M75883J19749m38379k26273L74148L17239
$$ -132748 323208 208749 -271768 -273766 202117 321866 -116513 -342786 31362 348601
417C48601k87397l82778J82763M19058p0530m24350m5252L96743J51768l42152
$$ 348601 61204 -321574 -138811 280247 209717 -214633 -259885 136858 288626 -53526
427e3526k46028K61747L19136j65839l65410N8946L83866N0597l71579j53173
$$ -53526 -299554 -37807 281329 115490 -249920 -190974 192892 243489 -128090 -281263
437b81263L32171K46169k66319l18253J81162L70383q2486l96144k1554L94975
$$ -281263 50908 297077 30758 -287495 -106333 264050 181564 -214580 -236134 158841
447A58841J23376l68280k17924L15236K95346k42729l53598J51393L86981n1486
$$ 158841 282217 -86063 -303987 11249 306595 63866 -289732 -138339 248642 197156
457A97156l95239n2243L76973J51453l32814k38598K68594L08294j84081l53823
$$ 197156 -198083 -250326 126647 278100 -54714 -293312 -24718 283576 99495 -254328
467b54328Q9998L73870J1830l65307j11182L30699K03052k73011k79683J94173
$$ -254328 -164330 209540 221370 -143937 -255119 75580 278632 5621 -274062 -79889
477g9889L34183j03892l65773N442L66803R2699l42837j83183K91322K60325k18492
$$ -79889 254294 150402 -215371 -209929 156874 249573 -93264 -276447 14875 275200 56708
488E6708l18160J31333L53601l3987l61921o2673L45999J54880l03579k33446
$$ 56708 -261452 -130119 223482 189495 -172426 -235099 110900 265780 -37799 -271245
498b71245K40899K94403j60751l33466O8939L48574K5254l41077j18234L08037
$$ -271245 -30346 264057 103306 -230160 -161221 187353 212607 -128470 -246704 61333
508F1333K00326k56829k68042J87528L14869j06305l38643J8321L39844P0495
$$ 61333 261659 4830 -263212 -75684 239185 132880 -205763 -187442 152402 222897
518B22897l16336j52417K73299K24592k10563k79091J36664L13551n3325l24442
$$ 222897 -93439 -245856 27443 252035 41472 -237619 -100955 212596 159271 -165171
528a65171l2550L11556J13770k75969j88558K19215K47917j48355k90391O5021
$$ -165171 -197721 113835 227605 -48364 -236922 -17707 230210 81855 -208536 -143515
538a43515L10409K1638l07957j06903K82235J85594k35240k48990J69965K97272
$$ -143515 166894 188532 -119425 -226328 55907 241501 6261 -242729 -72764 224508
548B24508q9967l23444M927L27583Q2722l10005j62226K70454K30756k14219k82756
$$ 224508 134541 -188903 -183976 143607 226329 -83676 -245902 24552 255308 41089 -241667
559b41667J42522L13103o3650l23148j9321L09596R7825k76154j68738K25066
$$ -241667 -99145 213958 150308 -172840 -192161 117435 215260 -60894 -229632 -4566
569d566K25297j60118k62169Q6191K79821p304k74253o8852K49179J40451k03886
$$ -4566 220731 60613 -201556 -115365 164456 157152 -117101 -185953 63226 203677 -209
580b09j99873J44624K44036p4578k71030j527K76436P7182k63277j49313K29179
$$ -209 -200082 -55458 188578 114000 -157030 -158557 117879 195061 -68216 -217529 11650
591A1650K10252j78861k59331J14316K92061m2113l05666l3287L00989J07185
$$ 11650 221902 43041 -216290 -101974 190087 147974 -157692 -190979 110010 217195
601B17195k75733j71873K33432K26623j75717k63285J07432K81977l1945k80856
$$ 217195 -58538 -230411 3021 229644 53927 -209358 -101926 180051 148106 -132750
611a32750m3920K59529J13271k20852j73265J65387K16972j00482k42722K7387
$$ -132750 -176670 82859 196130 -24722 -197987 -32600 184372 83890 -158832 -131445
621a31445K46903M6982k31409j17839J97163J81301j47244k29344Q5286K62833
$$ -131445 115458 162440 -68969 -186808 10355 191656 44412 -184932 -99646 163187
631A63187j5227k75170n5854K68947J24637k42679j85199J99235K34337j43557
$$ 163187 147960 -127210 -183064 85883 210520 -32159 -217358 -18123 216214 72657
641G2657k69160P7874K85546j0074k85699n7226K65754J17879k30762j67983J81511
$$ 72657 -196503 -118629 166917 156843 -128856 -186082 79672 197551 -33211 -201194 -19683
652a9683K05438j22665k24838N6899K30043J0903k16644p4069J88508J30524j46120
$$ -19683 185755 63090 -161748 -104849 125194 136097 -80547 -154616 33892 164416 18296
663A8296j73949R2585K02902l1760k15328l3740K09615R7533j89033j56868J51131
$$ 18296 -155653 -63068 139834 108074 -107254 -140994 68621 166154 -22879 -179747 -28616
674b8616K06348j03302k42757M6133K62985J5937k65886p7228K51487J36129k19900
$$ -28616 177732 74430 -168327 -122194 140791 156728 -109158 -186386 65101 201230 -18670
685a8670j85382J75543K24923j19871k49238N9182K57472L546k48845o3382K22384
$$ -18670 -204052 -28509 196414 76543 -172695 -113513 143959 147505 -101340 -164722 57662
696E7662J15247j82644j56861J29339J84085o9880j96368N650J91971N7373j72915
$$ 57662 172909 -9735 -166596 -37257 146828 76948 -119420 -113770 78201 135574 -37341
707c7341j12643J38571J59145r2021j91601L8688K10006K1571k11603q1265J98065
$$ -37341 -149984 -11413 147732 55711 -135890 -97202 112804 134375 -77228 -158493 39572
718C9572J38086j70126j87020J29291K24627q1374k47542K5226K55326L0068k46798
$$ 39572 177658 7532 -179488 -50197 174430 93056 -154486 -129260 126066 156134 -90664
729i0664q5884K22946J34233j85799j73345J38099K01562q3666k13638K6659K12141
$$ -90664 -176548 46398 180631 -5168 -178513 -40414 161148 77482 -136156 -109497 102644
740A02644K9354j93594q0057J61975J22662j16941j54269O3802J72375o385j75929
$$ 102644 131998 -61596 -141653 20322 142984 26043 -128226 -64424 107951 101566 -74363
751g4363n2908J63743J06669j38464j53879J00082J88896n2531k11087j349K18009
$$ -74363 -127271 36472 143141 4677 -149202 -49120 139776 87245 -123842 -125191 92818
762I2818N7716k09805j11109J88816J59055j54345j96081J12223K21111o2412
$$ 92818 150534 -59271 -170380 18436 177491 23146 -172935 -60712 160399 97987
772I7987k31870J0900K27130M0574k08815q7676J77294J26388j37247j55632Q8812
$$ 97987 -133883 -122983 104147 144721 -64094 -151770 25524 151912 14665 -140967 -52155
783e2155J70675l7599j73470j3699J61628O0746j36285j01226J00658J33797n5781
$$ -52155 118520 80921 -92549 -106248 55380 116126 -20159 -121385 -20727 113070 57289
794E7289j54041O871J63159M4268j58129r2751J42147J34764j13503j69702P4981
$$ 57289 -96752 -89881 73278 117546 -40583 -133334 8813 143577 30074 -139628 -64647
805f4647J93735l0731k06140j8178K04906O6388j92558j11272J67578J48729j33051
$$ -64647 129088 98357 -107783 -125961 78945 145333 -47225 -158497 9081 157810 24759
816B4759j76855R1434J92793m4037j95015k937J84270M9902j61254q9985J28370
$$ 24759 -152096 -60662 132131 88094 -106921 -109858 74412 124314 -36940 -126925 1445
827A445J22659q7137j43887M0968J52200O565j48087n3247J29721R4815j01686
$$ 1445 124104 36967 -106920 -65952 86248 92813 -55274 -108521 21200 116015 14329
838A4329j29439O2586J54435j9267j67585k7463J68932P3716j57237j14612J35102
$$ 14329 -115110 -52524 101911 82644 -84941 -112404 56528 130244 -26993 -141605 -6503
849f503J49396j01655j74395O2045J89089j7846j92106k6944J83827O8835j64637
$$ -6503 142893 41238 -133157 -71112 117977 100131 -91975 -118919 64908 133743 -30894
860c0894j06070J36110J33214j00238j52015N8702J58160j5044j53612k8264J37447
$$ -30894 -136964 -854 132360 32122 -119893 -61191 96969 81925 -71687 -99951 37496
871C7496O7870j11155j00694P8139J25070l8413j37240l583J39074M5992j27888
$$ 37496 105366 -5789 -106483 -28344 96726 58313 -78927 -82510 56564 102556 -25332
882b5332q5346J06081J20189p6272j46927L8264J63616K103j70255m3657J63969
$$ -25332 -110678 -4597 115592 39320 -107607 -69343 94273 96376 -73879 -117536 46433
893D6433Q2599j47379j17555J20473J44744q5938j62386M6158J70617l574j67274
$$ 46433 129032 -18347 -135902 -15429 129315 43377 -119009 -72851 97766 94192 -73082
904g3082l6012J53443P3495j29792j02459R8227J23228o1062j33452K0083J33045
$$ -73082 -109094 44349 117844 -11948 -114407 -16180 107048 45986 -87466 -67383 65662
915F5662K0451j23185n9003J02878R1045p5506j16413M1702J31555n032j36152
$$ 65662 86113 -37072 -96075 6803 97848 22342 -94071 -52369 79186 74154 -61998
926f1998l2997J30456P0470j14817j02586R1246J29590n9237j48358K4645J57778
$$ -61998 -94995 35461 105931 -8886 -111472 -20226 109364 50127 -98231 -73586 84192
937H4192J1789j55984m8358J44766Q0585j24461j08420R5212J28628o1993j40329
$$ 84192 95981 -60003 -108361 36405 116990 -7471 -115891 -20679 107949 45956 -94373
948i4373K3845J42091J4123j35391m8491J18595P9416r3658j02858O2797J17737
$$ -94373 -70528 71563 85686 -49705 -98196 20399 99815 6157 -96701 -33904 83833
959H3833k5505j22466j2431J18937M9683j05978q2485Q4148J09001n5194j28358
$$ 83833 58328 -64138 -76569 42368 92051 -13927 -96412 -12264 96737 41543 -86815
970h6815K2048J36477J2780j35200m8817J23964Q1159j04435j09434P8115J30103
$$ -86815 -64767 71710 84490 -50710 -99527 24437 105596 1161 -108273 -30158 99945
981I9945m6850j41614J3329J44242K1176j36707n2953J20514Q1568r5402j03381
$$ 99945 53095 -88519 -75190 69052 90228 -46479 -99432 21082 102650 7248 -96133
992i6133O5484J17582l1567j23854l292J20340L5983j08833o5670Q8338Q9108
$$ -96133 -30649 86933 55366 -68488 -71780 48560 84543 -24290 -89960 -1622 87486
1003H7486o2010j06226L0279J14865L267j14419l6893J06551O8330r0347r3899
$$ 87486 25476 -80750 -50471 64394 67661 -46758 -83651 22900 91230 883 -93016
1014i3016O8088J13395l9607j24624Q136J28123K4090j21655n5844J07081Q3662
$$ -93016 -24928 88467 48860 -75764 -67628 60495 84585 -37070 -92914 14167 97829
1025I7829q6446j06013N9072J20626k9324j27152k896J24530L3877j12723o2695
$$ 97829 11383 -94630 -35558 85068 55744 -71408 -74304 50226 84103 -28620 -91315
1036i1315R3748Q6291o7403j03628L8005J13602n211j14867k5693J07756N4611
$$ -91315 2433 88724 21321 -82307 -44302 69300 64089 -50778 -76471 31285 85896
1047H5896r1911p9402O9279R8166m1955j09896J0670J12741K0631j08628n1067
$$ 85896 -6015 -85417 -16138 82028 40073 -69823 -59153 53588 74219 -34409 -85476
1058h5476R6792P6235p7372r6710N2166J10522k4438j14639n749J12426L5812
$$ -85476 11316 87551 10179 -86531 -34365 76157 51719 -62920 -68669 43757 79569
1069G9569j01958o2364Q5464Q5708o3318j01674L6715J10861q208j11965k1253
$$ 79569 -22389 -84753 711 86419 23101 -78573 -41858 69003 60795 -51170 -72423
1080g2423J04218M8528r0014p3218O9410R1349m3541j04392J5380J09412J2688
$$ -72423 31795 80323 -9691 -82909 -13499 77850 34309 -70083 -54703 54709 67397
1091F7397j05692m0550R5174O5488p6728q4251N2998R9071k5729j05505l361J05129
$$ 67397 -38295 -78845 16329 81817 5089 -79162 -26164 72907 47178 -58327 -61688 43441
1103D3441L1441r7193n7808Q2137P8930o0929r4949L5220J02739p481j03754k2119
$$ 43441 74882 -22311 -80119 2018 80948 20019 -74930 -39710 63029 55548 -48206 -70325
1115g0325R7558M9474q4475p3216O6325R0866m1981j02479J6837J06149J1229
$$ -70325 27233 76707 -7768 -80984 -14659 76207 34226 -68253 -51416 54733 65962
1126F5962j01980l7683R1281O1598p4037q1331N2255R5117k8039j02408J717J01525
$$ 65962 -36018 -73701 17580 79178 5141 -76190 -23935 71182 43143 -59265 -57548 43977
1138D3977K3736r3930m8009P9308O7547n9310q2755L5913R1760r586r4095j6477
$$ 43977 67713 -26217 -74226 5082 72629 13319 -69436 -33523 58237 48651 -45444 -61921
1150f1921Q9908M1758p8156o3182O1694P9894l9681r0207J4079R4720J2321r2978
$$ -61921 27987 69745 -8411 -71593 -9899 69995 30314 -59893 -45814 48906 61227 -31751
1162c1751l9058Q4358O2116p0071q1348N0164R4640k7652j01314K248J01039K3473
$$ -31751 -70809 13549 75665 5594 -75754 -25590 69050 41398 -59916 -57668 43371 66844
1174F6844r3822m7249Q1342O7979o2343q3854M1411R2755j7043r4381p983R0735
$$ 66844 -26978 -74227 7115 75094 12751 -71103 -29692 63063 46020 -48361 -56344 34391
1186C4391L0308p9115n1378O1560O8030m0827p9593J6339Q4697P917q3653l1902
$$ 34391 64699 -14416 -65794 -4234 63796 22969 -56624 -40285 44412 52329 -31324 -63226
1198f3226P5473N3400o1254p0659M2570Q3360j9154r0300m672R1275K9029q5686
$$ -63226 12247 65647 4393 -66266 -23696 59664 40510 -49790 -54462 36813 65842 -19844
1210a9844n1483P5083P0345n8809q4453L8367R2879j6530r5482o686R0740K9721
$$ -19844 -71327 3756 74101 15292 -69161 -30794 62085 45555 -49927 -56613 34127 63848
1222F3848q2089n0048O7314O6140m8519p7024K7053Q2188l964q0708j7892P2871
$$ 63848 -18241 -68289 -975 65165 16646 -60378 -33325 48863 44899 -35809 -53701 19170
1234A9170L9510n9080n7026M1253O9891j9248p8313k869P9558K5516p5325m6936
$$ 19170 58680 -400 -57426 -16173 53718 34470 -43843 -46712 32846 58362 -16963 -63899
1246f3899O4556O4783m8880p9655K9422Q7776p106r1376j6248Q9869L7829q1571
$$ -63899 657 65440 16560 -63095 -33673 54103 46997 -44379 -60627 29242 67071 -14500
1258a4500n6670O8403P2074n0363q1674L0238Q5866p679q4592j4098P7314L4305
$$ -14500 -71170 -2767 69307 18944 -62730 -32492 53374 45695 -38897 -52995 24319 58624
1270E8624o5368n1485M9649O2773l0547o9461Q890O9952J2319o5238l2300N4269
$$ 58624 -6744 -58229 -8580 54193 23646 -45815 -36925 33027 45346 -19892 -52192 2077
1282B077N0822l9810o4942K1982P4399j215p8165j9508P7296L8980o8389n7391
$$ 2077 52899 13089 -51853 -29871 44528 43313 -34852 -54360 22936 61916 -6473 -63864
1294f3864N6053P1823l8955q2742J9524Q7737J259q8415k2014Q2888L9510p1730
$$ -63864 -7811 64012 25057 -57685 -38161 49576 50835 -37580 -59594 23294 62804 -8926
1306h926n5613N7407O6156l8896p2328J8237P4164K487o9368k2030O0431L9845
$$ -8926 -64539 -7132 59024 20128 -52200 -33963 40201 42688 -26680 -48710 11721 51566
1318E1566m6963n2971K9988O1884j0809o4586r805O1752K9719n4733m7672M2310
$$ 51566 4603 -48368 -18380 43504 32695 -31891 -41696 20056 49775 -4958 -52630 -10320
1330a0320O2792k7343p4290R662P9554R037p9959k7497P5031M4738o3658o0525
$$ -10320 52472 25129 -49161 -39499 40055 49092 -30867 -58364 16667 61405 -2253 -62778
1342f2778N0650P2001l3111p8942J4699Q0991M134p7626k1884O9336L7490n7235
$$ -62778 -12128 59873 26762 -52180 -37481 43510 47644 -29982 -51866 17470 54960 -2275
1354b275m9640M1007N6699k2206o0978L352N8915J5591n3175l3032M2792M7285
$$ -2275 -51915 -10908 45791 23585 -37393 -34041 24874 40465 -12710 -45742 -2950 44335
1366D4335k8865n6302J2073O2366O482o2604k5181N8153M3545m9653n8463L6409
$$ 44335 15470 -40832 -28759 33607 40089 -22515 -47696 10457 54002 4349 -54114 -17705
1378a7705P1246k1586p8402M049Q0598J3101p7862l0700O9740M6159n8299n8258
$$ -17705 53541 31955 -46447 -42398 38200 51301 -26561 -57261 12479 58638 339 -57919
1390e7919M2858O6616k5342p0968P896O9728J0051o3625k5168N3402L8206l8734
$$ -57919 -15061 51555 26213 -44755 -36859 32869 42920 -20705 -45873 7529 45735 7001
1402G001m7148K1947N2235l718n3232j4981M9481L1540m1830m5781K9358N6658
$$ 7001 -40147 -18200 34035 30317 -22915 -37896 11585 43125 1295 -44486 -15128 41530
1414D1530j5000o2925j921O4670J9828o2521l6604N6425N0950m5725o2958L3076
$$ 41530 26530 -36395 -38316 26354 46182 -16339 -52943 3482 54432 8707 -54251 -21175
1426b1175P1334j7734p4763K201P3127J4824o7824k9684N8101M2353m5724n2000
$$ -21175 50159 32425 -42338 -40137 32990 47814 -20010 -49694 8407 50760 5036 -46964
1438d6964L0412N7185j4767n8468j977N4893J7280m6809l0943L5319M1980k0916
$$ -46964 -16552 40633 25866 -32602 -34579 20314 37594 -9215 -40158 -4839 37141 16225
1450A6225m8503M540N1801J2856n0490k8522M5448M2750l5819n4522K3091O2387
$$ 16225 -32278 -27738 24063 36919 -13571 -42093 3355 46105 10286 -44236 -21145 41242
1462D1242q365o6470q025O6263K3670o2187l9058N4388N1181m3381o0260K9797
$$ 41242 32877 -33593 -41618 24645 48315 -13872 -52930 1458 52639 9258 -51002 -21205
1474b1205O5148j4487o5802q15O1983J6338n4252k9353M3968M0129l0856m6839
$$ -21205 43943 29456 -36346 -37161 24822 41160 -13092 -42445 1523 41652 10796 -36043
1486c6043J6106M9663m87m8137j4519M2035K7820l3229l9538K1159M7407o872
$$ -36043 -19937 29726 29239 -18898 -33417 8618 36438 3209 -36329 -15170 32237 25365
1498B5365n2599q732N3613K3654m9986l7243M3152M9336l2656n7873J9810O3137
$$ 25365 -27234 -35966 17647 41301 -8685 -45928 -2776 46560 13904 -43969 -24159 38978
1510C8978m319o4990j0285O2713K4555n6910l7023M7100M7003l5858n3084K1375
$$ 38978 34659 -30331 -40616 22097 46652 -10258 -47281 -181 46822 10964 -42120 -20745
1522b0745N5284o615n4238p705M8537K1620m0327l2661K8660M1397j5634m5598
$$ -20745 34539 27924 -26314 -34019 14518 36138 -4189 -36850 -8190 33207 17573 -28025
1534b8025J373M6606J3087m2461k6252L4729L8501k4557m7538J1832N3743J605
$$ -28025 -26652 19954 33041 -9420 -35672 -943 37558 13001 -34537 -22705 31038 32643
1546C2643n5885j5931N4217K8729m9135m0454M0248M9189k8606n5610J5217N8349
$$ 32643 -23242 -39173 15044 43773 -5362 -45816 -5568 43621 15015 -40595 -25378 32971
1558C2971m59n8231j2318N3541K5226m6319l4607L6071M2464k3466m5910R652
$$ 32971 32512 -25719 -38037 15504 40730 -5589 -40196 -4125 38339 14873 -31037 -21385
1570b1385M5395M402m2549j7553L5933K9208k7786l7918J5577M3978l155m6066
$$ -21385 24010 28412 -14137 -31690 4243 33451 5665 -32253 -16676 27302 24147 -21919
1582b1919r953M4281K3094l9236l4486L0915M4799k0300n1562Q238N5413M917
$$ -21919 -31872 12409 35503 -3733 -38219 -7304 37495 17195 -34367 -26129 29284 34201
1594C4201n5048j7598N1895K8709m4579l8847L4495M5876k2481n0603R388N0886
$$ 34201 -20847 -38445 13450 42159 -2420 -41267 -6772 39104 16623 -33980 -24592 26294
1606B6294L665m8684j6025M3242K6655l5098l4128K3912L9237j0712m1394k090
$$ 26294 29959 -18725 -34750 8492 35147 49 -34079 -10167 29070 18358 -23036 -25126
1618b5126M0083J5543l5793k6980K8552L6869j9476m2698P859M5565M384m5645
$$ -25126 14957 30500 -5293 -32273 -3721 33148 13672 -29026 -21167 24398 28782 -16863
1630a6863j6730M1540K8210l5397l7973K6538M5164j5932n0090M481N1712P172
$$ -16863 -33593 7947 36157 760 -37213 -10675 34489 18557 -31533 -27052 24660 31832
1642C1832m9160j8284M3619K8898l5514l6126K4749M2048j3228m4503J077M4030
$$ 31832 -17328 -35612 8007 36905 1391 -34735 -9986 32062 18834 -25669 -24592 19438
1654A9438J0203m0028k1706L3573K9403k3335l6096J2296L9447l11m0002j2095
$$ 19438 29641 -10387 -32093 1480 30883 7548 -28548 -16252 23195 22884 -17118 -29213
1666b9213L7668K3074l1815l2733K3960M0741j4808m3928L382M5209Q454m2955
$$ -29213 8455 31529 -286 -33019 -9059 31682 16874 -27054 -23672 21537 29991 -12964
1678a2964k0171L8493K9871l0802l8404K1639M3655j1578m5568l88M4779J0819
$$ -12964 -33135 5358 35229 4427 -33977 -12338 31317 19739 -25829 -26217 18562 29381
1690B9381m0966k0296L3779K9384k5334l5449J5103L9121l144m0216p588L7874
$$ 29381 -11585 -31881 1898 31282 5948 -29501 -14398 24723 21579 -18637 -26225 11649
1702A1649J7460l1863k6372K4603L3079j4762l7731M269L8527P134l7829j7984
$$ 11649 29109 -2754 -29126 -4523 28556 13794 -23937 -19668 18859 25993 -11836 -29820
1714b9820L4034K6770k7599l4293J9027L8894r129m1497j377M1072J2158l7416
$$ -29820 4214 30984 3385 -30908 -11881 27013 17884 -23613 -24990 16082 28240 -9176
1726i176k1818L2215L0350k4160l6702J5162M0306n125m0408n435L7823J5161
$$ -9176 -30994 1221 31571 7411 -29291 -14129 26177 21052 -19356 -24791 13032 28193
1738B8193l2920k4430K5608L1016j6343l6295O365L8018M052l7367j3702L3687
$$ 28193 -4727 -29157 -3549 27467 11124 -25171 -18806 19212 23264 -14103 -27805 5882
1750E882K2281k6812k9186J8559L4621r221l6943j099L7402J1115l4757k0348
$$ 5882 28163 1351 -27835 -9276 25345 16124 -20819 -21918 15484 26599 -8158 -28506
1762b8506K9717K8199k2734l3717J3917L6108l691l7179o714L5390J6178l1130
$$ -28506 1211 29410 6676 -27041 -13124 22984 19293 -17886 -24600 10790 26968 -4162
1774d162k4732K4690L1146j6580l5037P556L6893K071l5548j1270L1832K0634
$$ -4162 -28894 -4204 26942 10362 -24675 -17119 19774 21845 -13703 -24973 6859 27493
1786B7493k6217k7730J9134L2898j0647l5864J473L6098P268l4070j6559K8982
$$ 27493 1276 -26454 -7320 25578 14931 -20933 -19460 16638 23906 -10164 -26723 2259
1798B259K4205k2417k9450J3455L3142l836l4790n123L3363J4199k9540k1705
$$ 2259 26464 4047 -25403 -11948 21194 17358 -17432 -22555 10808 25007 -4533 -26238
1810b6238K3921K7934j5748l1921O959L3716K542l3037j2081L0570K0001k5223
$$ -26238 -2317 25617 9869 -22052 -15093 18623 21165 -11872 -23953 6617 26618 1395
1822A395k7879J8919L1841j0501l5027J876L4583P586l2564j6053K8373K3155
$$ 1395 -26484 -7565 24276 13775 -21252 -19376 15207 22793 -9771 -25824 2549 25704
1834B5704k1629k8839J4441L2474n879l3751k556L2616J0525k8448j7868K2765
$$ 25704 4075 -24764 -10323 22151 16272 -17479 -20035 12581 23106 -5342 -23210 -445
1846d45K3909j5645k8343O892L0564J553l0794r605K7784J7225k3165k3849J6702
$$ -445 23464 7819 -20524 -13632 16932 18485 -12309 -21914 5870 23095 -70 -23919 -7217
1859g217K8452q774l1163K78L1922Q990l0342j6682K6674K3875k1205k8998J3903
$$ -7217 21235 12461 -18702 -18424 13498 22488 -7854 -24536 2138 26013 4808 -24190 -10287
1872a0287L2620o649l2878k526L1935J0671k9129j8308K3926K4473j8003k7943
$$ -10287 22333 15684 -17194 -19720 12215 22886 -6243 -24551 -625 23848 5845 -22098
1884b2098R825L0157j990k9716n850K7199J3362k1816j9751J6019K4209p877k7926
$$ -22098 -12273 17884 15894 -13822 -19672 7527 20889 -927 -20678 -4659 19550 11673 -16253
1897a6253O42K8092P463k6544j4862K2927K0871j7291k6384J0726K9088k477l1400
$$ -16253 -15611 12481 19944 -6600 -21462 1465 22336 5045 -21339 -10613 18475 15998 -15402
1910a5402n080L0706J2335k7695j9404K3576K4797j7534k8402J0744L0075k870
$$ -15402 -20482 10224 22559 -5136 -24540 -964 23833 6299 -22103 -11359 18716 15846
1922A5846k9650n195K7862J2722k4115j8619J8621K3023j2051k5805M584K5790
$$ 15846 -13804 -18999 8863 21585 -2530 -21149 -2528 20495 8444 -17361 -12777 13013
1934A3013K699k4471r730K0621J6948j5816k2298R546K5638k037k7510m840K7051
$$ 13013 15712 -8759 -18489 2132 19080 3264 -19034 -9488 16150 14113 -13397 -18237 8814
1947H814J2338k4335j8789J9549K4332j3534k7823P018K9879k58k9988p512K8392
$$ 8814 21152 -3183 -21972 -2423 21909 8375 -19448 -12430 17449 17191 -12797 -20309 8083
1960H083J4255k5369j9633K0104K3689j3973k6040O735K6069R81k4906p537K1931
$$ 8083 22338 -3031 -22664 -2560 21129 7156 -18884 -12149 13920 14901 -10005 -17542 4389
1973D389J4071j8076j8009J1958K1848n375k2645j775K1847Q735j9545j5550J5768
$$ 4389 18460 384 -17625 -5667 16181 10806 -11839 -13614 8233 16968 -2577 -18127 -2359
1986b359K0593j0500k4656M338K6585K378k7069q837K5464J4835k2104k0240J6674
$$ -2359 18234 7734 -16922 -12584 14001 16379 -10690 -19527 5937 20772 -1332 -21572 -4898
1999d898K5010j0623k7410M542K8140K491k7619q199K4976J3506k0948j7660J5316
$$ -4898 20112 9489 -17921 -13379 14761 17252 -10367 -18566 6410 19916 -1032 -18692 -3376
2012c376K0897r048k2341J285K2555M550j9826j1454J6655J6219j1903j9584N893
$$ -3376 17521 8473 -13868 -12583 9972 14522 -5304 -16758 -103 16116 4213 -15371 -9478
2025i478K1362Q48k1641o834J9845J3998j7119j9070J2970K3371p522k6506J925
$$ -9478 11884 12732 -8909 -15743 4102 18100 981 -18089 -5119 18252 10730 -15776 -13851
2038a3851K7005M489k6452j0306K3385J5264j9123k0437J4405K3396q545k4871
$$ -13851 13154 17643 -8809 -19115 4270 19534 411 -20026 -5621 17775 9230 -15641
2050a5641K508K4701L677k3190q469J9471J3537j4596j6541Q675J8903k381j9972
$$ -15641 -13133 11568 15245 -7945 -16414 3057 16594 1998 -14543 -5868 13035 10654 -9318
2063i318l465J8188R788j5758j4886J1942J8515p000k0642K29K1849N270k1038
$$ -9318 -12783 5405 15193 -565 -15451 -3509 15006 8006 -12636 -12407 9442 14712 -6326
2076f326j1788J9517J6768j5466k1285J1291K4528o617k4947M38K5037N628k3665
$$ -6326 -18114 1403 18171 2705 -18580 -7289 17239 10622 -14325 -13887 11150 16778 -6887
2089f887j0697K0621J4757j5686j8801J0802K0744n426k1255n36K0381N752j7870
$$ -6887 -17584 3037 17794 2108 -16693 -5891 14853 9427 -11828 -12364 8017 13769 -4101
2102d101j0230J3263J4227q404j6422K305J8276K919j7255q287J5608J3352j2296
$$ -4101 -14331 -1068 13159 4755 -11667 -9362 8914 11833 -5422 -13709 1899 15251 2955
2115B955j7439Q337K0140l214k1878k460K1931P966k0777j3108J8281J7077j4795
$$ 2955 -14484 -6147 13993 10779 -11099 -13559 8372 16338 -4439 -17547 734 17811 3016
2128C016k0288R831K2236m663k2864k20K1577O030j9327j0806J5568J4794j1107
$$ 3016 -17272 -7441 14795 10132 -12732 -12952 8625 14655 -4672 -15478 90 14884 3777
2141C777j6809O074J8283j122j7738l776J5638Q733j2597j3084Q306J5882l766
$$ 3777 -13032 -6958 11325 10203 -7535 -11311 4327 13060 463 -12621 -4315 11567 7801
2154G801j7267k163J8177O959j7124j1869J4982J5658j0935j8953O881K0920j890
$$ 7801 -9466 -11629 6548 13507 -3617 -15486 -504 15154 4219 -14734 -7853 13067 11177
2167A1177k0834m209K1109Q555j8818j2965J6160J6032j1977j8670P246J9210
$$ 11177 -9657 -13866 7243 15798 -3020 -15985 175 16207 4230 -14440 -7194 12016
2179A2016k269j8851l058J7251P857j4858j1475J0499J4764o469j5545J061J6550
$$ 12016 9747 -9104 -12162 5089 12946 -1912 -13387 -2888 11876 5407 -10138 -9077 7473
2192G473L221j4813p837J2618J1915q431j5904M820J7410L42j8706m455J8055
$$ 7473 10694 -4119 -11956 662 12577 4146 -11758 -6938 10472 10814 -7892 -12347 5708
2205E708Q614j6484j2808J3338J5996r518j8596M981J9698K8k0113m003J8255
$$ 5708 14322 -2162 -14970 -1632 14364 4846 -13750 -8769 10929 10957 -9156 -13159 5096
2218E096R135j6073j2308J2712J4790q360j6488L950J6556Q67j5243n683J3259
$$ 5096 14231 -1842 -14150 -1438 13352 4992 -11496 -7546 9010 9877 -5366 -11049 2210
2231B210R980j0483j2975O166J5326k853j5499k236J5191O371j3240j0430J0002
$$ 2210 12190 1707 -11268 -5102 10224 7371 -8128 -10364 4827 11198 -2042 -12472 -2470
2244b470J4518o563j6750K508J8392J740j8287o008J7004R891j4468j3461J1389
$$ -2470 12048 5485 -11265 -8757 9635 11375 -6912 -12920 4084 13975 -493 -13954 -2565
2257b565J5646o945j7357K958J7373J502j7041n867J5229R055j1940j2257Q738
$$ -2565 13081 6136 -11221 -8263 9110 10612 -6429 -12296 2933 11988 48 -12209 -3471
2270c471J3656m189j4657J97J3798M953j2531q772J0380J2261p337j4213L472
$$ -3471 10185 5996 -8661 -8464 5334 10287 -2244 -11016 -636 11625 4288 -9925 -6453
2283f453J5235L01j5038m678J3813Q777j1828j2407Q894J4982n911j6422J800
$$ -6453 8782 9083 -5955 -10633 3180 11957 129 -12278 -3384 11598 5687 -10735 -8935
2296h935J6699K607j6246o749J5589R611j2082j2578Q651J4800m684j5357J00
$$ -8935 7764 10371 -5875 -12624 2965 12576 494 -12084 -3433 11367 6683 -8674 -8574
2309h574J5220M175j4398p380J1926J0126q881j2279M603J3321k49j3931l777
$$ -8574 6646 10821 -3577 -10957 969 11095 2214 -10065 -5462 7859 7610 -6321 -10098
2322a0098J3007P567j1056j0483Q341J2820m952j4376J333J5271K549j4517o169
$$ -10098 2909 10476 -580 -11063 -2722 10098 5146 -9230 -7897 7374 9923 -4594 -10763
2335a0763J2527J0158j0316j2755P113J5056l844j6072L05J5162L853j4381p022
$$ -10763 1764 11922 1606 -11149 -4036 11020 7176 -8896 -8591 6571 10424 -3957 -10979
2348a0979J1739R611q758j2029N305J3686j377j4439j714J3375N957j1993q361
$$ -10979 760 10371 1613 -10416 -5111 8575 7198 -7241 -8955 4420 10377 -1616 -9977
2361i977R504J0539n453j2695J497J3838J996j3217o012J1799Q875r385j1600
$$ -9977 -473 10066 4613 -8082 -6585 7253 9249 -3968 -9980 1819 10694 1309 -10291
2374a0291O485J2992l412j4125j31J3762M123j2291p690J0601J0603q028j2379
$$ -10291 -3806 9186 5774 -8351 -8482 5280 9403 -2888 -10578 23 10626 2598 -9781
2387i781N083J3717j727j3674j817J3052M973j1115q577Q784J0727n854j2182
$$ -9781 -4698 9019 7292 -6382 -8199 4853 9826 -1289 -9866 -1082 9645 3791 -8391
2400h391K223J3291L41j2651m416J1802P337r486r781O841J1619l490j2643N7
$$ -8391 -6168 7123 7464 -5187 -9603 2199 9536 50 -9731 -2890 8729 5239 -7404 -7347
2414g347J2691L770j2122o381J0137R288q201j1288N546J2266j903j2514k411
$$ -7347 5344 9114 -3008 -9389 748 10036 1835 -9453 -3907 8359 6456 -6058 -8469
2427h469J2193N480j0949q188Q511J0868o096j2037K756J2781L47j2370l399J0919
$$ -8469 3724 9204 -1745 -9933 -1422 9446 3350 -8687 -5931 6850 7197 -5173 -8572 2347
2441B347P082q837r539O533J1118l285j2269K64J2575K315j1709n290R721P692
$$ 2347 9429 592 -8947 -2414 8704 5419 -6850 -6586 5989 8304 -3405 -8695 1026 8718
2455H718p309j0237M779J1704j675j1827j815J1412M654j0435o957Q095R628n696
$$ 8718 1409 -8828 -4049 7655 5980 -5847 -7662 3750 8404 -2031 -8988 -893 8735 3039
2469C039j0729K516J1547O44j1232l753R718P448r020r390O852J0643l957j1509
$$ 3039 -7690 -5174 6373 7017 -4215 -7968 1750 9198 178 -9212 -2360 8283 4326 -7183
2483g183Q63J1345K533j1321n164R495Q181p366j0052M833J1882k305j2122q62
$$ -7183 -6320 5025 7558 -3763 -8927 568 8749 1383 -8669 -3836 8046 5741 -6381 -7243
2497g243J1726L547r995o353Q256Q342n455j0101K721J0948k35j0465l574J0139
$$ -7243 4483 8030 -1965 -8318 -62 8280 2825 -7276 -4555 6393 6158 -4307 -7881 2258
2511B258N533q197p942O294R374l427j0646M92J0787L170j0570n482R088Q298
$$ 2258 7791 -406 -8348 -2054 7320 3893 -6753 -6261 4526 7696 -2874 -8356 732 9030
2525I030o928r903M905J0525k069j1458p11J1180L120r345o549Q009Q402o208
$$ 9030 2102 -7801 -2896 7629 5560 -5898 -6609 4571 7691 -1654 -8203 -194 8208 2000
2539B000r936L648J0432r05j0266j925R816M459p808p096N866Q721l186r824J268
$$ 2000 -7936 -4288 6144 5239 -5027 -6952 2864 7323 -485 -7581 -1715 7006 3820 -6004 -4736
2554d736R615K054r467m732Q364O758o385q780M117R811j630j0361j544J0355
$$ -4736 4879 6933 -2534 -7266 1098 7856 1471 -7309 -3192 6619 4989 -5372 -6916 3439
2568C439M260r386p030Q173Q555o118r426L445J0357m63j0658j529R368M697q418
$$ 3439 7699 -1687 -8717 -544 8011 1893 -7533 -4088 6269 5806 -4852 -6381 2987 7684 -734
2583g34o602O540Q454m666r099J847R326J17q647k660P215M967n325p261L384
$$ -734 -7336 -796 7658 2992 -6107 -4260 5066 5183 -3464 -6124 1091 6058 733 -6528 -3144
2598c144R046j629r357j107R337L867q288o081P199P629m378r290K222J0071j5
$$ -3144 5902 4273 -5084 -6191 3146 7013 -1275 -7356 -157 7472 3094 -6196 -3974 6097 6082
2613F082j0536k518R872M676q687o777P022Q184n112r009K363R697J48r060k636
$$ 6082 -4454 -6972 2900 7576 -1111 -7888 -866 7318 2206 -6803 -4440 5257 5405 -3655 -6291
2628f291Q273M577o604o456M506Q082k401q059l72Q244K532p354m978O216O255
$$ -6291 1982 6559 -45 -6501 -1995 6087 3686 -4373 -4745 3499 6031 -1323 -6301 -85 6170
2643F170l742q080J530R160K96r204k658Q887M518p766o442N811Q223l817q979
$$ 6170 2428 -5652 -4122 5038 5334 -3870 -6528 2359 6877 -889 -7331 -1520 6703 2886 -6093
2658f093J720R598O45r783k315Q752M544p118o570N636P079l222q091R24Q087
$$ -6093 -4373 5225 5870 -3913 -6228 2524 7068 -50 -6620 -984 6095 2873 -5218 -4294 3793
2673C793J512p232m023O427M879m425o399K592P216k42p600j744P088L960n713
$$ 3793 5305 -1927 -5950 477 5356 931 -5468 -2876 4340 4098 -3502 -5246 1842 5802 89
2688H9o298M751P964k844q652O59R137J317q909l705Q238M959o505o726M712Q067
$$ 89 -6209 -1458 6506 3662 -4990 -4331 4806 6123 -2786 -6491 1747 6706 201 -6525 -1813 6254
2704F254k899q680O28Q779J200q271k870P307M210n248o066L804O608j089p086
$$ 6254 3355 -5325 -4697 4082 5282 -2989 -5859 1448 5658 410 -5656 -1852 4756 3667 -3419
2719c419p61O194L319n996m426M300O184l037o621J75P572J272p129l197O170
$$ -3419 -4180 2014 5333 -663 -5089 -789 5395 2358 -4263 -4088 3484 4756 -2373 -5570 600
2734F00N337n179p130M157P848j926q879K60Q661K094q401l534O914N545n443
$$ 600 5937 758 -6372 -2215 5633 3707 -5172 -4912 3749 5843 -2558 -6092 822 6367 924
2749I24o367L468P398k053p692j73P520J910o504l715M744N451l622n917J601
$$ 924 -5443 -1975 5423 3370 -4322 -4495 3025 4935 -1569 -5284 -540 4911 1289 -4628 -3027
2764c027O323O03o010k671N808M244m978n615L666O623j640o680r82O966K636
$$ -3027 3296 3899 -2111 -4782 1026 5270 292 -5323 -1657 4966 3326 -3354 -4336 2630 5266
2779E266o549m478O206N603m585p599L309Q270j663q008o45P547K651p061m020
$$ 5266 -1283 -5761 445 6048 1463 -6136 -2827 5443 3780 -4228 -4873 2674 5325 -1736 -5756
2794e756N762N680m383o021K271O925p39o553j203O051K659m709m256L155N251
$$ -5756 6 5686 1303 -4718 -2447 4478 3739 -2814 -4017 2034 4693 -16 -4272 -1117 4134
2809D134j856n587m34O256K084o131l812N674M652l675o227K634O432m67p166
$$ 4134 2278 -3309 -3743 2513 4597 -1534 -5346 328 4980 1305 -4922 -2288 4144 3677 -3489
2824c489j270P189K629n980m377N133N881m152o648K768O806j032o890r00O338
$$ -3489 -4759 2430 5059 -921 -5298 -165 5716 1564 -5084 -2316 4490 3458 -3432 -4332 2006
2839B006K625n165m489M339N031k613n767Q26O136M69n379k563M776L975l315
$$ 2006 4631 -534 -5023 -684 4347 1734 -4033 -3207 2929 3398 -1981 -4544 232 4207 892
2854H92m916J794N821J6o407j301O057L091n848m165M361N517l401o348J560O842
$$ 892 -4024 -2230 3591 3607 -2800 -4101 1956 5047 -801 -4966 -605 4912 1511 -4837 -3277 3565
2870C565L57p099j681O593K901n343m163M597N278l240n781J428N687L76n469
$$ 3565 3922 -3177 -4858 1735 4636 -707 -4870 -273 5005 1765 -4016 -2588 3099 3475 -1994
2885a994j838M881L228l774m603K673M992j383n499k01N862J708n089l314L807
$$ -1994 -3832 1049 4277 503 -4100 -1427 3565 2182 -3317 -3518 2344 4052 -1037 -4351 -544
2900e44M316k414n576J365O241L10o232j955O099L310n160m477M001N197k473
$$ -544 3772 1358 -4218 -2853 3388 3698 -2534 -4489 1610 4920 -240 -4717 -716 4481 2008
2915B008n573Q46O242O27o330j954N396L276m592m519L559M754k109n112M46M918
$$ 2008 -3565 -2719 3523 4150 -2180 -4134 1262 4538 -54 -4573 -1014 3740 1631 -3481 -3035 1883
2931A883J362m276k868L879M085k776m930J875M751O4n071j631N070K332l800
$$ 1883 3245 -1031 -3899 -20 4065 1289 -3641 -1766 2985 3049 -2022 -3653 1417 3749 -51
2946e1m048L251M831j981n827M45N969J049n805j933M857L543m432m350L179N339
$$ -51 -4099 -848 3983 2002 -3825 -3380 2589 3638 -2167 -4100 757 4300 -132 -4482 -1303 4036
2962D036j864n026j18N239J431m980k714M655L587l750l852J644M723m33m841
$$ 4036 2172 -2854 -2972 2267 3698 -1282 -3996 659 4246 496 -3356 -1712 3011 2578 -2263
2977b263q22M468J972l956l445L121M709k345n064J483M657M71m436k368M468
$$ -2263 -3085 1383 3355 -601 -4046 -925 3784 1439 -3625 -2142 2515 2986 -1450 -3818 650
2992F50L476l781m357K958N026j355n631p1N734R47m893k358M050L411l152m415
$$ 650 4126 345 -4012 -1054 3972 2617 -3014 -3085 2649 3596 -1297 -3655 395 3806 654 -3761
3008c761J830N151r99m687n33M973J615m495k735L418L544k120l776K79N047M2
$$ -3761 -1931 3220 2221 -2466 -2999 1974 3589 -906 -3641 -223 3321 1201 -2575 -2296 2751 2793
3024B793m331j471L857K702l262l795K281M479j457m512k00M847J312m563k279
$$ 2793 -1538 -3009 848 3550 288 -3507 -1226 3253 1796 -2716 -2916 1931 3243 -1320 -3599
3039c599L875L370k890m109J578M752n51n085J42M397J570m015k906L446L496
$$ -3599 276 3646 756 -3353 -1775 2977 2426 -2659 -2517 1880 3450 -565 -3471 -25 3471
3054C471k776l469K45M968j7m268j358M227K466l768l056K105M145j203m124p8
$$ 3471 695 -2774 -2529 2439 2422 -1846 -3204 1023 3489 -279 -3335 -1230 2915 1712 -2412 -2490
3070b490M348J503m266k466L784L292l128l534J808M199n08m071j146L940K003
$$ -2490 1858 3361 -905 -3371 413 3705 577 -2957 -1149 3050 2542 -1529 -2675 1265 3268
3085C268l485l214L056L542k321l934J152M769n85m328q40L927K442l648k869
$$ 3268 -217 -3431 -375 3167 846 -3088 -1936 2833 2248 -2080 -2920 1007 3449 -199 -3068
3100c068K027M092j475m000J92M101J127m343j473L261K412k282l640J760L859
$$ -3068 -1041 3051 1576 -2424 -2232 1869 2996 -1347 -2820 441 2853 571 -3069 -1309 2550
3115B550q28l862k33L673J424l680k206K787L365k040l761J408L579J80l796j306
$$ 2550 1722 -2140 -2373 1300 2724 -956 -3162 -375 2990 950 -2811 -1403 2176 2356 -1440 -2746
3131b746L797K218l007l334K346L499j061m052N24L667P91m017j677L251K696
$$ -2746 1051 3269 262 -3072 -726 2773 1712 -2340 -1816 1851 2642 -1375 -3052 199 2895
3146B895l026k842J658L781p63l877j61L637J333l222j931K672K727j879l246
$$ 2895 -131 -2973 -1315 2466 1703 -2174 -2335 1302 2635 -587 -2518 154 2881 1002 -2244
3161b244R72L285q4l751n84L405J409k848k210K031K882j083l553K42L675P79
$$ -2244 -1272 2013 1929 -1822 -2406 999 2408 -440 -2650 -619 2263 1180 -2373 -2131 1544 2323
3177B323l339j644K794K658k665k716J764L522j323l307m5L724Q84l290j554K439
$$ 2323 -1016 -2660 134 2792 127 -2589 -825 2697 1374 -1933 -1978 1746 2630 -660 -2214 225
3193B25K763k427l075J454K704K0l561l42L294R01k567j763J947K616j145l289
$$ 225 2988 561 -2514 -1060 1644 1664 -1897 -2239 1055 1956 -611 -2374 -427 2189 1044 -2245
3209b245O53L130Q72l634n49K370J815k156k426J321L283p91l232p79L291J458
$$ -2245 -1592 1538 2410 -1224 -1773 597 2412 256 -2170 -849 2434 1643 -1589 -2368 923 2381
3225B381l035j921K508K400j860k970J014L508k42l286o26L071J334k318k396
$$ 2381 -654 -2575 -67 2333 473 -2497 -1483 2025 1783 -1503 -2129 942 2276 -42 -2438
3240b438K230K615j532l416J373K767L03k990p88K079J971j946k367J583K256
$$ -2438 -208 2407 875 -2541 -1168 1599 1902 -1088 -1876 203 2174 228 -2139 -556 1700
3255A700m12k900k1L033K30k323j548K268K379j525k980P98L183q6k924j010L032
$$ 1700 1288 -1612 -1633 1400 1630 -693 -2241 27 2406 881 -2099 -1301 1882 1796 -1128 -2138 894
3272H94J231k531j868K132K385j400k658N94K778J98l065n64K188J797j957k263
$$ 894 2125 -406 -2274 -142 2243 843 -1815 -1221 1557 1755 -1310 -1874 314 2111 154 -2109
3288b109J399K647j088k541L27K839J77k044j268J515K290j746k193O61K585K23
$$ -2109 -710 1937 849 -1692 -1365 1474 1651 -393 -1661 -146 2144 398 -1795 -1134 1451 1674
3304A674l098o16K697J725k612j911J686K717j164k966M77L128J58l127p92K789
$$ 1674 -1424 -2040 657 2382 -230 -2141 -455 2262 1098 -1868 -1391 1737 1895 -1232 -2024 765
3320G65J442k255j888J879J924q31k786L14K903L43k590j151K180J771j763j835
$$ 765 2207 -48 -1936 -57 1867 1036 -1750 -1436 1467 1810 -780 -1931 249 2020 257 -1578
3336a578O27K628o83j869n00J866J210j721j831J473K139r34k206J11K925N44
$$ -1578 -951 1677 994 -875 -1375 491 1701 -20 -1851 -378 1761 827 -1379 -1268 1657 2201
3352B201l034j104K278J627j792k120J082K642o12k711K62K295P04k511j169K304
$$ 2201 -833 -1937 341 1968 176 -1944 -862 1780 1168 -1543 -1281 1014 1718 -793 -1962 342
3368C42J331j745j816R22K418k13k310k70K358R33k125j638J935J319p02k009
$$ 342 1673 -72 -1888 -966 1452 1239 -1071 -1341 1017 1950 -175 -1813 122 1441 739 -1270
3384a270M29J634R07k349j450K344J419j423k196J245K057o31k432L77K285M10
$$ -1270 -841 793 1700 -649 -2099 245 1664 241 -1955 -710 1347 716 -1716 -1339 946 1356
3400A356j995r78K028J587j965j543Q00K391m85k321l15K609N16k379j037J686
$$ 1356 -639 -1617 411 1998 33 -1510 -710 1681 1196 -1125 -1440 1169 1685 -694 -1731 -45
3416d5J362r36j652K16K030J94j773j009K053R40j408j307O53K002n40j629l04
$$ -45 1317 381 -1271 -1055 975 1169 -604 -1613 440 1380 -28 -1335 -682 1320 780 -849 -1153
3433a153K046N53j597j561J805J805j498k076R70K443p25k282r9K128N02j635
$$ -1153 893 1446 -151 -1712 93 1898 400 -1676 -706 1737 1012 -1270 -1369 759 1261 -374
3449c74j174J104J936q86k503J095J977j75k000j48J766Q05j490r77R71J297m91
$$ -374 -1548 -444 1492 606 -1897 -802 1175 1000 -1000 -1148 618 1423 -67 -1044 -73 1224 733
3466G33j471k21J913K74j705j166J462J687j272j555N17K099o29j825Q6J778J111
$$ 733 -738 -959 954 1228 -477 -1643 -181 1506 234 -1321 -804 1295 666 -1159 -1073 705 1816
3483A816j822j752J905J801j488j842P86J677J8j817n70J799J004j877j194J289
$$ 1816 -6 -1758 147 1948 460 -1382 -596 1081 1099 -718 -1288 511 1515 -362 -1556 -267
3499b67J514o09j891L53K095n17j379l93Q96J419j015j245L15J977l51j343n81
$$ -267 1247 638 -1253 -900 1195 678 -701 -1094 -198 1221 206 -1039 -724 1253 902 -441 -1022
3516a022J832O37j566j197J540P17q21j256J55K031J92k052m41J365J374j768
$$ -1022 810 1447 -119 -1316 224 941 120 -1136 -981 1050 1242 -810 -1251 114 1488 -280
3532b80j551J399J619n61j797L42K024j95j355o59J417Q80q38j804J002J616p33
$$ -280 -1831 -432 1187 626 -1171 -829 1195 1000 -355 -1014 403 1283 445 -1359 -357 1259 526
3549E26j498J15J262N06j171q29R26J137m06j740M81J660J90j591m94J232J044
$$ 526 -972 -857 405 911 -260 -1089 -163 974 568 -1172 -691 969 1159 -432 -926 306 1350
3566A350j294j330Q24J700q42j423J75J916j53j496m67J261Q85r85j174P75J203
$$ 1350 56 -1274 -450 1250 408 -1015 -840 1076 923 -573 -1040 221 1106 121 -1053 -278 925
3583I25l93j437l7J300J46j012p48J373J265j450j015K82J806l31j494j03J398
$$ 925 532 -905 -942 358 504 -508 -1256 117 1382 -68 -1083 -801 1005 674 -820 -923 475
3600D75O67j081j241Q93J633o28j517r4J663P9j501n19J498O68j061j241P66J441
$$ 475 1142 61 -1180 -287 1346 718 -799 -893 770 849 -652 -1171 327 995 -66 -1307 -541 900
3618I00k64j481R6J145P77j770m05J112R38j086q53O34J215l05j440m18J423P72
$$ 900 636 -845 -749 396 1173 -597 -1002 110 1048 -38 -891 -257 958 653 -787 -1205 218 990
3636I90r79j041P31J189p52j041j79J548K41j211m43J314M39l45j675P94J383
$$ 990 11 -1030 -299 890 138 -903 -1082 466 707 -504 -947 367 806 461 -1214 -420 963
3653I63q0j659m2J468J72p54j128J176J055j052j256Q61J166m75j216k26J463
$$ 963 883 -776 -818 650 822 68 -1060 116 1171 119 -1137 -276 890 415 -801 -1027 436
3670D36M17q26j010P44J125o13j021M72Q69M7p35r16J267P62p58j244N99J235
$$ 436 853 27 -983 -239 886 273 -748 -276 593 640 -95 -1011 256 1018 260 -984 -385 850
3688H50m85j088k25J054J000j734o68J238J210r22j206M29J550m56j147Q1J227
$$ 850 365 -723 -948 106 1106 -628 -1296 -58 1152 230 -976 -547 1003 547 -600 -519 708
3705G08K95j327o23Q92Q91o56r29P1J423K90j497q14J678O23j096q53M62Q88J83
$$ 708 1003 -324 -947 -55 836 180 -749 -678 745 1035 -462 -1276 402 1025 -71 -924 -462 426 609
3724F09j547J03J149O96r23j084J236L39m83q90K84J352l75q82N9P12L73r03p59
$$ 609 -938 -835 314 1010 87 -997 239 578 95 -795 -511 841 466 -416 -357 355 728 -175 -934
3743i34R75N81l23j257M67Q28L10q55m70R33J18m73o89N08J136j12j186J43R68
$$ -934 41 622 299 -958 -491 337 647 -208 -678 255 373 -100 -789 -281 855 743 -443 -300 668
3762F68J55j176k02O89Q34q93l87j42J001J07j216l18J144M54j144n06J031L55
$$ 668 823 -353 -555 134 968 75 -312 -454 547 654 -562 -880 264 718 -426 -932 99 454
3780D54m39o34P9J148j96n81l50Q41Q23j047m93M25N43N1j186k27J304K7p54o51
$$ 454 15 -619 -540 608 412 -169 -519 322 1145 98 -395 30 573 624 -562 -789 515 542 -212 -863
3800h63N23J105o76j215P50Q13k65p41M0R64N51j103k86K60J049n78j142N28O56
$$ -863 -340 765 89 -1126 -376 437 172 -569 -529 435 986 -117 -403 -143 906 328 -814 -286 370
3819C70K43j101o9R96L42r80k36M76N22m60k07n61Q74M03p46p11R09Q19q57p09
$$ 370 613 -488 -557 439 781 -199 -435 41 563 103 -104 -665 209 612 -134 -845 64 883 26 -683
3839f83K84Q99Q6j201L36N80N69j023n38R39N66o96q22O46Q63o22l65l24O55M52
$$ -683 -399 500 586 -615 -279 301 870 -153 -691 248 814 118 -704 -58 805 183 -182 -506 149 601
3859F01j240J2L78R47m86r66M06O16L09r26j40N80M81m56n83J59R35M6j019l24
$$ 601 -639 -627 -249 698 212 -754 -348 268 577 -349 -489 91 572 116 -467 -308 627 673 -346 -670
3879f70Q08O44q40p21O12Q98o38q67L15P60L3n56n46J010N96q66n77N28Q87p93
$$ -670 138 782 -58 -779 -167 731 93 -774 -459 301 334 -222 -768 242 838 -28 -605 -77 810 17
3899A7k40LQ10k22o99j37P15J97n54m39P01N56k61r44J65N33R0l42o10P52M92
$$ 17 -223 -220 590 368 -331 -468 247 444 -110 -549 152 708 447 -497 -332 201 291 -51 -661 91 583
3920E83o85m19M56N18J21q31l83Q46K94k40j040M15J251r02k16m59J278J09q29
$$ 583 -102 -521 -65 453 574 -257 -640 206 500 260 -780 -365 886 -16 -232 -691 587 696 -133
3939a33m41P56J88p48j22N23N33o6j235K83M83O25q50p15P93O92n95n29K03R74
$$ -133 -574 182 370 -378 -500 23 556 490 -745 -462 21 646 -204 -919 -126 566 -29 -558 -355 619
3959F19n03l75L9O08n9k65n67N08M43K05j101k34J019J95j089K9N79L2k99l96
$$ 619 116 -259 -220 388 329 64 -503 5 448 653 -448 -682 337 532 -557 -528 51 83 -216 -612
3979f12N82N26k21o33L65J51L62r03n2O10L11o0n92n61R31Q0o43m24P67O87n91
$$ -612 -30 496 275 -358 7 158 520 -383 -435 175 486 426 -166 -727 204 284 -359 -783 -16 671 80
4000H0l46Q0M77m14K9l15N97L81n10n17L46P96m47p27L28M62k57j75p3N80k14
$$ 80 -266 -186 291 -123 -94 -409 188 569 59 -458 -112 684 237 -490 -162 300 43 -132 -205 375 161
4021A61l10m75O42M20m39k46O23J8l45j93q3N14J90k13n53K23M56q5n27k25Q77
$$ 161 -149 -624 18 438 -1 -247 376 394 49 -144 -227 287 477 264 -289 -66 390 305 -222 -447 430
4042D30k96K1o00O00Q5K5o26L61N39n79l82J27O41M3r31K13N78k35k6j62J26O51
$$ 430 134 155 -445 155 240 265 -361 0 539 -40 -422 -295 346 389 -542 -329 249 14 -12 -174 -48 603
4064F03qr52J26L52K58k70l24p5M32k37m42K65L51J34l46j41J46Q13m88k75o9
$$ 603 595 -357 -231 121 379 109 -215 -290 142 -95 -537 -272 79 213 -133 -274 -128 685 197 -78 -147
4085a47K53j8l91K4K69L00j37l10K31L84m72l20P6M21j12l59Q1M94j41l51M3k6
$$ -147 106 88 -303 -279 -10 290 153 -157 74 458 -14 -334 -258 163 51 -308 -227 267 126 -225 -182 -208
4107b08O10k35n61L60J16J06j40M9K15j62k7l40L68J51on97j49O32L41l54k59
$$ -208 402 167 -394 -34 82 188 48 97 312 150 123 -217 151 302 296 -301 -450 182 523 169 -90
4128i0N4K58n16j92M26K88j1m31j51M78N9l04n27N34Q37n65k91n5L91J78o89K26
$$ -90 -36 222 -294 -486 -60 228 217 -214 -365 113 172 -132 -659 -125 712 147 -144 -199 192 370 -319 -93
4150i3J04K59l9k69J71M30k60o88J46N70o4m79J50M91j58l42K23j13M56K44r02
$$ -93 11 270 231 -38 133 563 303 -385 -239 331 267 -212 -62 429 271 -71 152 39 495 739 -163
4171a63n6K44K01k68j32P4K88l16r2L2L59j42q3l55L18L24p9o56J63N74m5q64
$$ -163 -219 25 226 -42 -174 -100 188 -128 -220 -188 171 29 -54 -409 -91 233 154 -502 -339 235 190 -674
4193f74M42M55j15m27K67J85r5m21K44J95M32k17n68lO71k35m3k4j88L02j90k60
$$ -674 -232 223 108 -319 -52 133 38 -383 -139 56 488 271 -297 -300 371 136 93 69 -119 183 -7 -267
4215b67K9N34J74n95N4J63j03j35m51M05M65j03n80N15K43J79n32J33j27l1P2
$$ -267 -238 296 470 -125 -71 92 -11 -146 -597 -192 273 170 -410 105 348 527 -5 128 1 -30 42
4236D2j45J7J97O6m69L35N1J06n6k59J68J07p9l06K4N24j85L6n58P84m5n56q6
$$ 42 -103 -86 111 177 -292 43 94 200 144 -115 53 160 81 -225 -201 323 138 174 -384 400 355 -201 -287
4259b87J61O09k62l24q2M90p7n16j07O66Jm32j73J76N70k26l37L2O3M36l11l85
$$ -287 -126 483 221 -103 -185 305 228 -288 -395 271 272 -160 -333 -157 413 187 -150 -118 -55 381 70 -315
4281c15O00l96K13r1j57L70q3k95r5m5O58m76l1j01M09j4m99J33P6K6M58n12l2
$$ -315 285 -111 102 11 -146 224 141 -154 -249 -294 364 -112 -143 -244 165 151 -348 -215 -139 -113 345 -167 -199
4304a99O30k05m49J19L26j42J88m08K54J18k29J04k52L29M2l00J97R3k22m94N58
$$ -199 431 226 -223 -104 222 80 268 -140 114 232 3 107 -145 184 226 -74 123 216 -6 -500 58
4325E8%m3P2o04P82n20M89n20K94L00l7k81j50L35j46L58p94L25R5k7P0Mr7J17
$$ 58 58 15 87 -517 265 -255 234 -286 8 308 271 -10 -160 175 29 387 -407 -82 13 -14 56 60 -37 80
4349H0K57n77j24L44J13j54q1L77m31j8K11O0k54K53K58k78j0L94m83k04N76o68
$$ 80 337 -240 -364 -20 93 -61 -142 235 -196 -214 -3 57 -197 56 314 36 26 420 -63 -267 309 -359
4371c59L14j36K31J38Q3n58J88p5L74j43r8o5N84o34j71M13m03J94K59r0L14l30
$$ -359 -45 -181 50 188 271 -287 -99 -174 200 57 -41 -106 478 -156 -327 86 -317 -123 136 46 360 30
4393C0j55J19L6j59J46O8n1K23l31J57j69J72N6l23K48K7m1l4l57N1M93o1p2l98
$$ 30 -125 -6 30 -129 17 85 34 257 -74 83 -86 86 142 -181 67 94 53 19 -338 -287 206 145 73 -325
4417c25N27j39J92n31L56j31k07L32j2J9l8o1K3j6K02j87k26J70m3L7l91L33K92
$$ -325 202 63 255 -276 80 -51 -258 74 62 81 43 -18 5 -11 191 4 -222 -52 -95 -58 -449 -116 176
4440A76Lk32j19L56m31L59j75J75j7j61o85R68j25K32j87j70j00J43k40L6J44
$$ 176 179 -53 -172 184 -247 112 -63 112 95 -66 -751 217 92 324 137 -33 -133 10 -230 -194 -50
4461e0K4K2m12M20K2K23j96j13L78l42L87j72L3j29P2l55J24j72K25K05n45J73
$$ -50 -26 -4 -416 4 26 249 53 -60 318 -24 363 191 224 95 167 -188 -64 -236 -11 194 -351 -178
4483a78N69p8r4l83M41j97j25J52k15M51k98j25l25O02m6Q1j31j09L37m92J93
$$ -178 391 313 219 -164 277 80 -45 107 -108 343 45 -80 -405 197 151 232 101 -8 329 -163 30
4504C0K49q2k83j25N3J3J69k54Q8K38K4o6j27J56K69l77K64j63j8K19p43P63n88
$$ 30 279 197 -86 -211 -158 -145 24 -230 -142 96 120 54 -73 83 352 -25 239 76 58 277 -466 297 -291
4527b91L93p4j31J06j93j0Q1J52M4N9n03L81j35L6r1R3J66J39j36j21r7o1L51
$$ -291 102 28 -103 3 -190 -200 -119 33 77 136 -367 14 -121 -85 -176 -83 83 222 86 -35 -132 -193 158
4550A58j94mJ47r9o4J47L23k88J5l02j80N7J80L69l97R8k55M38n4J34n01M40j80
$$ 158 -36 -40 107 8 -56 91 414 126 141 -161 -341 -284 -104 265 -132 -34 -289 149 95 229 -272 168 -12
4573a2j4j69J62L33m91Q6L26k66j3M0L98o12L32J20k49K29l13m0J03n0J25J50
$$ -12 -26 -195 -33 300 -191 -105 221 -45 -58 -18 380 -232 100 220 -29 200 -113 -153 -50 -100 25 175
4595A75k54R8n5JJ58l48J02mK05k04J85j37J47j87J89l2j33P6K17l0J5j39j22
$$ 175 -79 19 -36 -35 123 -225 -123 -127 78 -126 59 -78 69 -118 71 39 -94 -18 199 169 184 45 -77
4618g7Q3J9r2J90j36q7J47k79K97j10K15o0r3o5N8M9j26P7K56l7j76K56n35O8
$$ -77 6 25 -67 123 -13 -100 47 -232 65 -45 170 110 17 -48 10 59 -67 10 266 229 53 309 -226 -158
4642a58j11O8J96k46M59K9p06L04K18rJ11J03j98j51k7J7K24j77pK03k77K15p5
$$ -158 -269 -201 -5 -251 208 237 -469 -165 53 44 155 258 60 -91 -118 -101 123 -54 -61 142 -135 80 5
4665EJ86J25O5k55j4j81n7M1r5M26l12j66L24P4k34O8K58l61J68r3J58l75M2R5
$$ 5 191 316 381 126 112 -69 -126 -85 -180 246 -66 -232 92 166 -68 0 258 -103 65 -28 130 -245 -203 -108
4689a08j78L91K27j31k60R8N2j32j78jJ64J4r5KL14k26m2K89n17M7o3O2J27M02
$$ -108 -286 105 332 201 -59 39 91 -41 -219 -220 -56 -42 -137 -135 179 -47 -89 200 -317 -270 -333 -271 -144 258
4713B58k42l31L71j77nK48o0n2m5K3o7j73L66k29L15l98L33n5K15l76j92L76K5
$$ 258 16 -315 56 -121 -126 122 62 10 -35 -12 -79 -252 114 -115 200 -198 135 80 295 -81 -273 103 128
4736A28j72k38K40J52J39j76k93N02m43L87j98j22M16n06K54L21j65l33J34k17
$$ 128 -44 -282 -42 110 249 73 -220 282 -161 226 28 -94 322 -184 70 391 226 -107 27 -190
4756a90j7L36m56K30L4J33k62n0J67J47m8J07L3j64P4J14l56L59k71j16P0p2J28
$$ -190 -207 129 -327 -97 -63 70 -192 -242 -75 72 24 131 164 0 74 188 -168 191 -80 -196 -126 -198 -70
4779g0O0K3r4J47j37L79l23o4O4O4k68J86K37l23J51j81K80J23k24R1K0q5K93
$$ -70 -10 13 -81 66 -71 308 -15 -79 -15 49 -219 -33 204 -119 32 -149 131 254 30 121 141 56 349
4802C49m96J13o6L71j14l88L47K6K20l41J00m8P3j89j77q7J91P7j3r6N81n67J65
$$ 349 -147 -34 -100 271 157 -231 116 142 362 21 121 73 146 -43 -220 -307 -116 -39 -52 -148 433 -134 31
4825C1L82m85J40MO5j24j83R5jO1J34k29J73j12j8K06p6k18L05L4j14P2j50J02
$$ 31 413 -72 68 72 137 13 -170 -75 -76 -15 119 -110 63 -49 -67 139 63 -155 150 184 70 142 -8 94
4849I4r9j00MK22k11lJ91L7j87L2j91M6l10O13l78K78J49j42j52R9r8P3m9Q9j95
$$ 94 -5 -105 -101 121 -90 -93 98 135 -52 -20 -211 -165 -475 138 -240 38 187 45 -107 -8 -106 -33 -82 7 -188
4874a88L98k32K88J19n28L95k16l8j08L19l09k3L01J58m08j58J10M32l92ok66
$$ -188 210 -22 266 385 -143 252 36 -2 -110 209 -100 -123 178 336 -72 -230 -120 312 -80 -86 -352
4895c52O27k01p1J3q1%k38J08K94L3k08J06m24P6O06l74J96l71K18J98q3j27M28
$$ -352 275 74 3 16 -65 -65 -303 -195 99 132 -76 30 -394 -318 288 -86 110 -261 -43 155 72 -55 373
4918C73k86ll68M40jn6k27J82m9J21M4m19L85o8L02l50j31k03L54k40N6L89n17
$$ 373 87 84 -284 156 155 99 -128 54 5 126 170 -249 136 68 370 20 -111 -314 40 -200 -144 245 -272
4941b72L40oj81m0Q9k63K49J01J70j16P0n11N10k88L76k13j58J19M1l59K6L59
$$ -272 68 62 -119 -159 -70 -333 -84 17 187 71 141 -370 140 -148 228 15 -143 -24 17 -342 -316 43
4963D3N2l54L00k86M65j58j18K33l87L21J00k72M26l28q9k7L08k98K95r1o1K43
$$ 43 95 -259 41 -245 220 62 -56 177 -210 111 211 -61 365 37 -52 -79 229 -69 226 135 74 317
4985C17l24K18j18J36n2l7k11J15lk84K36j2K56m00K3J60K14m06o9R4J29L22k13
$$ 317 -7 211 93 229 177 140 -71 44 41 -243 -7 -19 237 -163 -140 20 234 -172 -241 -147 -18 304 91
5008I1o22M98K1q8K04m3o0j94R7k3R5r1J23l41K2L45O26r22M2M04l1k42J1K87
$$ 91 -531 -33 -12 -100 104 61 1 -193 -96 -119 -24 -115 8 -333 -311 34 660 -262 -220 184 153 -89 -78 209
5032B09n28M75r6n8k27K56M11l82p7O7k26J18J82j30k33N43Q2k55R9m36J83J85
$$ 209 -319 156 60 2 -225 31 442 60 -17 50 -176 -58 124 -6 -239 304 386 131 230 -206 -23 162
5054A62J18o44j93N97o8L6N5j80K94n74L65j21K58j76k32K63l6J07j95R2r2M42
$$ 162 280 -364 -557 40 -28 8 63 -117 177 -397 -32 -153 105 -71 -303 -40 -76 31 -164 -72 -164 278
5076B78j87j59q0J5J05K81l01J68j86J60m9NJ65K08m38k41O34j50k57Qj06K11
$$ 278 91 -68 -148 -133 -28 253 -48 120 -66 94 45 50 215 423 -15 -256 378 228 -29 -21 -127 84
5098H4pn0k85J08M90m93K47k9J22m91M23J52l47j15L81k52k17L53m6p4j68J19
$$ 84 77 27 -258 -150 340 -153 94 65 187 -304 119 271 -76 -191 190 -62 -279 74 28 -46 -214 -95
5120i5P7j08J99q6J54m08K95p0J24J98k54j44k09L82k30L34m51K52lR6J7M0r1
$$ -95 -18 -126 73 -13 141 -267 28 -42 82 280 26 -118 -327 55 -175 159 -292 -40 -43 53 70 110 19
5143A9j3j95N3N64l32j39J48k87K13L3K23j97L4j98K99J21m62RPp5o6K13k18L05
$$ 19 6 -189 -136 428 96 -43 105 -182 31 64 287 90 124 -74 225 346 -116 -107 -100 -175 -241 -28 -246 59
5167E9j9l51J2q8M58j82j02M51l74J94j4j38J82j7j75J33k34J24J9j56M18k45
$$ 59 40 -311 -299 -387 71 -111 -213 238 -136 58 44 -94 88 71 -104 29 -205 -81 -62 -218 200 -45
5189d5N3K24k50l17O30k62M2l31L66k25J47J14k47N2Q4L1m32K98p8J31k9N49m95
$$ -45 8 232 -18 -335 295 33 75 -256 110 -115 32 146 -101 -49 35 66 -366 -68 -146 -15 -44 505 10
5212A0k41N77l04P4n8j64j74J79O1L66m87K40l35M56k9l89n3L03%kNk29P8oQ2
$$ 10 -231 346 42 116 58 -106 -280 -101 -40 326 -161 79 -256 200 171 -218 -271 32 32 30 35 -194 -116 -122 -40
5237d0M98l04j13k73Q6J72qj01J03L09k59o0J38r4j81l1j43P9M93j51J70k94j24
$$ -40 458 154 41 -232 -146 26 18 -83 20 329 70 10 148 54 -127 -158 -301 -222 271 120 290 -4 -128
5260a28N7M5p0j37M19n9m13N02m88L45j47%P3j83j49K00K19O3l15J05k57K30K36
$$ -128 -71 -26 -96 -233 186 127 -286 216 -272 73 -74 -74 -1 -184 -333 -133 86 149 -166 -61 -318 -88 148
5283A48k95O3j48K25K6K7m22M93J3l44M4L29K9J8o9K40l23J84j95j7j14n9J57
$$ 148 -147 -84 -232 -7 19 46 -376 117 130 -214 -170 159 188 206 137 377 54 238 43 26 -88 -147 10
5306A0k0k91M84j01k88L12j59J40l10K20J48l82L16K17j48j93k45K15K4M52k77
$$ 10 -10 -301 183 82 -206 106 -53 87 -223 -3 145 -237 79 296 148 -45 -290 -75 -51 401 124
5327A24n48L44L01m14J80K55m88L8J36J80k54J76k52l1M51k32jP6P8j40K60j70
$$ 124 -424 -80 221 -193 -13 242 -246 -208 -72 108 -146 30 -222 -253 198 -34 -35 41 119 -21 239 69
5349F9P2J16K9k43j36N8L38l80N8m7k4K52j84%o5J42J18K4j91j72L5R6J11j69
$$ 69 141 257 286 43 -93 -35 303 -77 -19 -66 -90 162 -22 -22 -87 55 173 197 6 -166 -131 -35 76 -93
5373i3l3K26j70JL14k34n8J37r0J7j18P4K84l36l87J52J34Q6L41k64J38K02j46
$$ -93 -126 100 -70 -69 245 11 -47 90 0 17 -101 -27 257 -79 -466 -314 -180 -94 247 -17 121 323 177
5396A77k91J13r5L0K07j13j90j62L64q0j58M62N7J09p44R4J65L83j84j56N3J56
$$ 177 -114 -1 -96 -66 141 28 -162 -324 40 -40 -198 264 321 430 -314 -220 -55 328 144 -12 41 197
5418A97j90p3J93p2k01N8N6J64k72Q4j02O7Nj49J49m4L03j31j96L0J42J12jn01
$$ 197 7 -66 127 55 -146 -88 -32 132 -140 -56 -158 -91 -86 -235 -86 -130 173 42 -154 -124 18 130 129 -372
5442c72K74J32L66m13qJ49k7k02K71k02J23j14N2j47M72P3o94L51J50l60K51q9
$$ -372 -98 34 400 -13 -21 128 101 -101 170 -32 91 -23 29 -118 354 427 -267 84 234 -126 125 36
5464C6j61M94j99k81Q9J01p0j29J45J29j53J29k84J10J27m90P17k74j2O7n8J67
$$ 36 -125 369 170 -111 -22 79 9 -120 25 154 1 130 -154 -44 83 -407 310 36 24 91 33 200
5486B00k33K60n53L36kJj56q1L43j48j8J28j35P3L7j07q1M46l15O8L4k87L04K39
$$ 200 -33 227 -326 10 8 9 -147 -228 115 -33 -51 77 -58 15 52 -55 -136 310 -5 63 97 -190 114 353
5510C53n16J74R6k6j63P8q7L01k49J07O2q5j78K17k47l2J32k05K3J27J63o2m7
$$ 353 -163 11 107 81 -82 -4 -91 210 -39 68 130 45 -133 84 -163 -195 -63 -268 -245 -118 45 -17 -64
5533f4J80O1k06J2q9K05L8K22n69j92M28Q6k40J10K23j15j70J19o1k7J83rj49
$$ -64 116 177 -29 -17 -106 99 137 359 -210 -402 26 112 -128 -18 205 90 -80 39 -22 -49 134 125 -24
5556b4J13K15l88j00L17k22KM4k45M68J17k41n3L7R0J40l15j01J96j58p6l6N42
$$ -24 89 304 -84 -184 133 -89 -87 -43 -288 180 297 56 3 40 130 270 -45 -146 50 -108 -184 -220 322
5579C22l31K5K4j1j36K29r4j54J17j35k47nM87k10J41j02K06N7j18j3j34M8J36
$$ 322 -9 16 40 29 -107 122 28 -126 -9 -144 -391 -396 91 -119 22 -80 126 183 65 52 -82 -34 102
5602A02J60oj07j5m68K67N8K70m98K59k85L47L08k14m4K35m74J78j98K47j77j59
$$ 102 262 256 149 134 -334 -67 -9 261 -237 22 -263 84 392 178 134 369 -105 73 -125 122 -55 -214
5624b14K45k69L83k53K26k57J69k26L68o21O60j83J2n6o5M43m04k3K46l45J32
$$ -214 31 -238 145 -108 118 -139 30 -196 172 -449 211 28 40 -16 -81 362 -42 -65 181 -164 -32
5645c2J46m8N7k6J35j65o14M39O31n24J2R2k54L09k35R9J57J31l76M3J24j22K63
$$ -32 114 66 123 97 232 67 -547 -108 523 -1 11 103 -151 158 -77 22 179 310 -66 -23 101 -21 242
5668B42m38r0J80M24o58L73J60k70q9K82n72N87j44q5k81K65J39l9j89K22k36
$$ 242 -196 -286 -106 318 -340 33 193 -77 -166 116 -456 131 -13 -98 -379 -114 25 -14 -203 19 -217
5689b17J75K47l07O80l98k51l75O12r2J44k95j4J68n0L70m29K12j33m2r3P9K74
$$ -217 -42 205 -102 578 180 -71 -446 166 74 218 -77 -91 77 27 397 -32 180 47 5 -88 -9 265
5711B65J82n89L34k18O2l62K88K43j53k50p8M01r4J05k05J2L14l62O6J6M1Q7j2
$$ 265 447 -142 192 -26 36 -326 -38 205 52 -198 -276 125 31 136 -69 -57 257 -105 -39 -23 18 105 93
5734I3l02K08q3k32K20K5Q7q2k79J96Q9L45k94N0m2j00L64k32p2r3N46l74om44
$$ 93 -209 -1 -84 -316 -96 -71 16 -66 -345 -149 -60 285 -9 41 -1 -101 263 31 -41 -134 412 38 32 -412
5758d12O52l32J6k12K32L25n37K66k73M34k33J1J85K09l16J0q8O6J33n0J20pj60
$$ -412 240 -92 -76 -288 -56 269 -268 -2 -275 159 -74 -63 122 331 15 25 -63 3 136 86 206 199 39
5781C9m8M7j39O6J96j80r9L49J63m35L5P0J20l3k90J48L58l7j21k97PK46k55K43
$$ 39 -9 38 -101 -35 161 -19 -118 231 394 -41 -6 64 184 151 -139 9 367 330 209 -88 -81 165 -90 153
5805A53K2j06l80N08Ll38J84p7l1r4NL99l40j88oK82k06L49r0j13n6L3M7p4N3
$$ 153 175 69 -311 197 200 -138 46 -31 -62 -156 -151 248 -92 -280 -286 -4 -210 139 49 -64 -120 -87 -40 -114 -61
5830f1k51L36J42j53J04ql71k26L08J46j27J33l18j88L70L70k60r4J91R5j42j24
$$ -61 -312 24 166 13 117 109 -262 -488 -180 -34 -161 -28 -346 -534 -164 206 -54 -148 43 138 -4 -128
5852a28m7P9J22O7m92Q86m85J69RK1l67N99m29J03Pj78Q2j3J1j69N55m68J03K79
$$ -128 -175 -96 26 93 -399 487 2 171 180 201 -166 433 4 107 114 -64 18 5 16 -153 402 -66 37 316
5876C16l53R4j73j13L72NN3k15O0L58j96l50J46q1n5k46qp8K95N83n40J07L33
$$ 316 -37 57 -116 -229 143 148 201 -14 46 404 208 -142 4 -77 -132 -378 -386 -464 -169 414 -126 -19 314
5899C14n96J46L87l73j07K44n6K45P6n20R6L44k33JO7m3L06l73K4O5L76k02j15
$$ 314 -282 -136 251 -122 -229 15 -41 204 280 -240 -144 200 -33 -32 35 -8 298 -75 -51 14 390 188 73
5922G3J6l8k33K54k35K46J07L0l31k79M71l81L07l27K0K40N90m60j18o0Q4r1L09
$$ 73 89 51 -182 72 -163 83 190 220 -111 -390 81 -300 7 -320 -300 -60 530 70 -48 -108 -24 -115 194
5945A94o2m7q8P7m14M49J35k2j37J10n90K25K14k48M51k54J52o1j17J36J41r5
$$ 194 132 85 -3 74 -340 109 244 222 85 195 -395 -170 44 -204 247 -7 145 84 -33 103 244 149
5967A49K70k94l9L31m37J03j14p8l8R7K26j08k97L39k27K99m57o5N88j9r7k22
$$ 149 419 125 86 417 -20 83 -31 -109 -147 -50 176 68 -229 110 -117 182 -275 -340 248 229 132 -90
5989i0J80J34nj58n6J94j74n1k79M49k07K2j05k5M35j37Q2L0n7l25M1j4O6K97
$$ -90 90 224 219 61 5 199 25 -26 -305 144 -63 -41 -146 -171 264 127 209 239 182 -143 -102 -116 -50 247
6013B47J05n71M14k4j53M03m96q4M8N3j7R8J37N7k79k24M15K1O9j77M1p0j45n
$$ 247 352 -219 195 171 18 421 -75 -159 -111 -58 -75 23 160 217 -62 -286 129 150 219 42 83 13 -132 -137
6037a37J02M8J07k99Q4M96k63m65J36M4L15l70L06J39j05p2l29K96J04M1l01K24
$$ -137 -35 13 120 -179 -95 401 138 -327 -191 -147 168 -202 104 243 138 66 -263 33 137 178 -123 101
6059A01J75n55L85k20K74j67l36J83K12r5j04L46j02P5Q0p5k20N1L05l34j25k00
$$ 101 276 -279 106 -114 160 -7 -343 -160 52 -43 -147 199 97 172 252 177 -43 8 313 -21 -146 -346
6081c46M50Q6k85j22L47j66K21l76J66p7l5J5K58K11j23k03j98n3N05k09m8l3
$$ -346 104 190 -95 -217 130 -36 185 -191 -25 -102 -137 -122 136 347 224 21 -177 -230 275 66 18 -15
6103a5L19j60o8J51j96J34o25N55k12L87k52O4J94m90M39l15K39K5k26J53k91
$$ -15 304 144 76 227 31 165 -460 95 -117 270 18 82 276 -214 225 -90 149 174 -52 101 -190
6124a90L20o4L7l33k2K70K17J59o63J76P5j07Q2j82K63J06l40K57k87J68J08k
$$ -190 130 66 103 -230 -252 18 235 394 -269 -93 -18 -125 -43 -225 38 144 -196 61 -226 -58 50 48
6146D8p4k82L22L32l60J57M9m19K85j4l01M13k19Q4K16j23k46j97P06l31r6j32
$$ 48 -26 -308 14 346 -14 143 192 -227 58 44 -257 156 -63 21 237 114 -132 -329 377 46 -50 -182
6168a82j95J63L56j42J13l57K7J38K78j87j46L84l20L6L38k63m39P9K32K57p9
$$ -182 -377 -214 142 0 113 -244 -217 -79 199 12 -134 250 -70 -34 304 41 -398 -319 -87 170 91
6189I1j34j55J18j43NJ9O44l96k75K63q5K05r9n8m4j46J06k09K09K0L52k97k90
$$ 91 -43 -198 -80 -223 -218 -199 445 49 -226 37 -48 157 58 0 -44 -190 -84 -293 -84 -64 288 -9 -299
6212b99J70K53K71k65p8l1N6l01K51j28K95m05K50k32L69j84o4J79k44M50m19
$$ -299 -129 124 395 130 52 21 77 -224 27 -101 194 -211 39 -193 176 -8 -72 107 -137 313 -106
6233a06j47q3L25J05o60M15K20o4m13L68J97k08J51k33Q3K58Jl29O3j58K65l91
$$ -106 -253 -336 -11 94 -566 -151 69 5 -408 -40 157 -51 100 -133 -50 208 209 -120 -57 -215 50 -341
6255c41m4M93j80J29j37K06M7j06k59M07Qj50n5J26J18l29k16L68l13K59J31o8
$$ -341 -385 108 -72 57 -80 126 173 67 -192 215 223 73 18 144 262 -67 -283 85 -228 31 162 94
6277I4NN0n6j38J01l4j83J01k66N36m58J88j67K00L6n1K92n0j94P4J33l32J02
$$ 94 99 149 93 -45 56 22 -161 -60 -326 210 -248 -60 -227 -27 9 -42 250 200 6 80 213 -119 -17
6300a7k03L84O5k68J88l8l13k23P56m96L03n50L64m30M80k27j02L30k62M80j73
$$ -17 -220 164 229 -39 149 111 -202 -425 331 -165 138 -412 -48 -478 2 -225 -327 3 -259 221 48
6321D8J18J00k96j00J28R9j83Jj07j42L03J24q2m7N6j81MQ2Q2q8P4k40O6K91k04
$$ 48 166 266 -30 -130 -2 97 -86 -85 -192 -334 -31 93 11 -36 20 -161 -157 -75 7 -81 -7 -247 -181 110 -94
6346i4K30j48k34K61j44J99k46K6J56k02m2J49K22L44p40L14N0pl6J03J8k02K86
$$ -94 136 -12 -246 15 -129 70 -176 -150 6 -196 -238 -89 133 477 -263 51 101 94 58 161 179 -23 263
6369B63l98L23k37L37l40k19N9L74l30L21k3j43n7q6j33N59j13r7j48M80p8l25
$$ 263 -135 188 -49 288 -52 -271 -212 162 -168 153 130 -13 -70 -156 -289 270 157 60 -88 392 314 -11
6391a1k49n9M07j98k27K91N00l80k74L76k92L95k9l59k20J78k1N2K47k9J7j42
$$ -11 -260 -319 88 -110 -337 -46 454 74 -200 176 -116 279 250 -109 -329 -151 -172 -120 127 98 115 -27
6413b7k9K99J95l71r6J13k53K13k91M40l26j27L48j93O4J04j95J88J9P5r9J00
$$ -27 -56 243 438 67 -29 84 -169 44 -247 193 -133 -260 88 -105 -41 63 -132 56 75 150 51 151
6435A51j81k67N39r5m26K83ol1J04j33J13N7k15j6j29L2M85j34j37J02K49j99
$$ 151 -30 -297 242 147 -279 4 -2 -33 71 -62 51 108 -107 -123 -252 -220 265 131 -6 96 345 146
6457A46k32p4j97M94N9l07jj9L17l34j21K77k37J42N7k14J52r8L46l96l08N61
$$ 146 -86 -160 -357 137 196 -111 -112 -131 186 -148 -269 8 -229 -87 -30 -244 -92 -190 156 -240 -548 13
6479A3L4l34L96j63K3l6M10n12N9lJ43r8j2j46J11J73k17R4j18L41l37LJL91k8
$$ 13 47 -287 109 -54 -31 -67 343 -169 -110 -113 30 -68 -80 -226 -115 58 -159 -65 -183 158 -179 -176 -175 216 188
6504A88l44K49q9J5k98J80N9J38q6m06M91J65k58j13J40J70m14K84nj94L81o82
$$ 188 -156 93 4 19 -279 -99 -40 98 12 -394 97 262 4 -109 31 201 -213 71 66 -128 253 -429
6526d29K77L33j78n2R4K03k16J49j04j55k03NO51l86j61J75k44K82R2q5p2l78
$$ -429 -152 181 3 -49 45 248 32 181 77 -78 -281 -276 375 -11 -172 3 -241 41 133 48 -24 -402
6548d02N73L9p6j60K4J30p9K03j10L2m17N63k26k58J83k39N83p25J34L08j5K02
$$ -402 171 210 134 -26 -2 128 49 252 142 174 -243 320 94 -164 19 -220 363 -362 -228 80 65 267
6570B67l04J57m5K1p8j69J42k3p6l9L6J97j48o8M2K76N6l20N6J87O0l19M8q5j6
$$ 267 -37 120 75 96 18 -151 -9 -32 -108 -147 -111 86 -62 -130 -88 188 244 -76 -20 167 227 -92 -44 -129 -145
6595a45J00L9L3M26m88J59j89K42q6j3J11q1j46PJ81k30j5n2L88p9k35J04j45
$$ -145 -45 -6 27 453 -35 124 -65 177 91 78 189 108 -38 -31 150 -80 -95 -147 241 162 -73 31 -114
6618a14j03J12k62L99j75L65J23j35l47J84j5Q6l24R1L22k46K0k55J78P3M4l3
$$ -114 -217 -105 -367 32 -143 222 345 210 -137 47 32 118 -206 -115 207 -39 -19 -274 -96 -23 21 -12
6640a2j50J09k93L82o0R1o6j34j7J64J72k76n7J71J18j90k8j62m1L99l91K00j07
$$ -12 -162 -53 -346 36 -24 67 1 -133 -150 14 186 -90 -147 24 142 -48 -76 -238 -279 120 -271 -71 -178
6663a78J40R1o47N12K7L5N0k84M70k75k19M25p8J96n10K22N3L60m36K5L43l06
$$ -178 -38 53 -594 -82 -55 -20 30 -254 216 -59 -278 147 69 265 -245 -23 30 390 -46 -21 322 16
6685A6J03K20m17J1lJ84j31K9J92j45k02L33m26N0L91J07k4J06r5k78k09K36J4
$$ 16 119 339 -78 -67 -70 114 -17 12 204 59 -143 190 -236 -186 205 312 288 394 299 21 -188 48 62
6708F2L07l46R9l07L16Q4Lk31Q5O7k80P9k19L92k42J49N6Q6m7o9p1j83M32m56
$$ 62 369 23 122 -185 131 215 218 -13 72 139 -141 -62 -281 111 -131 18 74 160 113 44 -27 -210 222 -234
6732b34OM84j27m5j41L39l85J01K6l9j90K82l29lL39j35oJ72m4k54lR2J31l39
$$ -234 -228 256 129 84 -57 282 -103 -2 24 -15 -205 77 -252 -255 84 -51 -57 115 71 -183 -186 -94 37 -302
6756c02J92O2K03m46N31j66l23R1K87M1l8rK07M4j80j70j10J76L24n62J42l1J50
$$ -302 -110 -48 155 -291 240 74 -249 -158 129 170 132 123 330 374 194 24 -86 90 414 -148 -6 -37 113
6779A13K11o73K32L09m29K76l0Q3P6k6l22N8L69J04m38L83l98K67k37k16J95m7
$$ 113 324 -349 -117 192 -237 39 9 92 168 142 -180 -122 247 351 -87 296 -102 165 -72 -288 -93 -140
6801a40L16Q3K7j31n44L07N10l39J73j29J44o14K46K18k18N17l03k2k04M9j72
$$ -140 176 259 286 155 -389 -82 428 89 262 133 277 -337 -91 127 -91 426 123 101 -103 -54 -226
6822b26L01k30j7J57k10k9L88r5M78m10l12M88l19K03k08k53L37J91m02L05k83
$$ -226 75 -155 -172 -15 -225 -254 134 39 517 107 -205 283 -36 167 -41 -294 43 234 -168 137 -146
6843a46J59j97p6J43L34N3l07N8J7L66Pp22QN04j59j75p8K76Lm04L13j89K21k56
$$ -146 13 -184 -260 -117 217 270 -37 21 38 404 411 -311 -303 201 42 -133 -211 65 68 -336 -23 -212 9 -247
6867b47K35J73l54K31m6K07r0n4K5o0K15m07L50k12r2n1J46J67k82j6L09q1k55
$$ -247 -12 161 -193 38 -8 199 109 55 80 20 235 -172 178 -34 -126 -177 -31 136 -146 -162 147 66 -189
6890a89L6%J09R6P4n1k0K3j84O1L27j05l18oL67k35J87l07L08l7k16j66K04m4
$$ -189 -153 -153 -44 52 126 75 55 78 -106 -45 282 177 -141 -147 220 -15 172 -135 173 136 -80 -246 -42 -86
6914h6N0J42j22j48K77j18j04J90j1n3r4J59J67j35k25K60J6j53j03jm9K13l85
$$ -86 -36 106 -16 -164 113 -5 -109 81 70 17 -77 82 249 114 -111 149 165 12 -91 -92 -141 72 -313
6937c13L73k39J5K98l24J79m6M46m29j51p2J71J10k3L60k03r9n7M7l20L41q0n6
$$ -313 60 -179 -164 134 -190 -11 -57 389 -40 -191 -263 -92 18 -5 355 152 53 -4 43 -277 64 -16 -72
6960g2L57k57j91m7j63L06K8k9j30J00K16j50J74K33l69R3j45QL65k51n4k28M89
$$ -72 285 28 -163 -210 -373 -67 -39 -68 -198 -98 118 -32 142 375 6 99 -46 -38 327 76 22 -206 283
6983B83j80J5l09K52J12l85K15q3L95l44o8j57J78J59k65N1K23m20M31l59K0N6
$$ 283 103 118 -191 61 173 -212 3 -80 315 -29 -97 -254 -76 83 -182 -131 92 -328 103 -256 -236 -180
7005a80J51K58m33M13k68L29j3j87j19K07l75P8L06k09J19P8j52j54R9K99o37
$$ -180 -29 229 -204 209 -59 270 257 70 -49 158 -217 -139 167 -42 77 155 3 -151 -52 247 -390
7026c90K26K90k10k01J61J05L10l18O3j67Q0j19n6o7L52k2n6J66l1j07J6o0R3
$$ -390 -164 126 -84 -285 -124 -19 291 -27 36 -131 -51 -170 -226 -293 59 37 -19 147 116 9 25 -35 58
7049E8p4J37R6l44M60m64K41k34L13l20L95n74j67Q11l14J66J47k63M8l4m61M30
$$ 58 -16 121 217 -127 333 -131 110 -124 189 -131 264 -310 -477 334 20 186 333 70 118 84 -377 53
7071E3Oj40l81O56j51J28m9l4j4M2j79k50K21N1J97n46J57L76M8m97L48k7P9L3
$$ 53 59 -81 -462 194 43 171 122 88 74 116 -63 -313 -92 -41 156 -390 -233 143 191 -306 42 15 94 127
7095A27o9K48k13K1N2K06k8l16k6o1J57J08k62qM57m8k92J18J27k25K78l39K16
$$ 127 58 306 93 114 166 372 344 28 2 -59 98 206 -56 -64 393 345 53 171 298 73 351 12 228
7118B28m67L06k06J98j03K19j55j45oJ97L51m50K02L1j2K23m09O1q1J63j53j34
$$ 228 -239 67 -139 59 -44 175 20 -125 -131 66 417 -33 169 200 188 411 2 63 -18 145 -8 -142
7140a42K90K55k77l06P15o49Q9K11n7l86L73l7j69k38K12m0M15m77Q6J01m73L82
$$ -142 148 403 126 -180 535 -114 -25 186 129 -257 116 79 -90 -328 -116 -156 259 -218 -132 -31 -504 -122
7162a22N8K18m3nn16N22k1l52J50J57Qj56Q0L21k51L6k32K42j07P3k88J10J1R3
$$ -122 -64 154 111 106 -410 112 91 -261 -111 46 54 -102 -22 299 48 84 -148 94 -13 60 -228 -118 -107 -14
7186a4q2L10m44K86j91L92J5k67j51P8J4k74K14J13M40j87p3o00P04m76P85l20
$$ -14 -96 214 -230 56 -135 257 272 5 -146 -68 -54 -328 -114 -1 439 252 179 -421 283 -193 592 272
7208B72o02L50N9k53L68j32j01L8k39L55m08N46j81l22K06J77k72L97p12M38K5
$$ 272 -330 20 79 -174 194 62 -39 -1 -240 115 -293 253 72 -250 -44 133 -139 258 -454 -16 9
7229Il7q3K11O8N9j30l28L29l60O48k45l86N04l13Rp3L21r2k25L39l12O9k2l61
$$ 9 -28 -111 100 168 227 97 -231 98 -262 386 141 -245 259 -54 -45 -118 203 111 -114 225 -87 -18 -40 -401
7253d01L36K36k11q7r0N04m38l1N2J38K81j74j17l95J29K45l42Q0K35j42J56J55
$$ -401 -65 171 -40 -127 -217 287 -151 -182 -130 8 289 115 -2 -397 -268 -23 -365 -285 -50 -192 -36 119
7275A19j91O4J00qp6k2m18N4M45Q8l29K06k14J72j06l7L23n46L72k9L4k37L20
$$ 119 -72 -8 92 84 8 -14 -432 -378 67 155 -174 32 -182 -10 -116 -153 170 -376 -4 -33 1 -236 84
7298H4k69K47j17p1J96P1k09J23L53n03K9J0J84kj86r2r1M00j23k29k84N13Q8
$$ 84 -185 62 -55 -126 70 141 -68 55 408 -95 -66 -56 128 126 -60 -152 -243 157 34 -195 -479 34 122
7321A22j80j58J99J67k40j11L13m16O95k65J82m03r3K17Ok50M85K9m97L71k7q0
$$ 122 -58 -216 -17 150 -90 -201 112 -304 391 126 308 -95 -188 29 35 -215 270 299 -198 173 146 66
7343F6rl7K55j90j4p5J26k90J72q2J04n1K87j54k48J84j85O6L1r2N16m23o8R6
$$ 66 57 20 275 85 71 -4 122 -168 4 -78 26 -25 262 108 -140 44 -141 -75 -44 -136 380 -43 -111 -15
7367a5j54K62l42Q1J08j8K78l49L08k34N1K7j81J72J8K2l7J65p2J0L6l20L40K62
$$ -15 -169 93 -249 -168 -60 -78 200 -149 159 -75 -24 3 -178 -6 12 34 -3 162 90 100 136 -184 156 418
7391D18l39K31k98J10k46L12k98k5J53P6k44N17j71m62m6L93k12L78m23K60q8
$$ 418 79 310 12 122 -124 188 -110 -135 18 94 -150 367 196 -266 -312 81 -131 247 -176 84 -4
7412dl26M41n17M43J46j56j02J10J52l15J76l4j8M98o67J2K74k93J0K22M9l73
$$ -4 -330 111 -406 37 183 27 -75 35 187 -128 48 14 -4 494 -173 -161 113 -180 -170 52 101 -272
7434b72J35R3K78O3j81l65J53L3p0L39n38L83J83k67k35L38J81k11K76n13mJ05
$$ -272 -137 -44 234 297 116 -249 -96 -63 -133 206 -332 51 234 -33 -268 70 251 40 316 -197 -201 -96
7456i6J62r6j46J5K15L13p23O65k05l00K88m13K30k34M13K9J70j13m65L57j13
$$ -96 66 -30 -176 -161 54 367 -356 309 104 -196 92 -321 -91 -325 88 117 287 174 -291 66 -47
7477d7r7J80M3J85n28J55J85j15k3j59J90J20j85L74J05m18L27k50l72l2K07L03
$$ -47 -144 36 79 264 -264 -109 76 -39 -62 -221 -31 89 -96 278 383 -35 292 42 -330 -362 -155 148
7499A48J24k17j53J94J87k64j44K40m05P15m98oLj4L23j07j06J75l60K54k18O
$$ 148 272 55 -98 96 283 19 -125 115 -290 425 -73 -79 -76 -90 233 126 20 195 -165 89 -129 -123
7521a23o5L76l65J83nk13J38N78m34j12N7J66k19K43k59J86p6o1L56m44j16K64
$$ -123 -188 188 -177 6 1 -212 -74 504 70 -42 15 181 -38 205 -54 132 56 -5 351 -93 -209 55
7543E5l30J66O6l0J6o9L46l71L84j56l1l77L58K09k11k23J15O6k89L21P8n2J28
$$ 55 -275 -109 -43 -73 -57 -126 220 -151 233 77 46 -331 27 236 25 -198 -83 -17 -306 15 93 41 169
7566A69K66m42L3m97M16J12J90j00R5k12L7j88N7Rk00L84m0l1j41J6K79J21k63
$$ 169 435 -7 26 -471 -55 57 247 147 242 30 67 -121 -64 -55 -255 129 89 58 -83 -67 212 333 70
7589G0J34q1j95R5j59m32N48J85k03J09j06k39J01j62K46K02m25L25j16K58K3
$$ 70 204 123 -72 23 -136 -568 -20 165 -38 71 -35 -274 -173 -335 -89 113 -312 13 -103 155 178
7610A78k52L66K41j60j09k33R2nM0j51K50j16j39k8j71K88J47m60j58M84k18L12
$$ 178 -74 292 533 373 264 31 123 118 158 7 257 141 2 -26 -197 91 238 -222 -380 104 -114 198
7632A98k62j51L73m38K04L45j24j14M2l0k57J30L43m85J34J13n2o2j69O1K33J58
$$ 198 -64 -215 158 -280 -76 269 145 31 73 43 -214 -84 259 -226 -92 21 -31 -93 -262 -201 32 190
7654A90Q7j64k67L65qk03k25K89j1o1J98n24K06J40k50N52j0k8l35K22J14l64
$$ 190 277 113 -154 211 203 0 -225 64 53 -8 190 -334 -128 12 -238 314 304 276 -59 163 277 -87
7676h7K25k95K96k25K15K8k74J86R5nJ06j28k02k95K19J80l05J26J34j85K04k77
$$ -87 138 -157 139 -86 129 157 -117 69 164 159 265 137 -65 -360 -141 39 -266 -140 -6 -191 13 -264
7698b64K6J15j76K09K00q1k4L7k31K93j74J73N01o02Q4m8O4j31n2n6J56K26k04
$$ -264 -238 -123 -299 -90 110 29 5 42 -189 104 -70 103 604 2 86 38 102 -29 -81 -137 19 245 41
7721D1K9k24N6O4K20m46L24O9n0j80Q9l74N38l96J52K03L0k72l29L78rJ90j28
$$ 41 70 -154 -98 -34 186 -260 64 133 83 -97 -8 -382 156 -240 -88 115 145 -127 -456 -78 -87 103 -25
7744b5j4J82J9j76j58K49J02l27l23O32q7j32L03j36j22j43J61r6K14l09M38l76
$$ -25 -39 143 162 -14 -172 77 179 -148 -471 161 74 -58 245 109 -13 -156 5 -91 123 -186 252 -124
7766a24M32K8l42M1J61n9k83K51L7J33m32J79q3J16K03l75J88k33J89J37j17j02
$$ -124 308 336 -6 35 196 137 -146 105 142 275 -157 22 -61 55 258 -117 71 -162 27 164 47 -55
7788e5oN7l34M2J59L32j30n31Q01l18r8P5j36N23k96J31r4J00l69P8n4K5K0K30
$$ -55 -61 -4 -338 -296 -137 195 65 -466 335 17 -81 -6 -142 381 85 216 122 222 -147 -69 -123 -98 -78 152
7812A52j10n0R4N3M5n88M36j6j02O4k45q0N52k56j57M94l05J75m5j33M0J41J21
$$ 152 42 -8 86 139 184 -404 32 16 -86 -22 -267 -347 205 -51 -208 286 -19 156 111 -22 18 159 280
7835B80l54k50J74K62L1N3k92J13j95J52J56o66M45K05l5j15j60K84k6j41J73
$$ 280 -74 -324 -150 112 143 196 -96 17 -178 -26 130 -536 -91 114 79 -36 -196 88 62 -79 94
7856I4Q2l40K92K49M5l90J21J14k61l1N7m6M6j04K20q9q1k55L89j26N2Q5l36j17
$$ 94 176 -164 128 377 422 32 153 267 6 -25 32 -14 32 -72 148 59 -22 -277 112 -14 38 123 -213 -330
7880c30Q4N5J28J60N3l41M81j90k21M44l66p7J44rJ57j84J07j61J49l89M28N8
$$ -330 -246 -191 -63 97 150 -191 290 100 -121 323 -43 -120 24 15 172 -12 95 -66 83 -306 122 180
7902A80j32l7k93K03M5o2o3L44j80J74k61J13J02k09O2L49k72K27m50j03M6L84
$$ 180 48 11 -282 -79 -34 -96 -159 185 5 179 -82 31 133 -76 -14 335 63 290 -160 -263 -217 167
7924A67j40J08j5j08J0J40l59K73j04r4J42N2j82l1k09N19k59L96l32L04J62o82
$$ 167 27 135 120 12 22 162 -197 76 -28 -122 20 72 -110 -141 -350 169 -90 306 -26 278 440 -242
7946b42N36m07J33j56J59j2j49lJ85l90M00N4j23Q2R8j6k78j53L80k64j0j07J70
$$ -242 294 -113 20 -136 23 11 -138 -141 44 -346 54 108 -15 67 165 149 -129 -282 98 -166 -176 -283 -113
7969a13o3j18N37l74Q8J43k10M7l09L68O8k07NJ88J15m22J73RP5r9RJ99k9N6l49
$$ -113 -176 -294 243 -131 -43 100 -110 -63 -372 -4 64 -143 -138 50 165 -257 -84 -75 0 -99 -90 109 80 136 -213
7994b13N3J47k86K57j46M02l05j16Q7N00l17j17K90l78J31J60k92K46K47j88k45
$$ -213 -160 -13 -299 -42 -188 214 -91 -207 -120 380 63 -54 236 -142 -11 149 -143 103 350 162 -83
8015h3M47l51j7j30K18J17k50J06K65j70r0L3n14P10j06m86J49l9K18J44r8j64
$$ -83 364 13 -4 -134 84 201 -49 57 322 152 62 95 -419 291 185 -301 -152 -191 27 171 73 -91
8037i1J99L3N4m44J98j66K89j99J00j12K6J85p7J3N5j24K63n00M71J30l25jJ86
$$ -91 108 141 195 -249 -51 -217 72 -127 -27 -139 -113 72 -5 8 63 -61 202 -298 173 303 -22 -23 163
8060A63p2j31p6q0L40j41m7j8n1L20k87R2j13p2L76m66L72k86P2OK54j83K35j42
$$ 163 91 -40 -116 -196 144 3 -44 -62 -113 207 -80 12 -101 -173 203 -263 109 -177 -105 -99 155 -28 207 65
8084F5m2q5jk20J29N5M2J09m6L51j69k18ML22r2q8l69J42K68j83J08j93K08K91
$$ 65 23 -62 -63 -283 -154 -99 -57 52 6 357 188 -30 -26 296 204 116 -253 -111 157 -26 82 -111 97 388
8108C88l87j2r5K97m33L56P1m69K84R0l03J38qj26J95j98K73n0k8J2k77K53L7
$$ 388 1 -11 -106 191 -242 114 185 -284 0 90 -213 -75 -83 -209 -14 -212 61 11 -17 -5 -282 -29 8
8131HJ51lj82J47p4R4k54L72n28N83l71K68O4m84J38j61q5M87j33nL51o00N06
$$ 8 159 156 -26 121 47 141 -113 259 -269 314 -57 211 275 -209 -71 -232 -317 170 37 32 383 -217 289
8154B89l55J19q4p0J0R1j88N4J37J40j14l5j23K14j27l09L15j6j17K40p0j8j31
$$ 289 -66 53 -31 -101 -91 0 -188 -134 3 143 29 -6 -129 85 -42 -351 -36 -52 -169 71 1 -17 -148
8177a48L30j05Pk29L44l81R3L90k34J18k55j93L17J46
$$ -148 182 77 84 -145 199 -182 -89 301 67 185 -70 -263 54 200
8191B00
$$ Imaginary data points
##PAGE= N=2
##DATA TABLE= (X++(I..I)), XYDATA
0@%%%%%%%%%%l2O4o4O4r6J28j28J60k24K56k88L54m41N35o10P06q32R61j120J296
$$ 0 0 0 0 0 0 0 0 0 0 0 -32 32 -32 32 -64 64 -64 96 -128 128 -160 194 -247 288 -322 384 -448 513 -607 689
30F89j473J681j919K173k444K756l098L463l869M327m825N351n939O584p283Q046
$$ 689 -784 897 -1022 1151 -1293 1463 -1635 1828 -2041 2286 -2539 2812 -3127 3457 -3826 4220
46D220q880R799j0797J1890j3102J4441j5912J7550j9393K1466k3813K6509k9640
$$ 4220 -4660 5139 -5658 6232 -6870 7571 -8341 9209 -10184 11282 -12531 13978 -15662
59a5662L3318l7713M3089m9839N8587p0440Q7506j14297J62621k76505J008629
$$ -15662 17656 -20057 23032 -26807 31780 -38660 48846 -65451 97170 -179335 829294
70H29294O68422k485245j92147J985075P47696j997641j092178J411620J362155
$$ 829294 1497716 -987529 -1179676 805399 1553095 -444546 -1536724 -125104 1237051
79A237051j087188j403711O00652J517479j16537j250801k58988J078220N59210
$$ 1237051 149863 -1253848 -653196 864283 747746 -503055 -762043 316177 875387
88H75387p26652q36638L31172Q92304N8070r41722m34638Q40870Q00628o71756
$$ 875387 148735 -687903 -356731 535573 593643 -348079 -782717 58153 858781 187025
98A87025j056234M35468J264508j81090j389655j33900J422903M19769j372989
$$ 187025 -869209 -433741 830767 649677 -739978 -873878 549025 968794 -404195
107d04195o83484J294885R46528j112525j128819R18253J261400p04765j367996
$$ -404195 -1087679 207206 1153734 41209 -1087610 -169357 1092043 387278 -980718
116i80718M25809J353682j90856j312404n2453J217102L06313j018210m68662
$$ -980718 -554909 798773 607917 -704487 -756940 460162 766475 -251735 -720397
125g20397Q27064O28476n73241p24122K78907P14231k7340o84651k59133N50684
$$ -720397 106667 735143 161902 -562220 -283313 430918 403578 -281073 -540206 10478
135A0478N02326l49590o81420J25692Q35581J64357q91979m53093Q74126P26909
$$ 10478 512804 163214 -518206 -392514 443067 607424 -284555 -737648 136478 863387
145H63387p93332r86723O24692J187872l98191j319945J41243J388699J47149
$$ 863387 70055 -916668 -291976 895896 497705 -822240 -680997 707702 854851
154H54851j369004m29847J266693O72033j110978q83174Q80969J018483o17232
$$ 854851 -514153 -944000 322693 994726 -116252 -999426 -118457 900026 282794
163B82794j073501L43450J064326n5343r64173j96988Q02269M06280n93679n68139
$$ 282794 -790707 -447257 617069 561726 -402447 -599435 202834 609114 15435 -552704
173e52704L38084O49869p0920o61070j88886O06713M40366m75780o45169K96890
$$ -552704 -214620 435249 364329 -296741 -485627 121086 561452 85672 -559497 -262607
183b62607Q00983q3156r06644j62934R33763L98683r04655o23561Q13084Q20045
$$ -262607 538376 455220 -451424 -614358 319405 718088 -186567 -810128 2956 823001
193H23001o61458r62278M76052J059338k59924j093620L5085J067338J80209r87195
$$ 823001 161543 -800735 -324683 734655 474731 -618889 -583804 483534 663743 -323452
203c23452l71608Q56625N27166o83508o32082M84119O83932k72089o81501N4846
$$ -323452 -695060 161565 688731 5223 -626859 -142740 541192 269103 -412398 -357552
213c57552O19338J41103n13877l15104L67055M46888j89261n28400j790N63628
$$ -357552 261786 402889 -110988 -426092 -59037 387851 198590 -329810 -331600 232028
223B32028K00498n40374l87173M69740N53842l55491o90654K08041P87769l7917
$$ 232028 432526 -107848 -495021 -25281 528561 173070 -517584 -309543 478226 440309
233D40309q38872j40029Q41695L16012p96530m79273P03390O13062n74961p17038
$$ 440309 -398563 -538592 303103 619115 -177415 -656688 46702 659764 84803 -632235
243f32235M12335P77650k34539p92917N1553P62651J25739o83197k79311N66405
$$ -632235 -219900 557750 323211 -469706 -418153 344498 470237 -212960 -492271 74134
253G4134M02490m12000m83128K36285N19074m8441n05641j37506M45374L06934
$$ 74134 476624 64624 -418504 -182219 336855 288414 -217227 -354733 90641 397575
263C97575l43966m49465K05801N50441m4790o08109j32201O13207L07147n70514
$$ 397575 53609 -395856 -190055 360386 315596 -292513 -424714 188493 495640 -74874
273g4874m70501M82194O10738l56541p13035K06223P75131l8995p88002j26210
$$ -74874 -545375 -63181 547557 191016 -522019 -315796 459335 420340 -367662 -493872
283d93872P54924K81797o75968m13127N59196N13109m14624n77069K52725N97596
$$ -493872 261052 542849 -133119 -546246 12950 526059 111435 -465634 -212909 384687
293C84687q8969n78844o8935N17161K06415m22458l17688K97960L94890j54325
$$ 384687 295718 -283126 -352061 165100 371515 -50943 -368631 -70671 324219 169894
303A69894m33120J249M35382J52238l97460k91592L28120M12730k28205n03124
$$ 169894 -263226 -261977 173405 325643 -71817 -363409 -35289 377441 149236 -353888
313c53888J07992N59678K6055n78661j66326N58628L00139n04782m22570M16891
$$ -353888 -245896 313782 339837 -238824 -405150 153478 453617 -51165 -473735 -56844
323e6844N20816l06911n90182J76816O23516l9365o18926r6867N76661K24583
$$ -56844 463972 157061 -433121 -256305 367211 327846 -291080 -387947 188714 413297
333D13297m97163l30546L89785M12401k57876m59232J15946M70731K8981m44200
$$ 413297 -83866 -414412 -24627 387774 129898 -329334 -213388 257343 286324 -157876
343a57876j64795L80479K80290k85793l71909J65243M28611l0980m52190j10433
$$ -157876 -322671 57808 338098 52305 -319604 -154361 274250 243270 -208920 -319353
353c19353M37829K44416l89673l63399L11290M58625k07097n20675Q7369N50673
$$ -319353 118476 362892 -26781 -390180 -78890 379735 172638 -348037 -260668 290005
363B90005M1906n42871j67238N02261K84126m30542l81370L35355M51466k23482
$$ 290005 331911 -210960 -378198 124063 408189 -22353 -403723 -68368 383098 159616
373A59616m91930J00624M96969K1086m70335j37822M10774K38744l26684l19308
$$ 159616 -332314 -231690 265279 286365 -183970 -321792 88982 327726 1042 -318266
383c18266K20461L75168j03078l98373j8154L92019J37618l52529k43095K85573
$$ -318266 -97805 277363 174285 -224088 -242242 149777 287395 -65134 -308229 -22656
393b2656L31972j92668l95764Q3471M31002L6189m36675j56294M09467K65980
$$ -22656 309316 116648 -279116 -195645 235357 271546 -165129 -321423 88044 354024
403C54024l54177l61560K72146M30063j70907m72046N6166M82086O1576m59992
$$ 354024 -153 -361713 -89567 340496 169589 -302457 -246291 235795 297371 -162621
413a62621j74532M10491K74971l33017l52401K37148M04993j26733m25505J2904
$$ -162621 -337153 73338 348309 15292 -337109 -99961 305032 178299 -247206 -234302
423b34302M14583R9174l72862k01559L04069K85027k16220l45868J12157L77833
$$ -234302 180281 279455 -93407 -294966 9103 294130 77910 -267958 -155801 222032
433B22032m889l81097j03749L55168K01704l02041k84923K26638L48194j32436
$$ 222032 217143 -163954 -267703 87465 289169 -12872 -297795 -71157 277037 144601
443A44601l86306L1261L99655P4076l84969j71708L45345K58719k81653l27427
$$ 144601 -241705 -210444 189211 263287 -121682 -293390 51955 310674 29021 -298406
453b98406J98416L73469j02867l95195j111L89086J01830l58145j97137L02691
$$ -298406 -99990 273479 170612 -224583 -225694 163392 265222 -92923 -290060 12631
463A2631K75809k28185l34203J38422L67444l8564l72451o1688L51668J58710
$$ 12631 288440 60255 -273948 -135526 231918 193354 -179097 -240785 110883 269593
473B69593l02870k43491K35641L10265j49829l53643N4580L69553M3845l58635
$$ 269593 -33277 -276768 -41127 269138 119309 -234334 -179754 189799 233644 -124991
483a24991j39824L19679K23782k58698k92062J76285L38002q3336l61152j4358
$$ -124991 -264815 54864 278646 19948 -272114 -95829 242173 158837 -202315 -216673
493b16673L57012J10424l26944j96264K75464K66710k01631l16538J16378L44750
$$ -216673 140339 250763 -76181 -272445 3019 269729 68098 -248440 -132062 212688
503B12688k2035l47307p2651L27565J60442k85362k36584K23986K93001j48572
$$ 212688 190653 -156654 -229305 98260 258702 -26660 -263244 -39258 253743 105171
513A05171l30323O2299L41967K6391l31767j12472K96993J91093k44008k53819
$$ 105171 -225152 -162853 179114 205505 -126262 -238734 58259 249352 5344 -248475
523b48475J74966K99486r4944l21205J0938L21212P4250k95690j52831K49812
$$ -248475 -73509 225977 131033 -190172 -179234 141978 216228 -79462 -232293 17519
533A7519K20482j85582k71771J07349L02582k2129l13164o5117K97658J47047
$$ 17519 238001 52419 -219352 -112003 190579 168450 -144714 -209831 87827 234874
543B34874k61600k19378K03812K75419j30887l12822M8432L28350L9849l21197
$$ 234874 -26726 -246104 -42292 233127 102240 -210582 -162150 166200 206049 -115148
553a15148j23186K93356J98636k43798k58570J79958L00759j04306l20820K2429
$$ -115148 -238334 55022 253658 9860 -248710 -68752 232007 127701 -193119 -170690
563a70690L18396N9286k95754j35503K52379J98318j94412k46564J23197K74171
$$ -170690 147706 206992 -88762 -224265 28114 226432 32020 -214544 -91347 182824
573A82824m7320k79912l1304K64689J06014k28358j70733J75832K24794j09582
$$ 182824 135504 -144408 -175712 88977 194991 -33367 -204100 -28268 196526 86944
583H6944k60023L6913K76736M0100k72241j14285K48061J81546k06514k37176
$$ 86944 -173079 -136166 140570 180670 -91571 -205856 42205 223751 17237 -219939
593b19939J47317K77740p9595l01687M002L05285P1177k91145j41277K56817K01431
$$ -219939 -72622 205118 125523 -176164 -172162 133123 204300 -86845 -228122 28695 230126
604B30126k05849k46813J42467K76058o9781k83344n716K72810P9814k41788j45088
$$ 230126 24277 -222536 -80069 195989 126208 -157136 -162852 109958 189772 -52016 -197104
615a97104J94882J97297j34286k32367O4092K46924R266k42223q4047K16751J50672
$$ -197104 -2222 195075 60789 -171578 -107486 139438 148704 -93519 -177566 39185 189857
626A89857j74271k07478J16969K48525n0703k71417j9604K75123R1038k57959
$$ 189857 15586 -191892 -74923 173602 122899 -148518 -168122 107001 198039 -59920
636e9920j55520K23457K11620j72518k53409J11901K79261m4245k87384k4219
$$ -59920 -215440 8017 219637 47119 -206290 -94389 184872 140627 -146757 -170976
646a70976K77118Q8467k51235j44590K07762J87447j52996k17514Q9692K29321
$$ -170976 106142 194609 -56626 -201216 6546 193993 40997 -176517 -86825 142496
656A42496k3233k24603m3540K05079J03795j68376j53703J20756J91140o2554
$$ 142496 119263 -105340 -148880 56199 159994 -8382 -162085 -41329 149811 87257
666H7257k10923o36K15166O6065k01526j28055J71319J83182j28993k26615P4842
$$ 87257 -123666 -124302 90864 156929 -44597 -172652 -1333 181849 52856 -173759 -98917
677i8917K54616j5605k67039m7190K60376J07358k37572j62089J99448K06808
$$ -98917 155699 140094 -126945 -174135 86241 193599 -43973 -206062 -6614 200194
687B00194j48604k38472R0619K55661k7062k55165l3559K37938R0761k04058j38129
$$ 200194 51590 -186882 -96263 159398 132336 -122829 -156388 81550 172311 -31747 -169876
698a69876J57293J72010r9658j92883L6924J96045K5981j84807q6068J57202J37096
$$ -169876 -12583 159427 59769 -133114 -96190 99855 125836 -58971 -145039 12163 149259
709A49259j17283j77201O6429K02786q696k12565n1255K06850J10941j85167j63579
$$ 149259 31976 -145225 -78796 123990 115294 -97271 -148526 58324 169265 -15902 -179481
720a79481J51645K07113j05409k38121N3454K53872K784k53469n8915K36464J10449
$$ -179481 -27836 179277 73868 -164253 -110799 143073 145857 -107612 -166527 69937 180386
731A80386k05862j56436J63373J88785j11535k10381N5443K14804J826k04673
$$ 180386 -25476 -181912 -18539 170246 58711 -151670 -96227 118577 120403 -84270
741h4270n5430J79116J03961j40753j39681R1655J65515l5171j75583k3291J71683
$$ -84270 -139700 39416 143377 2624 -137057 -45402 120113 84942 -90641 -113932 57751
752E7751Q0745j53370j31198J20425J72311p7787k01564K5858K15512K9263k15959
$$ 57751 138496 -14874 -146072 -25647 146664 68877 -132687 -106829 108683 137946 -78013
763g8013q4878K00496J35789j72443j79096J34205K10520q7292k28054L7186K31337
$$ -78013 -162891 37605 173394 951 -178145 -43940 166580 79288 -148766 -111580 119757
774A19757J6059k19688o4770J95352J08192j58844j41779J13307J64681o3782
$$ 119757 135816 -83872 -148642 46710 154902 -3942 -145721 -32414 132267 68485
784F8485j74369J1769J68564L7658j50928q2072J18979J19219p9755j45623L2038
$$ 68485 -105884 -94115 74449 112107 -38821 -120893 -1914 117305 37550 -108073 -76035
795g6035J60357J8712j61925o8184J51852J14835j28063j53638R5648J83343n3640
$$ -76035 84322 103034 -58891 -127075 24777 139612 11549 -142089 -46441 136902 83262
806H3262k01218O796K06933M2070k00505q9850J81319J30914j51947j64365J12339
$$ 83262 -117956 -111160 95773 137843 -62662 -152512 28807 159721 7774 -156591 -44252
817d4252J86855o8892j95965K0650J91419K7094j74380p0682J46471J08217j08739
$$ -44252 142603 73711 -122254 -101604 89815 116909 -57471 -128153 18318 126535 17796
828A7796j33969O4329J50512j6718j52249k9814J40507P4635j17002j13421Q2521
$$ 17796 -116173 -51844 98668 81950 -70299 -100113 40394 115029 -1973 -115394 -32873
839c2873J43194m2182j62387m804J69688N0463j64531r5397J47591J33028j19076
$$ -32873 110321 68139 -94248 -99052 70636 121099 -43432 -138829 8762 141790 22714
850B2714j62815Q2584J83731m0220j92247l915J89507M8612j75320q7865J51726
$$ 22714 -140101 -57517 126214 85994 -106253 -110168 79339 127951 -47369 -135234 16492
861A6492J20583j18537j44110P9278J56428l6921j57324p286J45959M8789j26044
$$ 16492 137075 18538 -125572 -46294 110134 73213 -84111 -91397 54562 103351 -22693
872b2693q5406R5593J13890n9277j32512J7758J40393K4902j34806o6242J18939
$$ -22693 -108099 -12506 101384 42107 -90405 -72647 67746 92648 -42158 -108400 10539
883A0539J04001r1866j34178N7778J56826j8300j68355k2864J68128O3816j57272
$$ 10539 114540 22674 -111504 -53726 103100 84800 -83555 -106419 61709 125525 -31747
894c1747j01102J34419J32186j04198j55392O5997J67833k5123j70300j6908J61637
$$ -31747 -132849 1570 133756 29558 -125834 -59837 107996 82873 -87427 -104335 57302
905E7302N6136j42841q8787J15040J15212q0395j29638M1142J35359L52j29437
$$ 57302 113438 -29403 -118190 -3150 112062 31667 -97971 -56829 78530 78882 -50555
916e0555m0098J14087P5911r0332j04953N9193J24343k3808j35262j4687J34298
$$ -50555 -90653 23434 99345 9013 -95940 -36747 87596 63788 -71474 -86161 48137
927D8137N2073j23806q7408J03412J17492p5620j39954M2731J54599o769j57862
$$ 48137 100210 -23596 -111004 -7592 109900 34280 -105674 -62943 91656 84887 -72975
938g2975k9749J52038O5028j35309r5083J10786J19019p8812j35213M2037J42484
$$ -72975 -102724 49314 114342 -20967 -116050 -5264 113755 34943 -100270 -58233 84251
949H4251m932j40026l2383J27334O5196j07383r2157P8547J11101m4178j21611
$$ 84251 79319 -60707 -93090 34244 99440 -7943 -100100 -21553 89548 45370 -76241
960g6241P204J22239L1327j13047o6781R6094R6860o9874j19399L9180J33807
$$ -76241 -69037 53202 84529 -28518 -95299 795 97655 27781 -91618 -52438 81369
971H1369m634j37343l1075J30479O5176j15408r6282R2040J20558o3139j37300
$$ 81369 76735 -60608 -91683 38796 103972 -11436 -107718 -15678 104880 41741 -95559
982i5559K9702J44097M270j41559l7788J29403O7855j08128r2913Q1180J11979
$$ -95559 -65857 78240 82510 -59049 -96837 32566 100421 -7707 -100620 -19440 92539
993I2539m8580j21440J3900J23735J9993j15468n1597R9100P8496p6300r8176
$$ 92539 43959 -77481 -63581 60154 80147 -35321 -86918 12182 90678 14378 -83798
$$ [...]
8191A2
##END NTUPLES=NMR FID
##END=
