##TITLE=31P ikalashn
BAU 93-2024
25.10.2024
##JCAMPDX= 6.0         $$ Bruker NMR JCAMP-DX V2.0
##DATA TYPE= NMR SPECTRUM
##DATA CLASS= NTUPLES
##ORIGIN= UXNMR, Bruker Analytische Messtechnik GmbH
##OWNER= root
$$ TOPSPIN		Version 1.3
$$ 2024-10-25 11:03:14.546 +0400  Irina@DPX200
$$ Compression mode = diff/dup
##.OBSERVE FREQUENCY= 81.01967998063
##.OBSERVE NUCLEUS= ^31P
##.ACQUISITION MODE= SIMULTANEOUS
##.ACQUISITION SCHEME= undefined
##.AVERAGES= 64
##.DIGITISER RES= 17
##SPECTROMETER/DATA SYSTEM= spect
##.PULSE SEQUENCE= zgpg
##.SOLVENT NAME= D2O
##.SHIFT REFERENCE= INTERNAL, D2O, 1, 298.5841
##AUDIT TRAIL= $$ (NUMBER, WHEN, WHO, WHERE, WHAT)
$$ ##TITLE= Audit trail, TOPSPIN		Version 1.3
$$ ##JCAMPDX= 5.01
$$ ##ORIGIN= Bruker BioSpin GmbH
$$ ##OWNER= Irina
$$ $$ F:/spectra/data/iren/nmr/P31dec/1/pdata/1/auditp.txt
$$ ##AUDIT TRAIL=  $$ (NUMBER, WHEN, WHO, WHERE, VERSION, WHAT)
(   1,<2024-10-25 11:01:08.421 +0400>,<Irina>,<DPX200>,<TOPSPIN 1.3>,
      <acquisition in progress>)
(   2,<2024-10-25 11:02:50.984 +0400>,<Irina>,<DPX200>,<TOPSPIN 1.3>,
      <Start of raw data processing
       efp BC_mod = 2 LB = 15 FT_mod = 6 PKNL = 1 PHC0 = 128.9239 PHC1 = 227.9838 SI = 32K 
       data hash MD5: 32K
       DC B8 DD 83 C2 B4 E7 64 61 A5 99 95 1D D1 3B 14>)
(   3,<2024-10-25 11:02:53.718 +0400>,<Irina>,<DPX200>,<TOPSPIN 1.3>,
      <apk 
       data hash MD5: 32K
       83 E5 C1 9E EE 76 19 C3 BD D6 21 FD 6B FF 2A 44>)
(   4,<2024-10-25 11:02:56.046 +0400>,<Irina>,<DPX200>,<TOPSPIN 1.3>,
      <abs n ABSG = 5 
       data hash MD5: 32K
       3E 82 9D 0A D0 61 CE 58 63 01 A4 A2 FE A8 11 8B>)
(   5,<2024-10-25 11:03:02.031 +0400>,<Irina>,<DPX200>,<TOPSPIN 1.3>,
      <pk fgphup PHC0 = 12 PHC1 = 0 
       data hash MD5: 32K
       EB B4 DB A8 79 AF B2 9D 7B 52 96 EC 4E 4F BA AA>)
(   6,<2024-10-25 11:03:03.875 +0400>,<Irina>,<DPX200>,<TOPSPIN 1.3>,
      <abs n ABSG = 5 
       data hash MD5: 32K
       BC E8 F0 04 F3 A6 54 E5 8F 0B FA 58 43 46 11 85>)
$$ ##END=
$$ 
$$ $$ hash MD5
$$ $$ 12 7B D2 D0 D7 3C 3F F3 5B 5A 37 DD 04 28 6B C3
##$RELAX= 
##$RELAX= 
##$RELAX= 
##$RELAX= 
##$RELAX= 
##$RELAX= 
##$RELAX= 
##$RELAX= 
##$RELAX= 
##$RELAX= 
##$RELAX= 
$$ Bruker specific parameters
$$ --------------------------
##$DU= <F:/spectra>
##$EXPNO= 1
##$NAME= <P31dec>
##$PROCNO= 1
##$TYPE= <nmr>
##$USER= <iren>
##$AMP= (0..31)
100 100 100 100 100 100 100 100 100 100 100 100 100 100 100 100 100 100 
100 100 100 100 100 100 100 100 100 100 100 100 100 100 
##$ANAVPT= -1
##$AQSEQ= 0
##$AQ_mod= 1
##$AUNM= <au_zg>
##$AUTOPOS= <>
##$BF1= 81.014009
##$BF2= 200.13
##$BF3= 200.13
##$BF4= 200.13
##$BF5= 200.13
##$BF6= 200.13
##$BF7= 200.13
##$BF8= 200.13
##$BYTORDA= 1
##$CFDGTYP= 0
##$CFRGTYP= 5
##$CHEMSTR= <none>
##$CNST= (0..63)
1 1 145 1 1 1 1 1 1 1 1 1 1 1 1 1 1 1 1 1 1 1 1 1 1 1 1 1 1 1 1 1 1 1 
1 1 1 1 1 1 1 1 1 1 1 1 1 1 1 1 1 1 1 1 1 1 1 1 1 1 1 1 1 1 
##$CPDPRG= <waltz16>
##$CPDPRG1= <>
##$CPDPRG2= <waltz16>
##$CPDPRG3= <>
##$CPDPRG4= <mlev>
$$ [...]
##$SW_h= 37037.037037037
##$TD= 32768
##$TD0= 1
##$TE= 300
##$TE2= 300
##$TE3= 300
##$TEG= 300
##$TL= (0..7)
0 120 53 12 22 120 120 120 
##$TP= (0..7)
150 150 150 150 150 150 150 150 
##$TP07= 0
##$TPNAME0= <>
##$TPNAME1= <>
##$TPNAME2= <>
##$TPNAME3= <>
##$TPNAME4= <>
##$TPNAME5= <>
##$TPNAME6= <>
##$TPNAME7= <>
##$TPOAL= (0..7)
0.5 0.5 0.5 0.5 0.5 0.5 0.5 0.5 
##$TPOFFS= (0..7)
0 0 0 0 0 0 0 0 
##$TUNHIN= 0
##$TUNHOUT= 0
##$TUNXOUT= 0
##$USERA1= <user>
##$USERA2= <user>
##$USERA3= <user>
##$USERA4= <user>
##$USERA5= <user>
##$V9= 5
##$VALIST= <valist>
##$VCLIST= <CCCCCCCCCCCCCCC>
##$VD= 0
##$VDLIST= <DDDDDDDDDDDDDDD>
##$VPLIST= <PPPPPPPPPPPPPPP>
##$VTLIST= <TTTTTTTTTTTTTTT>
##$WBST= 1024
##$WBSW= 4
##$XGAIN= (0..3)
0 0 0 0 
##$XL= 0
##$YL= 0
##$YMAX_a= 4069
##$YMIN_a= -5534
##$ZGOPTNS= <>
##$ZL1= 120
##$ZL2= 120
##$ZL3= 120
##$ZL4= 120
##$ABSF1= 298.5841
##$ABSF2= -158.5842
##$ABSG= 5
##$ABSL= 5
##$ALPHA= 0
##$AQORDER= 0
##$ASSFAC= 0
##$ASSFACI= 0
##$ASSFACX= 0
##$ASSWID= 0
##$AUNMP= <proc_1d>
##$AXLEFT= 0
##$AXRIGHT= 0
##$AXTYPE= 0
##$AXUNIT= <>
##$AZFE= 0.1
##$AZFW= 0.5
##$BCFW= 0
##$BC_mod= 2
##$BYTORDP= 0
##$COROFFS= 0
##$CY= 12.5935478210449
##$DATMOD= 1
##$DC= 0
##$DFILT= <>
##$DTYPP= 0
##$F1P= 47.1127640792319
##$F2P= -24.0371245302204
##$FCOR= 0.5
##$FTSIZE= 32768
##$FT_mod= 6
##$GAMMA= 0
##$GB= 0
##$INTBC= 1
##$INTSCL= 7.269226e-011
##$ISEN= 30
##$LB= 15
##$LEV0= 0
##$LPBIN= 0
##$MAXI= 12.09355
##$MC2= 0
##$MEAN= 0
##$ME_mod= 0
##$MI= 0.7550151
##$NCOEF= 0
##$NC_proc= -14
##$NLEV= 6
##$NOISF1= 298.5841
##$NOISF2= 270.0111
##$NSP= 0
##$NTH_PI= 0
##$NZP= 0
##$OFFSET= 298.5841
##$PC= 1.4
##$PHC0= 110.3792
##$PHC1= 228.3749
##$PH_mod= 1
##$PKNL= yes
##$PPARMOD= 0
##$PPDIAG= 0
##$PPIPTYP= 0
##$PPMPNUM= 100
##$PPRESOL= 1
##$PSCAL= 0
##$PSIGN= 0
##$REVERSE= no
##$SF= 81.014009
##$SI= 32768
##$SIGF1= 270.0111
##$SIGF2= -158.5842
##$SINO= 77.54984
##$SIOLD= 32768
##$SREGLST= <31P.CDCl3>
##$SSB= 0
##$STSI= 32768
##$STSR= 0
##$SW_p= 37037.037037037
##$SYMM= 0
##$S_DEV= 0
##$TDeff= 32768
##$TDoff= 0
##$TI= <>
##$TILT= no
##$TM1= 0
##$TM2= 0
##$TOPLEV= 0
##$USERP1= <user>
##$USERP2= <user>
##$USERP3= <user>
##$USERP4= <user>
##$USERP5= <user>
##$WDW= 1
##$XDIM= 32768
##$YMAX_p= 249694480
##$YMIN_p= -44386120
$$ End of Bruker specific parameters
$$ ---------------------------------
##NTUPLES= NMR SPECTRUM
##VAR_NAME=  FREQUENCY,     SPECTRUM/REAL,   SPECTRUM/IMAG
##SYMBOL=    X,             R,               I
##VAR_TYPE=  INDEPENDENT,   DEPENDENT,       DEPENDENT
##VAR_FORM=  AFFN,          ASDF,            ASDF
##VAR_DIM=   32768,         32768,           32768
##UNITS=     HZ,            ARBITRARY UNITS, ARBITRARY UNITS
##FACTOR=    1.13031516577767, 1,            1
##FIRST=     37037.037037037, 16731310,      -8829093
##LAST=      0,             -2463345,        29763556
##MIN=       0,             -44386120,       0
##MAX=       37037.037037037, 249694480,     0
$$ Real data points
##PAGE= N=1
##DATA TABLE= (X++(R..R)), XYDATA
$$ [...]
16845a2912840O01959L21216J29155J3509n6783j09645j58455k02239k35212k63645
16835a2872980l17258m32392o10050p91862q88342q41109o64892m29875k05249
16826a8054009k5560R9126J68278J98337K30610L21285N27428Q96584J450147
16817a4187774K160549K936554L631741M077830M132303L734938K954964J982923
16809A1424028J055102L63497l78o3045N0237J70049J56222l9435l58769o84373
16799A2073135r08719r73218q69477o32878l44228j13397k3039p8714k23878l92320
16789G513267n35063o20417o35059n83248m73517l03648o4505K32429N34063P71032
16779E835334R14077R93915J052997J085926J042466Q84367O27310L28796M1772
$$ y = [-12912840, -12310881, -11989665, -11860510, -11847001, -11903784, -12013429, -12171884, -12374123, -12609335, -12872980, -13190238, -13622630, -14232680, -15024542, -15912884, -16753993, -17418885, -17848760, -18054009, -18079569, -17980443, -17812165, -17613828, -17383218, -17061933, -16534505, -15637921, -14187774, -12027225, -9090671, -5458930, -1381100, 2751203, 6486141, 9441105, 11424028, 12479130, 12842627, 12842249, 12779204, 12829441, 12999490, 13155712, 13116277, 12757508, 12073135, 11164416, 10191198, 9321721, 8688843, 8344615, 8231218, 8208179, 8129465, 7905587, 7513267, 6978204, 6357787, 5722728, 5139480, 4665963, 4362315, 4297810, 4530239, 5064302, 5835334, 6749411, 7743326, 8796323, 9882249, 10924715, 11809082, 12436392, 12765188, 12806960]
16770A2806960k14613m41050o32296p77675q77249r41007r73642r74742r51872
16761F022814r13489q45903p17329n15188k74245o5331N2377P7876N8768K6395
16751B906745m8051k19205m95056q10674j068719j198365j186015j061391q56445
16742d037176n83564k62134L1112J52820l7226n82792j397863k300685l075688
16733a2093196l544892l630847l368509k854047k183321j430224o55350Q3052
16725b9677334P18602J176277J403949J413353J274763J063826Q23360N75790
16717b1227414L52763J97892J40499J72700K56491L49280M17358M33250L75582
16708a8531599K36952K9272k19959m75309o96438q36558q44964o76709l09134
$$ y = [12806960, 12592347, 12151297, 11519001, 10741326, 9864077, 8923070, 7949428, 6974686, 6022814, 5109325, 4263422, 3546093, 3030905, 2756660, 2691329, 2743706, 2821582, 2880350, 2906745, 2858694, 2639489, 2144433, 1333759, 265040, -933325, -2119340, -3180731, -4037176, -4620740, -4882874, -4851762, -4698942, -4736168, -5318960, -6716823, -9017508, -12093196, -15638088, -19268935, -22637444, -25491491, -27674812, -29105036, -29760386, -29677334, -28958732, -27782455, -26378506, -24965153, -23690390, -22626564, -21803204, -21227414, -20874651, -20676759, -20536260, -20363560, -20107069, -19757789, -19340431, -18907181, -18531599, -18294647, -18265375, -18485334, -18960643, -19657081, -20493639, -21338603, -22015312, -22324446]
16699b2324446K33540Q63668J451713J876066K052754J938429J543934R56877
16691a1407465L21336k41356p03812j125526j577295k064400k506778k780792
16683b2086088k783012k479037j918563j210109m73509K01154P77016J270436
16675b8701712J721974K148842K511049K733874K783453K714440K626345K577706
16667h884029K550142K480218K311035K024479J651089J259802R18780O49225
16659D960741M21139J90921o6235l49455o38418r02784j110514j234303j260098
16650A0994j192535j054388q87147p48866p02074p93968j020211j282634j406541
16641i077370j251532q26664k90946J61400M22672N03873M84552M64426N52684
$$ y = [-22324446, -22090906, -21227238, -19775525, -17899459, -15846705, -13908276, -12364342, -11407465, -11086129, -11327485, -12031297, -13156823, -14734118, -16798518, -19305296, -22086088, -24869100, -27348137, -29266700, -30476809, -30950318, -30749164, -29972148, -28701712, -26979738, -24830896, -22319847, -19585973, -16802520, -14088080, -11461735, -8884029, -6333887, -3853669, -1542634, 481845, 2132934, 3392736, 4311516, 4960741, 5381880, 5572801, 5506566, 5157111, 4518693, 3615909, 2505395, 1271092, 10994, -1181541, -2235929, -3123076, -3871942, -4574016, -5367984, -6388195, -7670829, -9077370, -10328902, -11155566, -11446512, -11285112, -10862440, -10358567, -9874015, -9409589, -8856905]
16632h856905Q43967J354259J977702K528736K840896K835858K522517J954957
16624H001987J202700L62088m22619r83241j200655j068521o86309j85989L41611
16615E361052Q63593J370120J840346K242118K546106K729682K772496K645389
16607B2370902K296076J661687P31009l90854j498284k377293k885921k984121
16599A6923201k736988k291667j817458j441925j226604j179203j269624j440349
16591C519383j620709j744208j764163j667270j479975j257405j055936r10497
16583g980780q33535q20260q41136q41455p71664o28450m67400l76817m37801
16574a3999298o91094j106768j574533j951543k137094k096416j828627j344961
$$ y = [-8856905, -8012938, -6658679, -4680977, -2152241, 688655, 3524513, 6047030, 8001987, 9204687, 9566775, 9144156, 8160915, 6960260, 5891739, 5205430, 5019441, 5361052, 6224645, 7594765, 9435111, 11677229, 14223335, 16953017, 19725513, 22370902, 24666978, 26328665, 27059674, 26668820, 25170536, 22793243, 19907322, 16923201, 14186213, 11894546, 10077088, 8635163, 7408559, 6229356, 4959732, 3519383, 1898674, 154466, -1609697, -3276967, -4756942, -6014347, -7070283, -7980780, -8814315, -9634575, -10475711, -11317166, -12088830, -12717280, -13184680, -13561497, -13999298, -14690392, -15797160, -17371693, -19323236, -21460330, -23556746, -25385373, -26730334]
16566b6730334o93717L730N66783Q29297P15652K64077l97814j094399j647445
16557b8184170j923552j872064j531746j000477l90264K07371P34958J161190
16549c2798754J465420J637718J695557J692045J703586J803233K025715K338386
16541a8437094K639761K795740K703498K351976J838026J312796Q82205N42523
16533c370569K11622j85644o67335j204517j745893k228032k588970k790514k827199
16524a7397051k718756k497106k179627j732578j066302q8342J210618K684013
16516b3785131M020899M854776M958988M375770L371110K276616J340567O51159
16508B064754J46388k97763p52888j179671j470029j545098j411943j145840q53402
$$ y = [-26730334, -27424051, -27420321, -26853538, -26024241, -25308589, -25044512, -25442326, -26536725, -28184170, -30107722, -31979786, -33511532, -34512009, -34902273, -34694902, -33959944, -32798754, -31333334, -29695616, -28000059, -26308014, -24604428, -22801195, -20775480, -18437094, -15797333, -13001593, -10298095, -7946119, -6108093, -4795297, -3913092, -3370569, -3158947, -3344591, -4011926, -5216443, -6962336, -9190368, -11779338, -14569852, -17397051, -20115807, -22612913, -24792540, -26525118, -27591420, -27679762, -26469144, -23785131, -19764232, -14909456, -9950468, -5574698, -2203588, 73028, 1413595, 2064754, 2211142, 1913379, 1160491, -19180, -1489209, -3034307, -4446250, -5592090, -6445492]
16499f445492o41847n68308n98319o37044o08305m99566l55789k51096k47493
16490a0853259l59337n53134p70810r39568r69538p77567l41143K71694R35641
16481a4357021J536733K017269K365678K574068K616366K470247K155747J750789
16473C129876J366929J100571R94800J034274J165687J325653J457549J503033
16465A3078372J387454J034260L96835n25189j667570k863612l862094m463637
16457B514819m649173m537300m235305l763585l098607k254509j325354m58359
16449b1807373K14949O25802P63143O49450L37764p6072m64050p06601p26143
16440b1189131m94221k6770O24670J385471K164649K860061L382346L691047L804229
$$ y = [-6445492, -7087339, -7655647, -8253966, -8891010, -9499315, -9998881, -10354670, -10605766, -10853259, -11212596, -11765730, -12536540, -13476108, -14445646, -15223213, -15564356, -15292662, -14357021, -12820288, -10803019, -8437341, -5863273, -3246907, -776660, 1379087, 3129876, 4496805, 5597376, 6592176, 7626450, 8792137, 10117790, 11575339, 13078372, 14465826, 15500086, 15896921, 15371732, 13704162, 10840550, 6978456, 2514819, -2134354, -6671654, -10906959, -14670544, -17769151, -20023660, -21349014, -21807373, -21592424, -20966622, -20203479, -19554029, -19216265, -19292337, -19756387, -20462988, -21189131, -21683352, -21710122, -21085452, -19699981, -17535332, -14675271, -11292925, -7601878, -3797649]
16431c797649L758633L545653L085597K288233J165884j10109j273755k089186
16423F573301k435425k314336j806383j021189p7359Q91410J729869K279332K429311
16414F248531K177475J642943J004262M04498j05020n51865r85203j418699j810811
16405F606111k099735k263804k342572k393944k434267k422322k299811k047914
16397a1698258j707016j346732j026968p87956o60653o65689p85745r32210r42600
16388b0553827o22121J78512J457520K975619M294044M988731M907779M239186
16380A865443L332265K462032J722606J074759M64659j00810n73485r19698j141068
16371H186703j262256j321395j367822j447507j572679j700131j747339j641345
$$ y = [-3797649, -39016, 3506637, 6592234, 8880467, 10046351, 9936242, 8662487, 6573301, 4137876, 1823540, 17157, -1004032, -1081391, -189981, 1539888, 3819220, 6248531, 8426006, 10068949, 11073211, 11477709, 11372689, 10820824, 9835621, 8416922, 6606111, 4506376, 2242572, -100000, -2493944, -4928211, -7350533, -9650344, -11698258, -13405274, -14752006, -15778974, -16566930, -17227583, -17893272, -18679017, -19611227, -20553827, -21175948, -20997436, -19539916, -16564297, -12270253, -7281522, -2373743, 1865443, 5197708, 7659740, 9382346, 10457105, 10921764, 10820954, 10247469, 9327771, 8186703, 6924447, 5603052, 4235230, 2787723, 1215044, -485087, -2232426, -3873771]
16363c873771j358129r18979l62624K59099Q61015J331717J580473J573525J334109
16354D26435R33825M85979J15991q8575j09860N016J79228L58037N40408P59425
16344C605909J036187J350620J636886J795322J719877J342678O81823j49415
16336A3019887r91127j695870k150639k282032k084563j653410j168966q23207
16328A70073p33907r01115j224965j566154j810665j902615j839104j652746j401278
16319a2862476j156227r84357r36228j045029j311762j671777j977957k025551
16311b3971364j603013n64101J051587K905295M433607N161802M989530M180320
16303c416337L130911K170262J492047J159674J118195J220370J294631J232221
$$ y = [-3873771, -5231900, -6150879, -6513503, -6254404, -5393389, -4061672, -2481199, -907674, 426435, 1360260, 1846239, 1962230, 1873655, 1763795, 1768811, 1948039, 2306076, 2846484, 3605909, 4642096, 5992716, 7629602, 9424924, 11144801, 12487479, 13169302, 13019887, 12028760, 10332890, 8182251, 5900219, 3815656, 2162246, 993280, 170073, -563834, -1464949, -2689914, -4256068, -6066733, -7969348, -9808452, -11461198, -12862476, -14018703, -15003060, -15939288, -16984317, -18296079, -19967856, -21945813, -23971364, -25574377, -26138478, -25086891, -22181596, -17747989, -12586187, -7596657, -3416337, -285426, 1884836, 3376883, 4536557, 5654752, 6875122, 8169753, 9401974]
16295I401974J037533Q06150O40220N61441M98356L64688J55835k3542j5272L02647
16285A3730030R46096J804149K674075L341180L667663L632227L293907K725454
16277C5814781J981838J117874K13846o32637j342400j877623k234299k419238
16269C0622142k431532k262603j913107j407742p91244j01987O60652J537648
16261B3912227K561070L693842M821785N810736O563708P006749P029267O487342
16253F7886726N312708L632635J779126J54687r69050j574339j856089k078335
16245G2288069k440147k998539l659781m249980m626957m751627m677073m481417
16237D0402548m210901l885041l534317l200593k903211k630570k368076k117694
$$ y = [9401974, 10439507, 11245657, 11885877, 12447318, 12945674, 13310362, 13466197, 13442655, 13427383, 13730030, 14676126, 16480275, 19154350, 22495530, 26163193, 29795420, 33089327, 35814781, 37796619, 38914493, 39128339, 38495702, 37153302, 35275679, 33041380, 30622142, 28190610, 25928007, 24014900, 22607158, 21815914, 21713927, 22374579, 23912227, 26473297, 30167139, 34988924, 40799660, 47363368, 54370117, 61399384, 67886726, 73199434, 76832069, 78611195, 78765882, 77796832, 76222493, 74366404, 72288069, 69847922, 66849383, 63189602, 58939622, 54312665, 49561038, 44883965, 40402548, 36191647, 32306606, 28772289, 25571696, 22668485, 20037915, 17669839, 15552145]
16229A5552145j887283j671205j440660j150452p62379k64661L26042R63965J571681
16220A1237193K062011K382738K533689K534883K397180K135399J789287J409146
16212B8481526J024931O41239K60292r4181l75698n48269o33218p17714r01324
16203B7137584j220116j611092j944291k097766k020823j745421j354861r46905
16195A4196309o07455l90022l02469l04821l18646k56639p5248J85337M21461
16186A2547807N35488M86493K82775m9697m76545r44439j384185j739769j991179
16177G266749k135026k146157j983704j645760j200986p56589l98484j49113M2863
16168c106207K77144O41463J148768J716874K204911K488726K530966K384406
$$ y = [15552145, 13664862, 11993657, 10552997, 9402545, 8640166, 8375505, 8701547, 9665512, 11237193, 13299204, 15681942, 18215631, 20750514, 23147694, 25283093, 27072380, 28481526, 29506457, 30147696, 30407988, 30313807, 29938109, 29389840, 28756622, 28038908, 27137584, 25917468, 24306376, 22362085, 20264319, 18243496, 16498075, 15143214, 14196309, 13588854, 13198832, 12896363, 12591542, 12272896, 12016257, 11941009, 12126346, 12547807, 13083295, 13569788, 13852563, 13802866, 13326321, 12381882, 10997697, 9257928, 7266749, 5131723, 2985566, 1001862, -643898, -1844884, -2601473, -2999957, -3149070, -3106207, -2829063, -2187600, -1038832, 678042, 2882953, 5371679, 7902645, 10287051]
16160A0287051K118409J758694J322228Q96322O51535P57115J268801K081200
16152B1141355K975436L713857M116509M099415L683068K968933K089654J163258
16144D5951485K75375n18827j190618j732792k146264k423698k553190k548218
16136C3113253k464570k366645k278007k187856k109661k105713k234445k477542
16128A4888814k719970k800262k596889k093391j380439n98870J31221P45743
16120C575957J220115J534364J669721J636686J485939J280631J063064Q48525
16112A4315002O36958M22427K02595j0823j94899l33151m27902m95751n58349
16103A3556107o36079p35193q35466r03759r24175r03821q50756p63562o44147
$$ y = [10287051, 12405460, 14164154, 15486382, 16382704, 17034239, 17791354, 19060155, 21141355, 24116791, 27830648, 31947157, 36046572, 39729640, 42698573, 44788227, 45951485, 46226860, 45708033, 44517415, 42784623, 40638359, 38214661, 35661471, 33113253, 30648683, 28282038, 26004031, 23816175, 21706514, 19600801, 17366356, 14888814, 12168844, 9368582, 6771693, 4678302, 3297863, 2698993, 2830214, 3575957, 4796072, 6330436, 8000157, 9636843, 11122782, 12403413, 13466477, 14315002, 14951960, 15374387, 15576982, 15566159, 15371260, 15038109, 14610207, 14114456, 13556107, 12920028, 12184835, 11349369, 10445610, 9521435, 8617614, 7766858, 7003296, 6359149]
16094F359149m98902l14874n7490K73757N83932P07517N20802K6420o71357j443499
16084E485455k180274k801521l262018l550715l676001l639701l414892k960863
16076b0000530k282214j472909o85471m8229L96513O99643R74691J342225J852528
16067a9223753K425951K877389L034510K857441K452843J982906J564124J229734
16059g98855R62738P57412O43637O49596P58657R20812J101117J302489J537045
16050G834648J776090J927656J871891J533323R27014J45160o85067j432464j976021
16041A1922230k219810k120738j714942j115452m79675K8813K75885K00660j45806
16032D631165o09771j008997j227783j259729j166241j001901p84522n17585k13759
$$ y = [6359149, 5860247, 5545373, 5487883, 5761640, 6345572, 7053089, 7573891, 7600311, 6928954, 5485455, 3305181, 503660, -2758358, -6309073, -9985074, -13624775, -17039667, -20000530, -22282744, -23755653, -24441124, -24489353, -24092840, -23393197, -22418506, -21076281, -19223753, -16797802, -13920413, -10885903, -8028462, -5575619, -3592713, -2028589, -798855, 163883, 921295, 1564932, 2214528, 2973185, 3893997, 4995114, 6297603, 7834648, 9610738, 11538394, 13410285, 14943608, 15870622, 16015782, 15330715, 13898251, 11922230, 9702420, 7581682, 5866740, 4751288, 4271613, 4300426, 4576311, 4776971, 4631165, 4021394, 3012397, 1784614, 524885, -641356, -1643257, -2427779, -2945364, -3159123]
16023c159123J03433L97453O08225O62378N18184K12470j37927l93851m68280
16014a657038l54337r4455K55902O31850R61038J192778J317905J347203J284995
16005D885841J136417R28538P11437N37898M38213M01239L77381L18139K22006
15996I957109J34997J08169J60635K77292M29395N90214P31209Q09766P70283
15987A3969069N67254K02644k46240o42074q49396p99704n16394r3965L48696
15978A1939890P13742R42808J001009Q53672M77306r4474p44749j315332j691278
15969A2082594j838838j756258j417176p97355N2002R87766J836330K465025K809424
15960A4423514K863203K658522K249300J698215J065633M04473k33948p96162
$$ y = [-3159123, -3055690, -2658237, -2050012, -1387634, -869450, -656980, -794907, -1188758, -1657038, -2011375, -2105830, -1849928, -1218078, -257040, 935738, 2253643, 3600846, 4885841, 6022258, 6950796, 7662233, 8200131, 8638344, 9039583, 9416964, 9735103, 9957109, 10092106, 10200275, 10360910, 10638202, 11067597, 11657811, 12389020, 13198786, 13969069, 14536323, 14738967, 14492727, 13850653, 13001257, 12201553, 11685159, 11591194, 11939890, 12653632, 13596440, 14597449, 15451121, 15928427, 15833953, 15089204, 13773872, 12082594, 10243756, 8487498, 7070322, 6272967, 6324969, 7312735, 9149065, 11614090, 14423514, 17286717, 19945239, 22194539, 23892754, 24958387, 25362860, 25128912, 24332750]
15952B4332750j238049j541024j715187j784754j776701j731003j698590j695851
15944A1151591j668544j524699j199632o86946l2607O82088J361922J920083K294013
15935A2297269K457916K431431K268047K019552J707047J329428Q95960M45393
15927B5852043L8625k59333l93403l39559j38758R6726K42852K51632J77127J08312
15917B5636264Q8480J06393J41760J95259K76255L71176M36404M33755L64157
15908B8049903K56179J33865N466j31306k90781m97892p60639j038528j250025
15899B4476242j309975j160153p88647k48080L41112Q28306J103221J142850R93175
15890B5378051P17143L65498k0610m02030p45264j034864j280609j505043j717339
$$ y = [24332750, 23094701, 21553677, 19838490, 18053736, 16277035, 14546032, 12847442, 11151591, 9483047, 7958348, 6758716, 6071770, 6039163, 6721251, 8083173, 10003256, 12297269, 14755185, 17186616, 19454663, 21474215, 23181262, 24510690, 25406650, 25852043, 25890668, 25631335, 25237932, 24898373, 24759615, 24856341, 25099193, 25350825, 25527952, 25636264, 25724744, 25831137, 25972897, 26168156, 26444411, 26815587, 27251991, 27685746, 28049903, 28306082, 28439947, 28445413, 28314107, 28023326, 27525434, 26764795, 25726267, 24476242, 23166267, 22006114, 21217467, 20969387, 21310499, 22138805, 23242026, 24384876, 25378051, 26095194, 26460692, 26440082, 26038052, 25292788, 24257924, 22977315, 21472272, 19754933]
15881A9754933j897031k001569j987289j819826j474973r60517l50419K28496
15873I491805O66812R27856J034600J016403Q84032O52973L64580P3101j79302
15864A4932860l81635n59337p52955r87920j270423j600315j967383k337286k653816
15855B421790k854895k887251k720744k364140j870273j321108q00019l70733
15847a2767373p4545O6392N2957q8519l14072n73178q18608j023593j201707j403685
15837a8145931j679062k018333k311122k371652k043378j309043l17034O90608
15829b9504947J495689J993222K197350K177618J998938J705319J328926R05483
15821a5702402M87736J42918o7094j00367O9419M52222J012097J637055K159843
$$ y = [19754933, 17857902, 15856333, 13869044, 12049218, 10574245, 9613728, 9263309, 9491805, 10158617, 11086473, 12121073, 13137476, 14021508, 14674481, 15039061, 15112162, 14932860, 14551225, 13991888, 13238933, 12251013, 10980590, 9380275, 7412892, 5075606, 2421790, -433105, -3320356, -6041100, -8405240, -10275513, -11596621, -12396640, -12767373, -12841918, -12775526, -12722569, -12811088, -13125160, -13698338, -14516946, -15540539, -16742246, -18145931, -19824993, -21843326, -24154448, -26526100, -28569478, -29878521, -30195555, -29504947, -28009258, -26016036, -23818686, -21641068, -19642130, -17936811, -16607885, -15702402, -15214666, -15071748, -15138842, -15239209, -15169790, -14717568, -13705471, -12068416, -9908573]
15812i908573K434708K413013K157672J795953J452678J199120J033938Q99918
15804C478427P35166N31539L46072K57010L16769N33477Q72076J273863J691909
15795A0036308K107054K498578K797809K880110K624845K007920J145402K36565
15787B6334591n54485j175727j663408k060577k364867k542818k574116k470411
15779A0928182k259513j966499j609729j208095p99157m53574k51989k26498l22115
15770A831013m24247m34431l26298j27817J44879N13690R85508J491105J900831
15761E554233K101201K054061J802636J438931J058251P29264M92098L67129L52633
15752A5950437M12611M78957M80614L75978J59231j58094n63454j037967j540473
$$ y = [-9908573, -7473865, -5060852, -2903180, -1107227, 345451, 1544571, 2578509, 3478427, 4213593, 4745132, 5091204, 5348214, 5664983, 6198460, 7070536, 8344399, 10036308, 12143362, 14641940, 17439749, 20319859, 22944704, 24952624, 26098026, 26334591, 25780106, 24604379, 22940971, 20880394, 18515527, 15972709, 13398593, 10928182, 8668669, 6702170, 5092441, 3884346, 3085189, 2631615, 2379626, 2153128, 1831013, 1406766, 972335, 646037, 518220, 663099, 1176789, 2162297, 3653402, 5554233, 7655434, 9709495, 11512131, 12951062, 14009313, 14738577, 15230675, 15597804, 15950437, 16363048, 16842005, 17322619, 17698597, 17857828, 17699734, 17136280, 16098313, 14557840]
15743A4557840k005937k361921k546576k524348k305418j957021j585606j288739
15735b017726j108520j023999r81373r29396q39364p13960n87507n12521n35914
15726i250280o70359q73478j058787j137673j060691q41179n60985l39133k57802
15717a6050367k99024l53820k99497p5489K98555P47854J171831J472819J595043
15708a1792095J557080J439634J321584J212341J044935P43260K97411k29138
15700d404988p52391j208462j547371j711625j642247j314038p63319q5322N89138
15691a2840625J132973J471265J599272J551877J367746J077056O91749K01234
15683c747453l92268j017177j527698j778313j716559j415490j026536o89356
$$ y = [14557840, 12551903, 10189982, 7643406, 5119058, 2813640, 856619, -728987, -2017726, -3126246, -4150245, -5131618, -6061014, -6900378, -7614338, -8201845, -8714366, -9250280, -9920639, -10794117, -11852904, -12990577, -14051268, -14892447, -15453432, -15792565, -16050367, -16349391, -16703211, -17002708, -17078197, -16779642, -16031788, -14859957, -13387138, -11792095, -10235015, -8795381, -7473797, -6261456, -5216521, -4473261, -4175850, -4404988, -5157379, -6365841, -7913212, -9624837, -11267084, -12581122, -13344441, -13429763, -12840625, -11707652, -10236387, -8637115, -7085238, -5717492, -4640436, -3948687, -3747453, -4139721, -5156898, -6684596, -8462909, -10179468, -11594958, -12621494, -13310850]
15675a3310850m58824l03279j68893l6525Q5864K08618L74810O16044Q95118J104426
15665a0993491J136954R71197O85486L85258J26852q8899k79715m53034n91299
15656i100691o50804n85062l82993q8163K23891M89000O73330P59099P31443N90293
15646g340657L65874J07695j42511l61443n30657o20930o00161m62573k49634
15637i834997m0459Q7483J02719L3717n7438j16494j19221o0134O8727K75306
15627i660791N47032Q44787J115069J301119J351383J233237R51740N66864J90265
15618a559295n8783j19799j8300J79213M34213P60336J191035J719934K252384
15609D780938K619568K671580K379212J851931J259710P26494K67820j92593p35242
$$ y = [-13310850, -13769674, -14072953, -14241846, -14278371, -14192507, -13983889, -13609079, -12993035, -12097917, -10993491, -9856537, -8885340, -8199854, -7814596, -7687744, -7776643, -8056358, -8509392, -9100691, -9751495, -10336557, -10719550, -10807713, -10583822, -10094822, -9421492, -8662393, -7930950, -7340657, -6974783, -6867088, -7009599, -7371042, -7901699, -8522629, -9122790, -9585363, -9834997, -9875456, -9787973, -9685254, -9651537, -9708975, -9825469, -9944690, -10004824, -9936097, -9660791, -9113759, -8268972, -7153903, -5852784, -4501401, -3268164, -2316424, -1749560, -1559295, -1618078, -1737877, -1756177, -1576964, -1142751, -382415, 808620, 2528554, 4780938, 7400506, 10072086, 12451298, 14303229, 15562939, 16289433, 16557253, 16364660, 15629418]
15600A5629418j346302j893249k200805k160251j786229j195868n43987M0974
15592D543701M88148P69454Q64096P45923M05878j14957p17293j280101j718128
15583C986721k006399k150483k142449j950994j554145r81024l20424L10855Q12431
15574e995911J133239J284256J325814J335432J379678J502235J713118J968566
15566E646427K168307K201671K012124J617888J085140M97710n9317n11788q01673
15557A3856489q85449p42277l95647O8607N07884P63734P30121M11101q1549n95963
15547A3637051j014360j283879j410425j432938j389275j296984j158652r75868
15539C674670p60465n44220l80130l24234m04127n95435q25946j009691j088166
$$ y = [15629418, 14283116, 12389867, 10189062, 8028811, 6242582, 5046714, 4502727, 4543701, 5031849, 5801303, 6665399, 7411322, 7817200, 7702243, 6984950, 5704849, 3986721, 1980322, -170161, -2312610, -4263604, -5817749, -6798773, -7119197, -6808342, -5995911, -4862672, -3578416, -2252602, -917170, 462508, 1964743, 3677861, 5646427, 7814734, 10016405, 12028529, 13646417, 14731557, 15229267, 15169950, 14658162, 13856489, 12971040, 12228763, 11833116, 11901723, 12409607, 13173341, 13903462, 14314563, 14233014, 13637051, 12622691, 11338812, 9928387, 8495449, 7106174, 5809190, 4650538, 3674670, 2914205, 2369985, 1989855, 1665621, 1261494, 666059, -159887, -1169578, -2257744]
15530b257744j046850q99963o71988l95111j01821J96091N13782Q72107J271970
15521b519527J684180K051638K303527K385132K278804J988485J512975Q52155
15513A2537369M5840p92300j486827j871312j871945j536092r94165l97078J34527
15504C768017N34788P86628R01230R11660Q82237R00748J033863J276573J549235
15495A2544979J751998J818744J718083J428462R46934L34149k65284o78437q05424
15486A8794204o78453m31282k16134j35185k14853m11909o40705q15050q81247
15477A4369386q18005o18288k89725J24729N41328Q67875J053423J116738J134529
15468A7481990J196003J348291J568657J783641J912562J895062J696972J317200
$$ y = [-2257744, -3304594, -4204557, -4876545, -5271656, -5373477, -5177386, -4663604, -3791497, -2519527, -835347, 1216291, 3519818, 5904950, 8183754, 10172239, 11685214, 12537369, 12583209, 11790909, 10304082, 8432770, 6560825, 5024733, 4030568, 3633490, 3768017, 4302805, 5089433, 5990663, 6902323, 7784560, 8685308, 9719171, 10995744, 12544979, 14296977, 16115721, 17833804, 19262266, 20209200, 20543349, 20278065, 19599628, 18794204, 18115751, 17684469, 17468335, 17333150, 17118297, 16706388, 16065683, 15250633, 14369386, 13551381, 12933093, 12643368, 12768097, 13309425, 14177300, 15230723, 16347461, 17481990, 18677993, 20026284, 21594941, 23378582, 25291144, 27186206, 28883178, 30200378]
15460C0200378P97499K19688l07623o72158q00856p01090m54567j59101J25319
15451B8247489L78560N97326P89569R71807J144451J267442J273491J115875Q09961
15442C6595971M33275Q5559j57710k68085k59515j68896l6927R7654J92126K04544
15432C6717996J18532l7224k00375l12976l62545l97612m98539p17286j029672
15423C3280299j337615j518753j482340j194761o81895l4192N90847J001939J052384
15414B9675913P15497R1734o57180j387050k010148k493356k841829l077411l211237
15405A4804933l231604l121567k887032k569654k232182j920522j634565j344068
15397d136261j031571p05465l78471o0127K28849M57077O03211O68311O66583
$$ y = [30200378, 30997877, 31217565, 30909942, 30237784, 29436928, 28735838, 28281271, 28122170, 28247489, 28626049, 29223375, 30012944, 30984751, 32129202, 33396644, 34670135, 35786010, 36595971, 37029246, 37114805, 36957095, 36689010, 36429495, 36260599, 36223672, 36321326, 36513452, 36717996, 36836528, 36799304, 36598929, 36285953, 35923408, 35525796, 35027257, 34309971, 33280299, 31942684, 30423931, 28941591, 27746830, 27064935, 27030743, 27621590, 28623529, 29675913, 30391410, 30483144, 29825964, 28438914, 26428766, 23935410, 21093581, 18016170, 14804933, 11573329, 8451762, 5564730, 2995076, 762894, -1157628, -2792193, -4136261, -5167832, -5873297, -6251768, -6311895, -6083046, -5625969, -5022758, -4354447, -3687864]
15388c687864O04859M73148K65017Q409k36873m20829n40011o21173o58900n78782
15378e392999k83361K58556R72866J721727K372101K835460L065583L036143K735672
15369A1321748K188919J471045O89797m6988o45901j020271j089539q14152k55627
15360A1799031L96701Q86720J015015P30807J29403o20936j352297j922398k210722
15351H851324k142097j733345j098414l97762K18973O44913Q28798P77039N41583
15342F491012K04220j27529l34500l32185j19905K13608N39304P59295Q50722
15333H144042Q54623Q23479P71258O72776N07895K86920L0321k48786n33514p93205
15323A0515809r88811j082371j050753r02185o77041m27546j98847k0054J11413
$$ y = [-3687864, -3083005, -2609857, -2344840, -2336431, -2573304, -2994133, -3534144, -4155317, -4814217, -5392999, -5676360, -5417804, -4444938, -2723211, -351110, 2484350, 5549933, 8586076, 11321748, 13510667, 14981712, 15671509, 15624521, 14978620, 13958349, 12868810, 12054658, 11799031, 12195732, 13082452, 14097467, 14828274, 14957677, 14336741, 12984444, 11062046, 8851324, 6709227, 4975882, 3877468, 3479706, 3698679, 4343592, 5172390, 5949429, 6491012, 6695232, 6567703, 6233203, 5901018, 5781113, 5994721, 6534025, 7293320, 8144042, 8998665, 9822144, 10593402, 11266178, 11774073, 12060993, 12091314, 11842528, 11309014, 10515809, 9526998, 8444627, 7393874, 6491689, 5814648, 5387102, 5188255, 5168201, 5279614]
15314E279614K40953M27467O86961R71843J214741J394551J556731J765487K036996
15305A5575344K313087K482151K425801K079703J485723P90719J75087k42003
15297B7085612m45510m89110m35825l39001k53701k29292k81555l87985n22285
15288B3701348o84700q86529j113751j324766j485978j594332j657024j660625
15280A3293643j574066j385967j136293q99027p21664n82072m08280j44667J89373
15271F630980M97314O67898O50322M80942K58312R6650O6697J38746J79040L2036
15261I698937l61712r12876j441888j792683j906084j805551j527088j069931
15253a118876m21171L74213J186406J855668K270080K399101K282186J999085
$$ y = [5279614, 5520567, 5948034, 6634995, 7606838, 8821579, 10216130, 11772861, 13538348, 15575344, 17888431, 20370582, 22796383, 24876086, 26361809, 27152528, 27327615, 27085612, 26640102, 26150992, 25715167, 25376166, 25122465, 24893173, 24611618, 24223633, 23701348, 23016648, 22130119, 21016368, 19691602, 18205624, 16611292, 14954268, 13293643, 11719577, 10333610, 9197317, 8298290, 7576626, 6994554, 6586274, 6441607, 6630980, 7128294, 7796192, 8446514, 8927456, 9185768, 9282418, 9349115, 9487861, 9666901, 9698937, 9337225, 8424349, 6982461, 5189778, 3283694, 1478143, -48945, -1118876, -1540047, -1165834, 20572, 1876240, 4146320, 6545421, 8827607, 10826692]
15245A0826692J630783J224453P89398L23803j64839o63158j154159j599744j925600
15236I287629k042091j892982j487999r00889k52592L12206O66072P44212N64038
15227D997604K16079j61872m27256m83731l13742K7881M54884Q92591J283097
15218F485535J559207J639706J465087J033217M03378l12816r62513j394354j532812
15209H383635j423006j197339r85728q43983p55085o76447n70417m07453j68530
15200A355647J45764N05575Q50789J112713J248812J257631J165208J004286Q00913
15191I447338N73101L44355J53241L3069k0043m3818o7509p3162J1890K86701
15181A0645163Q14256J553216K337527K938262L176125L000963K486484J763990
$$ y = [10826692, 12457475, 13681928, 14471326, 14795129, 14630290, 13967132, 12812973, 11213229, 9287629, 7245538, 5352556, 3864557, 2963668, 2711076, 3023282, 3689354, 4433566, 4997604, 5213683, 5051811, 4624555, 4140824, 3827082, 3854963, 4309847, 5202438, 6485535, 8044742, 9684448, 11149535, 12182752, 12586130, 12273314, 11310801, 9916447, 8383635, 6960629, 5763290, 4777562, 3933579, 3178494, 2502047, 1931630, 1524177, 1355647, 1501411, 2006986, 2857775, 3970488, 5219300, 6476931, 7642139, 8646425, 9447338, 10020439, 10364794, 10518035, 10551104, 10531061, 10487243, 10419734, 10346572, 10358462, 10645163, 11459419, 13012635, 15350162, 18288424, 21464549, 24465512, 26951996, 28715986]
15173B8715986R49476J01871p71543j673223k569673l370602l945384m174547
15165A3262361m016496l549154k944122k375355j925793j568605j238852r21041
15157e277057o59560m86942l61567j97483M1435K94955M65560N14352M94455N07543
15147d664309O36762R04795J271735J663314K010315K274024K440263K501008
15139I037907K456700K325285K122969J836125J439067R54332M78530J32872o974
15130B0776813N7476K56226M85174O57699P48602P89548Q14418Q14775P52208
15121B6152939O02577L80131J32118p4452j72341j29099K0418J74290K10088N9718
15111B7356387k45328o06468r35258j193584j366335j419952j312705j046666
$$ y = [28715986, 29665462, 29767333, 28995790, 27322567, 24752894, 21382292, 17436908, 13262361, 9245865, 5696711, 2752589, 377234, -1548559, -3117164, -4356016, -5277057, -5936617, -6423559, -6785126, -6982609, -6941174, -6646219, -6180659, -5666307, -5171852, -4664309, -4027547, -3122752, -1851017, -187703, 1822612, 4096636, 6536899, 9037907, 11494607, 13819892, 15942861, 17778986, 19218053, 20172385, 20650915, 20783787, 20776813, 20834289, 21090515, 21575689, 22233388, 22981990, 23771538, 24585956, 25400731, 26152939, 26755516, 27135647, 27267765, 27193313, 27020972, 26891873, 26912291, 27086581, 27296669, 27356387, 27111059, 26504591, 25569333, 24375749, 23009414, 21589462, 20276757, 19230091]
15103A9230091o91653l53085j22701m7274j16004k71817m52054o22344p64734
15094A5788425q44551q05668n98440k15267K86831P99215J207293J422094J376244
15085A8416176J026507L91382m17179j217913j829164k133301k110623j838784
15077A0287101j446372j039206o63148l24185j3148K92753O21495R80520J343472
15068A0039282J660308J872107J922728J777965J449779J004616N47363J94546
15060B0468694M5757J47406M57174Q41219J119661J138424Q34317K60930m46314
15051B4867268j139582j704633k076769k263808k362068k506910k766305l072879
15043F974314l261918l179431k771425k099219j292155m82223K48952Q96502J517310
$$ y = [19230091, 18538438, 18185353, 18062652, 18015378, 17899374, 17627557, 17175503, 16553159, 15788425, 14943874, 14138206, 13539766, 13324499, 13611330, 14410545, 15617838, 17039932, 18416176, 19442683, 19834065, 19416886, 18198973, 16369809, 14236508, 12125885, 10287101, 8840729, 7801523, 7138375, 6814190, 6801042, 7093795, 7715290, 8695810, 10039282, 11699590, 13571697, 15494425, 17272390, 18722169, 19726785, 20274148, 20468694, 20514451, 20661857, 21119031, 21960250, 23079911, 24218335, 25052652, 25313582, 24867268, 23727686, 22023053, 19946284, 17682476, 15320408, 12813498, 10047193, 6974314, 3712396, 532965, -2238460, -4337679, -5629834, -6112057, -5863105, -4966603, -3449293]
15034c449293K173366K866684L514760L989968M191834M091673L724510L154867
15026B4258369K452584J692235R60476L47142q2827l11852l56521k28979P6304
15017B8806931N51108J134702J702356K091321K164765J883080J329438O65822
15009D0329523M5543m59375q63754j216952j557038j901208k241717k536342k719810
15000B6878870k740049k585036k270559j812857j236438o07441l3120L87430O09561
14991A6590361O40036N01345K11038k08259p07938j202385j580477j741758j637077
14982A0864886j287750p77729k21419K88403P27435J143287J603015K121700K632692
14973A7094520L021676L190126L099955K778441K299522J765204J282315R21460
$$ y = [-3449293, -1275927, 1590757, 5105517, 9095485, 13287319, 17378992, 21103502, 24258369, 26710953, 28403188, 29363664, 29710806, 29627979, 29316127, 28959606, 28730627, 28806931, 29358039, 30492741, 32195097, 34286418, 36451183, 38334263, 39663701, 40329523, 40375066, 39915691, 39051937, 37834985, 36277947, 34376739, 32135022, 29598680, 26878870, 24138821, 21553785, 19283226, 17470369, 16233931, 15626490, 15593370, 15980800, 16590361, 17230397, 17731742, 17942780, 17734521, 17026583, 15824198, 14243721, 12501963, 10864886, 9577136, 8799407, 8577988, 8866391, 9593826, 10737113, 12340128, 14461828, 17094520, 20116196, 23306322, 26406277, 29184718, 31484240, 33249444, 34531759, 35453219]
14965C5453219O81155M98057L06207R5542q6530j89162k11562k10872k64406m13287
14955C5658361o22957p93759q24607o81023m05228n8999L38862Q09004J346054
14946C4765708J870036K253110K396527K288152K001335J649926J329155J063883
14938D9617832P95459M24645j24992q67473j742561k624501l358037l815641l942830
14929C4361901l760645l332644k735339k052201j372055p73092l01816L2677K45745
14920B0312531L65145M34273N10427O35524Q04166R68576J072540J075922R61831
14911B7140935P48597N03661L19530K41408K12570J08692j59205n66361r85055
14902B7564772j265114j319445j168771r30198p48770p03072p48427p38139n17158
$$ y = [35453219, 36134374, 36632431, 36938638, 37034180, 36947650, 36758488, 36546926, 36336054, 36071648, 35658361, 35035404, 34241645, 33417038, 32736015, 32330787, 32271788, 32610650, 33419654, 34765708, 36635744, 38888854, 41285381, 43573533, 45574868, 47224794, 48553949, 49617832, 50413291, 50837936, 50712944, 49845471, 48102910, 45478409, 42120372, 38304731, 34361901, 30601256, 27268612, 24533273, 22481072, 21109017, 20335925, 20034109, 20066786, 20312531, 20677676, 21111949, 21622376, 22257900, 23062066, 24030642, 25103182, 26179104, 27140935, 27889532, 28393193, 28712723, 28954131, 29166701, 29275393, 29116188, 28549827, 27564772, 26299658, 24980213, 23811442, 22881244, 22132474, 21429402, 20680975, 19942836, 19425678]
14893A9425678m1402N64174J071946J296044J192848Q49101M01406l3434l90183
14884B4336178o61368q78096j066717j213395j273431j216331j049069p85087
14876A6192684m08885J00577P07877J296721J721421J895542J841313J661133
14868B5008383J465905J320901J230124J141421R59800N84821j4386p30946j339110
14859B9626913j612864j452925r26393k17755M52442R00181J017442P75500K17214
14850B8779755n46538j342544j954056k172642j894090j205671l60403L75451
14842A9679262Q68759J142629J292940J389979J441018J423539J335904J212355
14834B9786385J103222J049889J068751J147240J256578J371069J470879J527847
$$ y = [19425678, 19384276, 19948450, 21020396, 22316440, 23509288, 24358389, 24759795, 24726361, 24336178, 23674810, 22796714, 21729997, 20516602, 19243171, 18026840, 16977771, 16192684, 15783799, 15884376, 16592253, 17888974, 19610395, 21505937, 23347250, 25008383, 26474288, 27795189, 29025313, 30166734, 31126534, 31711355, 31696969, 30966023, 29626913, 28014049, 26561124, 25634731, 25416976, 25869418, 26769599, 27787041, 28562541, 28779755, 28233217, 26890673, 24936617, 22763975, 20869885, 19664214, 19303811, 19679262, 20548021, 21690650, 22983590, 24373569, 25814587, 27238126, 28574030, 29786385, 30889607, 31939496, 33008247, 34155487, 35412065, 36783134, 38254013, 39781860]
14826C9781860J496732J325007R78887M77176q6419n65076q31927q55412p16107
14817D1004721n55998n06364o38457r38255j302992j583050j659913j498575j139737
14808C1181380o58551j21303M48273J070464J763678K492361L164723L676262
14800D3017287L952060L963246L730006L318893K821965K324724J887210J537164
14792F6552555J259163R90133O51244K10686k82093p29899j049356j200675j179480
14783F5222278j001586p02944l55635p6031O633j84930o31514j234834j875850
14774E9165587k464466k955527l330595l561455l591200l362411k871423k192684
14766C4835826j446576p39780j30976L57835P15833R38731J037816J037148R59818
$$ y = [39781860, 41278592, 42603599, 43582486, 44059662, 43973243, 43408167, 42576240, 41720828, 41004721, 40448723, 39942359, 39303902, 38365647, 37062655, 35479605, 33819692, 32321117, 31181380, 30522829, 30401526, 30849799, 31920263, 33683941, 36176302, 39341025, 43017287, 46969347, 50932593, 54662599, 57981492, 60803457, 63128181, 65015391, 66552555, 67811718, 68801851, 69453095, 69663781, 69381688, 68651789, 67602433, 66401758, 65222278, 64220692, 63517748, 63162113, 63086082, 63092715, 62907785, 62276271, 61041437, 59165587, 56701121, 53745594, 50414999, 46853544, 43262344, 39899933, 37028510, 34835826, 33389250, 32649470, 32518494, 32876329, 33592162, 34530893, 35568709, 36605857, 37565675]
14757C7565675Q21550O29032L77328O5126k71663n48959o76617o24135m49558
14748C6887779k69067j98409l07648n99902j003828j387685j612238j600714j374093
14739B8534195j028584o76901l92933j89144l1991J17479K65984L87237M64498
14730B7449840N37992P03211J040900J532025K047785K433620K599776K538636
14722D0883785K291937J925322J511956J114096P84168N75810N21338N87202O66364
14713E0861978O25993L73524r8730p02936j280538j660622j728105j462733r33486
14704D3994345k66950L92013R22468J260203J402739J388576J272450J109705
14696E1475549R45745Q04028O78652N52375M38849L99473M98134P35398J033650
$$ y = [37565675, 38387225, 39016257, 39393585, 39458711, 39187048, 38638089, 37961472, 37337337, 36887779, 36618712, 36420303, 36112655, 35512753, 34508925, 33121240, 31509002, 29908288, 28534195, 27505611, 26828710, 26435777, 26246633, 26214642, 26332121, 26598105, 26985342, 27449840, 27987832, 28691043, 29731943, 31263968, 33311753, 35745373, 38345149, 40883785, 43175722, 45101044, 46613000, 47727096, 48511264, 49087074, 49608412, 50195614, 50861978, 51487971, 51861495, 51762765, 51059829, 49779291, 48118669, 46390564, 44927831, 43994345, 43727395, 44119408, 45041876, 46302079, 47704818, 49093394, 50365844, 51475549, 52421294, 53225322, 53903974, 54456349, 54895198, 55294671, 55792805, 56528203, 57561853]
14687E7561853J286929J426952J454142J419327J381544J379520J423334J485687
14679F8819288J502727J414921J217762R57417O81047M12852J75098L456p4542
14670G5110026p0058l9931p0004k41556n86459j058324j549184j935780k112988
14661F7445742k011440j626698j048254m39001M3412L27270M51770N21616O21785
14652F4286202P56936Q60493Q50468O70142K89205k95086j029122j789574k427239
14643F2172425k833786k968879k837527k463272j895600j233991o18717j73349
14635D7147304N9756J39858J85448K94072M82550O94022Q57818R38790R40358
14626E1739976Q88624Q24533P92247Q21145R22347J097816J335807J592291J790605
$$ y = [57561853, 58848782, 60275734, 61729876, 63149203, 64530747, 65910267, 67333601, 68819288, 70322015, 71736936, 72954698, 73912115, 74593162, 75006014, 75181112, 75184568, 75110026, 75039968, 75000037, 74930033, 74688477, 74102018, 73043694, 71494510, 69558730, 67445742, 65434302, 63807604, 62759350, 62320349, 62363761, 62691031, 63142801, 63664417, 64286202, 65043138, 65903631, 66754099, 67424241, 67713446, 67418360, 66389238, 64599664, 62172425, 59338639, 56369760, 53532233, 51068961, 49173361, 47939370, 47320653, 47147304, 47207060, 47346918, 47532366, 47826438, 48308988, 49003010, 49860828, 50799618, 51739976, 52628600, 53453133, 54245380, 55066525, 55988872, 57086688, 58422495, 60014786, 61805391]
14617F1805391J850593J724558J422085J010024N72469J56157k38552o10510r18919
14608F6773296j109421j174675j168826j151366j125058j040463q63295o32245
14600E8507947m46918m02864n39420q31985j207307j558877j766168j726901j390538
14591D8636969p66328R3652J104209K140436L044314L666182L916796L786791
14583F5623021L329249K639169J845760J101996N59627L32341M54896Q61419J408464
14574G8155942J930905K295183K429481K324959K016767J565884J047361N35804
14566I2302286R3855k24123l67198l03731m2328L70999Q70004J378143J816313
14557I5894220K113191K210669K075986J727591J239372P03689J91902k51061
$$ y = [61805391, 63655984, 65380542, 66802627, 67812651, 68385120, 68541277, 68302725, 67692215, 66773296, 65663875, 64489200, 63320374, 62169008, 61043950, 60003487, 59140192, 58507947, 58061029, 57658165, 57118745, 56286760, 55079453, 53520576, 51754408, 50027507, 48636969, 47870641, 47964293, 49068502, 51208938, 54253252, 57919434, 61836230, 65623021, 68952270, 71591439, 73437199, 74539195, 75098822, 75431163, 75886059, 76747478, 78155942, 80086847, 82382030, 84811511, 87136470, 89153237, 90719121, 91766482, 92302286, 92396141, 92172018, 91804820, 91501089, 91458761, 91829760, 92699764, 94077907, 95894220, 98007411, 100218080, 102294066, 104021657, 105261029, 105964718, 106156620, 105905559]
14549A05905559n88731p82919q05808o62987m02775j02053J56772L07190L20971
14540A03345219K25883J00281L5037Q4820K42657M49613O32739P47232P90579
14531A06654060P80265P18929N83250L47564R439m03834q35856j216674j504551
14522A05132592j721040j943332k256190k688028l170884l561674l711392l524864
14514H2555188k984557k157445j186747k46771N26801J082115J446936J692725
14506H0728245J888694K065477K211754K299313K302914K202652J983218J638699
14498I7320966J186229O84428K31361p4056j77675q3768J58766M74241P80213
14489A00500705J014354J163309J276209J432754J665797J907356K028501J946200
$$ y = [105905559, 105316828, 104533909, 103728101, 103065114, 102662339, 102560286, 102717058, 103024248, 103345219, 103571102, 103671383, 103706420, 103791240, 104033897, 104483510, 105116249, 105863481, 106654060, 107434325, 108153254, 108736504, 109084068, 109093507, 108689673, 107853817, 106637143, 105132592, 103411552, 101468220, 99212030, 96524002, 93353118, 89791444, 86080052, 82555188, 79570631, 77413186, 76226439, 75979668, 76506469, 77588584, 79035520, 80728245, 82616939, 84682416, 86894170, 89193483, 91496397, 93699049, 95682267, 97320966, 98507195, 99191623, 99422984, 99348928, 99171253, 99087485, 99246251, 99720492, 100500705, 101515059, 102678368, 103954577, 105387331, 107053128, 108960484, 110988985, 112935185]
14481A12935185J695817J399512J162231J000383Q69642P44667O50575O18801
14473A21076813O36395O50528O07420M75104K48088m2132l22288n07394n49169
14464A22273365m49605k31750Q1002M55434Q41438J187402J464548J681332J869987
14455A29173153K045350K175916K203792K090374J835260J460024R94503M81843
14447A42460215k0073m53413p79475r91903j119155j205754j275854j306323j231123
14438A34077142r78972n22509R6776P82420J422603J931899K275123K465002K528982
14429A44078466K463560K228738J803453J244582O82564K60670P2248J30489L78928
14420A53343698P33269J123773J510264J868193K167155K370513K460990K461250
$$ y = [112935185, 114631002, 116030514, 117192745, 118193128, 119062770, 119807437, 120458012, 121076813, 121713208, 122363736, 122971156, 123446260, 123694348, 123652216, 123329928, 122822534, 122273365, 121823760, 121592010, 121673012, 122128446, 122969884, 124157286, 125621834, 127303166, 129173153, 131218503, 133394419, 135598211, 137688585, 139523845, 140983869, 141978372, 142460215, 142440142, 141986729, 141207254, 140215351, 139096196, 137890442, 136614588, 135308265, 134077142, 133098170, 132575661, 132672437, 133454857, 134877460, 136809359, 139084482, 141549484, 144078466, 146542026, 148770764, 150574217, 151818799, 152501363, 152762033, 152834281, 152964770, 153343698, 154076967, 155200740, 156711004, 158579197, 160746352, 163116865, 165577855, 168039105]
14412A68039105K418322K361292K276158K128910J918929J704619J561542J507412
14404A83916289J474042J363229J137907Q62820O58817O20195P67204J048714
14396A91849217J367768J621235J749253J759259J703681J642949J626968J685009
14388B05005339J805775J927804J969307J877135J650393J326952R49574N34876
14380B17047155P3070m29931r05683j228248j281517j039426n92238q9432L56622
14371B11910372P16463J011118J270852J531321J825928K144289K406463K506600
14363B25323406K393873K111741J769627J484662J330384J309519J367307J437467
14355B38527986J480791J493146J490102J480720J449594J361034J173403Q51869
$$ y = [168039105, 170457427, 172818719, 175094877, 177223787, 179142716, 180847335, 182408877, 183916289, 185390331, 186753560, 187891467, 188754287, 189413104, 190033299, 190800503, 191849217, 193216985, 194838220, 196587473, 198346732, 200050413, 201693362, 203320330, 205005339, 206811114, 208738918, 210708225, 212585360, 214235753, 215562705, 216512279, 217047155, 217120225, 216690294, 215784611, 214556363, 213274846, 212235420, 211643182, 211553750, 211910372, 212626835, 213637953, 214908805, 216440126, 218266054, 220410343, 222816806, 225323406, 227717279, 229829020, 231598647, 233083309, 234413693, 235723212, 237090519, 238527986, 240008777, 241501923, 242992025, 244472745, 245922339, 247283373, 248456776, 249308645]
14347B49308645L85835j90817p94718j313998j647816j754054j682174j548905
14339B40761998j456067j423217j395294j302344j112004q46104n60530l02884
14331B32363554q5296J01075K48622L12694K30493k8355m11951p84601r95307
14322B30950928r65260p22335l72698m4215J71145K55740K65574K89265L92585
14313B30220729N83859Q15903J015564J125180J133067J068114R62273Q18648
14305B37743337O17395L49980M2831k54009m96501o58702p23284o80622n46983
14296B35393442l67960j83766M906K26501M96926P85472J016498J109053J020521
14287B39501593P62317L90136j5777l67306n81318o04740m46606j80993R1281
$$ y = [249308645, 249694480, 249503663, 248708945, 247394947, 245747131, 243993077, 242310903, 240761998, 239305931, 237882714, 236487420, 235185076, 234073072, 233226968, 232666438, 232363554, 232278258, 232379333, 232627955, 232940649, 233171142, 233142787, 232730836, 231946235, 230950928, 229985668, 229263333, 228890635, 228846420, 229017565, 229273305, 229538879, 229828144, 230220729, 230804588, 231620491, 232636055, 233761235, 234894302, 235962416, 236924689, 237743337, 238360732, 238710712, 238753543, 238499534, 238003033, 237344331, 236621047, 235940425, 235393442, 235025482, 234841716, 234846622, 235073123, 235570049, 236355521, 237372019, 238481072, 239501593, 240263910, 240654046, 240638269, 240270963, 239689645, 239084905, 238638299, 238457306, 238548587]
14278B38548587K91948L89746L91149L16778J86464J8162j69803l61801n45914
14269B39065316p06288q23556q98574r75037j119473j361373j650457j878936
14261B29651622j953346j855057j643621j410418j226277j115929j059034j005188
14253B18382752r00016p17219m80868k63597j53518j96795l45094m56592l78562
14244B14490491o1065L99041Q24217J069665J094262R55989P61137O05978N31763
14235B20671478N08317M49438K46265j92260q98190j819607k828114l759087m467510
14226B07910730m867482m939063m719882m294963l771214l232132k702832k153542
14218A77229620j534550q23321o8318O01611J024482J077112P24855L9216q16518
$$ y = [238548587, 238840535, 239230281, 239621430, 239938208, 240124672, 240142834, 239973031, 239611230, 239065316, 238359028, 237535472, 236636898, 235661861, 234542388, 233181015, 231530558, 229651622, 227698276, 225843219, 224199598, 222789180, 221562903, 220446974, 219387940, 218382752, 217482736, 216765517, 216284649, 216021052, 215867534, 215670739, 215325645, 214869053, 214490491, 214429426, 214828467, 215652684, 216722349, 217816611, 218772600, 219533737, 220139715, 220671478, 221179795, 221629233, 221875498, 221683238, 220785048, 218965441, 216137327, 212378240, 207910730, 203043248, 198104185, 193384303, 189089340, 185318126, 182085994, 179383162, 177229620, 175695070, 174871749, 174803431, 175405042, 176429524, 177506636, 178231491, 178270707, 177454189]
14209A77454189j641974k274219k640920k774344k785307k803125k909414l102480
14201A56522406l311446l443563l426815l235270k903145k509576k128717j794960
14193A33768914j514806j291714j134760j055904j062192j149056j300544j495840
14185A23764098j715416j939238k143278k301085k376627k311353k045936j579252
14177A07351913r94079m06415J04227N04808P67775Q52352P42625M95078K24140
14168A09642424K6400p8384j38659k20516l63402n62981p73830r20106r15942
14159A05695004o99158k70297K86091Q32600J258582J534404J685366J729877
14151A12052469J653042J425222J043121N67940J24723j50228j80163R362L01874
$$ y = [177454189, 175812215, 173537996, 170897076, 168122732, 165337425, 162534300, 159624886, 156522406, 153210960, 149767397, 146340582, 143105312, 140202167, 137692591, 135563874, 133768914, 132254108, 130962394, 129827634, 128771730, 127709538, 126560482, 125259938, 123764098, 122048682, 120109444, 117966166, 115665081, 113288454, 110977101, 108931165, 107351913, 106357834, 105951419, 106055646, 106560454, 107328229, 108180581, 108923206, 109418284, 109642424, 109668824, 109590440, 109451781, 109231265, 108867863, 108304882, 107531052, 106610946, 105695004, 104995846, 104725549, 105011640, 105844240, 107102822, 108637226, 110322592, 112052469, 113705511, 115130733, 116173854, 116741794, 116866517, 116716289, 116536126, 116545488, 116847362]
14142A16847362N52200O62978O23404M82953K87989M8195k39270n53280q43738
14133A17868793j052130j140040j116857j048650j027466j110897j274873j417198
14125A08680682j419780j235175r27100o26678m45488m13393m76464n50093n89826
14116A01996685o20539o93719q23559r69180j054507r92520p24594k76748K19482
14107I6060801N83818O87453N16444J53054k95810p54691j183497j554637j847066
14098I2365869k061830k228128k380516k525770k630760k640337k515728k274409
14090G3108391j995351j769963j643030j605722j632563j703118j785534j815011
14082E9158099j709075j420581r79151m75673m366L80336O59162Q21026Q53411
$$ y = [116847362, 117399562, 118062540, 118685944, 119168897, 119456886, 119505081, 119265811, 118712531, 117868793, 116816663, 115676623, 114559766, 113511116, 112483650, 111372753, 110097880, 108680682, 107260902, 106025727, 105098627, 104471949, 104026461, 103613068, 103136604, 102586511, 101996685, 101376146, 100682427, 99858868, 98889688, 97835181, 96842661, 96118067, 95841319, 96060801, 96644619, 97332072, 97848516, 98001570, 97705760, 96951069, 95767572, 94212935, 92365869, 90304039, 88075911, 85695395, 83169625, 80538865, 77898528, 75382800, 73108391, 71113040, 69343077, 67700047, 66094325, 64461762, 62758644, 60973110, 59158099, 57449024, 56028443, 55049292, 54573619, 54569253, 54949589, 55608751, 56429777, 57283188]
14073E7283188P51742N27152K03754j90724o33192j103296j568749j967008k200031
14064E1102836k165346j825557j254508n94565L3339N65397R66794J215606J320140
14055D9364136J320175J252987J119941Q90008N41266J05661l29837o75968r00424
14046E2687945j038755j149050j248980j286424j171412q48894l52950K02472
14038D5793952O82181R88724J090232J019292Q56555O97515O03035N63642N13975
14029E2809103L93292K00597k548j36063j50059m7779J23804L05676M54238N45734
14019E4495995N66779N07527L61795J30419j71600m98169p64859q91059q70001
14010E2866827p80844p21653p37076p95488q11746o97949m11976K5984N46619
$$ y = [57283188, 58034930, 58562082, 58765836, 58575112, 57941920, 56838624, 55269875, 53302867, 51102836, 48937490, 47111933, 45857425, 45262860, 45296199, 45861596, 46828390, 48043996, 49364136, 50684311, 51937298, 53057239, 53947247, 54488513, 54594174, 54264337, 53588369, 52687945, 51649190, 50500140, 49251160, 47964736, 46793324, 45944430, 45591480, 45793952, 46476133, 47464857, 48555089, 49574381, 50430936, 51128451, 51731486, 52295128, 52809103, 53202395, 53402992, 53400444, 53264381, 53114322, 53066543, 53190347, 53496023, 53950261, 54495995, 55062774, 55570301, 55932096, 56062515, 55890915, 55392746, 54627887, 53736828, 52866827, 52085983, 51364330, 50627254, 49831766, 49020020, 48322071, 47910095, 47936079, 48482698]
14001D8482698J056701J460949J671292J619434J291886P63669J86675k73851
13993E6259453n21299n79410n71894o36325q37703j147203j491499j811653k069804
13984D6592663k218615k195336j955337j506335r19418l18758J55207M02980M07357
13975C8444408K36934K1165r7995k9463K31458O25459J075617J515507J896122
13966D3919212K179769K333459K338239K207536J989919J748835J538789J392852
13958E9648610J315907J287668J284069J297068J326660J354802J336875J227128
13950G0078787J012868P18413L78661J9305l44808p14201j106527j529322j942169
13941F6571007k261696k412541k368999k160028j857004j548222j298940j126594
$$ y = [48482698, 49539399, 51000348, 52671640, 54291074, 55582960, 56346629, 56533304, 56259453, 55738154, 55158744, 54586850, 53950525, 53112822, 51965619, 50474120, 48662467, 46592663, 44374048, 42178712, 40223375, 38717040, 37797622, 37478864, 37634071, 38037051, 38444408, 38681342, 38702507, 38604512, 38575049, 38806507, 39431966, 40507583, 42023090, 43919212, 46098981, 48432440, 50770679, 52978215, 54968134, 56716969, 58255758, 59648610, 60964517, 62252185, 63536254, 64833322, 66159982, 67514784, 68851659, 70078787, 71091655, 71810068, 72188729, 72208034, 71863226, 71149025, 70042498, 68513176, 66571007, 64309311, 61896770, 59527771, 57367743, 55510739, 53962517, 52663577, 51536983]
13933E1536983j009203r11337q14424p36009p10422p40182p73609p36079n83676
13924D4522042l40304r8022K9187k4673k37969n25019q01318j034667j243257
13915D0246000j447617j619789j678540j543646j206651p50990l00076N7154K95116
13906C2050961M17669M12397K51842o0926m59676q36786j095889j181051j068409
13897B8430132p53661k55260L81526J087066J769575K332474K720238K948941
13889C8661031L072850L124108L093607K954629K691364K310315J830726J268072
13881E9006702O30705o4696p70696j406218j892897k207840k398955k538294k651306
13872D5706505k686097k546973k162930j545453p99041p2499N15392R16663J142382
$$ y = [51536983, 50527780, 49616443, 48802019, 48066010, 47355588, 46615406, 45841797, 45105718, 44522042, 44181738, 44083716, 44112903, 44088230, 43850261, 43325242, 42523924, 41489257, 40246000, 38798383, 37178594, 35500054, 33956408, 32749757, 31998767, 31698691, 31755845, 32050961, 32468630, 32881027, 33132869, 33071943, 32612267, 31775481, 30679592, 29498541, 28430132, 27676471, 27421211, 27802737, 28889803, 30659378, 32991852, 35712090, 38661031, 41733881, 44857989, 47951596, 50906225, 53597589, 55907904, 57738630, 59006702, 59637407, 59572711, 58802015, 57395797, 55502900, 53295060, 50896105, 48357811, 45706505, 43020408, 40473435, 38310505, 36765052, 35966011, 35893512, 36408904, 37325567, 38467949]
13863C8467949J230549J224495J165785J088154J008035R30107Q66638Q34254
13855D6815966Q22963P84537O69336M73864K39156j95k57533n84254j022848j563769
13845D6377223k131884k603691k849082k784843k410117j803348j090374m05538
13837C0298346J36205M53152N07626L16003m8456m64671q00231r76998j009738
13828B8411238r68428r06000q23663o87056m59322j18264L49338R53369J675245
13819B7426457K422617L022579L287502L108829K509229J630039O72354j76123
13811D3903483p93194j135655j226767j132330r23951o45258l16473K5178L02312
13802C8057345M27961L61974J39974j52975m52416p67775j154926j625866k086814
$$ y = [38467949, 39698498, 40922993, 42088778, 43176932, 44184967, 45115074, 45981712, 46815966, 47638929, 48423466, 49092802, 49566666, 49805822, 49805627, 49548094, 48963840, 47940992, 46377223, 44245339, 41641648, 38792566, 36007723, 33597606, 31794258, 30703884, 30298346, 30434551, 30887703, 31395329, 31711332, 31662876, 31198205, 30397974, 29420976, 28411238, 27442810, 26536810, 25713147, 25026091, 24566769, 24448505, 24797843, 25751212, 27426457, 29849074, 32871653, 36159155, 39267984, 41777213, 43407252, 44079606, 43903483, 43110289, 41974634, 40747867, 39615537, 38691586, 38046328, 37729855, 37755033, 38057345, 38485306, 38847280, 38987254, 38834279, 38381863, 37614088, 36459162, 34833296, 32746482]
13793C2746482k372164k352952k028773j521360r81932n07075j24582J80575M46988
13784B3485207P23671J047388J421852J819566K204717K555556K860916L088298
13776C9207171L165823L018870K634045K081897J475193R04908M11019N358k92030
13767E2612254m53183m80607m34264m12459n02836p35568j065561j396940j631541
13758D5499295j713010j649781j500755j326381j143729r22310o19892k24403
13750C6399034K32944O97471J120216J472176J735115J882567J879803J711208
13742D7130534J408638J055562P59689O03167O02444P09191Q49128R65713J035113
13733E5119179J047587R89979Q55279O52220L85315L2229m40656j034568j688298
$$ y = [32746482, 30374318, 28021366, 25992593, 24471233, 23489301, 22982226, 22857644, 23038219, 23485207, 24208878, 25256266, 26678118, 28497684, 30702401, 33257957, 36118873, 39207171, 42372994, 45391864, 48025909, 50107806, 51582999, 52487907, 52898926, 52904284, 52612254, 52159071, 51678464, 51244200, 50831741, 50328905, 49593337, 48527776, 47130836, 45499295, 43786285, 42136504, 40635749, 39309368, 38165639, 37243329, 36623437, 36399034, 36631978, 37329449, 38449665, 39921841, 41656956, 43539523, 45419326, 47130534, 48539172, 49594734, 50354423, 50957590, 51560034, 52269225, 53118353, 54084066, 55119179, 56166766, 57156745, 58012024, 58664244, 59049559, 59081788, 58641132, 57606564, 55918266]
13724E5918266k285331k702614k881821k861654k733244k567029k381412k161090
13716C5344071j889231j564309j189274p49769k19648M04581J081322J737990
13708C2955733K308344K757419L073348L249968L284417L174153K908578K479440
13700E6191400J902338J217054M69609k98083j042969j712739k254270k635403
13692E1836937k848206k883430k717232k346297j834666j300429q42801m91344
13684C6572532k25041j7562J41805K45155K66731J79182j4110k53957m33680m45910
13674C6015145k35790J73673O87658J175944J531780J713270J734831J629343
13666D4425854J426407J162384Q93497O79481N47050M68102L73677J99695o6949
$$ y = [55918266, 53632935, 50930321, 48048500, 45186846, 42453602, 39886573, 37505161, 35344071, 33454840, 31890531, 30701257, 29951488, 29731840, 30136421, 31217743, 32955733, 35264077, 38021496, 41094844, 44344812, 47629229, 50803382, 53711960, 56191400, 58093738, 59310792, 59780401, 59482318, 58439349, 56726610, 54472340, 51836937, 48988731, 46105301, 43388069, 41041772, 39207106, 37906677, 37063876, 36572532, 36347491, 36329929, 36471734, 36716889, 36983620, 37162802, 37148692, 36894735, 36461055, 36015145, 35779355, 35953028, 36640686, 37816630, 39348410, 41061680, 42796511, 44425854, 45852261, 47014645, 47908142, 48587623, 49134673, 49602775, 49976452, 50176147, 50109198]
13657E0109198l78179o54781q36543r22808r67517j022965j084733j097908j019270
13648D2124494q69149p20257o35720o17785o13333n60174m29510k40597l5857
13639C7402112J68973M01250O85928R95810J260418J413571J421870J279827R97675
13630D6027434O00968J32305l58744q27007j228514j513673j640619j602796j438090
13621C8151264j204682r44781o67265l61400l0191K86897N29413O58801O84206
13612C7102262O45066N73107M75509L53166K25977J24018M7802m6317k08994m49267
13602C8842329p14520r02381q97343o22794r0163N81431J203250J607151J727778
13593D0734738J612293J357859J042990P09908L82479P3429k16073m77538o78561
$$ y = [50109198, 49731019, 49076238, 48239695, 47316887, 46349370, 45326405, 44241672, 43143764, 42124494, 41255345, 40535088, 39899368, 39281583, 38668250, 38108076, 37678566, 37437969, 37402112, 37571085, 37972335, 38658263, 39654073, 40914491, 42328062, 43749932, 45029759, 46027434, 46628402, 46760707, 46401963, 45574956, 44346442, 42832769, 41192150, 39589354, 38151264, 36946582, 36001801, 35334536, 34973136, 34942945, 35229842, 35759255, 36418056, 37102262, 37747328, 38320435, 38795944, 39149110, 39375087, 39499105, 39546907, 39500590, 39291596, 38842329, 38127809, 37225428, 36328085, 35705291, 35615128, 36196559, 37399809, 39006960, 40734738, 42347031, 43704890, 44747880, 45457788, 45840267, 45913696, 45697623, 45220085, 44541524]
13584D4541524p91378q49383r57089j221283j663248k193016k658740k916237
13576C1291150k869714k487372j812971r63832r6230O46519J173958J472378J608557
13567B7962443J689446J787598J896037J955121J915910J776009J565021J301268
13559D1848853R66152N40646P7758k84763m05164k28780J91756P37208J272414
13550D4716080J680869J882178J838210J550037J041752L39576n26182j490583
13542E1031937k427465l163144l541664l508503l141339k592981k003745j462204
13534B9190892j015247o81225m57973l38091l14419l62158m23265m20769k94797
13525B4882948l1320L36412P48617J139778J446162J607602J579213J356834J001854
$$ y = [44541524, 43750146, 42900763, 41943674, 40722391, 39059143, 36866127, 34207387, 31291150, 28421436, 25934064, 24121093, 23157261, 23061031, 23707550, 24881508, 26353886, 27962443, 29651889, 31439487, 33335524, 35290645, 37206555, 38982564, 40547585, 41848853, 42815005, 43355651, 43433409, 43148646, 42743482, 42514702, 42706458, 43443666, 44716080, 46396949, 48279127, 50117337, 51667374, 52709126, 53048702, 52522520, 51031937, 48604472, 45441328, 41899664, 38391161, 35249822, 32656841, 30653096, 29190892, 28175645, 27494420, 27036447, 26698356, 26383937, 26021779, 25598514, 25177745, 24882948, 24851628, 25188040, 25936657, 27076435, 28522597, 30130199, 31709412, 33066246, 34068100]
13516C4068100O42960M32839M60241O75825R13781J005177Q75078N41683N9155
13507C9674839n06104j056383j467062j646098j595068j404299j184747j000274
13499B9814804q53793p23208o05006n28027n22227n68609n89983n04238k83654
13490B4636059L8344L98120P27011R67219J092468J121216J103128J084860J077503
13481C2245928J048140R45174P39019M42269R8497k37529n13110o91003p70208
13472C3307177q01295q62056r93527j164781j315167j420636j503800j593910
13464B3652005j692526j765700j757825j621815j349940r83722n91249k25543
13456A3663685R9969M01282P01912J018301J345610J646026J852175J887595J702415
$$ y = [34068100, 34711060, 35143899, 35604140, 36279965, 37193746, 38198923, 39074001, 39615684, 39674839, 39168735, 38112352, 36645290, 34999192, 33404124, 31999825, 30815078, 29814804, 28961011, 28237803, 27632797, 27104770, 26582543, 26013934, 25423951, 24919713, 24636059, 24674403, 25072523, 25799534, 26766753, 27859221, 28980437, 30083565, 31168425, 32245928, 33294068, 34239242, 34978261, 35420530, 35519027, 35281498, 34768388, 34077385, 33307177, 32505882, 31643826, 30650299, 29485518, 28170351, 26749715, 25245915, 23652005, 21959479, 20193779, 18435954, 16814139, 15464199, 14480477, 13889228, 13663685, 13763654, 14164936, 14866848, 15885149, 17230759, 18876785, 20728960, 22616555, 24318970]
13447B4318970J309791P91182K56324k13440n94607r03529j143308j264557j194821
13438B1362005r22586n44327k12158l4679k4503j17835k32806l22192l82297m14040
13428A8154582l84959k40394N1455M72626R64819J448973J834655K033977J999391
13419B6335125J765149J443048J162909J006140R79957J039037J126698J208753
13411C6066816J294997J438950J698416K073088K474125K755242K777498K470232
13403E3049364J864243J076966K59259m62470j028930j457763j807094k119749
13395D9373826k399592k632424k807805k908983k902317k761799k501176k174059
13387B8285671j849683j584972j400061j271320j157146j038588r31447q59890
$$ y = [24318970, 25628761, 26419943, 26676267, 26462827, 25868220, 24964691, 23821383, 22556826, 21362005, 20439419, 19895092, 19682934, 19648255, 19623752, 19505917, 19273111, 18950919, 18568622, 18154582, 17769623, 17529229, 17580684, 18053310, 19018129, 20467102, 22301757, 24335734, 26335125, 28100274, 29543322, 30706231, 31712371, 32692328, 33731365, 34858063, 36066816, 37361813, 38800763, 40499179, 42572267, 45046392, 47801634, 50579132, 53049364, 54913607, 55990573, 56249832, 55787362, 54758432, 53300669, 51493575, 49373826, 46974234, 44341810, 41534005, 38625022, 35722705, 32960906, 30459730, 28285671, 26435988, 24851016, 23450955, 22179635, 21022489, 19983901, 19052454, 18192564]
13379A8192564q27640q08031p47173n84539k92216R3159M77798P61039Q89592
13370A7154553Q68295P30185N12030K58893L0113j20332j65680j03623M9784K54227
13360A9468445M50510N80271O02629N15107L72019K63634K64873M05835O74283
13351B3597606J015132J320473J451967J315893R30492M14856p9200m29075n77814
13342B8960330n45546m07260k45369j06991J3044J65693M26088Q52541J430351
13333C0542881K040643K494772K621796K357907J788521J115790N63891K71868
13325D3798069K34695L33750M34723M70357M50118M12380L65964K57443r018m98246
13315D6250235j168947j863454k376127k555830k383981j987419j571193j306365
$$ y = [18192564, 17364924, 16556893, 15809720, 15225181, 14932965, 15026124, 15503922, 16264961, 17154553, 18022848, 18753033, 19265063, 19523956, 19554069, 19433737, 19268057, 19164434, 19214218, 19468445, 19918955, 20499226, 21101855, 21616962, 21988981, 22252615, 22517488, 22923323, 23597606, 24612738, 25933211, 27385178, 28701071, 29631563, 30046419, 29967219, 29538144, 28960330, 28414784, 28007524, 27762155, 27655164, 27668208, 27833901, 28259989, 29112530, 30542881, 32583524, 35078296, 37700092, 40057999, 41846520, 42962310, 43526201, 43798069, 44032764, 44366514, 44801237, 45271594, 45721712, 46134092, 46500056, 46757499, 46748481, 46250235, 45081288, 43217834, 40841707, 38285877, 35901896, 33914477, 32343284, 31036919]
13307C1036919j257770j394738j635276j872832j998351j937492j684062j298682
13299A7957716q70349m76322j70071K4206J36474K56545M73530P90151J099632
13290A9221512J250561J154027Q64461N65308M51062N95918R10070J205305J321023
13281B7539247J223065R96483P42902M86883J81124k12637o68383j118242j504496
13272B7665946j800635k007052k145410k238183k276498k217136k012948j642037
13264A1326047j122007n13286R2759O02924R56893J155302J268456J404008J635609
13255A6806705J946585K241654K411307K395093K208672J924560J624213J358190
13247C2916979J133916R25878O98690M31379J26928j99276n36225q76541j201163
$$ y = [31036919, 29779149, 28384411, 26749135, 24876303, 22877952, 20940460, 19256398, 17957716, 17087367, 16611045, 16440974, 16465180, 16601654, 16858199, 17331729, 18121880, 19221512, 20472073, 21626100, 22490561, 23055869, 23506931, 24102849, 25012919, 26218224, 27539247, 28762312, 29758795, 30501697, 30988580, 31169704, 30957067, 30288684, 29170442, 27665946, 25865311, 23858259, 21712849, 19474666, 17198168, 14981032, 12968084, 11326047, 10204040, 9690754, 9783513, 10386437, 11343330, 12498632, 13767088, 15171096, 16806705, 18753290, 20994944, 23406251, 25801344, 28010016, 29934576, 31558789, 32916979, 34050895, 34976773, 35675463, 36106842, 36233770, 36034494, 35498269, 34621728, 33420565]
13238C3420565j477766j681554j811586j883207j906024j863769j716515j440983
13230A9639161j077824p28224m92786m07574m34131n04847n69037n99228n83968
13221A4241542n37135m97354m96858n34738n86418o32570o72594p13231p50078
13212H820566p58982p05400n73747l92418k20698j08366p0010r4928j80841l54482
13202E360694o45578j030691j411219j662674j706122j532119j179548p12668
13194d519925k10448K41639N65950P16607P06758O17189N61158O08615P24707
13185A2250P93266P19454N16737L04479K34186M00580P82232J246680J625036
13176F634900J807609J786069J617742J365478J062137P03319K71145k19475o97560
$$ y = [33420565, 31942799, 30261245, 28449659, 26566452, 24660428, 22796659, 21080144, 19639161, 18561337, 17833113, 17340327, 16932753, 16498622, 15993775, 15424738, 14825510, 14241542, 13704407, 13207053, 12710195, 12175457, 11589039, 10956469, 10283875, 9570644, 8820566, 8061584, 7356184, 6782437, 6390019, 6169321, 6060955, 5990945, 5896017, 5715176, 5360694, 4715116, 3684425, 2273206, 610532, -1095590, -2627709, -3807257, -4519925, -4730373, -4488734, -3922784, -3206177, -2499419, -1882230, -1321072, -712457, 12250, 805516, 1524970, 2041707, 2346186, 2580372, 2980952, 3763184, 5009864, 6634900, 8442509, 10228578, 11846320, 13211798, 14273935, 14977254, 15248399, 15028924, 14331364]
13167A4331364j061246j227539j179082r89977p97984p15409p48513q02773p62227
13158F046614n69387k51220J12914M45699P05977Q85391R83995R96493R20091
13149A0276567P65870N60245L41132J54214M3924L1367Q8500J37113Q4635j28357
13139A2355210m95863r41299j355420j667997j889954k079961k271261k429994
13131g76539k478060k355333k064531j662742j223055q10240m71489k18642j3697
13122a2074328K11205N08107Q83578J305265J726056K095870K359532K465306
13114e19409K392405K177455J912394J705956J632201J696807J834817J945493
13106A4778119J957170J878673J785403J748891J778936J829151J847342J819171
$$ y = [14331364, 13270118, 12042579, 10863497, 9873520, 9075536, 8360127, 7611614, 6808841, 6046614, 5477227, 5226007, 5338921, 5784620, 6490597, 7375988, 8359983, 9356476, 10276567, 11042437, 11602682, 11943814, 12098028, 12141952, 12173319, 12261819, 12398932, 12483567, 12355210, 11859347, 10918048, 9562628, 7894631, 6004677, 3924716, 1653455, -776539, -3254599, -5609932, -7674463, -9337205, -10560260, -11370500, -11841989, -12060631, -12074328, -11863123, -11355016, -10471438, -9166173, -7440117, -5344247, -2984715, -519409, 1872996, 4050451, 5962845, 7668801, 9301002, 10997809, 12832626, 14778119, 16735289, 18613962, 20399365, 22148256, 23927192, 25756343, 27603685, 29422856]
13098B9422856J777879J780920J867004K020378K169272K225493K143082J951871
13090D5358755J734374J561763J441275J315484J112178Q03525M16609j3314m79755
13081E3250894r80106j470414j871277k120217k201538k127329j918009j617788
13073C8944216j306329j061918r06951q02957p03939o05483n39287n36210o05438
13064C1875704p37400r09920j090430j244210j349133j405021j433683j467514
13056B2238393j523988j585166j610047j571679j481152j376736j288021j207177
13048A0594427j101718r58787q07295o92300o36465o28993o35027o04497m91824
13039D037521k90479m2068J98951M00687N53195O55029P13169P37868P17641O07068
$$ y = [29422856, 31200735, 32981655, 34848659, 36869037, 39038309, 41263802, 43406884, 45358755, 47093129, 48654892, 50096167, 51411651, 52523829, 53327354, 53743963, 53730649, 53250894, 52270788, 50800374, 48929097, 46808880, 44607342, 42480013, 40562004, 38944216, 37637887, 36575969, 35669018, 34866061, 34162122, 33556639, 33017352, 32481142, 31875704, 31138304, 30228384, 29137954, 27893744, 26544611, 25139590, 23705907, 22238393, 20714405, 19129239, 17519192, 15947513, 14466361, 13089625, 11801604, 10594427, 9492709, 8533922, 7726627, 7034327, 6397862, 5768869, 5133842, 4529345, 4037521, 3747042, 3704974, 3903925, 4304612, 4857807, 5512836, 6226005, 6963873, 7681514, 8288582]
13029H288582L54205n7049n82410j119843j543665j760454j748482j552538j248211
13020i69865r09416n97793l62896k27041j62847j10425l9002J3988k1488j72252
13010c559037l88483n90358p43746q79708j033894j176782j218093j075287p31746
13001a1397134k43978K93232P97318J231952J600345J898136K063327J983556
12993a773246J580868R10776J74613l84357o14826n19722k23764J19195M15006
12984c15457O43912Q01732Q49114P25503M07885m1104m85394p89024q86641p96953
12974A13573n95930l78247k08052q5791K6863J50197K73376L94138N40318P37113
12964I67558R67827J176396J300873J303176J178177R44144O25134K39010k03635
$$ y = [8288582, 8642787, 8585738, 8003328, 6883485, 5339820, 3579366, 1830884, 278346, -969865, -1879281, -2477074, -2839970, -3067011, -3229858, -3340283, -3379285, -3365297, -3386785, -3559037, -3947520, -4537878, -5281624, -6161332, -7195226, -8372008, -9590101, -10665388, -11397134, -11641112, -11347880, -10550562, -9318610, -7718265, -5820129, -3756802, -1773246, -192378, 718398, 893011, 508654, -106172, -625894, -849658, -730463, -315457, 328455, 1130187, 1979301, 2704804, 3112689, 3071585, 2586191, 1797167, 910526, 113573, -482357, -860604, -1068656, -1154447, -1127584, -977387, -704011, -309873, 230445, 967558, 1935385, 3111781, 4412654, 5715830, 6894007, 7838151, 8463285, 8702295, 8498660]
12955H498660o90597j190680j641716j963802k093279k015707j780221j483237
12947d360579j220363j023567q27017n06438K4625P42315J523564K220569K735092
12938f91799L044461L168538L117629K877050K435438J814088J064411K48195
12930A7078011n71197j329878j972596k465163k798575k988963l080827l142894
12922a272082l234846l347763l366183l116424k496852j573516n45246L65382
12914a8587530R90073J245141J139844P62731K47435k64883o61073q89336r70607
12905a6988205r68743r36010q76193p51623n29370k35821K9501J50109Q2049r8261
12895b1122567k27916j52833J78499O87076J214307J608100J785718J744097J530795
$$ y = [8498660, 7808063, 6617383, 4975667, 3011865, 918586, -1097121, -2877342, -4360579, -5580942, -6604509, -7431526, -7937964, -7913339, -7171024, -5647460, -3426891, -691799, 2352662, 5521200, 8638829, 11515879, 13951317, 15765405, 16829816, 17078011, 16506814, 15176936, 13204340, 10739177, 7940602, 4951639, 1870812, -1272082, -4506928, -7854691, -11220874, -14337298, -16834150, -18407666, -18952912, -18587530, -17597457, -16352316, -15212472, -14449741, -14202306, -14467189, -15128262, -16017598, -16988205, -17956948, -18892958, -19769151, -20520774, -21050144, -21285965, -21256464, -21106355, -21024306, -21122567, -21350483, -21503316, -21324817, -20637741, -19423434, -17815334, -16029616, -14285519, -12754724]
12886a2754724J210164Q55731N63532M39545N38356Q04166J085252J221819J132842
12877d903317Q39376M32393K5125k90157m69692n19060m77729m06395l75021m37782
12867f582259o03675q30041j044806j173332j155796r68136o43727k56960J39498
12858a3119234N61024J066497J691643K401581L086363L594803L797078L644523
12850F724278L181648K510462J756841J060502N52764L06180K99516M32307N72966
12841A7397464O13489N10273K86109j0463l49321p27368j147500j600080k066467
12832A2906136k528450k952832l268680l389298l276033k977697k602821k255259
12824a0344934j989686j803814j652747j478280j242508r40004n82841j83934
$$ y = [-12754724, -11544560, -10688829, -10125297, -9685752, -9147396, -8343230, -7257978, -6036159, -4903317, -4063941, -3631548, -3606423, -3896580, -4366272, -4885332, -5363061, -5769456, -6144477, -6582259, -7185934, -8015975, -9060781, -10234113, -11389909, -12358045, -13001772, -13258732, -13119234, -12558210, -11491713, -9800070, -7398489, -4312126, -717323, 3079755, 6724278, 9905926, 12416388, 14173229, 15233731, 15786495, 16092675, 16392191, 16824498, 17397464, 18010953, 18521226, 18807335, 18796872, 18447551, 17720183, 16572683, 14972603, 12906136, 10377686, 7424854, 4156174, 766876, -2509157, -5486854, -8089675, -10344934, -12334620, -14138434, -15791181, -17269461, -18511969, -19451973, -20034814, -20218748]
12816b0218748K47336P03305J166098J592639J931001K168295K350972K545912
12808g513190K787680L052421L249745L245511K940542K351585J611391Q93627
12800A2619312L35591N606q7973K3035K73821N74285Q32582R75270R53247P57901
12790A7262677M46926J33344p8074j56296j56921j79899l07634n61198q91349
12781A5511576j204059j409111j459685j359889j152550r02493o76405n20111
12773F827273m41866m15160m07529m19446m94377o70871r10800j090952j093004
12764H83268r08023o39166l96993k05315j2436K27151M99505P45723R03991R36975
12754B034680Q46169O79574N13895M10763L84058M02860M18295L93727L24976
$$ y = [-20218748, -19971412, -19268107, -18102009, -16509370, -14578369, -12410074, -10059102, -7513190, -4725510, -1673089, 1576656, 4822167, 7762709, 10114294, 11725685, 12619312, 12954903, 12960509, 12872536, 12895571, 13169392, 13743677, 14576259, 15551529, 16504776, 17262677, 17709603, 17842947, 17764873, 17608577, 17451656, 17271757, 16964123, 16402925, 15511576, 14307517, 12898406, 11438721, 10078832, 8926282, 8023789, 7347384, 6827273, 6385407, 5970247, 5562718, 5143272, 4648895, 3978024, 3067224, 1976272, 883268, -24755, -663921, -1060914, -1266229, -1278665, -1051514, -552009, 193714, 1097705, 2034680, 2880849, 3560423, 4074318, 4485081, 4869139, 5271999, 5690294, 6084021, 6408997]
12745F408997K41728J89262K01437K82233M07024N39509O48754P10829O95632
12736A0325405N60954K72538j63189o91203j235632j726771k103435k309683k302712
12727F26272k067592j629196j047812l99877K33576P63504J097730J172057R88493
12718b62845O21693J84183k19457n24304p18655q32452r03841r53350r82451r80228
12708e571707r25240p91030n62035k47642J17399M83051Q01591J049672J233750
12699d412191J366896J446413J458783J395767J256370J037020P29670L35728
12691D614456j17513n78581r97055j345911j608180j747438j715206j492990j111941
12682f100359o29909j02098M26274R12197J308368J569600J671013J619638J446106
$$ y = [6408997, 6650725, 6839987, 7041424, 7323657, 7730681, 8270190, 8918944, 9629773, 10325405, 10886359, 11158897, 10995708, 10304505, 9068873, 7342102, 5238667, 2928984, 626272, -1441320, -3070516, -4118328, -4518205, -4284629, -3521125, -2423395, -1251338, -262845, 358848, 543031, 323574, -200730, -919385, -1751837, -2655678, -3609028, -4591479, -5571707, -6496947, -7287977, -7850012, -8097654, -7980255, -7497204, -6695613, -5645941, -4412191, -3045295, -1598882, -140099, 1255668, 2512038, 3549058, 4278728, 4614456, 4496943, 3918362, 2921307, 1575396, -32784, -1780222, -3495428, -4988418, -6100359, -6730268, -6832366, -6406092, -5493895, -4185527, -2615927, -944914, 674724, 2120830]
12673B120830J187984Q83677N73846K95346P1496q6353j69375j69709r5828O322
12663D618236O1954J1187j66682m70539q83197j338201j702243j827181j642302
12654c338968j205219o70337k06244Q0389J78601J57703J12295R7155J01005P5297
12644d618323k7347k37065n49821r00746j164601j207975r66093m84953J06460
12635a0050464O64559J086852J336091J434026J423073J318973J102588P61648
12627i22654L32382j02894m43263n87718m61590p4282M38754Q58599R94628P76144
12617H08106K63778l99590j045334j520175j718938j611910j255928p76168l16734
12608g572893J9742K09102K97537L56388M31810N22689N93614O03670N32089L89121
$$ y = [2120830, 3308814, 4192491, 4766337, 5061683, 5133179, 5046826, 4877451, 4707742, 4611914, 4618236, 4680190, 4691377, 4524695, 4054156, 3170959, 1832758, 130515, -1696666, -3338968, -4544187, -5214524, -5420768, -5340379, -5161778, -5004075, -4891780, -4794625, -4693620, -4618323, -4645670, -4882735, -5432556, -6333302, -7497903, -8705878, -9671971, -10156924, -10050464, -9385905, -8299053, -6962962, -5528936, -4105863, -2786890, -1684302, -922654, -590272, -693166, -1136429, -1724147, -2185737, -2260019, -1821265, -962666, 31962, 808106, 1071884, 672294, -373040, -1893215, -3612153, -5224063, -6479991, -7256159, -7572893, -7553151, -7344049, -7046512, -6690124, -6258314, -5735625, -5142011, -4538341, -4006252, -3617131]
12598c617131K10292N1686j0987Q9955L57993O96393R28479Q69385M21262l59787
12588c62460j279220k093990k611738k751120k547286k105314j536744r26972
12580a6214844l44020J42691M61729N62590M53541K21894L831p8347M0914L63723
12570a4386298Q31243J328088J719334J919974J927232J776233J487589J077031
12562b319574N93571J19427k72970n64548p97565j039679j325131j614325j809173
12553i029967j820849j628213j272731q14722l11381J71034N49711P52032P55663
12544a2649423N99871L60175J11390r3911k23060k55271j86779l8841J50192L39462
12534a1886195M87207N47425M82113K86458L497k90847n18700o13520n22117k30132
$$ y = [-3617131, -3406839, -3355153, -3366140, -3276185, -2918192, -2221799, -1293320, -423935, -2673, -362460, -1641680, -3735670, -6347408, -9098528, -11645814, -13751128, -15287872, -16214844, -16558864, -16416173, -15954444, -15391854, -14938313, -14716419, -14712588, -14790935, -14750021, -14386298, -13555055, -12226967, -10507633, -8587659, -6660427, -4884194, -3396605, -2319574, -1726003, -1606576, -1879546, -2444094, -3241659, -4281338, -5606469, -7220794, -9029967, -10850816, -12479029, -13751760, -14566482, -14877863, -14706829, -14157118, -13405086, -12649423, -12049552, -11689377, -11577987, -11671898, -11894958, -12150229, -12337008, -12375849, -12225657, -11886195, -11398988, -10851563, -10369450, -10082992, -10079495, -10370342, -10889042, -11502562, -12024679, -12254811]
12524a2254811J98757O19567Q61942Q19175N16397J02664k44995m33429m83894
12515a0298627m75154m79315n45184p11838j005815j410085j846185k201123k376020
12506b1349346k317538k019875j512581q55221j40565N15888J015400J317719
12498b5346119J438710J406979J238337R56311O19231L10895J03274L4014J19502
12489a9118866L73048P93609J342915J949724K535960L034510L395434L589734
12481b103932L604100L427784L053041K496424J817977J115451M88636j1692m06769
12472A3481020p54057j095630j446643j808155k165482k476892k676448k695499
12464a637786k490790k069530j502291r07436m01069l8743K00035L66579M86733
$$ y = [-12254811, -12056054, -11436487, -10574545, -9755370, -9238973, -9136309, -9381304, -9814733, -10298627, -10773781, -11253096, -11798280, -12510118, -13515933, -14926018, -16772203, -18973326, -21349346, -23666884, -25686759, -27199340, -28054561, -28195126, -27679238, -26663838, -25346119, -23907409, -22500430, -21262093, -20305782, -19686551, -19375656, -19272382, -19238368, -19118866, -18745818, -17952209, -16609294, -14659570, -12123610, -9089100, -5693666, -2103932, 1500168, 4927952, 7980993, 10477417, 12295394, 13410845, 13899481, 13887789, 13481020, 12726963, 11631333, 10184690, 8376535, 6211053, 3734161, 1057713, -1637786, -4128576, -6198106, -7700397, -8607833, -9008902, -9047645, -8847610, -8481031, -7994298]
12455g994298N49781N36454M44872K97989J35868m565j14023k24285l90357o40340
12445g402904r34092j177182j289006j266325j180300j115921j118651j182963
12437a6667344j265172j303481j247527j088417q60801o10587l65415j34433Q5566
12428b3457611L17404N95741R28152J272549J573867J819330K034856K225099
12420a2690613K342928K328321K161913J870156J485860J020726M86118p3360
12412a067951n92708j036613j418940j764723k059082k234706k203256j908753
12404a4286732j381343p53457k08184J06771J33843r2947m77119q98807j251805
12395a9109780j462499j490334j324371r78314m88037P8455O20586J041988J297733
$$ y = [-7994298, -7444517, -6908063, -6463191, -6165202, -6029334, -6033899, -6147922, -6372207, -6762564, -7402904, -8336996, -9514178, -10803184, -12069509, -13249809, -14365730, -15484381, -16667344, -17932516, -19235997, -20483524, -21571941, -22432742, -23043329, -23408744, -23543177, -23457611, -23140207, -22544466, -21616314, -20343765, -18769898, -16950568, -14915712, -12690613, -10347685, -8019364, -5857451, -3987295, -2501435, -1480709, -994591, -1067951, -1660659, -2697272, -4116212, -5880935, -7940017, -10174723, -12377979, -14286732, -15668075, -16421532, -16629716, -16522945, -16389102, -16482049, -16959168, -17857975, -19109780, -20572279, -22062613, -23386984, -24365298, -24853335, -24774880, -24154294, -23112306, -21814573]
12386b1814573J400827J385633J277052J102386R16267P86031P51790Q10649R26561
12377a2457377J045636J120277J132885J093942J019646R17686P92356O56570
12369d678379N33720M43466L87238L51824L22803K92633K59305K11259J08720
12360a767411j08440m78675r71097j469017j812405j890450j714923j406236j106708
12351a2725362q98729p84992p20404o50053n38089l96917k92027k88640l77241
12342a7672454m62083m34412k56997K4379L45542O85656J058231J450320J777832
12333a3483986J900970J701093J176960M84459j27802m49822m09529o9872M44538
12324h832991R97835J437560J599986J380099Q15482R4352n33574q83459r10543
$$ y = [-21814573, -20413746, -19028113, -17751061, -16648675, -15732408, -14946377, -14194587, -13383938, -12457377, -11411741, -10291464, -9158579, -8064637, -7044991, -6127305, -5334949, -4678379, -4144659, -3701193, -3313955, -2962131, -2639328, -2346695, -2087390, -1876131, -1767411, -1875851, -2354526, -3325623, -4794640, -6607045, -8497495, -10212418, -11618654, -12725362, -13624091, -14409083, -15129487, -15779540, -16317629, -16714546, -17006573, -17295213, -17672454, -18134537, -18568949, -18825946, -18801567, -18456025, -17770369, -16712138, -15261818, -13483986, -11583016, -9881923, -8704963, -8220504, -8348306, -8798128, -9207657, -9277529, -8832991, -7835156, -6397596, -4797610, -3417511, -2602029, -2507677, -3041251, -3924710, -4835253]
12315d835253o91681l54600j6838K54226M61385O51977Q49904J008335J033913
12306a638632Q55073M70379m6940n72640r68575j125251r99996o39231j70836
12297d836649K40761M62092M46872K51274j410j90313k53698j95243n2331J40163
12287c988482L65034O03258Q03332Q86283P92974N24894J35385l08064p43793
12278i29179j121064j415799j639134j811636j925617j937038j793040j472372
12270a4044879j015233n24666j25233J07960J94720K25083K85885M01588N30972
12261a3963803O13447O21250N67418M66902L06275N6710k94157p20497j156038
12252a3502493j515182j725131j748159j591673j304372r43241n26990l0392N59356
$$ y = [-4835253, -5526934, -5881534, -5898372, -5644146, -5182761, -4530784, -3680880, -2672545, -1638632, -783559, -313180, -360120, -932760, -1901335, -3026586, -4026582, -4665813, -4836649, -4595888, -4133796, -3686924, -3435650, -3437060, -3627373, -3881071, -4076314, -4128645, -3988482, -3623448, -3020190, -2216858, -1330575, -537601, -12707, 122678, -185386, -929179, -2050243, -3466042, -5105176, -6916812, -8842429, -10779467, -12572507, -14044879, -15060112, -15584778, -15710011, -15602051, -15407331, -15182248, -14896363, -14494775, -13963803, -13350356, -12729106, -12161688, -11694786, -11388511, -11331801, -11625958, -12346455, -13502493, -15017675, -16742806, -18490965, -20082638, -21387010, -22330251, -22857241, -22887633, -22328277]
12243b2328277J176292J673714J900578J789820J384601P97349J58081m07695
12235a3855537p92686r38251q57475o21187l16893j1217K66999N26334Q03286
12226a5796627J143773J579484K113103K715887L327913L862828M228054M357584
12218G531999M234253L883255L347937K673439J907941J112147L58321k91304
12210B4757988q06907j188787j449834j608013j687909j712090j685510j598563
12202A3020375j453851j286629j151064j087801j107432j190884j293325j355837
12194C093552j330056j205417j016216q13943o18361l81235j496N99805J400166
12185b73201K260394K978434L369090L333416K894495K183222J379678O43032
$$ y = [-22328277, -21151985, -19478271, -17577693, -15787873, -14403272, -13605923, -13447842, -13855537, -14648223, -15586474, -16443949, -17065136, -17382029, -17393246, -17126247, -16599913, -15796627, -14652854, -13073370, -10960267, -8244380, -4916467, -1053639, 3174415, 7531999, 11766252, 15649507, 18997444, 21670883, 23578824, 24690971, 25049292, 24757988, 23951081, 22762294, 21312460, 19704447, 18016538, 16304448, 14618938, 13020375, 11566524, 10279895, 9128831, 8041030, 6933598, 5742714, 4449389, 3093552, 1763496, 558079, -458137, -1272080, -1890441, -2271676, -2273172, -1673367, -273201, 1987193, 4965627, 8334717, 11668133, 14562628, 16745850, 18125528, 18768560]
12177A8768560O6121l30675n71237o79115o48178m54270r9989L50264P82797J084050
12167A8268328J185149J079535Q15725M68073R8210k68129o36644j019897j406835
12158A8583515j745718j956435j964688j739717j322026q21863l77804j00658
12150H554606l8365j71306m32858p41924j026392j233345j342596j389366j464150
12141G14304j655617j968650k291959k450402k313631j882597j274573o19837
12133a3742962K3909O66313J320830J959815K526583K977365L296538L473652
12125B502043L488162L325710K994656K521322J944747J325623P46694K84260
12117A9133217k5343j89276k37653k04567j20595j8350N5331M1831j04185l92654
$$ y = [18768560, 18834681, 18504006, 17932769, 17253654, 16605476, 16151206, 16051217, 16401481, 17184278, 18268328, 19453477, 20533012, 21348737, 21816810, 21915020, 21646891, 21010247, 19990350, 18583515, 16837797, 14881362, 12916674, 11176957, 9854931, 9033068, 8655264, 8554606, 8516241, 8344935, 7912077, 7170153, 6143761, 4910416, 3567820, 2178454, 714304, -941313, -2909963, -5201922, -7652324, -9965955, -11848552, -13123125, -13742962, -13719053, -13052740, -11731910, -9772095, -7245512, -4268147, -971609, 2502043, 5990205, 9315915, 12310571, 14831893, 16776640, 18102263, 18848957, 19133217, 19107874, 18918598, 18680945, 18476378, 18355783, 18337433, 18392764, 18434595, 18330410, 17937756]
12107A7937756q00795j286705j794182k252167k581891k720607k655342k437214
12099A408853k157856j910475j760034j720178j740568j722916j566517j220631
12091a2390322p11402j21409M62797R93457J468287J902596K289660K585267K731203
12082g89866K689883K457317K053621J514395Q91935K47228l74715r59189j505485
12073F225124j997535k392380k635494k687255k544691k255360j913157j621438
12065a1822186j442945j378135j379137j370108j259304r59527m25900L06353
12057a9730889J111693J814969K271173K424002K304020J995485J607963J254011
12049d947573J026966R76644J088005J280962J442252J475193J335495J037648
$$ y = [17937756, 17136961, 15850256, 14056074, 11803907, 9222016, 6501409, 3846067, 1408853, -749003, -2659478, -4419512, -6139690, -7880258, -9603174, -11169691, -12390322, -13101724, -13223133, -12760336, -11766879, -10298592, -8395996, -6106336, -3521069, -789866, 1900017, 4357334, 6410955, 7925350, 8817285, 9064513, 8689798, 7730609, 6225124, 4227589, 1835209, -800285, -3487540, -6032231, -8287591, -10200748, -11822186, -13265131, -14643266, -16022403, -17392511, -18651815, -19611342, -20037242, -19730889, -18619196, -16804227, -14533054, -12109052, -9805032, -7809547, -6201584, -4947573, -3920607, -2943963, -1855958, -574996, 867256, 2342449, 3677944, 4715592]
12041D715592O45105K44014j03568l83915o03056p55791q40804q90013r58844
12032A068720j079928j236982j393514j531198j641231j693388j641879j465437
12024a0614837j191200q77727n78023l18533j06763N4842J71628K67236L79389
12015a2813988N37850P44254R76588J217146J471415J751708K045856K309404
12007a759767K484060K515602K356058J962470J313086M41110n39964j452783
11999G319872k122898k454713k457114k207380j797013j295272p33625j15846
11991e863989N44492J190953J729287K059933K112246J880188J447504R64097
11983F064711N71174L28109J94284P3460j13929l79088o65368q93683j019904
$$ y = [4715592, 5360697, 5604711, 5501143, 5117228, 4514172, 3758381, 2917577, 2027564, 1068720, -11208, -1248190, -2641704, -4172902, -5814133, -7507521, -9149400, -10614837, -11806037, -12683764, -13261787, -13580320, -13687083, -13632241, -13460613, -13193377, -12813988, -12276138, -11531884, -10555296, -9338150, -7866735, -6115027, -4069171, -1759767, 724293, 3239895, 5595953, 7558423, 8871509, 9312619, 8772655, 7319872, 5196974, 2742261, 285147, -1922233, -3719246, -5014518, -5748143, -5863989, -5319497, -4128544, -2399257, -339324, 1772922, 3653110, 5100614, 6064711, 6635885, 6963994, 7158278, 7231738, 7117809, 6738721, 6073353, 5179670, 4159766]
11974D159766j069001j116086j219861j368444j489578j509662j408539j230464
11966f251869j045453q93073p56602n87061l48734l9548L29325P56450J233282
11957g603283J710886K099877K302785K247922J914600J352154O83807Q0371l00731
11948D488388l90268k46866k3704J14859O0590k18813o76872j185230j568732
11939C53352j697053j567689j295553j015446p94741o28720m91059l68187k55744
11930g760840j49006m9878K0615K6768n3181j94332l23644l59135k55617k1838
11920i120088K91392O16751R01228J129150J316811J482318J623552J722577J761727
11911A725418J730556J622356J432242J160871Q23409M63175J47116p3809k03477
$$ y = [4159766, 3090765, 1974679, 754818, -613626, -2103204, -3612866, -5021405, -6251869, -7297322, -8190395, -8946997, -9534058, -9882792, -9922340, -9593015, -8836565, -7603283, -5892397, -3792520, -1489735, 758187, 2672787, 4024941, 4708748, 4789119, 4488388, 4098120, 3851254, 3827550, 3942409, 4002999, 3784186, 3107314, 1922084, 353352, -1343701, -2911390, -4206943, -5222389, -6017130, -6645850, -7136909, -7505096, -7760840, -7909846, -7959724, -7939109, -7912341, -7965522, -8159854, -8483498, -8842633, -9098250, -9120088, -8828696, -8211945, -7310717, -6181567, -4864756, -3382438, -1758886, -36309, 1725418, 3455974, 5078330, 6510572, 7671443, 8494852, 8958027, 9105143, 9031334, 8827857]
11902H827857k91922l87064m94565n77848n94474n36340m34931l29819k40960
11893D939934j69134j06427m3367J8450N3108K1474r0883k50627m03228n23899
11883C445401o36229p78569r53318j105699j150859j036591p96741n49502m38368
11874d000475n49233q54838j232832j549670j734017j767015j618527j234677
11866a4541284o09677J49069Q45054J281756J348909J068629N86441J01327k30946
11857a0000722l53538k95633j26840P6450K45354L29773L06885J78342k7618k41291
11847i908838l61672l11497q2658K76776P05592J155841J595775K000453K337231
11838b592997K560963K634186K560618K398116K228054K100526K001545J865766
$$ y = [8827857, 8535935, 8148871, 7654306, 7076458, 6481984, 5945644, 5510713, 5180894, 4939934, 4770800, 4664373, 4621006, 4639456, 4692564, 4714038, 4623155, 4372528, 3969300, 3445401, 2809172, 2030603, 1077285, -28414, -1179273, -2215864, -3012605, -3562107, -4000475, -4549708, -5404546, -6637378, -8187048, -9921065, -11688080, -13306607, -14541284, -15150961, -15001892, -14156838, -12875082, -11526173, -10457544, -9871103, -9769776, -10000722, -10354260, -10649893, -10776733, -10700283, -10454929, -10125156, -9818271, -9639929, -9667547, -9908838, -10270510, -10582007, -10664665, -10387889, -9682297, -8526456, -6930681, -4930228, -2592997, -32034, 2602152, 5162770, 7560886, 9788940, 11889466, 13891011, 15756777]
11830A5756777J619502J219922O68176R394o66622j244414j630236j792836j767763
$$ y = [15756777, 17376279, 18596201, 19264377, 19273771, 18607149, 17362735, 15732499, 13939663, 12171900]
$$ [...]
##END NTUPLES=NMR SPECTRUM
##END=
