##TITLE=31P ikalashn
96-2024-BAU
20.11.2024
##JCAMPDX= 6.0         $$ Bruker NMR JCAMP-DX V2.0
##DATA TYPE= NMR SPECTRUM
##DATA CLASS= NTUPLES
##ORIGIN= UXNMR, Bruker Analytische Messtechnik GmbH
##OWNER= root
$$ TOPSPIN		Version 1.3
$$ 2024-11-20 10:39:02.937 +0400  Irina@DPX200
$$ Compression mode = diff/dup
##.OBSERVE FREQUENCY= 81.01967998063
##.OBSERVE NUCLEUS= ^31P
##.ACQUISITION MODE= SIMULTANEOUS
##.ACQUISITION SCHEME= undefined
##.AVERAGES= 64
##.DIGITISER RES= 17
##SPECTROMETER/DATA SYSTEM= spect
##.PULSE SEQUENCE= zgpg
##.SOLVENT NAME= CDCl3
##.SHIFT REFERENCE= INTERNAL, CDCl3, 1, 298.5841
##AUDIT TRAIL= $$ (NUMBER, WHEN, WHO, WHERE, WHAT)
$$ ##TITLE= Audit trail, TOPSPIN		Version 1.3
$$ ##JCAMPDX= 5.01
$$ ##ORIGIN= Bruker BioSpin GmbH
$$ ##OWNER= Irina
$$ $$ F:/spectra/data/iren/nmr/P31dec/1/pdata/1/auditp.txt
$$ ##AUDIT TRAIL=  $$ (NUMBER, WHEN, WHO, WHERE, VERSION, WHAT)
(   1,<2024-11-20 10:38:40.093 +0400>,<Irina>,<DPX200>,<TOPSPIN 1.3>,
      <created by zg
	started at 2024-11-20 10:36:57.140 +0400,
	POWCHK disabled, PULCHK disabled
       configuration hash MD5:
       BE 6D 3F 07 2A EA 11 49 91 17 2B D3 AF B3 58 0D
       data hash MD5: 32K
       00 02 A8 73 9B 63 93 F6 64 E3 1B BA B5 46 15 B9>)
(   2,<2024-11-20 10:38:44.312 +0400>,<Irina>,<DPX200>,<TOPSPIN 1.3>,
      <Start of raw data processing
       efp BC_mod = 2 LB = 10 FT_mod = 6 PKNL = 1 PHC0 = 236.4109 PHC1 = 36.4109 SI = 32K 
       data hash MD5: 32K
       62 61 8A D0 AD E2 12 CC 34 3A 85 13 2C C1 40 09>)
(   3,<2024-11-20 10:38:46.312 +0400>,<Irina>,<DPX200>,<TOPSPIN 1.3>,
      <apk 
       data hash MD5: 32K
       F6 A3 DB E3 52 05 E8 C7 68 4D B0 CB DB 2E AE E9>)
(   4,<2024-11-20 10:38:48.718 +0400>,<Irina>,<DPX200>,<TOPSPIN 1.3>,
      <abs n ABSG = 5 
       data hash MD5: 32K
       D7 2C 27 5A 47 A0 BA 15 5F F5 1C B6 FF 05 4B 60>)
$$ ##END=
$$ 
$$ $$ hash MD5
$$ $$ 97 98 AC AC 78 D8 DD D3 D1 F3 95 A4 5F 26 21 9C
##$RELAX= 
##$RELAX= 
##$RELAX= 
##$RELAX= 
##$RELAX= 
##$RELAX= 
##$RELAX= 
##$RELAX= 
##$RELAX= 
##$RELAX= 
##$RELAX= 
$$ Bruker specific parameters
$$ --------------------------
##$DU= <F:/spectra>
##$EXPNO= 1
##$NAME= <P31dec>
##$PROCNO= 1
##$TYPE= <nmr>
##$USER= <iren>
##$AMP= (0..31)
100 100 100 100 100 100 100 100 100 100 100 100 100 100 100 100 100 100 
100 100 100 100 100 100 100 100 100 100 100 100 100 100 
##$ANAVPT= -1
##$AQSEQ= 0
##$AQ_mod= 1
##$AUNM= <au_zg>
##$AUTOPOS= <>
##$BF1= 81.014009
##$BF2= 200.13
##$BF3= 200.13
##$BF4= 200.13
##$BF5= 200.13
##$BF6= 200.13
##$BF7= 200.13
##$BF8= 200.13
##$BYTORDA= 1
##$CFDGTYP= 0
##$CFRGTYP= 5
##$CHEMSTR= <none>
##$CNST= (0..63)
1 1 145 1 1 1 1 1 1 1 1 1 1 1 1 1 1 1 1 1 1 1 1 1 1 1 1 1 1 1 1 1 1 1 
1 1 1 1 1 1 1 1 1 1 1 1 1 1 1 1 1 1 1 1 1 1 1 1 1 1 1 1 1 1 
##$CPDPRG= <waltz16>
##$CPDPRG1= <>
##$CPDPRG2= <waltz16>
##$CPDPRG3= <>
##$CPDPRG4= <mlev>
##$CPDPRG5= <mlev>
##$CPDPRG6= <mlev>
##$CPDPRG7= <mlev>
##$CPDPRG8= <mlev>
##$CPDPRGB= <>
##$CPDPRGT= <>
##$D= (0..63)
$$ [...]
##$SW_h= 37037.037037037
##$TD= 32768
##$TD0= 1
##$TE= 300
##$TE2= 300
##$TE3= 300
##$TEG= 300
##$TL= (0..7)
0 120 53 12 22 120 120 120 
##$TP= (0..7)
150 150 150 150 150 150 150 150 
##$TP07= 0
##$TPNAME0= <>
##$TPNAME1= <>
##$TPNAME2= <>
##$TPNAME3= <>
##$TPNAME4= <>
##$TPNAME5= <>
##$TPNAME6= <>
##$TPNAME7= <>
##$TPOAL= (0..7)
0.5 0.5 0.5 0.5 0.5 0.5 0.5 0.5 
##$TPOFFS= (0..7)
0 0 0 0 0 0 0 0 
##$TUNHIN= 0
##$TUNHOUT= 0
##$TUNXOUT= 0
##$USERA1= <user>
##$USERA2= <user>
##$USERA3= <user>
##$USERA4= <user>
##$USERA5= <user>
##$V9= 5
##$VALIST= <valist>
##$VCLIST= <CCCCCCCCCCCCCCC>
##$VD= 0
##$VDLIST= <DDDDDDDDDDDDDDD>
##$VPLIST= <PPPPPPPPPPPPPPP>
##$VTLIST= <TTTTTTTTTTTTTTT>
##$WBST= 1024
##$WBSW= 4
##$XGAIN= (0..3)
0 0 0 0 
##$XL= 0
##$YL= 0
##$YMAX_a= 6904
##$YMIN_a= -10216
##$ZGOPTNS= <>
##$ZL1= 120
##$ZL2= 120
##$ZL3= 120
##$ZL4= 120
##$ABSF1= 298.5841
##$ABSF2= -158.5842
##$ABSG= 5
##$ABSL= 5
##$ALPHA= 0
##$AQORDER= 0
##$ASSFAC= 0
##$ASSFACI= 0
##$ASSFACX= 0
##$ASSWID= 0
##$AUNMP= <proc_1d>
##$AXLEFT= 0
##$AXRIGHT= 0
##$AXTYPE= 0
##$AXUNIT= <>
##$AZFE= 0.1
##$AZFW= 0.5
##$BCFW= 0
##$BC_mod= 2
##$BYTORDP= 0
##$COROFFS= 0
##$CY= 12.5935478210449
##$DATMOD= 1
##$DC= 0
##$DFILT= <>
##$DTYPP= 0
##$F1P= 47.1127640792319
##$F2P= -24.0371245302204
##$FCOR= 0.5
##$FTSIZE= 32768
##$FT_mod= 6
##$GAMMA= 0
##$GB= 0
##$INTBC= 1
##$INTSCL= 7.269226e-011
##$ISEN= 30
##$LB= 10
##$LEV0= 0
##$LPBIN= 0
##$MAXI= 12.09355
##$MC2= 0
##$MEAN= 0
##$ME_mod= 0
##$MI= 0.7550151
##$NCOEF= 0
##$NC_proc= -13
##$NLEV= 6
##$NOISF1= 298.5841
##$NOISF2= 270.0111
##$NSP= 0
##$NTH_PI= 0
##$NZP= 0
##$OFFSET= 298.5841
##$PC= 1.4
##$PHC0= 246.1559
##$PHC1= -34.74983
##$PH_mod= 1
##$PKNL= yes
##$PPARMOD= 0
##$PPDIAG= 0
##$PPIPTYP= 0
##$PPMPNUM= 100
##$PPRESOL= 1
##$PSCAL= 0
##$PSIGN= 0
##$REVERSE= no
##$SF= 81.014009
##$SI= 32768
##$SIGF1= 270.0111
##$SIGF2= -158.5842
##$SINO= 77.54984
##$SIOLD= 32768
##$SREGLST= <31P.CDCl3>
##$SSB= 0
##$STSI= 32768
##$STSR= 0
##$SW_p= 37037.037037037
##$SYMM= 0
##$S_DEV= 0
##$TDeff= 32768
##$TDoff= 0
##$TI= <>
##$TILT= no
##$TM1= 0
##$TM2= 0
##$TOPLEV= 0
##$USERP1= <user>
##$USERP2= <user>
##$USERP3= <user>
##$USERP4= <user>
##$USERP5= <user>
##$WDW= 1
##$XDIM= 32768
##$YMAX_p= 501774754
##$YMIN_p= -31070991
$$ End of Bruker specific parameters
$$ ---------------------------------
##NTUPLES= NMR SPECTRUM
##VAR_NAME=  FREQUENCY,     SPECTRUM/REAL,   SPECTRUM/IMAG
##SYMBOL=    X,             R,               I
##VAR_TYPE=  INDEPENDENT,   DEPENDENT,       DEPENDENT
##VAR_FORM=  AFFN,          ASDF,            ASDF
##VAR_DIM=   32768,         32768,           32768
##UNITS=     HZ,            ARBITRARY UNITS, ARBITRARY UNITS
##FACTOR=    1.13031516577767, 1,            1
##FIRST=     37037.037037037, -13259944,     -58795272
##LAST=      0,             -8297424,        57328318
##MIN=       0,             -31070991,       0
##MAX=       37037.037037037, 501774754,     0
$$ Real data points
##PAGE= N=1
##DATA TABLE= (X++(R..R)), XYDATA
$$ [...]
15969F96510J823855J957681J818119J311598M33445p70413k176032l475644m194583
$$ 696510 2520365 4478046 6296165 7607763 8041208 7270795 5094763 1619119 -2575464
15960b575464m025382l099654j829129n06708P51818J736650K150989J939853
$$ -2575464 -6600846 -9700500 -11529629 -12036337 -11284519 -9547869 -7396880 -5457027
15952e457027J363109P45226K50543j08790l16773l39481j57577K45191P48396
$$ -5457027 -4093918 -3348692 -3098149 -3206939 -3523712 -3863193 -4020770 -3775579 -3027183
15943c027183J069108J017478O82564L53785K85697M34760M88924L02227L3909
$$ -3027183 -1958075 -940597 -258033 95752 381449 816209 1305133 1607360 1641269
15934A641269j51361k12809j23947P2058J66898K8358j87458k51703j54964r2715
$$ 1641269 1489908 1277099 1153152 1225210 1392108 1420466 1233008 981305 826341 733626
15924G33626k73015o93165j016600q36326k33915J68190m2390n67456q18442n19654
$$ 733626 460611 -232554 -1249154 -2085480 -2319395 -2151205 -2193595 -2761051 -3579493 -4099147
15914d099147J20885O55196Q82763J015505J353641K008773K855986L552363L724206
$$ -4099147 -3978262 -3323066 -2440303 -1424798 -71157 1937616 4793602 8345965 12070171
15905A2070171L305989K556066J712784Q03528k79945j567859k829083l683631
$$ 12070171 15376160 17932226 19645010 20448538 20168593 18600734 15771651 12088020
15897A2088020l915716l650366l133507k407017j420936l81984L14836M67582
$$ 12088020 8172304 4521938 1388431 -1018586 -2439522 -2821506 -2506670 -2039088
15889b039088K24803r6032k14643Q3296P91266J601886K204309K457699K241035
$$ -2039088 -1814285 -1910317 -2124960 -2041664 -1250398 351488 2555797 5013496 7254531
15880G254531J442882K43969q63760j442467j340608p00969Q8608O04498O71902
$$ 7254531 8697413 8941382 8077622 6635155 5294547 4593578 4682186 5286684 5958586
15871E958586L72124r0093m22295l44249J62141Q04674J287278J563754J674606
$$ 5958586 6330710 6240617 5818322 5474073 5636214 6440888 7728166 9291920 10966526
15862A0966526J567315J252609Q44091M17186p2712p58577j608618k334580k672911
$$ 10966526 12533841 13786450 14630541 15047727 14975015 14216438 12607820 10273240 7600329
15853G600329k537383j924345r27286J47248Q81583J084921R15700O56420N00935
$$ 7600329 5062946 3138601 2211315 2358563 3240146 4325067 5240767 5897187 6398122
15844F398122M99003N05614L16097l6238l13128l53177k08710l3551J72558N56792
$$ 6398122 6897125 7402739 7718836 7682598 7369470 7016293 6807583 6774032 6946590 7503382
15834G503382J120256J657356J889258J621346Q93365j09925j119471j744107
$$ 7503382 8623638 10280994 12170252 13791598 14684963 14575038 13455567 11711460
15826A1711460j769829j354849p69852k60604q406m3620l46143p96620j033269
$$ 11711460 9941631 8586782 7816930 7556326 7547920 7504300 7158157 6361537 5328268
15817E328268q19148l87979j04917o6266j50422k60236l84810n09202n88159n78394
$$ 5328268 4509120 4121141 4016224 3949958 3799536 3539300 3154490 2645288 2057129 1478735
15807A478735m49477k75038k48653m79927j004188j845792k791238l349461l119177
$$ 1478735 1029258 754220 505567 25640 -978548 -2824340 -5615578 -8965039 -12084216
15798a2084216k220366j168598k20868P91533J907324K773052L102542K974301
$$ -12084216 -14304582 -15473180 -15694048 -14902515 -12995191 -10222139 -7119597 -4145296
15790d145296K628108K247461J885965J526265J120279N95809J5898m35443p37182
$$ -4145296 -1517188 730273 2616238 4142503 5262782 5858591 5874489 5439046 4701864
15781D701864j021679j363996j780173k191396k356048k157505j777313j501637
$$ 4701864 3680185 2316189 536016 -1655380 -4011428 -6168933 -7946246 -9447883
15773i447883j442229j336665p96410K25906J349525K050646K020655J340064
$$ -9447883 -10890112 -12226777 -13023187 -12797281 -11447756 -9397110 -7376455 -6036391
15765f036391L15969o98790j334360j356684r14285m48876k28727j54881j8299
$$ -6036391 -5720422 -6419212 -7753572 -9110256 -10024541 -10473417 -10702144 -10857025 -10875324
15756a0875324L25991R45127J696789K264535K449694K240447J688559R53230
$$ -10875324 -10549333 -9604206 -7907417 -5642882 -3193188 -952741 735818 1689048
15748A689048K92087j31173l03177l48366n18869r72142j568664j970943j870666
$$ 1689048 1981135 1849962 1546785 1198419 679550 -292592 -1861256 -3832199 -5702865
15739e702865j147090L3988J217025J930289K061399J877845J649419J356857
$$ -5702865 -6849955 -6815967 -5598942 -3668653 -1607254 270591 1920010 3276867
15731C276867Q43441J48984m34513o25600m05954O338M27571Q87772J423919J860523
$$ 3276867 4120308 4269292 3834779 3209179 2803225 2809563 3237134 4124906 5548825 7409348
15721G409348K065641K148919K134062J834314J219197N16220o7074n23235r25978
$$ 7409348 9474989 11623908 13757970 15592284 16811481 17327701 17260627 16737392 15811414
15712A5811414j241693j457475j794530k491624l402681m010302l907468l150446
$$ 15811414 14569721 13112246 11317716 8826092 5423411 1413109 -2494359 -5644805
15704e644805k064174r50697o7352L65551L37070J29281L5990P5734O6368m5593
$$ -5644805 -7708979 -8659676 -8727028 -8361477 -8024407 -7895126 -7859136 -7783402 -7717034 -7762627
15694g762627j47520k64615n71873j003708j155646p94782j59348L02256L48733
$$ -7762627 -7910147 -8174762 -8746635 -9750343 -10905989 -11700771 -11860119 -11557863 -11209130
15685a1209130J29273j03678l21885n64393o75840m80567p9892J92814P3227m69064
$$ -11209130 -11079857 -11183535 -11505420 -12069813 -12745653 -13226220 -13306112 -13113298 -13040071 -13509135
15675a3509135j139833j473124j312831q75046l68712K27516R91181J757676K225420
$$ -13509135 -14648968 -16122092 -17434923 -18309969 -18678681 -18451165 -17459984 -15702308 -13476888
15666a3476888K325501K223696K076462J920653J746135J537054J260438R11068
$$ -13476888 -11151387 -8927691 -6851229 -4930576 -3184441 -1647387 -386949 524119
15658E24119M81855j11221q49699j392488j284815l86663R92972K287891L024687
$$ 524119 1005974 894753 45054 -1347434 -2632249 -3018912 -2025940 261951 3286638
15649C286638L145609K887101K369390J484166K00321j110941j851242j754689
$$ 3286638 6432247 9319348 11688738 13172904 13373225 12262284 10411042 8656353
15641H656353j144327o30803n89031r54818j428883j783201k021013k201763k192743
$$ 8656353 7512026 6881223 6292192 5337374 3908491 2125290 104277 -2097486 -4290229
15632d290229j815769j151239m95525m7576K04278K88510J78507k4829j56669
$$ -4290229 -6105998 -7257237 -7752762 -7800338 -7596060 -7307550 -7129043 -7153872 -7310541
15623g310541k38612l37733m15075m85824o45337q96216j020882p11681Q7612
$$ -7310541 -7549153 -7886886 -8301961 -8787785 -9433122 -10329338 -11350220 -12061901 -11974289
15614a1974289J079487J885942K207995J823389P31614o99514j953949k763164
$$ -11974289 -10894802 -9008860 -6800865 -4977476 -4245862 -4945376 -6899325 -9662489
15606i662489l173118l283076l081197k573546j871156j076977j81582Q44332
$$ -9662489 -12835607 -16118683 -19199880 -21773426 -23644582 -24721559 -24903141 -24058809
15598b4058809J892577K774417L310635L295684K615273J456112K34919o28750
$$ -24058809 -22166232 -19391815 -16081180 -12785496 -10170223 -8714111 -8479192 -9107942
15590i107942r10458p30744m11015j61306k1017O7160J65306K36042K77485M33654
$$ -9107942 -10018400 -10749144 -11160159 -11321465 -11342482 -11275322 -11110016 -10873974 -10596489 -10162835
15580a0162835P67137J129284J366529J518395J701861J863337J831365J567132
$$ -10162835 -9395698 -8266414 -6899885 -5381490 -3679629 -1816292 15073 1582205
15572A582205J214348R12450O09049K42991O6729L26384P39867P69717K87481
$$ 1582205 2796553 3709003 4318052 4561043 4627772 4954156 5694023 6463740 6751221
15563F751221l77582r38109j370404j665912j723390j556178j375859j237233
$$ 6751221 6373639 5435530 4065126 2399214 675824 -880354 -2256213 -3493446
15555c493446q38672j7216Q96089J449467J441685R30945J72576o06312j319825
$$ -3493446 -4332118 -4349334 -3453245 -2003778 -562093 368852 541428 -64884 -1384709
15546a384709j751113j555369n81595R46834K477968L399241L415942K702297
$$ -1384709 -3135822 -4691191 -5272786 -4325952 -1847984 1551257 4967199 7669496
15538G669496J715065Q74278M13203L62864M93358M61422R4700n41794j361749
$$ 7669496 9384561 10258839 10672042 11034906 11528264 11989686 12084386 11542592 10180843
15529A0180843k282063k975116l063750k561069j732636q01140k158M27327M57746
$$ 10180843 7898780 4923664 1859914 -701155 -2433791 -3234931 -3237089 -2809762 -2352016
15520b352016K78459J03983M2385K7109j44272n88684j212634j797310k098797
$$ -2352016 -2073557 -1969574 -1927189 -1900080 -2044352 -2633036 -3845670 -5642980 -7741777
15511g741777j910283j179734j79124O55094J140709J348323J247148P63825O1752
$$ -7741777 -9652060 -10831794 -11010918 -10355824 -9215115 -7866792 -6619644 -5855819 -5794067
15502e794067o06829j134453j485884j486980r04739J38338J025555J211451Q35950
$$ -5794067 -6400896 -7535349 -9021233 -10508213 -11412952 -11274614 -10249059 -9037608 -8201658
15493h201658M73319L52927K53244N6857r9311j01073q814L9869L3541P8260K77863
$$ -8201658 -7728339 -7375412 -7122168 -7065311 -7164622 -7265695 -7274509 -7234640 -7201099 -7122839 -6844976
15482f844976O64368J102499J375280J343680J016949N75803K43521J20489J99603
$$ -6844976 -6180608 -5078109 -3702829 -2359149 -1342200 -766397 -522876 -402387 -202784
15473b02784M49522Q63334J426394J988816K351182K496650K473132K143385J332289
$$ -202784 246738 1110072 2536466 4525282 6876464 9373114 11846246 13989631 15321920
15464A5321920J94789q36742j408168j379070q56075j65721M10076P49742P70026
$$ 15321920 15516709 14679967 13271799 11892729 11036654 10870933 11281009 12030751 12800777
15455A2800777M49100n2340m68754o52057o13225l88290m2203J45553j45689p65937
$$ 12800777 13249877 13197537 12728783 12076726 11463501 11075211 11033008 11178561 11032872 10266935
15445A0266935j146330r02570k02362N10774R65003J081554Q92198M43735l09048
$$ 10266935 9120605 8218035 8015673 8526447 9491450 10573004 11465202 11908937 11599889
15436A1599889j340384k377059l071294l296915l147458k719262k089623j434442
$$ 11599889 10259505 7882446 4811152 1514237 -1633221 -4352483 -6442106 -7876548
15428g876548q81639k84669O02278J757242K860176L565528L689715L231998K335060
$$ -7876548 -8758187 -9042856 -8440578 -6683336 -3823160 -257632 3432083 6664081 8999141
15419H999141J166065q7770j138260j798575k158622k411830k555063k324603
$$ 8999141 10165206 10077436 8939176 7140601 4981979 2570149 15086 -2309517
15411b309517j554518m98325L78798P88126O83473K16105k71175m80036l42817
$$ -2309517 -3864035 -4362360 -3983562 -3195436 -2511963 -2295858 -2567033 -3047069 -3389886
15402c389886M7952M24828N04712L17732O5798j46795k88377m50580q60864j575232
$$ -3389886 -3341934 -2917106 -2412394 -2094662 -2028864 -2175659 -2464036 -2914616 -3775480 -5350712
15392e350712k326375k742923k630545k046537j264265o38730k88906o7442J38101
$$ -5350712 -7677087 -10420010 -13050555 -15097092 -16361357 -17000087 -17288993 -17356435 -17218334
15383a7218334K75141K89110L13905N52983J000382J481194J814386J831067J526522
$$ -17218334 -16943193 -16654083 -16340178 -15787195 -14786813 -13305619 -11491233 -9660166 -8133644
15374h133644J169952R89344R60151J022064J138076J161366R51776N62818K21788
$$ -8133644 -6963692 -5974348 -5014197 -3992133 -2854057 -1692691 -740915 -178097 43691
15365D3691J22431K40387L39767K09016n9741j77944m0680J31843J1883m38888
$$ 43691 166122 406509 746276 955292 895551 717607 676927 808770 820653 381765
15355C81765p72276m69760M25451J349511J788457J603708R72911J62903o09064
$$ 381765 -390511 -860271 -434820 914691 2703148 4306856 5279767 5442670 4833606
15346D833606j158905j409195j458182j374699j102299o68861j39133O12746J652360
$$ 4833606 3674701 2265506 807324 -567375 -1669674 -2338535 -2477668 -1864922 -212562
15337b12562K580955K836492K283203J215270N6083p72047r08383k16462J090820
$$ -212562 2368393 5204885 7488088 8703358 8759441 7987394 7079011 6862549 7953369
15328G953369K504721L399066L385551K553947J309596J46066n65686q50377j089562
$$ 7953369 10458090 13857156 17242707 19796654 21106250 21252316 20686630 19836253 18746691
15319A8746691j592509k347037l118305l533138l296002k499908j512159n89879
$$ 18746691 17154182 14807145 11688840 8155702 4859700 2359792 847633 257754
15311B57754J68166O51636Q03955O93913L98887K8001k50171l75977l45220j18537
$$ 257754 425920 1077556 1881511 2575424 2974311 3002312 2752141 2376164 2030944 1912407
15301A912407J12898r2536q67346j761472k240720k217871j902997j374179n61449
$$ 1912407 2025305 1932769 1065423 -696049 -2936769 -5154640 -7057637 -8431816 -8993265
15292h993265M34544J260023J516428J021946J5585r52048j479546j573678j442612
$$ -8993265 -8558721 -7298698 -5782270 -4760324 -4744739 -5696787 -7176333 -8750011 -10192623
15283a0192623j342785j471054j660504j487187p76714L10102J479737K415140
$$ -10192623 -11535408 -13006462 -14666966 -16154153 -16930867 -16620765 -15141028 -12725888
15275a2725888K923672K929334K379708J445237N60919j2283l95443p66574j018610
$$ -12725888 -9802216 -6872882 -4493174 -3047937 -2487018 -2499301 -2894744 -3661318 -4679928
15266d679928r65421p60408p08730q67727j077078j205496j283486j362858j309406
$$ -4679928 -5645349 -6405757 -7114487 -7982214 -9059292 -10264788 -11548274 -12911132 -14220538
15257a4220538q76456n8932P90449J390245J762418J957318J892477J480413P62095
$$ -14220538 -15096994 -15155926 -14365477 -12975232 -11212814 -9255496 -7363019 -5882606 -5120511
15248e120511o3486o99217r41425q39916o59841o27835p45102q65345q78803p45271
$$ -5120511 -5183997 -5883214 -6824639 -7664555 -8324396 -8952231 -9697333 -10562678 -11441481 -12186752
15238a2186752l65632M14616J581602K737215L352156L327430K965518K385311
$$ -12186752 -12552384 -12137768 -10556166 -7818951 -4466795 -1139365 1826153 4211464
15230D211464J459549K90649p64047j447151j674473j479405j024473n43698k30934
$$ 4211464 5671013 5961662 5197615 3750464 2075991 596586 -427887 -971585 -1202519
15221a202519k00183l77476n29715n68682o47685q94338j178616j253901j052827
$$ -1202519 -1402702 -1780178 -2309893 -2878575 -3526260 -4420598 -5599214 -6853115 -7905942
15212g905942p44744n17543l32952L0402O76960J451832K069889K320322K261335
$$ -7905942 -8650686 -9168229 -9501181 -9470779 -8793819 -7341987 -5272098 -2951776 -690441
15203f90441K127386J963693J599010J022513M93058J83933R0971K51447O59420
$$ -690441 1436945 3400638 4999648 6022161 6515219 6699152 6790123 7041570 7700990
15194G700990J092883J290242J143615O75466j5246p84970j447623j704094j263874
$$ 7700990 8793873 10084115 11227730 11903196 11887950 11102980 9655357 7951263 6687389
15185F687389k47995Q12933J451810J504358J113716O33373K43788k05807q27247
$$ 6687389 6439394 7252327 8704137 10208495 11322211 11955584 12199372 11993565 11166318
15176A1166318j496216k060780k443049k584543k427790j923493j132097k36610
$$ 11166318 9670102 7609322 5166273 2581730 153940 -1769553 -2901650 -3138260
15168c138260O09798J399707K186013K831401L093191K900022K242657J101686
$$ -3138260 -2528462 -1128755 1057258 3888659 6981850 9881872 12124529 13226215
15160A3226215k22360j077908j035762l21971N16248J136400J391809J188943
$$ 13226215 13003855 11925947 10890185 10568214 11084462 12220862 13612671 14801614
15152A4801614N76445j96928p99861j010180q63016o11480m28209k00587K95608
$$ 14801614 15378059 15181131 14381270 13371090 12508074 11896594 11468385 11267798 11563406
15143A1563406J084232J902374K365592K225790J539948O36146j01322m88777
$$ 11563406 12647638 14550012 16915604 19141394 20681342 21317488 21216166 20727389
15135B0727389o67068r46570j452222j980618k273666k290571k121709j855140
$$ 20727389 20060321 19113751 17661529 15680911 13407245 11116674 8994965 7139825
15127G139825j538880j078248m55587j2464r0870o43067j392230k083714k540826
$$ 7139825 5600945 4522697 4067110 4054646 3963776 3320709 1928479 -155235 -2696061
15118b696061k634161k352862j873530j339384o48749L14159J285333J739936
$$ -2696061 -5330222 -7683084 -9556614 -10895998 -11544747 -11230588 -9945255 -8205319
15110h205319J433813O24189j12483k30122L78881J241733J702991J557046J066016
$$ -8205319 -6771506 -6147317 -6259800 -6489922 -6111041 -4869308 -3166317 -1609271 -543255
15101e43255L84662n13863j379241j757475j559606j195889j067586j095597r45295
$$ -543255 -158593 -672456 -2051697 -3809172 -5368778 -6564667 -7632253 -8727850 -9673145
15092i673145n08666J11789Q06358J469606K032826K456705K654466K524715J985841
$$ -9673145 -10181811 -10070022 -9263664 -7794058 -5761232 -3304527 -650061 1874654 3860495
15083C860495J096846K12924k52743k05618K46248R92729J786385K265179K235943
$$ 3860495 4957341 5170265 4917522 4711904 4958152 5950881 7737266 10002445 12238388
15074A2238388J735050R14071O4193m99214p33544q62005j168699j841388k799767
$$ 12238388 13973438 14887509 14951702 14452488 13718944 12856939 11688240 9846852 7047085
15065G047085l631959l881550l596214l266587l058094k612451j726542p09833
$$ 7047085 3415126 -466424 -4062638 -7329225 -10387319 -12999770 -14726312 -15436145
15057a5436145M2902M23108N07493L66799J10247p4846q9584l9274k4364O7319
$$ -15436145 -15393243 -14970135 -14462642 -14095843 -13985596 -14060442 -14150026 -14189300 -14213664 -14146345
15047a4146345L87711R09393J409703J661379J670523J642196J715952J812858
$$ -14146345 -13758634 -12849241 -11439538 -9778159 -8107636 -6465440 -4749488 -2936630
15039b936630J766548J588366J465556J482431J503484J296663P11837j49841
$$ -2936630 -1170082 418284 1883840 3366271 4869755 6166418 6878255 6728414
15031F728414r26138j224146r54368m15184o402Q8969Q2933M04635J227157K281419
$$ 6728414 5802276 4578130 3623762 3208578 3202176 3291145 3374078 3778713 5005870 7287289
15021G287289L019123K939255J904888K52006j343705k282584k413527k018666
$$ 7287289 10306412 13245667 15150555 15402561 14058856 11776272 9362745 7344079
15013G344079j462370r69129o87974p26314j096123j613193j932873j867712j513903
$$ 7344079 5881709 4912580 4224606 3498292 2402169 788976 -1143897 -3011609 -4525512
15004d525512r75333l21909K71473O89118R96637J233208J339845J356986J369807
$$ -4525512 -5500845 -5822754 -5551281 -4862163 -3865526 -2632318 -1292473 64513 1434320
14995A434320J256700P79741k4710p38108r62722p10169l97429m59912q93947
$$ 1434320 2691020 3470761 3446051 2707943 1745221 1035052 637623 177711 -716236
14986g16236j325835j465274j342031j167961j036456q90468p50083o30748m88694
$$ -716236 -2042071 -3507345 -4849376 -6017337 -7053793 -7944261 -8694344 -9325092 -9813786
14977i813786l40844j57600J00963L87992P36143J221577J740762K050449J997162
$$ -9813786 -10154630 -10312230 -10211267 -9823275 -9087132 -7865555 -6124793 -4074344 -2077182
14968b077182J643328J173948P26462L11485r4098l87096m55934l46237j29277
$$ -2077182 -433854 740094 1466556 1778041 1683943 1296847 840913 494676 365399
14959C65399J54731M55124P07969P95249O24680K09847l87863j008715j377793
$$ 365399 520130 975254 1683223 2478472 3103152 3312999 2925136 1916421 538628
14950E38628j298278r06243o86931j045838j938464k934607l497959l309064k424898
$$ 538628 -759650 -1665893 -2352824 -3398662 -5337126 -8271733 -11769692 -15078756 -17503654
14941a7503654j203022n0069P95043J236044J216115P05018j68073j057235j603816
$$ -17503654 -18706676 -18756745 -17961702 -16725658 -15509543 -14804525 -14972598 -16029833 -17633649
14932a7633649j626326j149091m15534K48894O83595R40516J171618J517146J946141
$$ -17633649 -19259975 -20409066 -20824600 -20575706 -19892111 -18951595 -17779977 -16262831 -14316690
14923a4316690K194598K022320J437469O47068K5632j7969O16979J604290K387541
$$ -14316690 -12122092 -10099772 -8662303 -8015235 -7989603 -8007572 -7390593 -5786303 -3398762
14914c398762K500486J834442O62133o01189j697319k503483k774478k311837
$$ -3398762 -898276 936166 1598299 997110 -700209 -3203692 -5978170 -8290007
14906h290007j399487o35728l31890l64537m82101m54934j70871K28364N06825
$$ -8290007 -9689494 -10325222 -10657112 -11021649 -11503750 -11958684 -12129555 -11901191 -11394366
14897a1394366O35914Q23152J181573J479614J398773J001475P02832P22034R56060
$$ -11394366 -10758452 -9935300 -8753727 -7274113 -5875340 -4873865 -4171033 -3448999 -2492939
14888b492939J320944J783000K198398K380919K381658K492525K786425K919531
$$ -2492939 -1171995 611005 2809403 5190322 7571980 10064505 12850930 15770461
14880A5770461K478671J359730j41058j550484k553008l041757k948828k303304
$$ 15770461 18249132 19608862 19467804 17917320 15364312 12322555 9373727 7070423
14872G070423j377300m98896K07998P68010J207930J485770J481084J072137K82425
$$ 7070423 5693123 5194227 5402225 6170235 7378165 8863935 10345019 11417156 11699581
14863A1699581n41066r07216p26836m20823k75616p4115M19811J121532J839094
$$ 11699581 11158515 10251299 9524463 9103640 8828024 8753909 9173720 10295252 12134346
14854A2134346K395547K641466K516556K028743J205386Q0621j207872k330963
$$ 12134346 14529893 17171359 19687915 21716658 22922044 23002665 21794793 19463830
14846A9463830k985273l161391l030860k795497k617096k463290k211340j879632
$$ 19463830 16478557 13317166 10286306 7490809 4873713 2410423 199083 -1680549
14838a680549j490392r22686j76164M65206P78042Q39915P97049P15009O61019
$$ -1680549 -3170941 -4093627 -4269791 -3804585 -3026543 -2186628 -1389579 -674570 -13551
14829a3551O30426M61342N7156l64396l98694J45559R70349J437143J148726L75164
$$ -13551 616875 1078217 1135373 770977 372283 517842 1488191 2925334 4074060 4449224
14819D449224k66904m34387k25586j6253j85250q01102j581807k137167k117906
$$ 4449224 4182320 3747933 3522347 3506094 3320844 2519742 937935 -1199232 -3317138
14810c317138j417616l96804M22977Q36630R93210J172361J427581J463953J041908
$$ -3317138 -4734754 -5131558 -4708581 -3871951 -2878741 -1706380 -278799 1185154 2227062
14801B227062L06468l28935n08989j62028N50038J340303J798249J645241J013339
$$ 2227062 2533530 2204595 1695606 1533578 2083616 3423919 5222168 6867409 7880748
14792G880748K63059l53087o88103o15506k30724J03709Q1457l33010r23090j349786
$$ 7880748 8143807 7790720 7102617 6487111 6256387 6360096 6441553 6108543 5185453 3835667
14782C835667j412253j189939q35126l65917K08557O90231P95518M47905j86062
$$ 3835667 2423414 1233475 398349 32432 240989 931220 1726738 2174643 1988581
14773A988581q77616j376096j469623j189212p42525k44316L14325Q69070J216138
$$ 1988581 1110965 -265131 -1734754 -2923966 -3666491 -3910807 -3596482 -2727412 -1511274
14764a511274J204171R10820N73363L14308K9267l22620n01644l59425j77240
$$ -1511274 -307103 603717 1177080 1491388 1520655 1198035 696391 336966 159726
14755A59726k84661o10771q38623p92108n67316l64277k72844k61588l44483o48945
$$ 159726 -124935 -735706 -1574329 -2366437 -2933753 -3298030 -3570874 -3832462 -4176945 -4825890
14745d825890j179860j623016j593449r98178j12393O10533Q96682Q35456O43266
$$ -4825890 -6005750 -7628766 -9222215 -10220393 -10332786 -9722253 -8825571 -7990115 -7346849
14736g346849M51885L49548L74191M84904O22404Q17324J138378J511735J744220
$$ -7346849 -6894964 -6545416 -6171225 -5686321 -5063917 -4246593 -3108215 -1596480 147740
14727A47740J663818J238809O23280L9370l10385k58105N7549J92705n9500n64659
$$ 147740 1811558 3050367 3673647 3713017 3402632 3144527 3202076 3394781 3335281 2770622
14717B770622j121003j504520j555618j320475r39372n55949l51475l84087n11459
$$ 2770622 1649619 145099 -1410519 -2730994 -3670366 -4226315 -4577790 -4961877 -5473336
14708e473336n91526o43276p35445p57533m64398J94542J026817J820661K413565
$$ -5473336 -6064862 -6708138 -7443583 -8201116 -8665514 -8470972 -7444155 -5623494 -3209929
14699c209929K701109K653859K274008J635942J022461O74323M14870J7187l47290
$$ -3209929 -508820 2145039 4419047 6054989 7077450 7751773 8166643 8183830 7836540
14690G836540m20250k37538k0306P7618P3737P3570P6829q2337m61992p68187
$$ 7836540 7416290 7178752 7158446 7236064 7309801 7383371 7460200 7377863 6915871 6147684
14680F147684o42981j30449L33304M07496K01500M6584P2767K55059O58606J218762
$$ 6147684 5504703 5374254 5707558 6115054 6316554 6363138 6435905 6690964 7349570 8568332
14670H568332J578182J430909P98606r0630r95311j696763j973000j679063q83948
$$ 8568332 10146514 11577423 12376029 12285399 11290088 9593325 7620325 5941262 5057314
14661E057314O3635O67460P04360L96302L6714l51109r21037j695203k411652
$$ 5057314 5120949 5788409 6492769 6889071 6925785 6574676 5653639 3958436 1546784
14652A546784k725836k511432j893486j110362l52496L12725P81446Q85966O50071
$$ 1546784 -1179052 -3690484 -5583970 -6694332 -7046828 -6734103 -5952657 -5066691 -4416620
14643d416620L56427K35776K25226J57005q611k72046o64284j025940j000313
$$ -4416620 -4060193 -3824417 -3599191 -3442186 -3450797 -3722843 -4387127 -5413067 -6413380
14634f413380m40971M92843J634997K786926L544405L539609K818600J770841
$$ -6413380 -6854351 -6361508 -4726511 -1939585 1604820 5144429 7963029 9733870
14626I733870Q28802L21205K88859M65383N75564N73727N03176K20967m62859
$$ 9733870 10562672 10883877 11172736 11638119 12213683 12787410 13290586 13511553 13048694
14617A3048694j464699k458472l101658l196070k844618k413490k149968j965697
$$ 13048694 11583995 9125523 6023865 2827795 -16823 -2430313 -4580281 -6545978
14609f545978j666366j270654r61814o86103j69895O40024J485285J989634J917488
$$ -6545978 -8212344 -9482998 -10444812 -11130915 -11300810 -10660786 -9175501 -7185867 -5268379
14600e268379J321268L23919q73315j752068j824947j203187m77993j27808k25791
$$ -5268379 -3947111 -3623192 -4496507 -6248575 -8073522 -9276709 -9754702 -9882510 -10108301
14591a0108301n29063p36495p19626n20805j98568K08273O29611J017170J451848
$$ -10108301 -10637364 -11373859 -12093485 -12614290 -12812858 -12604585 -11974974 -10957804 -9505956
14582i505956K006228K490485K591255K257516J759708J350340J073565Q57673
$$ -9505956 -7499728 -5009243 -2417988 -160472 1599236 2949576 4023141 4880814
14574D880814O54172N47155O60228R29015J060346Q47458N31539M99445O81043
$$ 4880814 5534986 6082141 6742369 7671384 8731730 9579188 10110727 10610172 11291215
14565A1291215O81585L76971k6675l89461p22160r95510j137237j157178j168884
$$ 11291215 11972800 12349771 12323096 11933635 11211475 10215965 9078728 7921550 6752666
14556F752666j248432j278007j116365q23053n42278l79690l74768l70828j36170
$$ 6752666 5504234 4226227 3109862 2286809 1744531 1364841 990073 619245 483075
14547D83075K80427O11185P28707O08748J90077l87936q06431j090490j570001
$$ 483075 763502 1374687 2103394 2712142 2902219 2514283 1707852 617362 -952639
14538i52639k257900k779408k774632k085803q94640L11078J099290J341972J177207
$$ -952639 -3210539 -5989947 -8764579 -10850382 -11745022 -11433944 -10334654 -8992682 -7815475
14529g815475R09296Q38509R87868J210270J482124J729342J729167J465008J255048
$$ -7815475 -6906179 -6067670 -5079802 -3869532 -2387408 -658066 1071101 2536109 3791157
14520C791157J423393J863454K014995J370384l4838j643240k860445l408449
$$ 3791157 5214550 7078004 9092999 10463383 10428545 8785305 5924860 2516411
14512B516411l253999k551894j681540r66746m54904r5122J56599L39574L73450
$$ 2516411 -737588 -3289482 -4971022 -5937768 -6392672 -6487794 -6331195 -5991621 -5618171
14503e618171Q1147m85088q95377p27606l5616P21041J203549J452556J658503
$$ -5618171 -5537024 -6022112 -6917489 -7645095 -7680711 -6959670 -5756121 -4303565 -2645062
14494b645062J873108J979470J809086J277554M77370l57705j020059j473366
$$ -2645062 -771954 1207516 3016602 4294156 4771526 4413821 3393762 1920396
14486A920396j718213j671113j355865r87755p13642m91764k72248o8150P1213
$$ 1920396 202183 -1468930 -2824795 -3812550 -4526192 -5017956 -5290204 -5358354 -5287141
14477e287141Q9531N1140J57775N44883J158138J764459K029153J745985R73495
$$ -5287141 -5197610 -5146470 -4988695 -4443812 -3285674 -1521215 507938 2253923 3227418
14468C227418L8793o05579p48277n42938l45916m83048r60278j481091j808024
$$ 3227418 3266211 2660632 1912355 1369417 1023501 540453 -419825 -1900916 -3708940
14459c708940j913846j766620j337409p99778l61262j0883M36620J063706J656690
$$ -3708940 -5622786 -7389406 -8726815 -9526593 -9887855 -9898738 -9462118 -8398412 -6741722
14450f741722J874384J601973J046807N11842K09393K06694L88969N23033M91914
$$ -6741722 -4867338 -3265365 -2218558 -1706716 -1497323 -1290629 -901660 -378627 113287
14441A13287L52443J36932j40591l75651l99959q6913N11267J181385J699208
$$ 113287 465730 602662 462071 86420 -313539 -400452 110815 1292200 2991408
14432B991408J922663J824881J481823R60506K19879p06228j467427j736399j610941
$$ 2991408 4914071 6738952 8220775 9181281 9401160 8694932 7227505 5491106 3880165
14423C880165j373423j169170r99867q30347o59423m99486l26687j04165K04204
$$ 3880165 2506742 1337572 337705 -492642 -1152065 -1651551 -1978238 -2082403 -1878199
14414a878199O08046J011946J192618R89095N24127K5899m45988r44999j422855
$$ -1878199 -1270153 -258207 934411 1923506 2447633 2473532 2027544 1082545 -340310
14405c40310j665223j450736p58958J45548R45660J558486K067927K430207K412683
$$ -340310 -2005533 -3456269 -4215227 -4069679 -3124019 -1565533 502394 2932601 5345284
14396E345284J895684J047402K24261j72878M3010O39759J113289R70720J11747
$$ 5345284 7240968 8288370 8512631 8339753 8382763 9022522 10135811 11106531 11218278
14387A1218278r87422j741698j950939j766847j446996j140935q27060m81528
$$ 11218278 10230856 8489158 6538219 4771372 3324376 2183441 1356381 874853
14379H74853j88306k4095l993r3936j47853m5664J45530L61027N83294O73857
$$ 874853 686547 662452 658459 564523 416670 371006 516536 877563 1460857 2134714
14369B134714N02328J14175k63886l74631k52132k12155m46633q71173j343148
$$ 2134714 2637042 2751217 2487331 2112700 1860568 1648413 1201780 330607 -1012541
14360a012541j760387j971090j895444j633125j274360q99658o95016p69717r95794
$$ -1012541 -2772928 -4744018 -6639462 -8272587 -9546947 -10446605 -11141621 -11911338 -12907132
14351a2907132j186174j242447j150631r71885q05922o79353n14816l00090j40117
$$ -12907132 -14093306 -15335753 -16486384 -17458269 -18264191 -18943544 -19458360 -19758450 -19898567
14342a9898567l2034J92290N82761J033365J482952J939656K415906K829714L022075
$$ -19898567 -19930601 -19738311 -19155550 -18122185 -16639233 -14699577 -12283671 -9453957 -6431882
14333f431882K860840K305771J519921R23876R18872J464043K016107K010062
$$ -6431882 -3571042 -1265271 254650 1178526 2097398 3561441 5577548 7587610
14325G587610J399031N49090l10370j163368j840046k012267j616685r67899l63441
$$ 7587610 8986641 9535731 9225361 8061993 6221947 4209680 2592995 1625096 1261655
14316A261655J40114N30907P30499Q26514J061565J402826J580666J500933J210966
$$ 1261655 1401769 1932676 2663175 3489689 4551254 5954080 7534746 9035679 10246645
14307A0246645P14472J22224l11690n25232p06061r12357j036280j089698j172948
$$ 10246645 10961117 11083341 10771651 10246419 9540358 8628001 7591721 6502023 5329075
14298E329075j234316j047030m87433K32111P42990R32642R19074P72251N93451
$$ 5329075 4094759 3047729 2560296 2792407 3535397 4468039 5387113 6159364 6752815
14289F752815M57021K35528j63220o18084r71638j114184q93093k31128O44768
$$ 6752815 7209836 7445364 7282144 6664060 5692422 4578238 3685145 3454017 4098785
14280D098785J278858J375539J025121M12644m22237j400743k306850k901481
$$ 4098785 5377643 6753182 7778303 8190947 7768710 6367967 4061117 1159636
14272A159636l061453k815867k280981j633451j034699n28660m7912N17013J181918
$$ 1159636 -1901817 -4717684 -6998665 -8632116 -9666815 -10195475 -10243387 -9726374 -8544456
14263h544456J814205K278307K532405K616903K599133K477280K196525J780519
$$ -8544456 -6730251 -4451944 -1919539 697364 3296497 5773777 7970302 9750821
14255I750821J376172J142197J099846J115715J008678O67854J13686m86379q53641
$$ 9750821 11126993 12269190 13369036 14484751 15493429 16161283 16274969 15788590 14934949
14246A4934949q36048n80768l45622j87062L689K67794N80437Q70737R88017Q16468
$$ 14934949 14098901 13518133 13172511 12985449 12989138 13256932 13837369 14708106 15696123 16512591
14236A6512591M15390J5293k27404m36830q55098j533904k166087k266439j625510
$$ 16512591 16927981 16943274 16715870 16279040 15423942 13890038 11723951 9457512 7832002
14227G832002n21161N19120J098938J144724Q42200M46543R2922k86949p73812
$$ 7832002 7310841 7829961 8928899 10073623 10915823 11362366 11455288 11168339 10394527
14218A0394527j209412j366624j280846j220740j359525j558359j512062j034805
$$ 10394527 9185115 7818491 6537645 5316905 3957380 2399021 886959 -147846
14210a47846j89843Q07485J707722K281798K393644K039068J393361O87740l2245
$$ -147846 -337689 469796 2177518 4459316 6852960 8892028 10285389 10973129 10940884
14201A0940884p83495j461071j976909k352633k517612k347626j947494j496193
$$ 10940884 10157389 8696318 6719409 4366776 1849164 -498462 -2445956 -3942149
14193c942149j005168m81553n4948J48703J23838j5121k04630m81537p20960o26623
$$ -3942149 -4947317 -5428870 -5483818 -5335115 -5211277 -5226398 -5431028 -5912565 -6633525 -7260148
14183g260148j06647O50660J395719J869465J821796J187709K76810l31772k88357
$$ -7260148 -7366795 -6716135 -5320416 -3450951 -1629155 -441446 -164636 -496408 -784765
14174g84765K73967J016907J641731K014161K222433K347618K250680J736387
$$ -784765 -510798 506109 2147840 4162001 6384434 8732052 10982732 12719119
14166A2719119R07562J61363j83266p3996L50838Q19896R78020O37398n9860q22143
$$ 12719119 13626681 13788044 13604778 13530782 13881620 14701516 15679536 16316934 16257074 15434931
14156A5434931j453068j877233k079685k079208j959342j823816j679711j526925
$$ 15434931 13981863 12104630 10024945 7945737 5986395 4162579 2482868 955943
14148I55943j449728j412518j172802n34603M23315J484223K477896L094461K942845
$$ 955943 -493785 -1906303 -3079105 -3613708 -3190393 -1706170 771726 3866187 6809032
14139F809032J998358O64901n14653j079204r25512m47877j02536J29698N55004
$$ 6809032 8807390 9472291 8957638 7878434 6952922 6505045 6402509 6532207 7087211
14130G087211J170721J559921J414829R50947N51018K68875q0922o33467j318768
$$ 7087211 8257932 9817853 11232682 12183629 12734647 13003522 12922600 12289133 10970365
14121A0970365j846464j981165j803036j444511q80109k54132M2653j01499l52913
$$ 10970365 9123901 7142736 5339700 3895189 3015080 2760948 2803601 2702102 2349189
14112B349189m13934k56825O7991M89334R09040J330628J752766J991778J879388
$$ 2349189 1935255 1678430 1746421 2235755 3144795 4475423 6228189 8219967 10099355
14103A0099355J456002Q85843L53576j2406j91247k16919j66509j56477k33003
$$ 10099355 11555357 12441200 12794776 12782370 12591123 12374204 12207695 12051218 11818215
14094A1818215l99349o96470j113734j430132j331064p65653o5512L28163K12945
$$ 11818215 11418866 10722396 9608662 8178530 6847466 6081813 6016301 6344464 6557409
14085F557409l21401j059308j812196k460971k824700k613560j717482n03046
$$ 6557409 6236008 5176700 3364504 903533 -1921167 -4534727 -6252209 -6755255
14077f755255M38322Q86516J107135J319769J470015J553443J710470J925820
$$ -6755255 -6316933 -5430417 -4323282 -3003513 -1533498 19945 1730415 3656235
14069C656235J977554J726622J180086L85511n02863j201705j512517j444609
$$ 3656235 5633789 7360411 8540497 8926008 8423145 7221440 5708923 4264314
14061D264314j123742p28086m45205k90438q8300K95864Q50234J488716K121528
$$ 4264314 3140572 2412486 1967281 1676843 1588543 1884407 2734641 4223357 6344885
14052F344885K681702K980712K679650J596268p330j446207k133305k068204j580368
$$ 6344885 9026587 12007299 14686949 16283217 16275887 14829680 12696375 10628171 9047803
14043I047803r58247m69138l39407n56633r18180j265187j385042r29210J80976
$$ 9047803 8089556 7620418 7281011 6724378 5806198 4541011 3155969 2226759 2407735
14034B407735J419904K057084J908056J427884J107549J099010J271749J408280
$$ 2407735 3827639 5884723 7792779 9220663 10328212 11427222 12698971 14107251
14026A4107251J356786R87479J99835r42533k141678k949722l029840k406129
$$ 14107251 15464037 16451516 16651351 15708818 13567140 10617418 7587578 5181449
14018E181449j449528n53724O7009L52310L90943L27665K58883K98968N42913
$$ 5181449 3731921 3178197 3245206 3597516 3988459 4316124 4575007 4873975 5416888
14009E416888R16398J240964J441549J594483J807109K062762K180803K011971
$$ 5416888 6333286 7574250 9015799 10610282 12417391 14480153 16660956 18672927
14001A8672927J602738J102391O55756L13111M460k71621m19630m81225n79384
$$ 18672927 20275665 21378056 22033812 22346923 22351383 22079762 21660132 21178907 20599523
13992B0599523o59376n83673l85764k33756k40368l79315n19258n09665k87612
$$ 20599523 19940147 19356474 18970710 18736954 18496586 18117271 17598013 17088348 16800736
13983A6800736N9918L90559O98459J143688J763032K256123K309564K039391J769967
$$ 16800736 16860654 17251213 17949672 19093360 20856392 23112515 25422079 27461470 29231437
13974B9231437J580765J405933J250480J088157Q04508L74101r3055n36149r15556
$$ 29231437 30812202 32218135 33468615 34556772 35361280 35735381 35642326 35106177 34190621
13965C4190621j097995r52113n65259k84429l73657p26937r89640q77394m07818
$$ 34190621 33092626 32140513 31575254 31290825 30917168 30190231 29200591 28323197 27915379
13956B7915379J36571M06697K42902k11450o99661j033830j085132q17499m35336
$$ 27915379 28051950 28458647 28701549 28490099 27790438 26756608 25671476 24853977 24418641
13947B4418641l89248r95134k010401k817224k984649k513808j687566p90382
$$ 24418641 24029393 23034259 21023858 18206634 15221985 12708177 11020611 10230229
13939A0230229j2497N02661P00013O14812K88757k07371o97150r27163p72096
$$ 10230229 10217732 10720393 11420406 12035218 12323975 12116604 11419454 10492291 9720195
13930I720195l88374L7816N69693J242352J752482J798182J420322P78295K8394
$$ 9720195 9331821 9369637 9939330 11181682 12934164 14732346 16152668 16930963 16959357
13921A6959357n69691p73554m69977K11901Q37955J002566O65725J07499l16194
$$ 16959357 16389666 15616112 15146135 15358036 16195991 17198557 17864282 17971781 17655587
13912A7655587l55670L3851O50928J180568J430813J463793J432708J309561R48045
$$ 17655587 17299917 17333768 17984696 19165264 20596077 22059870 23492578 24802139 25750184
13903B5750184K49413p96339j974059k827890l000573k587790k069317j785812
$$ 25750184 25999597 25203258 23229199 20401309 17400736 14812946 12743629 10957817
13895A0957817j615930j307959q13382k51751J36212K01473R3554j110p0118j28101
$$ 10957817 9341887 8033928 7220546 6968795 7105007 7306480 7400034 7398924 7328806 7200705
13885G200705j39099p4668J01807L73860N39731L49213k69958j153225j909007
$$ 7200705 7061606 6986938 7088745 7462605 8002336 8351549 8081591 6928366 5019359
13876E019359k157821j816550j056752o6601J010638J913903K336956K168931
$$ 5019359 2861538 1044988 -11764 -78365 932273 2846176 5183132 7352063
13868G352063J574984Q31177J24531l32102k51163L46897R54501J060899O58767
$$ 7352063 8927047 9758224 9882755 9550653 9299490 9646387 10600888 11661787 12320554
13859A2320554J03603l07676m53124k68080K63410R99899J668707J961258J648204
$$ 12320554 12424157 12116481 11663357 11395277 11658687 12658586 14327293 16288551 17936755
13850A7936755Q17959q7236o42081p53546n48964j65304K50125N13130M30426
$$ 17936755 18754714 18667478 18025397 17271851 16722887 16557583 16807708 17320838 17751264
13841A7751264q3511q95427j715872k220904k181568j659658j019513o53942o49044
$$ 17751264 17667753 16772326 15056454 12835550 10653982 8994324 7974811 7320869 6671825
13832F671825p39762o17704k21578K65972P23835J212232J656672J717264J267803
$$ 6671825 5932063 5314359 5092781 5358753 6082588 7294820 8951492 10668756 11936559
13823A1936559P16223N29267P25917R85081J042500Q67658N67487K82102J48918
$$ 11936559 12652782 13182049 13907966 14893047 15935547 16803205 17370692 17652794 17801712
13814A7801712K15105L49331L84488K78072P5993j03357j17774O87P2219R2743
$$ 17801712 18016817 18366148 18750636 19028708 19104701 19001344 18883570 18884257 18956476 19049219
13804A9049219K78751O76826J011799J070418R20585O82643L97317J41428L2198
$$ 19049219 19327970 20004796 21016595 22087013 23007598 23690241 24087558 24228986 24261184
13795B4261184P2261J59111J73524M5068q7308m0933P3554M7057r0796j73597
$$ 24261184 24333445 24492556 24666080 24711148 24623840 24582907 24656461 24703518 24612722 24439125
13785B4439125j35278p6417p3377M188L13839Q30510J389366J796366J843606
$$ 24439125 24303847 24227430 24154053 24158241 24472080 25302590 26691956 28488322 30331928
13776C0331928J386944N57920l60964j187299j743748j851444j580605j205221
$$ 30331928 31718872 32276792 31915828 30728529 28984781 27133337 25552732 24347511
13768B4347511q48160n11420l10749l94213p39539j143140j380931j304383q08759
$$ 24347511 23499351 22987931 22677182 22282969 21543430 20400290 19019359 17714976 16906217
13759A6906217R7222J093307J644216J446853O44788l30812r79475r17106j27974
$$ 16906217 17003439 18096746 19740962 21187815 21832603 21501791 20522316 19605210 19477236
13750A9477236Q80939J462935J401193R87524O43282N63312O39034O48290N10620
$$ 19477236 20358175 21821110 23222303 24209827 24853109 25416421 26055455 26703745 27214365
13741B7214365K86412p601m44892j038278j598688j804670j510468r14518k35273
$$ 27214365 27500777 27493176 27048284 26010006 24411318 22606648 21096180 20181662 19946389
13732A9946389N75878J589479K558933L077148K967617K362448J646958J212747
$$ 19946389 20522267 22111746 24670679 27747827 30715444 33077892 34724850 35937597
13724C5937597J110398J148565J078512O36690k45822j301678k241181k989710
$$ 35937597 37047995 38196560 39275072 39911762 39665940 38364262 36123081 33133371
13716C3133371l435630l380048k776974j746790m51450R27718K089240K630706
$$ 33133371 29697741 26317693 23540719 21793929 21342479 22270197 24359437 26990143
13708B6990143K414053J753500R86406K17760l96169n16693K9659R10166J616772
$$ 26990143 29404196 31157696 32144102 32361862 31965693 31449000 31478659 32388825 34005597
13699C4005597J998303K212806K408285K571460K564802K321044J936975J485816
$$ 34005597 36003900 38216706 40624991 43196451 45761253 48082297 50019272 51505088
13691E1505088R23267K33653m06810p11455o04308l95390n65122j327207k371192
$$ 51505088 52428355 52662008 52255198 51543743 50939435 50544045 49978923 48651716 46280524
13682D6280524l081431l073203k418495j435673m50694L02275P22752Q38659P34014
$$ 46280524 43199093 40125890 37707395 36271722 35821028 36123303 36846055 37684714 38418728
13673C8418728N09031L40420M60112Q97083J318410J344770R46495M43883K16081
$$ 38418728 38927759 39268179 39728291 40625374 41943784 43288554 44235049 44678932 44895013
13664D4895013L86446P59345J071957J226574J279363J352296J553427J847221
$$ 44895013 45281459 46040804 47112761 48339335 49618698 50970994 52524421 54371642
13656E4371642K025783J987688J883275J830384J769576J573132J143574N54818
$$ 54371642 56397425 58385113 60268388 62098772 63868348 65441480 66585054 67139872
13648F7139872L4802l40569o55121q51436p72872m29464N8321N94540J008743
$$ 67139872 67174674 66834105 66178984 65327548 64554676 64125212 64183533 64778073 65786816
13639F5786816J045514O51229J59840k844K88135P81169J170625J444553J783482
$$ 65786816 66832330 67483559 67643399 67640555 67928690 68709859 69880484 71325037 73108519
13630G3108519K209148K471415K226388J358391J53828r43366j616713j749245
$$ 73108519 75317667 77789082 80015470 81373861 81527689 80584323 78967610 77218365
13622G7218365j463439j048317p17710m36679n2367M09031P41018Q38393Q56548
$$ 77218365 75754926 74706609 73988899 73552220 73499853 73908884 74649902 75488295 76344843
13613G6344843J013886J317495J592575J622390J228749L76049p14691j527895
$$ 76344843 77358729 78676224 80268799 81891189 83119938 83495987 82781296 81253401
13605H1253401j602291j003391j83858N02016R77747J305995J548593J786721
$$ 81253401 79651110 78647719 78463861 78965877 79943624 81249619 82798212 84584933
13597H4584933K038170K113727J795729J136687M66413J50863L67340J034174
$$ 84584933 86623103 88736830 90532559 91669246 92135659 92286522 92653862 93688036
13589I3688036J861463K503899K755680K659590K394432K036619J519337Q22570
$$ 93688036 95549499 98053398 100809078 103468668 105863100 107899719 109419056 110241626
13581A10241626J02170l67937m05670q2968L70367Q14545J269025J735342K107269
$$ 110241626 110343796 109975859 109570189 109487221 109857588 110672133 111941158 113676500 115783769
13572A15783769K247943K013437J327221M07483k42691j70552O55935J754249
$$ 115783769 118031712 120045149 121372370 121779853 121537162 121366610 122022545 123776794
13564A23776794K555451K893568K946089K861015K596748K136568J645521J296851
$$ 123776794 126332245 129225813 132171902 135032917 137629665 139766233 141411754 142708605
13556A42708605J084325Q75465O07846L67332K74564L04242K42317n283k49153
$$ 142708605 143792930 144668395 145276241 145643573 145918137 146222379 146464696 146459413 146210260
13547A46210260l09639j89152j6506M1284q1352k98715m61657m24736m1763P40342
$$ 146210260 145900621 145711469 145694963 145736247 145654895 145356180 144894523 144469787 144428024 145168366
13537A45168366J750612K693600L373356L825189M199166M557450M820871M884322
$$ 145168366 146918978 149612578 152985934 156811123 161010289 165567739 170388610 175272932
13529A75272932M812099M766742M666457M214078L324094K288135J476517J082053
$$ 175272932 180085031 184851773 189518230 193732308 197056402 199344537 200821054 201903107
13521B01903107J091977J274550J393163J438183J537330J826140K327962K876237
$$ 201903107 202995084 204269634 205662797 207100980 208638310 210464450 212792412 215668649
13513B15668649L251798L325190L085551K597607K012392J571232J521900J972847
$$ 215668649 218920447 222245637 225331188 227928795 229941187 231512419 233034319 235007166
13505B35007166K723610L359683L621393L556892L268709K750839K146313J809449
$$ 235007166 237730776 241090459 244711852 248268744 251537453 254288292 256434605 258244054
13497B58244054J910507K298612K829041L509570M291774M947626N170825M838403
$$ 258244054 260154561 262453173 265282214 268791784 273083558 278031184 283202009 288040412
13489B88040412M172476L567437L294708L417252L831471M249208M321475L900429
$$ 288040412 292212888 295780325 299075033 302492285 306323756 310572964 314894439 318794868
13481C18794868L216936K780545K925204L557506M396204N127272N428006N160585
$$ 318794868 322011804 324792349 327717553 331275059 335671263 340798535 346226541 351387126
13473C51387126M493977L736938L099825K684488K561768K780903L390088M250415
$$ 351387126 355881103 359618041 362717866 365402354 367964122 370745025 374135113 378385528
13465C78385528M877513M823974M182418L539938L440988L977897M776998N202494
$$ 378385528 383263041 388087015 392269433 395809371 399250359 403228256 408005254 413207748
13457D13207748M845266L999347L330408L196000L460642L713346L624880L169572
$$ 413207748 418053014 422052361 425382769 428578769 432039411 435752757 439377637 442547209
13449D42547209K584037K127738J909594J958018K283133K852879L588732M306382
$$ 442547209 445131246 447258984 449168578 451126596 453409729 456262608 459851340 464157722
13441D64157722M793911M989933M918998M494298L616264K483814J540821R84105
$$ 464157722 468951633 473941566 478860564 483354862 486971126 489454940 490995761 491979866
13433D91979866N72940L4764n49890q42154o54565j60275L24560O14332P20547
$$ 491979866 492552806 492587570 492037680 491195526 490540961 490380686 490705246 491319578 492040125
13424D92040125P90988J030147J548564K123068K252357J602337L87168q31961
$$ 492040125 492831113 493861260 495409824 497532892 499785249 501387586 501774754 500942793
13416E00942793j637276j918869j814480j580066j347496j007989m92090R3736
$$ 500942793 499305517 497386648 495572168 493992102 492644606 491636617 491144527 491238263
13408D91238263O70736J143652J298509R52497N6201j293266k792479m034970
$$ 491238263 491908999 493052651 494351160 495303657 495359858 494066592 491274113 487239143
13400D87239143m838850n352221n740784n998312o017266n676669m939344m010554
$$ 487239143 482400293 477048072 471307288 465308976 459291710 453615041 448675697 444665143
13392D44665143l278010l020117l194178l479053l575166l484429l540681m066995
$$ 444665143 441387133 438367016 435172838 431693785 428118619 424634190 421093509 417026514
13384D17026514m941842n655555n851916n613930n226501m890837m705000m715818
$$ 417026514 412084672 406429117 400577201 394963271 389736770 384845933 380140933 375425115
13376C75425115m784042m536607l803943k956252k513618k554325k758990k899325
$$ 375425115 370641073 366104466 362300523 359344271 356830653 354276328 351517338 348618013
13368C48618013k998439l133147l280092l284159k979875k455051k093591k215064
$$ 348618013 345619574 342486427 339206335 335922176 332942301 330487250 328393659 326178595
13360C26178595k763679l476978m148062m705504n158975n502161n631190n414758
$$ 326178595 323414916 319937938 315789876 311084372 305925397 300423236 294792046 289377288
13352B89377288m981085m677612m648997m769133m878159m849327m585321m108290
$$ 289377288 284396203 279718591 275069594 270300461 265422302 260572975 255987654 251879364
13344B51879364l558888l065872k744432k717041k920435l126350l282143l495995
$$ 251879364 248320476 245254604 242510172 239793131 236872696 233746346 230464203 226968208
13336B26968208l738148l781498l383198k535214j539396q09759n84172p58734
$$ 226968208 223230060 219448562 216065364 213530150 211990754 211180995 210596823 209838089
13328B09838089j037230j222820j256501j196214j250459j576313k083276k562130
$$ 209838089 208800859 207578039 206321538 205125324 203874865 202298552 200215276 197653146
13320A97653146k939427l322540l754939m013475l807465l172190k421127j775158
$$ 197653146 194713719 191391179 187636240 183622765 179815300 176643110 174221983 172446825
13312A72446825j260384q64415o91997r36802j652158k561793l259022l560514
$$ 172446825 171186441 170322026 169630029 168693227 167041069 164479276 161220254 157659740
13304A57659740l492248l064469k298212j403877p75433p19238j195223j825806
$$ 157659740 154167492 151103023 148804811 147400934 146625501 145906263 144711040 142885234
13296A42885234k156503k018937j620510j305242j251404j375576j586002j970922
$$ 142885234 140728731 138709794 137089284 135784042 134532638 133157062 131571060 129600138
13288A29600138k570440l158680l481909l544470l467819l281823k915730k286847
$$ 129600138 127029698 123871018 120389109 116844639 113376820 110094997 107179267 104892420
13280A04892420j403109m19833L68915P11450O28752L89910K53999K74563L27071
$$ 104892420 103489311 103069478 103438393 104149843 104778595 105168505 105422504 105697067 106024138
13271A06024138L13479K25963k641m54070j040661j517917j752376j831441j842511
$$ 106024138 106337617 106563580 106560939 106106869 105066208 103548291 101795915 99964474 98121963
13262I8121963j760769j590712j372184j082837o72575j18020M04675N26371J27090
$$ 98121963 96361194 94770482 93398298 92315461 91642886 91524866 91929541 92455912 92583002
13253I2583002m87648r86767j363146j744988k080296k203402k045778j731109
$$ 92583002 92095354 91108587 89745441 88000453 85920157 83716755 81670977 79939868
13245G9939868j481912j364620j262039j079546p73570l46425Q4972L47604L49998
$$ 79939868 78457956 77093336 75831297 74751751 73978181 73631756 73716728 74064332 74414330
13236G4414330J20513k88943q05207j292903j582518j611557j465330j197538
$$ 74414330 74534843 74245900 73440693 72147790 70565272 68953715 67488385 66290847
13228F6290847p67537j22144O81682J525030K310215K883935L041198K620443
$$ 66290847 65523310 65401166 66082848 67607878 69918093 72802028 75843226 78463669
13220G8463669J589878J61902j336317k611656l356107l426743l057299k603325
$$ 78463669 80053547 80215449 78879132 76267476 72911369 69484626 66427327 63824002
13212F3824002k160561j638425j164576j072656j359001j505039j128811m49212
$$ 63824002 61663441 60025016 58860440 57787784 56428783 54923744 53794933 53345721
13204E3345721J53015N69551Q84106J221681J590342J809015J757382J536024
$$ 53345721 53498736 54068287 54952393 56174074 57764416 59573431 61330813 62866837
13196F2866837J263665Q98040L71026k53115q35009j181690j143337q01657m13392
$$ 62866837 64130502 65028542 65399568 65146453 64311444 63129754 61986417 61184760 60771368
13187F0771368k37649l51544n53031n37377k28916R4934Q9057l65544j168734
$$ 60771368 60533719 60182175 59629144 59091767 58862851 58957785 59046842 58681298 57512564
13178E7512564k037590k601854k595914j907636p05865M57511R96902P48245M9318
$$ 57512564 55474974 52873120 50277206 48369570 47663705 48121216 49118118 49866363 49915681
13169D9915681n71381p64133n14831j20523O0823o6700l20716n42585o97829p06483
$$ 49915681 49344300 48580167 48065336 47944813 48005636 47938936 47618220 47075635 46377806 45671323
13159D5671323n39110m22232o33349j078994j376318j322878j041047q11291q25576
$$ 45671323 45132213 44709981 44076632 42997638 41621320 40298442 39257395 38446104 37620528
13150C7620528j074033j369724j488934j409105j319497j329820j279443r63276
$$ 37620528 36546495 35176771 33687837 32278732 30959235 29629415 28349972 27386696
13142B7386696n11867l07609n99757j332225k087897k334060j881107q31017O21522
$$ 27386696 26874829 26567220 25967463 24635238 22547341 20213281 18332174 17501157 18122679
13133A8122679K088531L103276L458321L323345K971394K541780K067521J488617
$$ 18122679 20211210 23314486 26772807 30096152 33067546 35609326 37676847 39165464
13125C9165464P11533k50972j258179k104706k547694k481933k104974j695626
$$ 39165464 39876997 39626025 38367846 36263140 33715446 31233513 29128539 27432913
13117B7432913j341188j048212q87330q83034r41115r12334p24576m29504j23555
$$ 27432913 26091725 25043513 24156183 23273149 22332034 21419700 20695124 20265620 20142065
13108B0142065R6768J82746R6750k32691p09312j058663j109468q75388m62769
$$ 20142065 20238833 20421579 20518329 20285638 19576326 18517663 17408195 16532807 16070038
13099A6070038m6057K04375K38189J55564J84141M77250R39800J397131J728950
$$ 16070038 16023981 16228356 16466545 16622109 16806250 17283500 18223300 19620431 21349381
13090B1349381J802797J543464J053601N49053J28550l31840r11281j415459j529979
$$ 21349381 23152178 24695642 25749243 26298296 26426846 26095006 25183725 23768266 22238287
13081B2238287j163654o04741k43088j93047l38700o09657r72221j248070j153875
$$ 22238287 21074633 20469892 20226804 20033757 19695057 19085400 18113179 16865109 15711234
13072A5711234n42303M34965J428681K134043K420884K249413J670212R60288
$$ 15711234 15168931 15603896 17032577 19166620 21587504 23836917 25507129 26467417
13064B6467417L95413m8395m75666p55840o38137r3114P02935J516618K004634
$$ 26467417 26862830 26814435 26338769 25582929 24944792 24851678 25554613 27071231 29075865
13055B9075865J813186R54670m5813n82651m54777K6076L24509J73836l35330
$$ 29075865 30889051 31843721 31797908 31215257 30760480 30786556 31111065 31284901 30949571
13046C0949571j023260j645750j890104j619325j023643m56531r4577J24211K26257
$$ 30949571 29926311 28280561 26390457 24771132 23747489 23290958 23196381 23320592 23546849
13037B3546849J04163k83878q28762j381792j841485k158437k247987k064809
$$ 23546849 23651012 23367134 22538372 21156580 19315095 17156658 14908671 12843862
13029A2843862j676905j111576l69580M44811J104987J405628J348490J117818
$$ 12843862 11166957 10055381 9685801 10130612 11235599 12641227 13989717 15107535
13021A5107535R67072J088147J407685J604449J453917J032254M76658k63846
$$ 15107535 16074607 17162754 18570439 20174888 21628805 22661059 23137717 22873871
13013B2873871j207188k069396k468724k283591j712166j070932n69625k72781
$$ 22873871 21666683 19597287 17128563 14844972 13132806 12061874 11492249 11219468
13005A1219468j97057k69065k88613j52062O5801K99750O01907J056178J572294
$$ 11219468 11022411 10753346 10464733 10312671 10378472 10678222 11280129 12336307 13908601
12996A3908601J849898J650208J023230K46876m01784q09137r87378r44962o54906
$$ 13908601 15758499 17408707 18431937 18678813 18277029 17467892 16480514 15535552 14880646
12987A4880646j12341N06948Q24490O55394K80767J08199K25163M17998M68449
$$ 14880646 14768305 15275253 16099743 16755137 17035904 17144103 17369266 17787264 18255713
12978A8255713L11908J7287k51912l67862m19802o13283r75599j338393j591533
$$ 18255713 18567621 18584908 18332996 17965134 17545332 16932049 15956450 14618057 13026524
12969A3026524j674794j409178p48730l1001L96113N44633N78111N50828M67229
$$ 13026524 11351730 9942552 9193822 9162821 9558934 10103567 10681678 11232506 11699735
12960A1699735L85765L77856M49384N29201M69859P5980o57788j349178j484714
$$ 11699735 12085500 12463356 12912740 13441941 13911800 13987780 13329992 11980814 10496100
12951A0496100r65408k37339J57164O77n14678r85673j085210q14427m99856m67665
$$ 10496100 9530692 9293353 9450517 9451194 8936516 7950843 6865633 6051206 5551350 5083685
12941E083685p36413j014982j024219p71541m45682j27495K64106P82943J300929
$$ 5083685 4347272 3332290 2308071 1536530 1090848 963353 1227459 2010402 3311331
12932C311331J585050J576433J456238J357213J207299Q70566L29400j80707k96699
$$ 3311331 4896381 6472814 7929052 9286265 10493564 11364130 11693530 11512823 11216124
12923A1216124J23649Q57790J464452J580966J108318K37517o46513j201714j296338
$$ 11216124 11339773 12197563 13662015 15242981 16351299 16588816 15942303 14740589 13444251
12914A3444251r93154m48651P5220K81170J39112o5681j10261r4258k03085l51034
$$ 13444251 12451097 12002446 12077666 12358836 12497948 12432267 12322006 12227748 12024663 11673629
12904A1673629k68956P8404L99380M24600J37477l16191p01615p34385l31347
$$ 11673629 11404673 11483077 11882457 12307057 12444534 12128343 11426728 10692343 10360996
12895A0360996K22460N51999N17502J79355l96463j102337j587284j418162m32731
$$ 10360996 10583456 11135455 11652957 11832312 11435849 10333512 8746228 7328066 6895335
12886F895335J096441K609915L670673M141777M031815L451464K637043J776414
$$ 6895335 7991776 10601691 14272364 18414141 22445956 25897420 28534463 30310877
12878C0310877R15595J44733l40622m80317m86629o45988j101912j779027k397162
$$ 30310877 31226472 31371205 31030583 30550266 30063637 29417649 28315737 26536710 24139548
12869B4139548k722352k734042k423198j748659q47719M9782Q53451J557422K027563
$$ 24139548 21417196 18683154 16259956 14511297 13663578 13713360 14566811 16124233 18151796
12860A8151796K037074J595147J078495R22554J130843J209343P92196K1680p84457
$$ 18151796 20188870 21784017 22862512 23785066 24915909 26125252 26917448 26939128 26154671
12851B6154671j419342j779150j816573j518421r02582q9788P01929J233562J285712
$$ 26154671 24735329 22956179 21139606 19621185 18718603 18628815 19330744 20564306 21850018
12842B1850018P89762j15831j175157k157849k910176l339325l467490l351106
$$ 21850018 22639780 22523949 21348792 19190943 16280767 12941442 9473952 6122846
12834F122846k905265k004772p58623N28149J571584K107467K003286J492727
$$ 6122846 3217581 1212809 454186 982335 2553919 4661386 6664672 8157399
12826H157399R19302L72427j50588n19507n80834k93123K71457R30990J446819
$$ 8157399 9076701 9449128 9298540 8779033 8198199 7905076 8176533 9107523 10554342
12817A0554342J565370J141017M02952j26114j99202o429K01738L36080L31428
$$ 10554342 12119712 13260729 13663681 13537567 13338365 13331936 13533674 13869754 14201182
12808A4201182M1527o04667j473535k252056k575693k180515j160484j1148P94402
$$ 14201182 14242709 13638042 12164507 9912451 7336758 5156243 3995759 3984611 4779013
12799D779013J091277R03899L55551l43026j010591j469311j509614j132761o39818
$$ 4779013 5870290 6774189 7129740 6786714 5776123 4306812 2797198 1664437 1024619
12790A024619l05341j82939j99052k30920j22812K53795Q16160J230855J222668
$$ 1024619 719278 536339 337287 106367 -16445 237350 1053510 2284365 3507033
12781C507033Q17089J71436o58680j637732k555294l083342l015651k419766j521276
$$ 3507033 4324122 4495558 3836878 2199146 -356148 -3439490 -6455141 -8874907 -10396183
12772a0396183n61717J95567N17492L70317K5831j4498N71780J483139K036814
$$ -10396183 -10957900 -10762333 -10244841 -9874524 -9848693 -9863191 -9291411 -7808272 -5771458
12763e771458J910419J396443R64617P57909N59994J56800m26765r84918j325692
$$ -5771458 -3861039 -2464596 -1499979 -742070 -182076 -25276 -452041 -1436959 -2762651
12754b762651j367512j063008n00801K4648M37882R74453J602230J912861J700875
$$ -2762651 -4130163 -5193171 -5693972 -5669324 -5231442 -4256989 -2654759 -741898 958977
12745I58977J214678P31644K02235n01312j247436j750819j831932j485011q19527
$$ 958977 2173655 2905299 3107534 2606222 1358786 -392033 -2223965 -3708976 -4528503
12736d528503n9509M65818N59687L51954J34575M5098q2972m77162j075127j621145
$$ -4528503 -4588012 -4122194 -3562507 -3210553 -3075978 -3030880 -3113852 -3591014 -4666141 -6287286
12726f287286j998971k216284k227949j946573j302334l18998Q65495J986602
$$ -6287286 -8286257 -10502541 -12730490 -14677063 -15979397 -16298395 -15432900 -13446298
12718a3446298K670520K712462K243008J551988R04612M67727K85647L16035M44279
$$ -13446298 -10775778 -8063316 -5820308 -4268320 -3363708 -2895981 -2610334 -2294299 -1850020
12709a850020N44402O49851Q54196J075716J257447J448474J516510J295308R49789
$$ -1850020 -1305618 -655767 198429 1274145 2531592 3980066 5496576 6791884 7741673
12700G741673Q13029R69381J173286J136512P16188l3471q48502j458613j779591
$$ 7741673 8554702 9524083 10697369 11833881 12550069 12516598 11668096 10209483 8429892
12691H429892j909438j992881k077815k071310j847711j459485j118016r12757
$$ 8429892 6520454 4527573 2449758 378448 -1469263 -2928748 -4046764 -4959521
12683d959521p51052n43415k56681P4703K87494K84995K25536L15056O02568R67711
$$ -4959521 -5710573 -6253988 -6510669 -6435966 -6148472 -5863477 -5637941 -5322885 -4720317 -3752606
12673c752606J214000J310168J382590J400165J168762O58386J21836k52395o17567
$$ -3752606 -2538606 -1228438 154152 1554317 2723079 3381465 3503301 3250906 2633339
12664B633339j202192j958541k574079k783209k598157k212196j682067q81271
$$ 2633339 1431147 -527394 -3101473 -5884682 -8482839 -10695035 -12377102 -13258373
12656a3258373J12457R46258J438833J763334K146813K562937K769375K529336
$$ -13258373 -13145916 -12199658 -10760825 -8997491 -6850678 -4287741 -1518366 1010970
12648A010970J741378N48267n97382j235943j329781j198870j153108j211657
$$ 1010970 2752348 3300615 2703233 1467290 137509 -1061361 -2214469 -3426126
12640c426126j150901q93457o05767m97547o20788p45399o38480l60863p3334
$$ -3426126 -4577027 -5470484 -6076251 -6573798 -7194586 -7939985 -8578465 -8939328 -9012662
12631i012662J65063K92962K60029Q1284k02764m48795m66964k36973Q7222L36799
$$ -9012662 -8847599 -8554637 -8294608 -8213324 -8416088 -8864883 -9331847 -9568820 -9481598 -9144799
12621i144799M83408N86561O78757Q23306J086768J464722J850575J967104J591675
$$ -9144799 -8661391 -8074830 -7396073 -6572767 -5485999 -4021277 -2170702 -203598 1388077
12612A388077Q74888J76155l39471p44516j071598j243045j186560q65122l47684
$$ 1388077 2262965 2439120 2099649 1355133 283535 -959510 -2146070 -3011192 -3358876
12603c358876J06900K65535K58150M42645R43910J534906J909487J944598J712107
$$ -3358876 -3251976 -2986441 -2728291 -2285646 -1341736 193170 2102657 4047255 5759362
12594E759362J319211Q32526L35288n9308k61182k76461k05552r7204J08809M54743
$$ 5759362 7078573 7911099 8246387 8187079 7925897 7649436 7443884 7346680 7455489 7910232
12584G910232Q45568J045212Q33327K22631m66185q16625o47579j59789K53931
$$ 7910232 8755800 9801012 10634339 10856970 10390785 9574160 8926581 8766792 9020723
12575I020723K78761j52549q48035j585446k193735k444097k162520j407607m21373
$$ 9020723 9299484 9146935 8298900 6713454 4519719 2075622 -86898 -1494505 -1915878
12566a915878M18122Q02408Q53787R39172J180353J484915J745954J882089J827336
$$ -1915878 -1497756 -695348 158439 1097611 2277964 3762879 5508833 7390922 9218258
12557I218258J472543P85626n656n83978p94335o15903j38694M08538Q32425J090871
$$ 9218258 10690801 11476427 11470771 10886793 10092458 9476555 9337861 9746399 10578824 11669695
12547A1669695J074009O11539k03997j025014j580329j860994k000761k048755
$$ 11669695 12743704 13355243 13151246 12126232 10545903 8684909 6684148 4635393
12539D635393j931760j598954j106528n53419r1714J08248P1311N611M0790J02085
$$ 4635393 2703633 1104679 -1849 -555268 -646982 -538734 -467423 -461812 -421022 -318937
12529c18937N2047j01803j61839O0821N41612J086173J522981J735886J526508
$$ -318937 -266890 -368693 -530532 -469711 71901 1158074 2681055 4416941 5943449
12520E943449P88721j60733q34303j147225j312449j352115j183887q77936n69894
$$ 5943449 6732170 6571437 5737134 4589909 3277460 1925345 741458 -136478 -706372
12511g06372l77015l31836l22426j99594J11754N93748J127350J574996J931123
$$ -706372 -1083387 -1415223 -1737649 -1937243 -1825489 -1231741 -104391 1470605 3401728
12502C401728K168790K052042J350206K18357q06180j342902j440625j295702
$$ 3401728 5570518 7622560 8972766 9191123 8384943 7042041 5601416 4305714
12494D305714j069754r28229r53312j066417j099387r24322n18122J26323R14019
$$ 4305714 3235960 2307731 1354419 288002 -811385 -1735707 -2253829 -2127506 -1213487
12485a213487J509672J591028J157144N62712K23661K94301O47854R48352Q42931
$$ -1213487 296185 1887213 3044357 3607069 3830730 4125031 4772885 5721237 6564168
12476F564168L55196j53417m42198n46007o23632q22981j194763j621115j891196
$$ 6564168 6919364 6765947 6323749 5777742 5154110 4331129 3136366 1515251 -375945
12467c75945j922461j803791j545779j038038l71848J12826K34666J27104m5984
$$ -375945 -2298406 -4102197 -5647976 -6686014 -7057862 -6945036 -6710370 -6583266 -6629250
12458f629250k88997o61426j178111j788760k242853k243153j902863j604010
$$ -6629250 -6918247 -7579673 -8757784 -10546544 -12789397 -15032550 -16935413 -18539423
12450a8539423j459900j249181p76562j61132L10141N62788Q61204J455345K096794
$$ -18539423 -19999323 -21248504 -22025066 -22186198 -21876057 -21313269 -20452065 -18996720 -16899926
12441a6899926K249405J804711J217607R36298R62347J024164R43704P24646M68565
$$ -16899926 -14650521 -12845810 -11628203 -10691905 -9729558 -8705394 -7761690 -7037044 -6568479
12432f568479L83148O56994J119879J306295R59600K84064k86971n75725p85124
$$ -6568479 -6185331 -5528337 -4408458 -3102163 -2142563 -1858499 -2145470 -2721195 -3506319
12423c506319j101151j443391j545637j215476o12961j34894m141q5622j08106
$$ -3506319 -4607470 -6050861 -7596498 -8811974 -9424935 -9559829 -9563970 -9649592 -9757698
12414i757698k9799J5444K1450J22235M72891J043495J562725J773854J610642
$$ -9757698 -9787497 -9772053 -9750603 -9628368 -9155477 -8111982 -6549257 -4775403 -3164761
12405c164761J164960N75290n0121n39437o14175j93237M11166P63382O02313
$$ -3164761 -1999801 -1424511 -1474632 -2014069 -2628244 -2821481 -2410315 -1646933 -1044620
12396a044620j062o83293j097557j206338j205254j122443p61556r2670O02321
$$ -1044620 -1045682 -1728975 -2826532 -4032870 -5238124 -6360567 -7122123 -7214793 -6612472
12387f612472J001017J055622J012020J088725J234184J350883J472838J557010
$$ -6612472 -5611455 -4555833 -3543813 -2455088 -1220904 129979 1602817 3159827
12379C159827J407326R28246K55569m70277j162048j586899j539930j155292p02197
$$ 3159827 4567153 5495399 5750968 5280691 4118643 2531744 991814 -163478 -865675
12370h65675l19776r2573p0562k59910o41496j127233j607023j970391k058089
$$ -865675 -1185451 -1278024 -1348586 -1608496 -2249992 -3377225 -4984248 -6954639 -9012728
12361i012728j733722j055118l03640K57014O17640Q87048J087106J217760J328235
$$ -9012728 -10746450 -11801568 -12105208 -11848194 -11230554 -10343506 -9256400 -8038640 -6710405
12352f710405J472651J670681J870323K009990K012972J692942R43117k886p26191
$$ -6710405 -5237754 -3567073 -1696750 313240 2326212 4019154 4962271 4959385 4233194
12343D233194r24741o27525j67860J27960J28680n2887p9743K69156Q28630J241153
$$ 4233194 3308453 2680928 2513068 2641028 2769708 2716821 2637078 2906234 3734864 4976017
12333D976017J168137M38817p26338j768090k291554k498341k829112l338681
$$ 4976017 6144154 6582971 5856633 4088543 1796989 -701352 -3530464 -6869145
12325f869145l739702l801685l510414k961574k219722j277767j30677J116006
$$ -6869145 -10608847 -14410532 -17920946 -20882520 -23102242 -24380009 -24510686 -23394680
12317b3394680K191407K781575K833679K646625K553608K619567K705159K623271
$$ -23394680 -21203273 -18421698 -15588019 -12941394 -10387786 -7768219 -5063060 -2439789
12309b439789K153632J148672k22367j374581j708522j212773m28211O9572O4974
$$ -2439789 -286157 862515 640148 -734433 -2442955 -3655728 -4083939 -4014367 -3949393
12300c949393j88841k29218J59990Q27303J498526J932648J966659J639593J219080
$$ -3949393 -4138234 -4367452 -4207462 -3380159 -1881633 51015 2017674 3657267 4876347
12291D876347R37051P93101P42699P62536O38041J08562p06860j364566j611649
$$ 4876347 5813398 6606499 7349198 8111734 8749775 8858337 8151477 6786911 5175262
12282E175262j617690j667386j783505j737133j305392n08917L88239J184224
$$ 5175262 3557572 1890186 106681 -1630452 -2935844 -3444761 -3056522 -1872298
12274a872298J791538J992529J585161O51786m86297j363126j574961j122124
$$ -1872298 -80760 1911769 3496930 4148716 3662419 2299293 724332 -397792
12266c97792l73060L13842P37787P49556K41790p10563j820531k772619l322873
$$ -397792 -770852 -457010 280777 1030333 1272123 561560 -1258971 -4031590 -7354463
12257g354463l270072k590943j572338o61608j42216M4646J25987K84398N80476
$$ -7354463 -10624535 -13215478 -14787816 -15449424 -15591640 -15546994 -15421007 -15136609 -14556133
12248a4556133Q89235R48414O69357L14809J87355K81775M28565O31802R95796
$$ -14556133 -13666898 -12718484 -12049127 -11734318 -11546963 -11265188 -10836623 -10204821 -9209025
12239i209025J412811J587091J371191Q25945J16473m35346m91354n7502M89167
$$ -9209025 -7796214 -6209123 -4837932 -4011987 -3895514 -4330860 -4822214 -4879716 -4390549
12230d390549Q00431P54690L56811k97110j015781j606894j896209j700758j028023
$$ -4390549 -3590118 -2835428 -2478617 -2775727 -3791508 -5398402 -7294611 -8995369 -10023392
12221a0023392j57869O21030J173233J439041J446274J295040J020420O71020
$$ -10023392 -10181261 -9560231 -8386998 -6947957 -5501683 -4206643 -3186223 -2515203
12213b515203M01863K77309Q3122l93998r11189r84390n31722J0110K36170K07178
$$ -2515203 -2113340 -1836031 -1752909 -2146907 -3058096 -4042486 -4574208 -4564098 -4327928 -4120750
12203d120750K50911N62271J021508J316357J271738R39001M26881p1290l61968
$$ -4120750 -3869839 -3307568 -2286060 -969703 302035 1241036 1667917 1596627 1234659
12194A234659n13140p19007r89005j156143j003049l70257O66411J665325K102564
$$ 1234659 721519 2512 -986493 -2142636 -3145685 -3515942 -2849531 -1184206 918358
12185I18358J882428J337176P63600J67706m89557j002829j194836j261037j500984
$$ 918358 2800786 4137962 4901562 5069268 4579711 3576882 2382046 1121009 -379975
12176c79975j922276k279344k389570k289654k053284j630203j016400m44425
$$ -379975 -2302251 -4581595 -6971165 -9260819 -11314103 -12944306 -13960706 -14405131
12168a4405131j19785N5573K48704M24135M44171L14830K04778K40383M03109
$$ -14405131 -14524916 -14469343 -14220639 -13796504 -13352333 -13037503 -12832725 -12592342 -12189233
12159a2189233N79231O82033Q39624J336532K163480K811289K747985J964061
$$ -12189233 -11610002 -10927969 -10088345 -8751813 -6588333 -3777044 -1029059 935002
12151I35002R04519p914o22347r73194j162710j240391j150887q68678m28431
$$ 935002 1839521 1831607 1209260 236066 -926644 -2167035 -3317922 -4186600 -4615031
12142d615031J31916O92115J082700J283416J428782J526074J380039R37496M16415
$$ -4615031 -4483115 -3791000 -2708300 -1424884 3898 1529972 2910011 3847507 4263922
12133D263922N5402j13913k98985p37674j456093k220253k654060k472032j734129
$$ 4263922 4319324 4205411 3906426 3168752 1712659 -507594 -3161654 -5633686 -7367815
12124g367815q35277j66734K05863M75708P90298J078360J173160J068897R35568
$$ -7367815 -8203092 -8369826 -8163963 -7688255 -6897957 -5819597 -4646437 -3577540 -2641972
12115b641972R11209R38647Q70723P13996O58255P58224P50279N01620L59381
$$ -2641972 -1730763 -792116 78607 792603 1450858 2209082 2959361 3460981 3820362
12106C820362O09828R55244R19425M05256l25069r41648j259566j255530j094758
$$ 3820362 4430190 5385434 6304859 6710115 6385046 5443398 4183832 2928302 1833544
12097A833544j107026j477852k035416k497721k805780l018593k977858k437527
$$ 1833544 726518 -751334 -2786750 -5284471 -8090251 -11108844 -14086702 -16524229
12089a6524229j479704m89904K18808O09039Q29344J012449J205060J376602J375229
$$ -16524229 -18003933 -18493837 -18275029 -17665990 -16836646 -15824197 -14619137 -13242535 -11867306
12080a1867306J078839O43754L93337M54120O92902R77942J247300J410423J334028
$$ -11867306 -10788467 -10144713 -9751376 -9297256 -8604354 -7626412 -6379112 -4968689 -3634661
12071c634661Q75778P7108p16186j208803j525428j911364k265954k264176j783454
$$ -3634661 -2758883 -2681775 -3397961 -4606764 -6132192 -8043556 -10309510 -12573686 -14357140
12062a4357140r93386j06324P72888J608096K286764K613790K549632K291561
$$ -14357140 -15350526 -15456850 -14683962 -13075866 -10789102 -8175312 -5625680 -3334119
12054c334119K044588J874351J720849J408590Q15683Q4306n53458r99016j140418
$$ -3334119 -1289531 584820 2305669 3714259 4529942 4614248 4060790 3061774 1921356
12045A921356q73641l41967J31898L20250K21147j08275o63560j331916j841666
$$ 1921356 1047715 705748 837646 1157896 1379043 1270768 607208 -724708 -2566374
12036b566374k007748j877830j591643j208569p04064q4909N25287R33224J070843
$$ -2566374 -4574122 -6451952 -8043595 -9252164 -9956228 -10041137 -9515850 -8582626 -7511783
12027g511783J028587R23685Q23216O93967M76603K29039J00332J71096L33110
$$ -7511783 -6483196 -5559511 -4736295 -4042328 -3565725 -3336686 -3236354 -3065258 -2732148
12018b732148L87407L10158K88271M05029M42981J85580j94410l19226o6523L41368
$$ -2732148 -2344741 -2034583 -1746312 -1341283 -898302 -712722 -907132 -1226358 -1292881 -951513
12008i51513O44288P87231P91868O57676M83628M38299N79720Q35815J118306
$$ -951513 -307225 480006 1271874 1929550 2413178 2851477 3431197 4267012 5385318
11999E385318J359196J443711J177469M84610l79989r98972j156290r14485m51667
$$ 5385318 6744514 8188225 9365694 9850304 9470315 8471343 7315053 6400568 5948901
11990E948901O6147N12162P48752P36891O82382Q26197J090200J167132R83478
$$ 5948901 6015048 6527210 7275962 8012853 8695235 9521432 10611632 11778764 12762242
11981A2762242P67498O75747O46343N66746M41104L88829M95265P24614R93126
$$ 12762242 13529740 14205487 14851830 15418576 15859680 16248509 16743774 17468388 18461514
11972A8461514J174925J039554L81886q01003k197215l218532l377697k681126
$$ 18461514 19636439 20675993 21057879 20256876 18059661 14841129 11463432 8782306
11964H782306j617396p68759l75286l19669m79722q34820j295074j677417j808134
$$ 8782306 7164910 6396151 6020865 5701196 5221474 4386654 3091580 1414163 -393971
11955c93971j683414j442492j126459p43474m69321l90369l03768J1128N30300
$$ -393971 -2077385 -3519877 -4646336 -5389810 -5859131 -6249500 -6553268 -6542140 -6011840
11946f011840R68785R90394M49492m99711j385496j685218j325791o95166k13937
$$ -6011840 -5043055 -4052661 -3603169 -4102880 -5488376 -7173594 -8499385 -9194551 -9408488
11937i408488r766J32681M24949P63522R06892Q21758P02532P18157Q36440Q90284
$$ -9408488 -9418254 -9285573 -8860624 -8097102 -7190210 -6368452 -5665920 -4947763 -4111323 -3221039
11927c221039Q09541O77513N52284L41514r8295p04605j150882j215591j023707
$$ -3221039 -2411498 -1733985 -1181701 -840187 -938482 -1643087 -2793969 -4009560 -5033267
11918e033267q65451r31877j188591j445548j484530j167576n75628R95L20427
$$ -5033267 -5898718 -6830595 -8019186 -9464734 -10949264 -12116840 -12692468 -12691473 -12371046
11909a2371046M04580M59094O64475J074712J579237J952294K026984J820633
$$ -12371046 -11966466 -11507372 -10842897 -9768185 -8188948 -6236654 -4209670 -2389037
11901b389037J439982R51087M66537K10228K68634L92991L35729J68838k6148
$$ -2389037 -949055 2032 468569 678797 947431 1340422 1676151 1844989 1818841
11892A818841l45302p99065j261523j589342j748441j945564k406518l033594
$$ 1818841 1473539 674474 -587049 -2176391 -3924832 -5870396 -8276914 -11310508
11884a1310508l566000l833154l685173l020739j861910k92583J553273L392300
$$ -11310508 -14876508 -18709662 -22394835 -25415574 -27277484 -27570067 -26016794 -22624494
11876b2624494M730094N133401M676639L856761L104783K547572K074697J478792
$$ -22624494 -17894400 -12760999 -8084360 -4227599 -1122816 1424756 3499453 4978245
11868D978245O38286k82925r09018j035381q04471n69572o13177r01682j138037
$$ 4978245 5616531 5333606 4424588 3389207 2584736 2015164 1401987 500305 -637732
11859f37732j049271p17171n46214p47627j059752j143583r77767p15455l82398
$$ -637732 -1687003 -2404174 -2950388 -3698015 -4757767 -5901350 -6879117 -7594572 -7976970
11850g976970Q8819N80231Q30237P28201M30920J81950Q8283J03193J35775J38640
$$ -7976970 -7888151 -7307920 -6477683 -5749482 -5318562 -5136612 -5048329 -4945136 -4809361 -4670721
11840d670721J88753L97242P47410J080533J181766R91497O26275J08271o07427
$$ -4670721 -4481968 -4084726 -3337316 -2256783 -1075017 -83520 542755 651026 43599
11831D3599j319609j758123j887650j803984j584003j259286p96553j87068M68061
$$ 43599 -1276010 -3034133 -4921783 -6725767 -8309770 -9569056 -10365609 -10552677 -10084616
11822a0084616R69839J019006L66955q25462j942025k385254j952729q29423N31603
$$ -10084616 -9114777 -8095771 -7728816 -8554278 -10496303 -12881557 -14834286 -15663709 -15132106
11813a5132106J571722J973404J883696J622788J304226Q27473J30932o11628
$$ -15132106 -13560384 -11586980 -9703284 -8080496 -6776270 -5948797 -5817865 -6429493
11805f429493j113618j221849r64679m85010Q216K97914K83312J80786L70678
$$ -6429493 -7543111 -8764960 -9729639 -10214649 -10206433 -9908519 -9625207 -9444421 -9073743
11796i073743R24980J555569J956570J994110J646354R79635K46354k40319m53239
$$ -9073743 -8148763 -6593194 -4636624 -2642514 -996160 -16525 229829 -10490 -463729
11787d63729o48991r33228j129000j120344r65787o93552l36640q7304j79796
$$ -463729 -1112720 -2045948 -3174948 -4295292 -5261079 -5954631 -6291271 -6378575 -6558371
11778f558371n88718r22613q50663n30724k55886J2326M52734J007521J441580
$$ -6558371 -7147089 -8069702 -8920365 -9451089 -9706975 -9694649 -9241915 -8234394 -6792814
11769f792814J709059K030105K548392L062777L195158K761402J871322P76578
$$ -6792814 -5083755 -3053650 -505258 2557519 5752677 8514079 10385401 11161979
11761A1161979k53722j027210j481937j628598j526667j291311j023179p49755
$$ 11161979 10908257 9881047 8399110 6770512 5243845 3952534 2929355 2179600
11753B179600l97275J17122O63055Q99784O65102J72218k46439m21077m31674
$$ 2179600 1782325 1899447 2562502 3462286 4127388 4299606 4053167 3632090 3200416
11744C200416n10008q40497j338260j626996j432691r11200m58661k47792p1452
$$ 3200416 2690408 1849911 511651 -1115345 -2548036 -3459236 -3917897 -4165689 -4237141
11735d237141L60762J115165J980515K597422K683384K222845J452558O76384
$$ -4237141 -3876379 -2761214 -780699 1816723 4500107 6722952 8175510 8851894
11727H851894J09565j03547M7316L36199N40687O36371O22681M27367P9243k55832
$$ 8851894 8961459 8857912 8905228 9241427 9782114 10418485 11041166 11468533 11547776 11291944
11717A1291944m39138m87674n45493p60370j173995j569204j556263j080486o18706
$$ 11291944 10852806 10365132 9819639 9059269 7885274 6316070 4759807 3679321 3060615
11708C060615p41687j519736k432376k838533k412195j313747n7954Q87094J404399
$$ 3060615 2318928 799192 -1633184 -4471717 -6883912 -8197659 -8255613 -7368519 -5964120
11699e964120J650854J747855J653179J314938P88952J92335l83138r39543j528298
$$ -5964120 -4313266 -2565411 -912232 402706 1191658 1383993 1000855 61312 -1466986
11690a466986k081797k379441k277438j879663j415487j014078o77772m00374
$$ -1466986 -3548783 -5928224 -8205662 -10085325 -11500812 -12514890 -13192662 -13593036
11682a3593036j88804M0520M05782Q97111J335886J501648J360973J085721Q09132
$$ -13593036 -13781840 -13741320 -13335538 -12438427 -11102541 -9600893 -8239920 -7154199 -6345067
11673f345067N84406N54044P55912Q76795N89223K8369l65068k80795L57505J328305
$$ -6345067 -5760661 -5206617 -4450705 -3573910 -2984687 -2956318 -3321386 -3602181 -3244676 -1916371
11663a916371K170520K522875K318496J820516J472908J512842J757466J748209
$$ -1916371 254149 2777024 5095520 6916036 8388944 9901786 11659252 13407461
11655A3407461J085168k19018j622056k475510k599913k306860j963764j719172
$$ 13407461 14492629 14273611 12651555 10176045 7576132 5269272 3305508 1586336
11647A586336j531826j232205o43508K02730J030369J505158J483583J174344
$$ 1586336 54510 -1177695 -1821203 -1618473 -588104 917054 2400637 3574981
11639C574981R03301O86837L76273M9490j49649k09485j68378o0782K0591l4951
$$ 3574981 4478282 5165119 5541392 5590882 5441233 5231748 5063370 5002588 5023179 4988228
11629D988228j77268l39563o54341j171746j566668j489231r55227l10532l6619
$$ 4988228 4810960 4471397 3817056 2645310 1078642 -410589 -1365816 -1676348 -1712967
11620a712967l97209j115798j612786j562585j015262k01834O05332J114657J134637
$$ -1712967 -2110176 -3225974 -4838760 -6401345 -7416607 -7618441 -7013109 -5898452 -4763815
11611d763815Q06137N43641N64796P12854P92466P54061N77505K14799l44885
$$ -4763815 -3957678 -3414037 -2849241 -2136387 -1343921 -589860 -12355 202444 -142441
11602a42441j041986j760901k287654k343184j822309r45158n4478O22598R68019
$$ -142441 -1184427 -2945328 -5232982 -7576166 -9398475 -10343633 -10398111 -9775513 -8807494
11593h807494R57806O84839L44274J79115L24630P30809J212140J499831J469754
$$ -8807494 -7849688 -7164849 -6820575 -6641460 -6316830 -5586021 -4373881 -2874050 -1404296
11584a404296J273299J112300J097407J225123J334862J229381R04513N31703
$$ -1404296 -130997 981303 2078710 3303833 4638695 5868076 6772589 7304292
11576G304292K60235J52823J44528R4371p0142l30689n98092p24269n69335j12055
$$ 7304292 7564527 7717350 7861878 7956249 7886107 7555418 6957326 6233057 5663722 5551667
11566E551667M45637Q00160P53045K64383m93217j207245j619839j571436j021510
$$ 5551667 5997304 6797464 7550509 7814892 7321675 6114430 4494591 2923155 1901645
11557A901645j95217N11968Q25288P45453N07942L40605K78705K43283J92595
$$ 1901645 1706428 2218396 3043684 3789137 4297079 4637684 4916389 5159672 5352267
11548E352267J20469J3296j47601m36877r80591j749185k372934k363125j620994
$$ 5352267 5472736 5486032 5338431 4901554 3920963 2171778 -201156 -2564281 -4185275
11539d185275m83406N87748J219970J304525J021457O37186K81255l9277l24801
$$ -4185275 -4668681 -4080933 -2860963 -1556438 -534981 102205 383460 344183 19382
11530A9382n61654p08402o94041n09748k55398m0485O7233K4201r4607j48135
$$ 19382 -542272 -1250674 -1944715 -2454463 -2709861 -2750346 -2683113 -2658912 -2753519 -2901654
11520b901654j00169P6232M02095P10263P90441O15602K64167k17755p71568j252173
$$ -2901654 -3001823 -2925591 -2523496 -1813233 -1022792 -407190 -143023 -360778 -1132346 -2384519
11510b384519j517961j469370j024096k81422L70563N73342M55901M61253P45759
$$ -2384519 -3902480 -5371850 -6395946 -6677368 -6306805 -5733463 -5277562 -4816309 -4070550
11501d070550J070543J221535J279258J430305J708112J976327K053961J797569
$$ -4070550 -3000007 -1778472 -499214 931091 2639203 4615530 6669491 8467060
11493H467060J130982P3200j168891k203821k752216k839959k575891j998938
$$ 8467060 9598042 9671242 8502351 6298530 3546314 706355 -1869536 -3868474
11485c868474j204435m00097K38036O31264O95366M66847K30046L11790P66966
$$ -3868474 -5072909 -5473006 -5234970 -4603706 -3908340 -3441493 -3211447 -2899657 -2132691
11476b132691J280154J409323R99395L68810O1529M25760J271603J930975J841611
$$ -2132691 -852537 556786 1556181 1924991 1986520 2412280 3683883 5614858 7456469
11467G456469J006237j24675r89420j247988j033647p24512n69856o05638p24927
$$ 7456469 8462706 8338031 7348611 6100623 5066976 4342464 3772608 3166970 2442043
11458B442043p67809n18103J25048R42636J600109J896616J811392J536863J386989
$$ 2442043 1674234 1156131 1281179 2223815 3823924 5720540 7531932 9068795 10455784
11449A0455784J457482J469568J086233K74228o89604j365576j365782o90220
$$ 10455784 11913266 13382834 14469067 14743295 14053691 12688115 11322333 10632113
11441A0632113K32519Q82738R52253N39089O2193j85129j92842J4759L87430P32797
$$ 10632113 10864632 11747370 12699623 13238712 13300905 13115776 12922934 12937693 13325123 14057920
11431A4057920R34883J060196J167929J280543J369159J205245M68748p81698
$$ 14057920 14992803 16052999 17220928 18501471 19870630 21075875 21544623 20762925
11423B0762925j898567k229272j797916j174871q68443r86641j357329j783161
$$ 20762925 18864358 16635086 14837170 13662299 12793856 11807215 10449886 8666725
11415H666725k112375k195025j934092j419334r25683o69515o27724o24027n79725
$$ 8666725 6554350 4359325 2425233 1005899 80216 -589299 -1217023 -1841050 -2420775
11406b420775o08670p61528q69339p39274l81189L9130L75287N60363N38933K59292
$$ -2420775 -3029445 -3790973 -4660312 -5399586 -5780775 -5741645 -5366358 -4805995 -4267062 -4007770
11396d007770j52010l28169K3089P62926J460874J820848J830169J643094J335068
$$ -4007770 -4159780 -4487949 -4464860 -3701934 -2241060 -420212 1409957 3053051 4388119
11387D388119Q33486K00822l46490p98271j243774j486177j216333m44218N24434
$$ 4388119 5221605 5422427 5075937 4277666 3033892 1547715 331382 -112836 411598
11378D11598J381338J859526J735578J136673N24537K21763K51552M36625N16319
$$ 411598 1792936 3652462 5388040 6524713 7049250 7271013 7522565 7959190 8475509
11369H475509L77877J75332K13899O63835J365897J972150K181858J871513J153927
$$ 8475509 8853386 9028718 9242617 9906452 11272349 13244499 15426357 17297870 18451797
11360A8451797K25218p75720j618255k005536j840794j288754o66199k58127p8748
$$ 18451797 18677015 17901295 16283040 14277504 12436710 11147956 10481757 10223630 10144882
11351A0144882J6730L7026k6616k5133J02160K24442L08041M68644P87155J229635
$$ 10144882 10161612 10198638 10172022 10146889 10249049 10473491 10781532 11250176 12037331 13266966
11341A3266966J646285J895909J982328J917872J670077J254314O22188l32088
$$ 13266966 14913251 16809160 18791488 20709360 22379437 23633751 24255939 23923851
11333B3923851j508097k557668l238119l561656l654722l669008l620887l342341
$$ 23923851 22415754 19858086 16619967 13058311 9403589 5734581 2113694 -1228647
11325a228647k631587j427092M5458J345151K053620K000789J345237M48003l35905
$$ -1228647 -3860234 -5287326 -5241868 -3896717 -1843097 157692 1502929 1950932 1615027
11316A615027q09917j011017j129873j223472j163251r15967n69090j75940J68786
$$ 1615027 805110 -205907 -1335780 -2559252 -3722503 -4638470 -5207560 -5383500 -5214714
11307e214714L13479K78001K29879J67087k4652k86113n02888p18007r70352j081763
$$ -5214714 -4901235 -4623234 -4393355 -4226268 -4250920 -4537033 -5039921 -5757928 -6728280 -7810043
11297g810043p69151O9866J245328K369368K993261K844518K099504J314537R98002
$$ -7810043 -8579194 -8509328 -7264000 -4894632 -1901371 943147 3042651 4357188 5355190
11288E355190J199442J525197J516457R77675R7456p23528j137432j055017p39434
$$ 5355190 6554632 8079829 9596286 10573961 10671417 9947889 8810457 7755440 7016006
11279G016006n28267m71929m08687k55100j09114j51549m29254p40720q70942
$$ 7016006 6487739 6015810 5607123 5352023 5242909 5091360 4662106 3921386 3050444
11270C050444q60002r59653j417440k200049l005499l593238l867807l648319
$$ 3050444 2190442 1230789 -186651 -2386700 -5392199 -8985437 -12853244 -16501563
11262a6501563k735013j284215K06871J358463K229415L052142L760183L999844
$$ -16501563 -19236576 -20520791 -20313920 -18955457 -16726042 -13673900 -9913717 -5913873
11254e913873L543266K500451J200850k8463j020929j683071j870758j463542
$$ -5913873 -2370607 129844 1330694 1302231 281302 -1401769 -3272527 -4736069
11246d736069m91994Q21372K119511L052632L414806L166522K405786J350768
$$ -4736069 -5228063 -4406691 -2287180 765452 4180258 7346780 9752566 11103334
11238A1103334L16475m58160r58920j268864j477916j649969j732188j621473
$$ 11103334 11419809 10961649 10002729 8733865 7255949 5605980 3873792 2252319
11230B252319j360178j165095j106555r00991k76871N78857J128642R80790K29244
$$ 2252319 892141 -272954 -1379509 -2280500 -2557371 -1978514 -849872 130918 360162
11221C60162o61571j236515j257498p14246J63774J021183J543558J534917R96976
$$ 360162 -301409 -1537924 -2795422 -3509668 -3345894 -2324711 -781153 753764 1750740
11212A750740J99265m40596o83469o04588l15001K49553J127417K083113K667987
$$ 1750740 1950005 1509409 825940 221352 -93649 155904 1283321 3366434 6034421
11203F034421K646785K227585J714610J197961O41282M9836m48928o90028o48250
$$ 6034421 8681206 10908791 12623401 13821362 14462644 14512480 14063552 13373524 12725274
11194A2725274m75233l30568k40361j91195j90791k42303m54691j024258j906549
$$ 12725274 12250041 11919473 11679112 11487917 11297126 11054823 10600132 9575874 7669325
11185G669325k737470l178370l110753k633562k066274j717641j595020j456900
$$ 7669325 4931855 1753485 -1357268 -3990830 -6057104 -7774745 -9369765 -10826665
11177a0826665j113134o29026k13603M3273K12072L73277N82968Q78257J181974
$$ -10826665 -11939799 -12568825 -12782428 -12739155 -12527083 -12153806 -11570838 -10692581 -9510607
11168i510607J339862J252174Q90674K54149n76011j449039k277668k956032l276822
$$ -9510607 -8170745 -6918571 -6027897 -5773748 -6349759 -7798798 -10076466 -13032498 -16309320
11159a6309320l078149k320826j065776M39021J786462K602761K705765K224997
$$ -16309320 -19387469 -21708295 -22774071 -22335050 -20548588 -17945827 -15240062 -13015065
11151a3015065J571860J178083J239474J660307K144952K410213K443669K427439
$$ -13015065 -11443205 -10265122 -9025648 -7365341 -5220389 -2810176 -366507 2060932
11143B060932K434485K366336K117263J706941J213088O45760r887o70997j142901
$$ 2060932 4495417 6861753 8979016 10685957 11899045 12544805 12534918 11863921 10721020
11134A0721020j256833j069105q26072o83424o28757o48458p54926q82371q71380
$$ 10721020 9464187 8395082 7569010 6885586 6256829 5608371 4853445 3971074 3099694
11125C099694n86642r3273L66342N88774M91841O7544n57950j136551j542361
$$ 3099694 2513052 2419779 2786121 3374895 3866736 3934280 3376330 2239779 697418
11116F97418j868292k214747k468980k427644k157477j944310j832655j608720
$$ 697418 -1170874 -3385621 -5854601 -8282245 -10439722 -12384032 -14216687 -15825407
11108a5825407j187376p16016l90979k87850l36520l61795j41664L63214Q49624
$$ -15825407 -17012783 -17728799 -18119778 -18407628 -18744148 -19105943 -19247607 -18884393 -18034769
11099a8034769R41400O22686K58290J47349J48466p8474n13907p49877m75142
$$ -18034769 -17093369 -16470683 -16212393 -16065044 -15916578 -15995052 -16508959 -17258836 -17733978
11090a7733978K10073J003054J664178K021234J998215J687712J292175R39847
$$ -17733978 -17523905 -16520851 -14856673 -12835439 -10837224 -9149512 -7857337 -6917490
11082f917490N26508p1668p03241j136315j309904j246585r55811m70505J54286
$$ -6917490 -6390982 -6462650 -7165891 -8302206 -9612110 -10858695 -11814506 -12285011 -12130725
11073a2130725Q09688J247359J210250N70559n08691j395471j426178o60137J64055
$$ -12130725 -11321037 -10073678 -8863428 -8292869 -8801560 -10197031 -11623209 -12283346 -12119291
11064a2119291M19902M3285o13157j096825j130745p57739j97357L96077Q69212
$$ -12119291 -11699389 -11656104 -12269261 -13366086 -14496831 -15254570 -15451927 -15055850 -14186638
11055a4186638J025262Q37183M35404r5815o55575j016540r76405o12890j79610
$$ -14186638 -13161376 -12324193 -11888789 -11984604 -12640179 -13656719 -14633124 -15246014 -15425624
11046a5425624J75970L88603M40042M34553N20948P05550Q88681J042493J167997
$$ -15425624 -15249654 -14861051 -14421009 -13986456 -13465508 -12759958 -11871277 -10828784 -9660787
11037i660787J269550J439411J671958J746266J517700J078050N41126J5892k71611
$$ -9660787 -8391237 -6951826 -5279868 -3533602 -2015902 -937852 -396726 -380834 -652445
11028f52445k02494J7152P7129j42531n42994r67418j304958j389115j054805
$$ -652445 -854939 -837787 -760658 -903189 -1446183 -2413601 -3718559 -5107674 -6162479
11019f162479m29671J74814P04460J377943K320352L324182L902831L644762K580251
$$ -6162479 -6592150 -6417336 -5712876 -4334933 -2014581 1309601 5212432 8857194 11437445
11010A1437445J157869j35200r94124j294712j211442j138713j299806j634195
$$ 11437445 12595314 12460114 11465990 10171278 8959836 7821123 6521317 4887122
11002D887122j999991k278085k312410j918096j059934l0408P59634J267564J765920
$$ 4887122 2887131 609046 -1703364 -3621460 -4681394 -4711802 -3952168 -2684604 -918684
10993i18684K293332K552109K297183J539157M04464q69476j881046k276870j986183
$$ -918684 1374648 3926757 6223940 7763097 8167561 7298085 5417039 3140169 1153986
10984A153986j191906j35253Q62256J385625J275419P94501L22049P4559J8789
$$ 1153986 -37920 -173173 689083 2074708 3350127 4144628 4466677 4541236 4560025
10975D560025j869l6845o3361n2161R9201M60700R16004J240696J262667R47356
$$ 4560025 4558156 4521311 4457950 4405789 4504990 4965690 5881694 7122390 8385057 9332413
10965I332413L94782j66846m24515k35548J73794L90398K28349q3085k94429m29898
$$ 9332413 9727195 9560349 9135834 8900286 9074080 9464478 9692827 9609742 9315313 8885415
10955H885415m62208k77710N5763M11522P26797R26195R14730O38652J97911k00723
$$ 8885415 8423207 8145497 8201260 8612782 9339579 10265774 11180504 11819156 12017067 11816344
10945A1816344n39859r33807j235945j156324o61536L7491O97792J126210J184879
$$ 11816344 11276485 10342678 9106733 7950409 7288873 7326364 8024156 9150366 10335245
10936A0335245Q27907J99554m53559r77071j326544j569177j802357j989986j959001
$$ 10335245 11163152 11362706 10909147 9932076 8605532 7036355 5233998 3244012 1285011
10927A285011j547669q10020j6188N59312P55973N14289j02631q36194j280789
$$ 1285011 -262658 -1072678 -1088866 -529554 226419 740708 638077 -198117 -1478906
10918a478906j152602n64295P709J56891m3851k23009k12873j17238m9451r8409
$$ -1478906 -2631508 -3195803 -3188094 -3031203 -3075054 -3298063 -3510936 -3628174 -3677625 -3776034
10908c776034l36363p31205j143102j383460j317596r71207m91518L5617O22347
$$ -3776034 -4112397 -4843602 -5986704 -7370164 -8687760 -9658967 -10150485 -10114868 -9492521
10899i492521J217726J714338K074475K292827K315630K110785J691164J126144
$$ -9492521 -8274795 -6560457 -4485982 -2193155 122475 2233260 3924424 5050568
10891E050568O33936M49853N52489O67700N49233J51309m04960r06815j230018
$$ 5050568 5684504 6134357 6686846 7354546 7903779 8055088 7650128 6743313 5513295
10882E513295j411561j512820j558822j487871j223397q38104n85937p30742j181503
$$ 5513295 4101734 2588914 1030092 -457779 -1681176 -2519280 -3105217 -3835959 -5017462
10873e017462j424473j017945q6078Q82730J546127J780001J596203J209456Q74736
$$ -5017462 -6441935 -7459880 -7545958 -6663228 -5117101 -3337100 -1740897 -531441 343295
10864C43295O00860L25919J63704J69933J53272r8035n48911j005737j359790
$$ 343295 944155 1270074 1433778 1603711 1756983 1658948 1110037 104300 -1255490
10855a255490j502075j159245j89815J058670K018864K403224K290878J930767
$$ -1255490 -2757565 -3916810 -4106625 -3047955 -1029091 1374133 3665011 5595778
$$ [...]
##END NTUPLES=NMR SPECTRUM
##END=
