##TITLE=31P ikalashn
95-2024-BAU
18.11.2024
##JCAMPDX= 6.0         $$ Bruker NMR JCAMP-DX V2.0
##DATA TYPE= NMR SPECTRUM
##DATA CLASS= NTUPLES
##ORIGIN= UXNMR, Bruker Analytische Messtechnik GmbH
##OWNER= root
$$ TOPSPIN		Version 1.3
$$ 2024-11-18 14:15:40.171 +0400  Irina@DPX200
$$ Compression mode = diff/dup
##.OBSERVE FREQUENCY= 81.01967998063
##.OBSERVE NUCLEUS= ^31P
##.ACQUISITION MODE= SIMULTANEOUS
##.ACQUISITION SCHEME= undefined
##.AVERAGES= 64
##.DIGITISER RES= 17
##SPECTROMETER/DATA SYSTEM= spect
##.PULSE SEQUENCE= zgpg
##.SOLVENT NAME= D2O
##.SHIFT REFERENCE= INTERNAL, D2O, 1, 298.5841
##AUDIT TRAIL= $$ (NUMBER, WHEN, WHO, WHERE, WHAT)
$$ ##TITLE= Audit trail, TOPSPIN		Version 1.3
$$ ##JCAMPDX= 5.01
$$ ##ORIGIN= Bruker BioSpin GmbH
$$ ##OWNER= Irina
$$ $$ F:/spectra/data/iren/nmr/P31dec/1/pdata/1/auditp.txt
$$ ##AUDIT TRAIL=  $$ (NUMBER, WHEN, WHO, WHERE, VERSION, WHAT)
(   1,<2024-11-18 14:15:09.109 +0400>,<Irina>,<DPX200>,<TOPSPIN 1.3>,
      <created by zg
	started at 2024-11-18 14:13:26.171 +0400,
	POWCHK disabled, PULCHK disabled
       configuration hash MD5:
       BE 6D 3F 07 2A EA 11 49 91 17 2B D3 AF B3 58 0D
       data hash MD5: 32K
       3A C7 F3 47 B5 ED B0 CC 42 EA 26 D4 9F 18 C9 46>)
(   2,<2024-11-18 14:15:10.421 +0400>,<Irina>,<DPX200>,<TOPSPIN 1.3>,
      <Start of raw data processing
       efp BC_mod = 2 LB = 10 FT_mod = 6 PKNL = 1 PHC0 = 118.6724 PHC1 = 177.7834 SI = 32K 
       data hash MD5: 32K
       FD B2 83 A5 B1 BA 6C B1 35 F9 C3 72 BB 63 B4 51>)
(   3,<2024-11-18 14:15:12.875 +0400>,<Irina>,<DPX200>,<TOPSPIN 1.3>,
      <apk 
       data hash MD5: 32K
       48 45 17 DB 1C 03 99 90 DE 8C BB AF DD CD 4D 17>)
(   4,<2024-11-18 14:15:16.109 +0400>,<Irina>,<DPX200>,<TOPSPIN 1.3>,
      <abs n ABSG = 5 
       data hash MD5: 32K
       A8 8D 59 3E 32 F0 15 E4 25 44 F4 37 9D 21 C2 57>)
(   5,<2024-11-18 14:15:27.656 +0400>,<Irina>,<DPX200>,<TOPSPIN 1.3>,
      <pk fgphup PHC0 = 3.2 PHC1 = 0 
       data hash MD5: 32K
       5E 67 BD 55 16 61 5B 66 A8 58 2A 96 51 02 75 D0>)
(   6,<2024-11-18 14:15:31.625 +0400>,<Irina>,<DPX200>,<TOPSPIN 1.3>,
      <abs n ABSG = 5 
       data hash MD5: 32K
       51 A8 DB 34 6B DE F6 A0 46 39 F4 91 20 0F 08 87>)
$$ ##END=
$$ 
$$ $$ hash MD5
$$ $$ 01 F0 54 9A 39 15 73 A8 03 35 1A 4C C2 27 92 F0
##$RELAX= 
##$RELAX= 
##$RELAX= 
##$RELAX= 
##$RELAX= 
##$RELAX= 
##$RELAX= 
##$RELAX= 
##$RELAX= 
##$RELAX= 
##$RELAX= 
$$ Bruker specific parameters
$$ --------------------------
##$DU= <F:/spectra>
##$EXPNO= 1
##$NAME= <P31dec>
##$PROCNO= 1
##$TYPE= <nmr>
##$USER= <iren>
##$AMP= (0..31)
100 100 100 100 100 100 100 100 100 100 100 100 100 100 100 100 100 100 
100 100 100 100 100 100 100 100 100 100 100 100 100 100 
##$ANAVPT= -1
##$AQSEQ= 0
##$AQ_mod= 1
##$AUNM= <au_zg>
##$AUTOPOS= <>
##$BF1= 81.014009
##$BF2= 200.13
##$BF3= 200.13
##$BF4= 200.13
##$BF5= 200.13
##$BF6= 200.13
##$BF7= 200.13
##$BF8= 200.13
##$BYTORDA= 1
##$CFDGTYP= 0
##$CFRGTYP= 5
##$CHEMSTR= <none>
##$CNST= (0..63)
$$ [...]
##$SW_h= 37037.037037037
##$TD= 32768
##$TD0= 1
##$TE= 300
##$TE2= 300
##$TE3= 300
##$TEG= 300
##$TL= (0..7)
0 120 53 12 22 120 120 120 
##$TP= (0..7)
150 150 150 150 150 150 150 150 
##$TP07= 0
##$TPNAME0= <>
##$TPNAME1= <>
##$TPNAME2= <>
##$TPNAME3= <>
##$TPNAME4= <>
##$TPNAME5= <>
##$TPNAME6= <>
##$TPNAME7= <>
##$TPOAL= (0..7)
0.5 0.5 0.5 0.5 0.5 0.5 0.5 0.5 
##$TPOFFS= (0..7)
0 0 0 0 0 0 0 0 
##$TUNHIN= 0
##$TUNHOUT= 0
##$TUNXOUT= 0
##$USERA1= <user>
##$USERA2= <user>
##$USERA3= <user>
##$USERA4= <user>
##$USERA5= <user>
##$V9= 5
##$VALIST= <valist>
##$VCLIST= <CCCCCCCCCCCCCCC>
##$VD= 0
##$VDLIST= <DDDDDDDDDDDDDDD>
##$VPLIST= <PPPPPPPPPPPPPPP>
##$VTLIST= <TTTTTTTTTTTTTTT>
##$WBST= 1024
##$WBSW= 4
##$XGAIN= (0..3)
0 0 0 0 
##$XL= 0
##$YL= 0
##$YMAX_a= 6318
##$YMIN_a= -2851
##$ZGOPTNS= <>
##$ZL1= 120
##$ZL2= 120
##$ZL3= 120
##$ZL4= 120
##$ABSF1= 298.5841
##$ABSF2= -158.5842
##$ABSG= 5
##$ABSL= 5
##$ALPHA= 0
##$AQORDER= 0
##$ASSFAC= 0
##$ASSFACI= 0
##$ASSFACX= 0
##$ASSWID= 0
##$AUNMP= <proc_1d>
##$AXLEFT= 0
##$AXRIGHT= 0
##$AXTYPE= 0
##$AXUNIT= <>
##$AZFE= 0.1
##$AZFW= 0.5
##$BCFW= 0
##$BC_mod= 2
##$BYTORDP= 0
##$COROFFS= 0
##$CY= 12.5935478210449
##$DATMOD= 1
##$DC= 0
##$DFILT= <>
##$DTYPP= 0
##$F1P= 47.1127640792319
##$F2P= -24.0371245302204
##$FCOR= 0.5
##$FTSIZE= 32768
##$FT_mod= 6
##$GAMMA= 0
##$GB= 0
##$INTBC= 1
##$INTSCL= 7.269226e-011
##$ISEN= 30
##$LB= 10
##$LEV0= 0
##$LPBIN= 0
##$MAXI= 12.09355
##$MC2= 0
##$MEAN= 0
##$ME_mod= 0
##$MI= 0.7550151
##$NCOEF= 0
##$NC_proc= -12
##$NLEV= 6
##$NOISF1= 298.5841
##$NOISF2= 270.0111
##$NSP= 0
##$NTH_PI= 0
##$NZP= 0
##$OFFSET= 298.5841
##$PC= 1.4
##$PHC0= 234.3019
##$PHC1= -6.439117
##$PH_mod= 1
##$PKNL= yes
##$PPARMOD= 0
##$PPDIAG= 0
##$PPIPTYP= 0
##$PPMPNUM= 100
##$PPRESOL= 1
##$PSCAL= 0
##$PSIGN= 0
##$REVERSE= no
##$SF= 81.014009
##$SI= 32768
##$SIGF1= 270.0111
##$SIGF2= -158.5842
##$SINO= 77.54984
##$SIOLD= 32768
##$SREGLST= <31P.CDCl3>
##$SSB= 0
##$STSI= 32768
##$STSR= 0
##$SW_p= 37037.037037037
##$SYMM= 0
##$S_DEV= 0
##$TDeff= 32768
##$TDoff= 0
##$TI= <>
##$TILT= no
##$TM1= 0
##$TM2= 0
##$TOPLEV= 0
##$USERP1= <user>
##$USERP2= <user>
##$USERP3= <user>
##$USERP4= <user>
##$USERP5= <user>
##$WDW= 1
##$XDIM= 32768
##$YMAX_p= 366108982
##$YMIN_p= -18430174
$$ End of Bruker specific parameters
$$ ---------------------------------
##NTUPLES= NMR SPECTRUM
##VAR_NAME=  FREQUENCY,     SPECTRUM/REAL,   SPECTRUM/IMAG
##SYMBOL=    X,             R,               I
##VAR_TYPE=  INDEPENDENT,   DEPENDENT,       DEPENDENT
##VAR_FORM=  AFFN,          ASDF,            ASDF
##VAR_DIM=   32768,         32768,           32768
##UNITS=     HZ,            ARBITRARY UNITS, ARBITRARY UNITS
##FACTOR=    1.13031516577767, 1,            1
##FIRST=     37037.037037037, -3892434,      3373568
##LAST=      0,             142738,          -12768722
##MIN=       0,             -18430174,       0
##MAX=       37037.037037037, 366108982,     0
$$ Real data points
##PAGE= N=1
##DATA TABLE= (X++(R..R)), XYDATA
$$ [...]
$$ plain form
16134 4218900 3783715 3351386 3008040 2799034 2764992 2937065 3386532 4197693 5277968
16125 5277968 6341427 7144181 7585439 7645488 7388945 6947016 6416358 5831077 5206231
16116 5206231 4572022 4016090 3678365 3612517 3734665 3932489 4123619 4264194 4339934 4308269
16106 4308269 4068759 3530280 2680261 1582762 355944 -881332 -2064869 -3093818 -3725693
16097 -3725693 -3696033 -2948269 -1711391 -343371 871450 1762009 2228920 2267562 2012134
16088 2012134 1703893 1548611 1565508 1573433 1360532 893231 287299 -409969 -1310894 -2565699
16078 -2565699 -4158567 -5828909 -7204680 -7954340 -7908824 -7203374 -6255697 -5506190 -5164346
16069 -5164346 -5146148 -5179203 -4995343 -4500773 -3788051 -2996171 -2216558 -1526285 -990479 -571552
$$ packed form
16134D218900m35185m32329l43346k09006l4042J72073M49467Q11161J080275
16125E277968J063459Q02754M41258O0049k56543m41929n30658n85281o24846
16116E206231o34209n55932l37725o5848J22148J97824J91130J40575P5740l1665
16106D308269k39510n38479q50019j097499j226818j237276j183537j028949o31875
16097c725693K9660P47764J236878J368020J214821Q90559M66911L8642k55428
16088B012134l08241j55282J6897P925k12901m67301o05932o97268r00925j254805
16078b565699j592868j670342j375771p49660M5516P05450R47677P49507L41844
16069e164346J8198l3055J83860M94570P12722P91880P79613O90273N35806M18927
$$ plain form
16059 -571552 -105020 569223 1472521 2513103 3543624 4361723 4823064 4973581 4957423
16050 4957423 4854694 4663696 4340455 3834710 3121899 2229463 1270608 404473 -248632
16041 -248632 -633238 -740691 -560817 -114545 421426 756630 721137 390855 -52287 -466781
16031 -466781 -721986 -714115 -481485 -202631 -54427 -80999 -204741 -356928 -556530 -867605
16021 -867605 -1286703 -1688813 -1939685 -2050655 -2168240 -2438416 -2906284 -3512663 -4138909 -4624330
16011 -4624330 -4818328 -4647594 -4136905 -3430918 -2750030 -2282105 -2153633 -2404352 -2914734
16002 -2914734 -3463915 -3882907 -4104029 -4092278 -3827539 -3385396 -2939713 -2651670 -2580281 -2666895
15992 -2666895 -2799263 -2928966 -3104628 -3348072 -3570245 -3686974 -3751052 -3923974 -4337320 -4970103
$$ packed form
16059e71552M66532O74243R03298J040582J030521Q18099M61341J50517j6158
16050D957423j02729j90998l23241n05745p12811q92436r58855q66135o53105
16041b48632l84606j07453J79874M46272N35971L35204l5493l30282m43142m14494
16031d66781k55205P871K32630K78854J48204k6572j23742j52187j99602l11075
16021h67605m19098m02110k50872j10970j17585k70176m67868o06379o26246m85421
16011d624330j93998J70734N10689P05987O80888M67925J28472k50719n10382
16002b914734n49181m18992k21122J1751K64739M42143M45683K88043P1389q6614
15992b666895j32368j29703j75662k43444k22173j16729o4078j72922m13346o32783
$$ plain form
15982 -4970103 -5620230 -6017459 -6032261 -5775244 -5482428 -5318598 -5264643 -5131826 -4683774 -3789022
15972 -3789022 -2485641 -951940 577542 1925788 3055967 4033872 4885660 5513094 5803977
15963 5803977 5760954 5437697 4863585 4092348 3241544 2437698 1748915 1169517 692905 405827
15953 405827 396064 558035 638298 491030 182202 -136281 -314032 -183115 390059 1392410
15943 1392410 2655794 3956692 5111527 6010104 6608869 6926400 6998127 6838175 6538285
15934 6538285 6327354 6392077 6688273 7013845 7174670 7043404 6571934 5775176 4707321
15925 4707321 3490207 2297988 1251359 398749 -190915 -427262 -291247 148671 781806
15916 781806 1486257 2100634 2420260 2354868 2060467 1831231 1878320 2187709 2541153 2689708
$$ packed form
15982d970103o50127l97229j4802K57017K92816J63830N3955J32817M48052Q94752
15972c789022J303381J533701J529482J348246J130179R77905Q51788O27434K90883
15963E803977m3023l23257n74112p71237q50804q03846o88783n79398m76612k87078
15953D05827r763J61971Q0263j47268l08828l18483j77751J30917N73174J002351
15943A392410J263384J300898J154835Q98577N98765L17531P1727j59952k99890
15934F538285k10931O4723K96196L25572J60825j31266m71470p96758j067855
15925D707321j217114j192219j046629q52610n89664k36347J36015M39918O33135
15916G81806P04451O14377L19626o5392k94401k29236M7089L09389L53444J48555
$$ plain form
15906 2689708 2546895 2238392 1948325 1731808 1547582 1394328 1314702 1327417 1374172 1324292
15896 1324292 1057450 548287 -76664 -564102 -719555 -561334 -241315 142927 604052
15887 604052 1171800 1781972 2247247 2366620 2070769 1446852 684727 10011 -426801 -618403
15877 -618403 -663761 -674135 -688874 -655698 -486723 -137018 356674 918558 1459137 1857099
15867 1857099 2040086 2061308 2037698 2095088 2335502 2802292 3538068 4602702 5935232 7314454
15857 7314454 8523137 9440042 10005795 10205670 10073459 9708148 9287584 8983103 8823974
15848 8823974 8686717 8381942 7683576 6393963 4529000 2401148 460965 -976818 -1888358
15839 -1888358 -2410175 -2609289 -2464699 -1991729 -1291331 -540673 20513 172393 -135725
$$ packed form
15906B689708j42813l08503k90067k16517j84226j53254p9626J2715M6755m9880
15896A324292k66842n09163o24951m87438j55453J58221L20019L84242M61125
15887F04052N67748O10172M65275J19373k95851o23917p62125o74716m36812j91602
15877f18403m5358j0374j4739L3176J68975L49705M93692N61884N40579L97962
15867A857099J82987K1222k3610N7390K40414M66790P35776J064634J332530J379222
15857G314454J208683R16905N65753J99875j32211l65311m20564l04481j59129
15848H823974j37257l04775o98366j289613j864963k127852j940183j437783r11540
15839a888358n21817j99114J44590M72970P00398P50658N61186J51880l08118
$$ plain form
15830 -135725 -744952 -1414077 -1931258 -2139251 -1974871 -1512715 -899643 -254837 384570 1055976
15820 1055976 1747592 2344555 2783478 3147286 3558916 4078966 4679477 5239064 5581433
15811 5581433 5539416 5019376 4073065 2911271 1817809 1036108 689606 772551 1193148
15802 1193148 1812275 2450467 2857831 2775284 2142365 1187845 266229 -321937 -399649 52624
15792 52624 898286 1891384 2747586 3295825 3590328 3774462 3862815 3740984 3344761 2773293
15782 2773293 2248216 1935537 1807848 1749656 1688150 1592809 1499718 1519783 1702395 1912069
15772 1912069 1926686 1647240 1151241 565301 -20446 -469863 -577987 -273509 237485 657711
15762 657711 897495 1076339 1255973 1332158 1173554 715003 -13861 -834474 -1482538 -1782663
$$ packed form
15830a35725o09227o69125n17181k07993J64380M62156O13072O44806O39407O71406
15820A055976O91616N96963M38923L63808M11630N20050O00511N59587L42369
15811E581433m2017n20040r46311j161794j093462p81701l46502Q2945M20597
15802A193148O19127O38192M07364q2547o32919r54520r21616n88166p7712M52273
15792E2624Q45662R93098Q56202N48239K94503J84134Q8353j21831l96223n71468
15782B773293n25077l12679j27689n8192o1506r5341r3091K0065J82612K09674
15772A912069J4617k79446m95999n85940n85747m49417j08124L04478N10994M20226
15762F57711K39784J78844J79634P6185j58604m58551p28864q20613o48064l00125
$$ plain form
15752 -1782663 -1747155 -1516397 -1187331 -724404 -34758 905005 1962373 2879462 3450962
15743 3450962 3635285 3461300 2980383 2343663 1781761 1453230 1352231 1356265 1285501 964668
15733 964668 350150 -421793 -1133042 -1570496 -1532611 -919452 115977 1225262 2099466
15724 2099466 2613795 2849504 3021645 3316550 3757323 4224410 4602372 4864663 5051364
15715 5051364 5216080 5322457 5237451 4918794 4504658 4176617 4023795 4071735 4328808 4703716
15705 4703716 5008708 5162951 5296008 5596755 6133808 6822207 7473634 7898698 8026339
15696 8026339 7918889 7701442 7498573 7378531 7305091 7151930 6802610 6297105 5871011 5726010
15686 5726010 5804823 5903962 5908557 5859406 5877062 6027979 6241948 6370962 6300733 6036278 5714134
$$ packed form
15752a782663L5508K30758L29066M62927O89646R39763J057368R17089N71500
15743C450962J84323j73985m80917o36720n61902l28531j00999M034p0764l20833
15733I64668o14518p71943p11249m37454L7885O13159J035429J109285Q74204
15724B099466N14329K35709J72141K94905M40773M67087L77962K62291J86701
15715E051364J64716J06377q5006l18657m14136l28041j52822M7940K57073L74908
15705D703716L04992J54243J33057L00747N37053O88399O51427M25064J27641
15696H026339j07450k17447k02869j20042p3440j53161l49320n05505m26094j45001
15686E726010P8813R9139M595m9151J7656J50917K13969J29014p0229k64455l22144
$$ plain form
15675 5714134 5491322 5400075 5322188 5121148 4766961 4347293 3997419 3808462 3770583 3800640
15665 3800640 3861662 3973686 4100476 4134441 3968861 3547294 2933045 2320768 1871100 1564634
15655 1564634 1255957 809981 143251 -783914 -1912516 -3056154 -4016216 -4732077 -5234575
15646 -5234575 -5492710 -5403676 -4913554 -4096765 -3133455 -2255943 -1676810 -1484104 -1595307 -1869544
15636 -1869544 -2233010 -2669622 -3161967 -3659934 -4089925 -4371502 -4432624 -4249374 -3869675 -3380182
15626 -3380182 -2835461 -2226391 -1534134 -772277 37434 888218 1783616 2711881 3621323
15617 3621323 4445072 5153605 5746784 6190591 6416635 6374348 6021079 5322992 4326491 3183512
15607 3183512 2068587 1099470 328623 -299602 -934926 -1661244 -2416322 -3063437 -3468731
$$ packed form
15675E714134k22812r1247p7887k01040l54187m19668l49874j88957l7879L0057
15665C800640O1022J12024J26790L3965j65580m21567o14249o12277m49668l06466
15655A564634l08677m45976o66730r27165j128602j143638r60062p15861n02498
15646e234575k58135Q9034M90122Q16789R63310Q77512N79133J92706j11203k74237
15636a869544l63466m36612m92345m97967m29991k81577o1122J83250L79699M89493
15626c380182N44721O09070O92257P61857Q09711Q50784Q95398R28265R09442
15617C621323Q23749P08533N93179M43807K26044m2287l53269o98087r96501j142979
15607C183512j114925r69117p70847o28225o35324p26318p55078o47115m05294
$$ plain form
15598 -3468731 -3527984 -3181027 -2450224 -1500959 -585047 175273 886496 1709006 2625193 3410184
15588 3410184 3831890 3827900 3498804 3043726 2692435 2610366 2811337 3112217 3229977 3018991
15578 3018991 2568233 2044402 1550213 1147759 880266 717726 560430 350442 110570
15569 110570 -202670 -756735 -1708848 -3116426 -4863260 -6600577 -7901271 -8529102 -8540110
15560 -8540110 -8170864 -7653802 -7114203 -6586787 -6061580 -5510404 -4900083 -4223547 -3575812
15551 -3575812 -3176431 -3212592 -3653166 -4242209 -4653657 -4704908 -4438193 -3993974 -3471137 -2910811
15541 -2910811 -2354515 -1865814 -1451254 -999543 -387196 362878 1087340 1631836 1940728
15532 1940728 2017700 1909908 1712820 1486182 1205122 839531 440665 136181 72278 354642
$$ packed form
15598c468731n9253L46957P30803R49265R15912P60320P11223Q22510R16187P84991
15588C410184M21706l990l29096m55078l51291q2069K00971L00880J17760k10986
15578C018991m50758n23831m94189m02454k67493j62540j57296k09988k39872
15569A10570l13240n54065r52113j407578j746834j737317j300694o27831j1008
15560h540110L69246N17062N39599N27416N25207N51176O10321O76536O47735
15551c575812L99381l6161m40574n89043m11448n1251K66715M44219N22837N60326
15541b910811N56296M88701M14560M51711O12347P50074P24462N44496L08892
15532A940728P6972j07792j97088k26638k81060l65591l98866l04484o3903K82364
$$ plain form
15522 354642 966608 1715898 2343147 2705598 2831132 2852569 2904333 2995429 2982896 2691146
15512 2691146 2057214 1181558 265652 -515342 -1130451 -1678880 -2267770 -2916376 -3549459
15503 -3549459 -4073360 -4432612 -4596919 -4540004 -4254480 -3774686 -3183126 -2652069 -2439257 -2676617
15493 -2676617 -3195749 -3658284 -3730367 -3144658 -1793293 168717 2336281 4233851 5593437
15484 5593437 6469372 7046161 7425081 7636083 7739930 7828095 7912094 7887124 7674382 7357558
15474 7357558 7101488 6929510 6689058 6240041 5574010 4766061 3881973 2949918 1991688
15465 1991688 1039480 139050 -644330 -1266281 -1737035 -2033178 -2040438 -1700330 -1167693 -761769
15455 -761769 -775982 -1283255 -2110264 -3026893 -3872604 -4506639 -4764935 -4530078 -3836097 -2906230
$$ packed form
15522C54642O11966P49290O27249L62451J25534K1437N1764R1096j2533k91750
15512B691146o33932q75656r15906p80994o15109n48429n88890o48606o33083
15503c549459n23901l59252j64307N6915K85524M79794N91560N31057K12812k37360
15493b676617n19132m62535p2083N85709J351365J962010K167564J897570J359586
15484E593437Q75935N76789L78920K11002J03847Q8165Q3999k4970k12742l16824
15474G357558k56070j71978k40452m49017o66031q07949q84088r32055r58230
15465A991688r52208r00430p83380o21951m70754k96143p260L40108N32637M05924
15455g61769j4213n07273q27009r16629q45711o34035k58296K34857O93981R29867
$$ plain form
15445 -2906230 -2053689 -1442447 -974054 -484609 44844 523949 895929 1189900 1393856
15436 1393856 1319028 758064 -206277 -1187066 -1799210 -1928567 -1726886 -1425544 -1189056 -1037739
15426 -1037739 -845308 -486792 -23883 339339 449063 254962 -212102 -825753 -1430549
15417 -1430549 -1939604 -2323613 -2549013 -2572472 -2367002 -1921581 -1261146 -475194 290316 922068
15407 922068 1450568 1973205 2504191 2983520 3321283 3394146 3103410 2499551 1793813 1162016
15397 1162016 608078 79947 -397822 -745162 -876373 -757911 -509019 -340663 -348746 -480585
15387 -480585 -659398 -836189 -956040 -952400 -802772 -568362 -336153 -127026 93811 285346
15377 285346 215499 -414614 -1653720 -3223810 -4801323 -6250663 -7573542 -8750544 -9734932
$$ packed form
15445b906230Q52541O11242M68393M89445N29453M79105L71980K93971K03956
15436A393856p4828n60964r64341r80789o12144j29357K01681L01342K36488J51317
15426a037739J92431L58516M62909L63222J09724j94101m67064o13651o04796
15417a430549n09055l84009k25400k3459K05470M45421O60435P85952P65510O31752
15407I22068N28500N22637N30986M79329L37763P2863k90736o03859p05738o31797
15397A162016n53938n28131m77769l47340j31211J18462K48892J68356q083j31839
15387d80585j78813j76791j19851L640J49628K34410K32209K09127K20837J91535
15377B85346o9847o30113j239106j570090j577513j449340j322879j177002r84388
$$ plain form
15368 -9734932 -10528429 -11124073 -11472354 -11560546 -11435501 -11161866 -10767954 -10220711 -9461142 -8488916
15358 -8488916 -7432490 -6499533 -5842197 -5465303 -5236059 -5008165 -4763035 -4588735 -4533797
15349 -4533797 -4555566 -4600217 -4706491 -4998897 -5559139 -6316744 -7079042 -7699366 -8202456 -8698693
15339 -8698693 -9221012 -9721155 -10137896 -10409341 -10479088 -10306455 -9893789 -9340007 -8799832 -8384401
15329 -8384401 -8157655 -8164463 -8372547 -8593854 -8530099 -7942574 -6798302 -5295204 -3779898
15320 -3779898 -2623992 -2102609 -2272361 -2938083 -3803140 -4650000 -5339180 -5730491 -5734307 -5396450
15310 -5396450 -4859030 -4231882 -3517478 -2685444 -1816872 -1100958 -655387 -423655 -263350
15301 -263350 -52563 268801 651767 944188 999278 750296 214408 -464723 -1022730 -1242734
$$ packed form
15368i734932p93497n95644l48281q8192J25045K73635L93912N47243P59569R72226
15358h488916J056426R32957O57336L76894K29244K27894K45130J74300N4938
15349d533797k1769m4651j06274k92406n60242p57605p62298o20324n03090m96237
15339h698693n22319n00143m16741k71445o9747J72633M12666N53782N40175M15431
15329h384401K26746o808k08084k21307O3755N87525J144272J503098J515306
15320c779898J155906N21383j69752o65722q65057q46860o89180l91311l816L37857
15310e396450N37420O27148P14404Q32034Q68572P15914M45571K31732J60305
15301b63350K10787L21364L82966K92421N5090k48982n35888o79131n58007k20004
$$ plain form
15291 -1242734 -1134652 -905824 -757149 -762679 -919960 -1214015 -1614013 -2075975 -2544980 -2926899
15281 -2926899 -3100331 -2978661 -2544653 -1876886 -1173320 -650579 -362419 -161202 121928
15272 121928 484985 752823 745557 459114 76386 -209074 -374819 -578773 -989310 -1592694
15262 -1592694 -2200917 -2615483 -2710880 -2429909 -1783273 -854656 215233 1302813 2345006
15253 2345006 3275525 3959231 4222385 3992425 3403847 2746757 2322625 2272958 2492395 2751780
15243 2751780 2913984 3004480 3126229 3362031 3705882 4050729 4276815 4358502 4360351 4344781
15233 4344781 4303306 4170620 3899905 3519869 3105639 2714795 2368977 2047759 1681948 1217183
15223 1217183 708820 318257 208413 421324 855107 1345286 1690031 1672891 1195365 391959
$$ packed form
15291a242734J08082K28828J48675n530j57281k94055l99998m61962m69005l81919
15281b926899j73432J21670M34008O67767P03566N22741K88160K01217K83130
15272A21928L63057K67838p266k86443l82728k85460j65745k03954m10537o03384
15262a592694o08223m14566r5397K80971O46636R28617J069889J087580J042193
15253B345006R30519O83706K63154k29960n88578o57090m24132m9667K19437K59385
15243B751780J62204R0496J21749K35802L43851L44847K26086Q1687J849j5570
15233D344781m1475j32686k70715l80036m14230l90844l45818l21218l65811m64765
15223A217183n08363l90563j09844K12911M33783M90179L44745j7140m77526q03406
$$ plain form
15213 391959 -375937 -685660 -312279 659078 1913503 3040458 3674227 3600626 2779889
15204 2779889 1352214 -353589 -1925797 -3049983 -3609300 -3692794 -3548825 -3449558 -3503652
15195 -3503652 -3590184 -3491175 -3068378 -2316807 -1352672 -382497 404337 946857 1317685 1617426
15185 1617426 1876914 2033581 1979157 1650626 1071255 306207 -561557 -1399914 -2069846 -2474839
15175 -2474839 -2556781 -2366941 -2105956 -1978747 -2081966 -2425953 -2915608 -3344359 -3441203 -2947881
15165 -2947881 -1812749 -318326 1106206 2163477 2730149 2785019 2404875 1744642 982321
15156 982321 291524 -158073 -262842 -88357 163627 306513 231891 -148943 -896082 -1933112
15146 -1933112 -3028881 -3941373 -4576471 -5006481 -5311030 -5436595 -5263725 -4757874 -4034094
$$ packed form
15213C91959p67896l09723L73381R71357J254425J126955O33769p3601q20737
15204B779889j427675j705803j572208j124186n59317q3494J43969R9267n4094
15195c503652q6532R9009M22797P51571R64135R70175P86834N42520L70828K99741
15185A617426K59488J56667n4424l28531n79371p65048q67764q38357o69932m04993
15175b474839q1942J89840K60985J27209j03219l43987m89655m28751r6844M93322
15165b947881J135132J494423J424532J057271N66672N4870l80144o60233p62321
15156I82321o90797m49597j04769J74485K51984J42886p4622l80834p47139j037030
15146a933112j095769r12492o35098m30010l04549j25565J72870N05851P23780
$$ plain form
15137 -4034094 -3335611 -2910725 -2794103 -2751847 -2531139 -2101694 -1612648 -1199227 -883499 -612266
15127 -612266 -335082 -68333 115163 180674 180340 213394 384439 763272 1346572 2097297
15117 2097297 3010037 4097742 5285166 6357950 7083682 7360500 7213091 6693896 5860244
15108 5860244 4825542 3761344 2819336 2054328 1417471 820389 212102 -414253 -1016199
15099 -1016199 -1458553 -1583134 -1374548 -1003763 -689187 -523006 -447395 -380827 -305415 -231884
15089 -231884 -152244 -76384 -48860 -96098 -228382 -435976 -640436 -714256 -546417 -125416
15079 -125416 411316 869370 1135860 1219094 1206707 1211356 1334485 1623664 2039614 2493850
15069 2493850 2889180 3148057 3262942 3285202 3231604 3047388 2683885 2169645 1557739 855998
$$ packed form
15137d034094O98483M24886J16622M2256K20708M29445M89046M13421L15728K71233
15127f12266K77184K66749J83496O5511l34L3054J71045L78833N83300P50725
15117B097297R12740J087705J187424J072784P25732K76818j47409n19195q33652
15108E860244j034702j064198r42008p65008o36857n97082o08287o26355o01946
15099a016199m42354j24581K08586L70785L14576J66181P5611O6568P5412P3531
15089b31884P9640P5860K7524m7238j32284k07594k04460p3820J67839M21001
15079a25416N36732M58054K66490Q3234j2387M649J23129K89179M15950M54236
15069B493850L95330K58877J14885K2260n3598j84216l63503n14240o11906p01741
$$ plain form
15059 855998 91800 -622691 -1130673 -1355099 -1416673 -1578870 -2039224 -2758187 -3429895 -3646156
15049 -3646156 -3205297 -2259195 -1181224 -314561 215681 490811 678619 954498 1449546
15040 1449546 2187085 3058013 3875680 4465705 4739895 4739793 4583304 4335169 3980634 3497322
15030 3497322 2929353 2392356 1944018 1523673 1094352 694336 302659 -197572 -909341
15021 -909341 -1869555 -3052850 -4349524 -5550713 -6358506 -6516127 -6000171 -5040936 -3937270
15012 -3937270 -2895426 -1991282 -1156776 -246202 776344 1728561 2311889 2325104 1811127
15003 1811127 1035498 332928 -85391 -225739 -222864 -163901 -33507 194484 464987 625957
14993 625957 554112 313763 112631 104606 285125 572684 947183 1446894 2043719 2625229
$$ packed form
15059H55998p64198p14491n07982k24426o1574j62197m60354p18963o71708k16261
15049c646156M40859R46102J077971Q66663N30242K75130J87808K75879M95048
15040A449546P37539Q70928Q17667N90025K74190j02j56489k48135l54535m83312
15030C497322n67969n36997m48338m20345m29321m00016l91677n00231p11769
15021i09341r60214j183295j296674j201189q07793j57621N15956R59235J103666
15012c937270J041844R04144Q34506R10574J022546R52217N83328J3215n13977
15003A811127p75629p02570m18319j40348K875N8963J30394K27991K70503J60970
14993F25957p1845k40349k01132q025J80519K87559L74499M99711N96825N81510
$$ plain form
14983 2625229 3100245 3439219 3626709 3611135 3283684 2583128 1668131 895329 605962 952939
14973 952939 1874462 3163168 4547971 5768016 6660611 7183035 7366094 7312274 7190794
14964 7190794 7155129 7255000 7431829 7580653 7579949 7271444 6529586 5420688 4220067 3246301
14954 3246301 2695545 2556691 2593569 2463851 1939429 1039291 40812 -613605 -584668 105270
14944 105270 1128327 2092550 2675803 2683262 2102580 1128766 87206 -771005 -1379354 -1750674
14934 -1750674 -1857893 -1641583 -1124401 -461433 198183 833708 1474675 2096618 2648609
14925 2648609 3076014 3278639 3136694 2619345 1857686 1118584 670307 589034 718765 853506
14915 853506 908445 930142 1004661 1157121 1358628 1620166 2002477 2519391 3091937 3591377
$$ packed form
14983B625229M75016L38974J87490j5574l27451p00556r14997p72802k89367L46977
14973I52939R21523J288706J384803J220045Q92595N22424J83059n3820j21480
14964G190794l5665R9871J76829J48824p04l08505p41858j108898j200621r73766
14954C246301n50756j38854L6878j29718n24422r00138r98479o54417K8937O89938
14944A05270J023057R64223N83253P459n80682r73814j041560q58211o08349l71320
14934a750674j07219K16310N17182O62968O59616O35525O40967O21943N51991
14925B648609M27405K02625j41945n17349p61659p39102m48277q1273J29731J34741
14915H53506N4939K1697P4519J52460K01507K61538L82311N16914N72546M99440
$$ plain form
14905 3591377 3853818 3694353 3007452 1835056 331083 -1316640 -2922496 -4316503 -5431903
14896 -5431903 -6315789 -6999669 -7441026 -7597326 -7456562 -6982836 -6112660 -4800059 -3096952
14887 -3096952 -1284319 149626 790931 569387 -256141 -1323722 -2343434 -3145523 -3660953
14878 -3660953 -3851815 -3712336 -3346225 -2916354 -2502079 -2109372 -1798537 -1748258 -2161559 -3077881
14868 -3077881 -4299767 -5481452 -6274471 -6461186 -6066169 -5357846 -4643265 -4045026 -3489535
14859 -3489535 -2830228 -1997170 -1087318 -341945 -232 -74478 -293739 -321134 60 589838
14849 589838 1242656 1736852 1875648 1551071 834854 -11911 -704175 -1162203 -1529621 -1950242
14839 -1950242 -2410884 -2786713 -2933365 -2741293 -2158522 -1196217 48054 1362966 2432495
$$ packed form
14905C591377K62441j59465o86901j172396j503973j647723j605856j394007j115400
14896e431903q83886o83880m41357j56300J40764M73726Q70176J312601J703107
14887c096952J812633J433945O41305k21544q25528j067581j019712q02089n15430
14878c660953j90862J39479L66111M29871M14275L92707L10835N0279m13301r16322
14868c077881j221886j181685p93019j86715L95017P08323P14581N98239N55491
14859c489535O59307Q33058R09852P45373L41713p4246k19261k7395L21194N89778
14849E89838O52818M94196J38796l24577p16217q46765o92264m58028l67418m20621
14839a950242m60642l75829j46652J92072N82771R62305J244271J314912J069529
$$ plain form
14830 2432495 2981140 2963777 2543913 1922048 1240768 608936 130651 -119820 -122367 102272
14820 102272 489835 911891 1243502 1407477 1348654 1059032 609918 156749 -97470 -63902
14810 -63902 109843 177205 9632 -351668 -783164 -1159570 -1346596 -1211268 -732962 -92780
14800 -92780 419636 635406 614382 537461 518362 516032 417660 155905 -250145 -683089 -1000181
14789 -1000181 -1178227 -1320215 -1515461 -1715582 -1699087 -1180486 -61613 1421180 2861224
14780 2861224 3964441 4666956 5082427 5398178 5760664 6196667 6629538 6921945 6942195
14771 6942195 6675997 6237667 5746182 5264461 4877939 4709654 4807842 5059840 5218318 5020410
14761 5020410 4322968 3164077 1763908 467076 -460940 -1054924 -1579550 -2184826 -2725045
$$ packed form
14830B432495N48645j7363m19864o21865o81280o31832m78285k50471k547K24639
14820A02272L87563M22056L31611J63975n8823k89622m49114m53169k54219L3568
14810f3902J73745O7362j67573l61300m31496l76406j87026J35328M78306O40182
14800i2780N12416K15770k1024p6921j9099k330r8372k61755m06050m32944l17092
14789a000181j78046j41988j95246k00121J6495N18601J118873J482793J440044
14780B861224J103217P02515M15471L15751L62486M36003M32871K92407K0250
14771F942195k66198m38330m91485m81721l86522j68285R8188K51998J58478j97908
14761E020410o97442j158891j400169j296832r28016n93984n24626o05276n40219
$$ plain form
14752 -2725045 -2940214 -2682252 -1957616 -915480 170077 1032499 1555145 1775274 1802239
14743 1802239 1716954 1510404 1137984 623940 39196 -594138 -1284286 -2003494 -2664133 -3143597
14733 -3143597 -3374852 -3403138 -3326170 -3234567 -3247310 -3506791 -4095478 -4988947 -6042224 -7038295
14723 -7038295 -7786288 -8169120 -8158727 -7800564 -7160349 -6324672 -5413491 -4528213 -3710276 -2939213
14713 -2939213 -2119658 -1134202 8439 1122895 1975791 2463892 2651368 2625550 2390241
14704 2390241 1944112 1368778 826950 495842 450243 663811 1087356 1644737 2231946 2745378
14694 2745378 3108326 3327955 3523847 3837195 4268720 4651604 4799582 4649463 4305795
14685 4305795 3963759 3793053 3879579 4203331 4650609 5082064 5429013 5734845 6057668 6305345
$$ packed form
14752b725045k15169K57962P24636J042136J085557Q62422N22646K20129K6965
14743A802239q5285k06550l72420n14044n84744o33334o90148p19208o60639m79464
14733c143597k31255k8286P6968R1603j2743k59481n88687q93469j053277r96071
14723g038295p47993l82832J0393L58163O40215Q35677R11181Q85278Q17937P71063
14713b939213Q19555R85456J142641J114456Q52896M88101J87476k5818k35309
14704B390241m46129n75334n41828l31108m5599K13568M23545N57381N87209N13432
14694B745378L62948K19629J95892L13348M31525L82884J47978j50119l43668
14685D305795l42036j70706Q6526L23752M47278M31455L46949L05832L22823K47677
$$ plain form
14675 6305345 6243769 5719903 4802135 3679472 2515258 1431218 535551 -88458 -375307
14666 -375307 -272024 203314 907290 1617444 2124280 2286523 2038973 1371984 385642 -624534
14656 -624534 -1250153 -1239421 -662316 228486 1215246 2182650 3076004 3846897 4458936 4939696
14646 4939696 5352648 5726661 6065146 6350575 6506813 6428977 6050860 5370997 4460556 3482775
14636 3482775 2648624 2087110 1767939 1556982 1316082 980066 578812 152180 -322082
14627 -322082 -849023 -1316387 -1556220 -1511414 -1286643 -1021996 -766399 -480106 -157001 83330
14617 83330 138922 108172 192507 488634 937581 1372843 1594877 1509234 1219625 947338
14607 947338 859557 984401 1268177 1624563 1921092 2053826 2013300 1770271 1168003 70486
$$ packed form
14675F305345o1576n23866r17768j122663j164214j084040q95667o24009k86849
14666c75307J03283M75338P03976P10154N06836J62243k47550o66989r86342j010176
14656f24534o25619J0732N77105Q90802R86760R67404Q93354P70893O12039M80760
14646D939696M12952L74013L38485K85429J56238p7836l78117o79863r10441r77781
14636C482775q34151n61514l19171k10957k40900l36016m01254m26632m74262
14627c22082n26941m67364k39833M4806K24771K64647K55597K86293L23105K40331
14617H3330N5592l0750Q4335K96127M48947M35262K22034q5643k89609k72287
14607I47338q7781J24844K83776L56386K96529J32734m0526k43029o02268j097517
$$ plain form
14597 70486 -1418640 -3004853 -4443688 -5617329 -6413297 -6728621 -6607740 -6245429 -5871953
14588 -5871953 -5647274 -5584059 -5573557 -5502906 -5312080 -4950942 -4347473 -3449593 -2289125 -1015533
14578 -1015533 154929 1065454 1670556 1968330 1937253 1591151 1077632 660975 565146 844780
14568 844780 1434297 2232230 3082751 3805586 4270077 4382151 4078663 3384042 2428363 1425233
14558 1425233 609165 109242 -116312 -238103 -450785 -861266 -1478477 -2274414 -3170559
14549 -3170559 -4040541 -4781517 -5306104 -5535777 -5448610 -5093720 -4603893 -4132559 -3707384 -3261801
14539 -3261801 -2782210 -2271053 -1630221 -711073 521843 1912632 3230023 4351309 5267487
14530 5267487 5943075 6279916 6232370 5904352 5529120 5333918 5405144 5698500 6120404 6524952
$$ packed form
14597G0486j489126j586213j438835j173641p95968l15324J20881L62311L73476
14588e871953K24679O3215J0502P0651J90826L61138O03469Q97880J160468J273592
14578a015533J170462R10525O05102K97774l1077l46102n13519m16657r5829K79634
14568H44780N89517P97933Q50521P22835M64491J12074l03488o94621r55679j003130
14558A425233q16068m99923k25554j21791k12682m10481o17211p95937q96145
14549c170559q69982p40976n24587k29673Q7167L54890M89827M71334M25175M45583
14539c261801M79591N11157O40832R19148J232916J390789J317391J121286R16178
14530E267487O75588L36841m7546l28018l75232j95202P1226K93356M21904M04548
$$ plain form
14520 6524952 6713325 6549590 6048657 5349838 4671119 4222649 4069259 4089102 4065576 3844206
14510 3844206 3473229 3204597 3304906 3809187 4460555 4902902 4906009 4470444 3783692 3050380
14500 3050380 2333963 1586153 783360 -51101 -858438 -1528166 -1962051 -2168768 -2252927 -2331654
14490 -2331654 -2471112 -2611486 -2571967 -2239904 -1697776 -1151917 -812050 -783482 -995843 -1229323
14480 -1229323 -1252598 -957942 -367230 411302 1212268 1856664 2221809 2335617 2329012 2210570
14470 2210570 1822595 1090648 196404 -505146 -707289 -367455 295794 1046368 1793731
14461 1793731 2514401 3136170 3553847 3749821 3870771 4116255 4569571 5170646 5839678
14452 5839678 6572792 7352359 8079157 8690899 9239910 9785881 10292671 10668678 10820980
$$ packed form
14520F524952J88373j63735n00933o98819o78719m48470j53390J9843k3526k21370
14510C844206l70977k68632J00309N04281O51368M42347L107m35565o86752p33312
14500C050380p16417p47810q02793q34461q07337o69728m33885k06717q4159p8727
14490b331654j39458j40374L9519L32063N42128N45859L39867K8568k12361k33480
14480a229323k3275K94656N90712P78532Q00966O44396L65145J13808o605j18442
14470B210570l87975p31947q94244p01550k02143L39834O63249P50574P47363
14461A793731P20670O21769M17677J95974J20950K45484M53316O01075O69032
14452E839678P33114P79567P26798O11742N49011N45971N06790L76007J52302
$$ plain form
14443 10820980 10648561 10088906 9161387 7948313 6603646 5328093 4261373 3430148 2809800
14434 2809800 2368855 2073451 1938339 2019126 2288851 2593345 2738447 2582883 2082680 1301828
14424 1301828 407664 -394104 -977419 -1343658 -1564392 -1721510 -1901503 -2159452 -2477733
14415 -2477733 -2821936 -3168686 -3439776 -3518763 -3388203 -3170690 -2985176 -2854792 -2759788 -2660805
14405 -2660805 -2501002 -2262529 -1992531 -1799005 -1805166 -2023786 -2296792 -2422290 -2331301 -2117774
14395 -2117774 -1957230 -1992405 -2207489 -2423353 -2429989 -2107539 -1475101 -668146 107028 637493
14385 637493 827383 747316 540762 347379 271862 296349 240142 -97331 -783384 -1747670
14375 -1747670 -2872456 -4047772 -5130226 -5930054 -6278231 -6068972 -5258518 -3889793 -2132276
$$ packed form
14443A0820980j72419n59655r27519j213074j344667j275553j066720q31225o20348
14434B809800m40945k95404j35112Q0787K69725L04494J45102j55564n00203p80852
14424A301828q94164q01768n83315l66239k20734j57118j79993k57949l18281
14415b477733l44203l46750k71090p8987J30560K17513J85514J30384R5004R8983
14405b660805J59803K38473K69998J93526o161k18620k73006j25498R0989K13527
14395b117774J60544l5175k15084k15864o636L22450O32438Q06955P75174N30465
14385F37493J89890q0067k06554j93383p5517K4487n6207l37473o86053r64286
14375a747670j124786j175316j082454p99828l48177K09259Q10454J368725J757517
$$ plain form
14366 -2132276 -243230 1591537 3378009 5202179 7063101 8899436 10691069 12430640
14358 12430640 14029454 15326515 16205670 16686500 16888905 16925487 16830178 16598258 16293032
14349 16293032 16013640 15756571 15430194 15008822 14604494 14376445 14359719 14397723 14261907 13817832
14339 13817832 13136271 12477905 12095844 12006598 11979012 11741460 11179342 10394277 9622659 9103978
14329 9103978 8973400 9181381 9523616 9786864 9843342 9611823 9066739 8343285 7711267 7385731
14319 7385731 7377092 7499651 7519256 7297047 6812686 6131988 5390370 4748529 4318697 4132452
14309 4132452 4155035 4301891 4445508 4445185 4186744 3597642 2659360 1432195 108227 -1013136
14299 -1013136 -1695246 -1871096 -1563874 -798847 376509 1866240 3536436 5185494 6562273
$$ packed form
14366b132276J889046J834767J786472J824170J860922J836335J791633J739571
14358A2430640J598814J297061Q79155M80830K02405L6582r5309k31920l05226
14349A6293032k79392k57069l26377m21372m04328k28049j6726L8004j35816m44075
14339A3817832o81561o58366l82061q9246k7586k37552n62118p85065p71618n18681
14329I103978j30578K07981L42235K63248N6478k31519n45084p23454o32018l25536
14319G385731q639J22559J9605k22209m84361o80698p41618o41841m29832j86245
14309D132452K2583J46856J43617l23k58441n89102r38282j227165j323968j121363
14299a013136o82110j75850L07222P65027J175356J489731J670196J649058J376779
$$ plain form
14290 6562273 7507503 8038049 8249596 8169080 7769422 7099387 6306491 5527575 4846746 4382973
14280 4382973 4276000 4515323 4888941 5141379 5135445 4854987 4358112 3819356 3486066 3470489
14270 3470489 3650874 3830757 3969643 4209781 4688882 5391692 6128502 6607274 6648590 6368047
14260 6368047 6048002 5857593 5743787 5535383 5144818 4658001 4191788 3730415 3180389
14251 3180389 2529126 1850209 1219191 694587 349026 259043 452067 881605 1425968 1947889
14241 1947889 2405928 2855082 3319418 3712835 3913684 3922937 3909950 4109869 4683488 5585603
14231 5585603 6552905 7277866 7600520 7555714 7260227 6785343 6197225 5646821 5324054 5358100
14221 5358100 5766379 6479165 7398854 8381518 9182256 9527036 9290731 8550283 7480865
$$ packed form
14290F562273R45230N30546K11547q0516l99658o70035p92896p78916o80829m63773
14280D382973j06973K39323L73618K52438n934k80458m96875n38756l33290j5577
14270C470489J80385J79883J38886K40138M79101P02810P36810M78772M1316k80543
14260F368047l20045j90409j13806k08404l90565m86817m66213m61373n50026
14251C180389o51263o78917o31018n24604l45561q9983J93024M29538N44363N21921
14241A947889M58039M49154M64336L93417K00849R253j2987J99919N73619R02115
14231E585603R67302P24961L22654m4806k95487m74884n88118n50404l22767L4046
14221E358100M08279P12786R19689R82664Q00738L44780k36305p40448j069418
$$ plain form
14212 7480865 6303337 5258536 4529885 4190823 4215353 4545563 5128320 5882109 6701656
14203 6701656 7503556 8226312 8792718 9119253 9198553 9131935 9067088 9168426 9585856 10357297
14193 10357297 11359338 12356635 13100595 13430519 13317868 12865916 12245061 11562279 10815842
14184 10815842 9927413 8820691 7559594 6365717 5454008 4866445 4455602 4037534 3575191
14175 3575191 3192587 3020589 3033140 3012135 2708585 2051435 1194288 438524 111994 399576
14165 399576 1241508 2372571 3447424 4219870 4662113 4914015 5131695 5393638 5729988
14156 5729988 6193643 6845063 7660013 8521143 9314372 9979883 10477565 10775212 10881159
14147 10881159 10830001 10659089 10445409 10270648 10117357 9881468 9509330 9041249 8509077
$$ packed form
14212G480865j177528j044801p28651l39062K4530L30210N82757P53789Q19547
14203F701656Q01900P22756N66406L26535P9300o6618o4847J01338M17430P71441
14193A0357297J002041R97297P43960L29924j12651m51952o20855o82782p46437
14184A0815842q88429j106722j261097j193877r11709n87563m10843m18068m62343
14175C575191l82604j71998J2551k1005l03550o57150q57147p55764l26530K87582
14165C99576Q41932J131063J074853P72446M42243K51902K17680K61943L36350
14156E729988M63655O51420Q14950Q61130P93229O65511M97682K97647J05947
14147A0881159n1158j70912k13680j74761j53291k35889l72138m68081n32172
$$ plain form
14138 8509077 7893910 7190276 6484815 5913191 5509638 5169467 4745034 4129224 3312817
14129 3312817 2406658 1583751 987615 680337 643472 827837 1196007 1703063 2289905 2875600
14119 2875600 3345812 3638529 3854875 4196699 4803111 5713600 6887526 8187373 9412992
14110 9412992 10365476 10912263 11098738 11180430 11425976 11899363 12463848 12917599 13091334 12882667
14100 12882667 12279629 11392188 10417208 9485854 8570854 7621158 6735328 6130579 5983881
14091 5983881 6356085 7211689 8400888 9657486 10703560 11388054 11722572 11776038 11556053
14082 11556053 11009947 10141600 9130439 8287089 7832691 7741809 7817836 7871728 7839120 7785964
14072 7785964 7821515 7991745 8191083 8188585 7806339 7079157 6230921 5514307 5067080 4875670
$$ packed form
14138H509077o15167p03634p05461n71624m03553l40171m24433o15810q16407
14129C312817r06159q22907n96136l07278l6865J84365L68170N07056N86842N85695
14119B875600M70212K92717K16346L41824O06412R10489J173926J299847J225619
14110I412992R52484N46787J86475Q1692K45546M73387N64485M53751J73735k08667
14100A2882667o03038q87441r74980r31354r15000r49696q85830o04749j46698
14091E983881L72204Q55604J189199J256598J046074O84494L34518N3466k19985
14082A1556053n46106q68347j011161q43350m54398r0882P6027N3892l2608n3156
14072G785964L5551J70230J99338k498l82246p27182q48236p16614m47227j91410
$$ plain form
14062 4875670 4842176 4843381 4743784 4446636 3980987 3527111 3302794 3427346 3906005 4681066
14052 4681066 5666927 6720869 7629262 8190334 8320681 8101321 7718182 7356695 7150198
14043 7150198 7159532 7376601 7786608 8382154 9072504 9696486 10179646 10598520 11081837 11672910
14033 11672910 12298125 12844262 13245317 13513704 13696482 13808778 13837021 13756485 13501738 13006653
14023 13006653 12261432 11310811 10261450 9258055 8407386 7740326 7243343 6857595 6449666
14014 6449666 5854537 5008178 4077844 3398616 3218506 3530121 4177931 5053062 6097407
14005 6097407 7195343 8201421 9039633 9678684 10094878 10325622 10472250 10633975 10846104
13996 10846104 11030114 11038601 10812385 10463618 10152992 9929814 9744439 9576546 9498782 9592751
$$ packed form
14062D875670l3494J205r9597k97148m65649m53876k24317J24552M78659P75061
14052D681066R85861J053942R08393N61072J30347k19360l83139l61487k06497
14043G150198R334K17069M10007N95546O90350O23982M83160M18874M83317N91073
14033A1672910O25215N46137M01055K68387J82778J12296K8243q0536k54747m95085
14023A3006653p45221r50621j049361j003395q50669o67060m96983l85748m07929
14014F449666n95129q46359r30334o79228j80110L11615O47810Q75131J044345
14005F097407J097936J006078Q38212O39051M16194K30744J46628J61725K12129
13996A0846104J84010Q487k26216l48767l10626k23178j85375j67893p7764R3969
$$ plain form
13986 9592751 9805839 9960782 9927546 9741021 9559403 9516988 9592260 9638760 9554052 9351559
13976 9351559 9083993 8767023 8381733 7935248 7519965 7289799 7339997 7636711 8106292 8744510
13966 8744510 9576334 10540592 11477462 12207763 12590589 12558961 12142181 11432819 10550139 9619438
13956 9619438 8738830 8013164 7588779 7579233 7984176 8682403 9514751 10407068 11389340 12479877
13946 12479877 13629039 14797554 15973088 17082983 18008369 18715262 19262678 19668213 19858276
13937 19858276 19773603 19459889 19039890 18635887 18336528 18204504 18249579 18360734 18307702 17888007
13927 17888007 17123457 16268615 15588209 15162399 14905477 14725814 14637354 14726531 14999627 15314688
13917 15314688 15526277 15620365 15673685 15725067 15727627 15663760 15630100 15713125 15868407 15967426 15867629
$$ packed form
13986I592751K13088J54943l3236j86525j81618m2415P5272M6500q4708k02493
13976I351559k67566l16970l85290m46485m15283k30166N0198K96714M69581O38218
13966H744510Q31824R64258R36870P30301L82826l1628m16780p09362q82680r30701
13956I619438q80608p25666m24385r546M04943O98227Q32348Q92317R82272J090537
13946A2479877J149162J168515J175534J109895R25386P06893N47416M05535J90063
13937A9858276q4673l13714m19999m04003k99359j32024M5075J11155n3032m19695
13927A7888007p64550q54842o80406m25810k56922j79663q8460Q9177K73096L15061
13917A5314688K11589R4088N3320N1382K560o3867l3660Q3025J55282R9019r9797
$$ plain form
13906 15867629 15477978 14843208 14132609 13514686 13060922 12718737 12351059 11891875 11465010
13897 11465010 11257758 11329183 11598120 11898230 12040902 11926218 11591327 11126458 10625611
13888 10625611 10223582 10063664 10208383 10603075 11082004 11418388 11449959 11195113 10832024
13879 10832024 10577870 10574744 10842725 11342868 12058420 12993198 14128973 15372391 16552860
13870 16552860 17500802 18081300 18191260 17818392 17067451 16114380 15201676 14607119 14487909
13861 14487909 14754605 15169547 15522695 15701066 15708296 15659968 15670676 15709311 15665191 15537782
13851 15537782 15435497 15427158 15508500 15720121 16169949 16885748 17743392 18555917 19206748 19703747
13841 19703747 20124700 20542446 20983878 21411393 21729840 21820386 21581499 21013983 20298461
$$ packed form
13906A5867629l89651o34770p10599o17923m53764l42185l67678m59184m26865
13897A1465010k07252P1425K68937L00110J42672j14684l34891m64869n00847
13888A0625611m02029j59918J44719L94692M78929L36384L1571k54846l63089
13879A0832024k54154l126K67981N00143P15552R34778J135775J243418J180469
13870A6552860R47942N80498J09960l72868p50941r53071r12704n94557j19210
13861A4487909K66696M14942L53148J78371P230m8328J0708L8635m4120j27409
13851A5537782j02285q339Q1342K11621M49828P15799Q57644Q12525O50831M96999
13841A9703747M20953M17746M41432M27515L18447R0546k38887n67516p15522
$$ plain form
13832 20298461 19689059 19293634 19038311 18849503 18784171 18951230 19372238 19939906 20482198
13823 20482198 20869806 21042850 20968498 20631314 20082268 19453970 18902466 18540370 18396618
13814 18396618 18421446 18509152 18546699 18474067 18311305 18151157 18105970 18250865 18615095 19191958
13804 19191958 19961164 20880961 21814762 22555074 22957902 22989981 22689169 22150772 21519609
13795 21519609 20938950 20487832 20180739 20021764 20015950 20094994 20117174 20020602 19893676 19841622
13785 19841622 19860630 19899149 19952183 20010032 19990869 19824542 19566392 19330743 19140975 18953921
13775 18953921 18768395 18643750 18671360 18937231 19479832 20206313 20874984 21272950 21398281
13766 21398281 21397964 21383019 21366750 21270933 20936666 20242719 19227428 18079483 17036116 16255861
$$ packed form
13832B0298461o09402l95425k55323j88808o5332J67059M21008N67668N42292
13823B0482198L87608J73044p4352l37184n49046o28298n51504l62096j43752
13814A8396618K4828Q7706L7547p2632j62762j60148m5187J44895L64230N76863
13804A9191958P69206R19797R33801P40312M02828L2079l00812n38397o31163
13795B1519609n80659m51118l07093j58975n814P9044K2180r6572j26926n2054
13785A9841622J9008L8519N3034N7849j9163j66327k58150k35649j89768j87054
13775A8953921j85526j24645K7610K65871N42601P26481O68671L97966J25331
13766B1398281l17j4945j6269r5817l34267o93947j015291j147945j043367p80255
$$ plain form
13756 16255861 15777647 15577145 15602205 15810186 16234355 16956338 17969391 19122196 20234142
13747 20234142 21203648 21958517 22387545 22445127 22292350 22246180 22566075 23304404 24339826
13738 24339826 25496213 26585399 27383063 27683032 27456837 26942007 26475560 26203700 26046326
13729 26046326 25904437 25750075 25590350 25467256 25476570 25705506 26131720 26644783 27152601 27595769
13719 27595769 27924471 28147511 28351160 28648289 29118712 29758483 30475339 31182806 31842507
13710 31842507 32394941 32799959 33136344 33538380 34040373 34536253 34878298 34968889 34787389
13701 34787389 34381066 33805382 33096083 32310902 31522723 30776394 30106428 29567733 29218525
13692 29218525 29114389 29251048 29463455 29505510 29268549 28876586 28580572 28617573 29119013 30044830
$$ packed form
13756A6255861m78214k00502K5060K07981M24169P21983J013053J152805J111946
13747B0234142R69506P54869M29028N7582j52777m6170L19895P38329J035422
13738B4339826J156387J089186P97664K99969k26195n14830m66447k71860j57374
13729B6046326j41889j54362j59725j23094R314K28936M26214N13063N07818M43168
13719B7595769L28702K23040K03649K97129M70423O39771P16856P07467O59701
13710C1842507N52434M05018L36385M02036N01993M95880L42045R0591j81500
13701C4787389m06323n75684p09299p85181p88179p46329o69966n38695l49208
13692B9218525j04136J36659K12407M2055k36961l91963k96014L7001N01440R25817
$$ plain form
13682 30044830 31202041 32329375 33211573 33775285 34073595 34193354 34183276 34102699 34112759
13673 34112759 34411708 35075734 36019190 37083831 38159864 39272727 40530914 41964243
13665 41964243 43440703 44740626 45719173 46402277 46916824 47351679 47721368 48047096 48364992
13656 48364992 48641156 48801240 48825263 48767193 48741285 48812183 48884774 48777817 48434475 48038164
13646 48038164 47867787 48070095 48635798 49489195 50495619 51491289 52380795 53129986 53660144
13637 53660144 53854464 53732202 53522165 53470271 53671506 54101400 54707993 55432890 56161279
13628 56161279 56720003 56971127 56895100 56590532 56212620 55883744 55645893 55479858 55348921
13619 55348921 55242083 55141796 54979242 54707782 54394263 54200628 54299131 54782410 55607666
$$ packed form
13682C0044830J157211J127334Q82198N63712K98310J19759j0078q0577J0060
13673C4112759K98949O64026R43456J064641J076033J112863J258187J433329
13665D1964243J476460J299923R78547O83104N14547M34855L69689L25728L17896
13656D8364992K76164J60084K4023n8070k5908P0898P2591j06957l43342l96311
13646D8038164j70377K02308N65703Q53397J006424R95670Q89506P49191N30158
13637E3660144J94320j22262k10037n1894K01235M29894O06593P24897P28389
13628E6161279N58724K51124p6027l04568l77912l28876k37851j66035j30937
13619E5348921j06838j00287j62554k71460l13519j93635R8503M83279Q25256
$$ plain form
13610 55607666 56658167 57877573 59265817 60800703 62434954 64110220 65753174 67284125
13602 67284125 68646346 69826324 70844549 71705298 72410746 73049196 73733873 74430163 74999305
13593 74999305 75428384 75872958 76477576 77258041 78110077 78866503 79411040 79750007 79952026
13584 79952026 80086820 80243222 80535118 81025292 81648601 82260389 82752783 83101685 83352236
13575 83352236 83610579 83996719 84533704 85121627 85648303 86105998 86596365 87222507 88000892
13566 88000892 88892670 89879313 90997812 92334539 93954203 95804842 97732813 99606329
13558 99606329 101350260 102860379 104024165 104847974 105492887 106193100 107117072 108282365 109627927
13549 109627927 111088594 112544069 113802726 114738593 115427982 116086106 116873236 117849589 119055813
$$ packed form
13610E5607666J050501J219406J388244J534886J634251J675266J642954J530951
13602F7284125J362221J179978J018225Q60749P05448O38450O84677O96290N69142
13593G4999305M29079M44574O04618P80465Q52036P56426N44537L38967K02019
13584G9952026J34794J56402K91896M90174O23309O11788M92394L48902K50551
13575H3352236K58343L86140N36985N87923N26676M57695M90367O26142P78385
13566H8000892Q91778R86643J118499J336727J619664J850639J927971J873516
13558I9606329J743931J510119J163786Q23809O44913P00213R23972J165293J345562
13549A09627927J460667J455475J258657R35867O89389O58124P87130R76353J206224
$$ plain form
13540 119055813 120502454 122084306 123563924 124700590 125409413 125750201 125815151 125740353 125774093
13531 125774093 126194458 127146695 128614360 130523060 132799088 135343056 138035669 140749459
13523 140749459 143315239 145570031 147474095 149145040 150816902 152713702 154843222 156975719
13515 156975719 158868219 160431409 161754328 163029791 164406993 165923912 167533280 169145981
13507 169145981 170715079 172321290 174116673 176136791 178244673 180306968 182336456 184419322
13499 184419322 186598143 188860295 191156394 193406846 195545761 197594194 199661482 201890895
13491 201890895 204392266 207135515 209932158 212595147 215076375 217445305 219793303 222174446
13483 222174446 224649427 227331386 230343811 233720502 237324859 240884784 244114969 246847040
$$ packed form
13540A19055813J446641J581852J479618J136666P08823L40788O4950p4798L3740
13531A25774093M20365R52237J467665J908700K276028K543968K692613K713790
13523A40749459K565780K254792J904064J670945J671862J896800K129520K132497
13515A56975719J892500J563190J322919J275463J377202J516919J609368J612701
13507A69145981J569098J606211J795383K020118K107882K062295K029488K082866
13499A84419322K178821K262152K296099K250452K138915K048433K067288K229413
13491B01890895K501371K743249K796643K662989K481228K368930K347998K381143
13483B22174446K474981K681959L012425L376691L604357L559925L230185K732071
$$ plain form
13475 246847040 249087315 250937599 252489607 253875882 255368732 257282905 259752873 262643664
13467 262643664 265739669 268943364 272227257 275531185 278761023 281808826 284561525 286975580
13459 286975580 289157640 291298563 293521658 295836852 298209583 300618762 303114031 305861258
13451 305861258 309026686 312566159 316213897 319709792 322973681 326048053 328970491 331757209
13443 331757209 334436848 337038179 339564879 342015996 344411484 346758239 349017269 351143853
13435 351143853 353131969 355011266 356805971 358494019 360021604 361361733 362506595 363381973
13427 363381973 363881472 364049176 364142475 364435985 364995803 365650192 366107693 366108982 365564112 364626150
13417 364626150 363607947 362777986 362268697 362107662 362222611 362439636 362545310 362386687 361945120
$$ packed form
13475B46847040K240275J850284J552008J386275J492850J914173K469968K890791
13467B62643664L096005L203695L283893L303928L229838L047803K752699K414055
13459B86975580K182060K140923K223095K315194K372731K409179K495269K747227
13451C05861258L165428L539473L647738L495895L263889L074372K922438K786718
13443C31757209K679639K601331K526700K451117K395488K346755K259030K126584
13435C51143853J988116J879297J794705J688048J527585J340129J144862Q75378
13427C63381973M99499J67704R3299K93510N59818O54389M57501J289n44870r37962
13417C64626150j018203q29961n09289j61035J14949K17025J05674j58623m41567
$$ plain form
13408 361945120 361309033 360582233 359867605 359282241 358864845 358476750 357868331 356808795 355143247
13399 355143247 352782673 349680967 345873141 341545802 337063863 332878347 329299316 326362498
13391 326362498 323901478 321661957 319391298 316960843 314464221 312132317 310113479 308352594
13383 308352594 306655068 304819350 302711331 300272386 297496179 294375942 290877200 286977963
13375 286977963 282714983 278219298 273756797 269645034 266048636 262931668 260155543 257511029
13367 257511029 254792895 251960609 249128541 246351484 243537536 240636943 237775656 235099241
13359 235099241 232574189 229999508 227228824 224351045 221597340 219115335 216904504 214920649
13351 214920649 213096943 211257840 209163594 206692494 203933402 201110024 198419237 195897702
$$ packed form
13408C61945120o36087p26800p14628n85364m17396l88095o08419j059536j665548
13399C55143247k360574l101706l807826m327339m481939m185516l579031k936818
13391C26362498k461020k239521k270659k430455k496622k331904k018838j760885
13383C08352594j697526j835718k108019k438945k776207l120237l498742l899237
13375B86977963m262980m495685m462501m111763l596398l116968k776125k644514
13367B57511029k718134k832286k832068k777057k813948k900593k861287k676415
13359B35099241k525052k574681k770684k877779k753705k482005k210831j983855
13351B14920649j823706j839103k094246k471100k759092k823378k690787k521535
$$ plain form
13343 195897702 193447260 190951569 188363776 185764541 183306108 181123479 179337096 178019530
13335 178019530 177117463 176435013 175693731 174661960 173268036 171594493 169731048 167652739
13327 167652739 165325877 162866609 160476543 158307602 156417930 154733642 153075895 151280991
13319 151280991 149280518 147127172 144956572 142846480 140748615 138622582 136580091 134808810
13311 134808810 133379115 132187976 131041769 129739666 128148276 126305208 124408043 122633130
13303 122633130 121020250 119500149 117960931 116344638 114737683 113361068 112398694 111797717
13295 111797717 111291525 110628266 109732802 108701787 107735267 107023512 106644852 106540685 106508768
13286 106508768 106238770 105487129 104251395 102724218 101116373 99544238 98002706 96422975
$$ packed form
13343A95897702k450442k495691k587793k599235k458433k182629j786383j317566
13335A78019530r02067o82450p41282j031771j393924j673543j863445k078309
13327A67652739k326862k459268k390066k168941j889672j684288j657747j794904
13319A51280991k000473k153346k170600k110092k097865k126033k042491j771281
13311A34808810j429695j191139j146207j302103j591390j843068j897165j774913
13303A22633130j612880j520101j539218j616293j606955j376615r62374o00977
13295A11797717n06192o63259q95464j031015r66520p11755l78660j04167l1917
13286A06508768k69998p51641j235734j527177j607845j572135j541532j579731
$$ plain form
13278 96422975 94767726 93035490 91199012 89191723 86954909 84534710 82167560 80223045
13270 80223045 78960792 78294531 77867637 77375919 76712038 75838963 74732961 73461833 72164686
13261 72164686 70914120 69655244 68305867 66875144 65433908 64073378 62938157 62161130
13253 62161130 61726455 61462930 61201945 60884880 60522264 60193570 60001997 59887373 59615769
13244 59615769 58991072 57984831 56665060 55116615 53517436 52164484 51293305 50895531
13236 50895531 50727756 50489215 49998839 49254954 48382314 47505672 46671785 45915132 45315605
13227 45315605 44963208 44921014 45223113 45849070 46664329 47447874 48009677 48265413 48184949 47730884
13217 47730884 46906170 45820793 44689811 43720048 42934645 42148759 41187134 40113873 39180182
$$ packed form
13278I6422975j655249j732236j836478k007289k236814k420199k367150j944515
13270H0223045j262253o66261m26894m91718o63881q73075j106002j271128j297147
13261G2164686j250566j258876j349377j430723j441236j360530j135221p77027
13253F2161130m34675k63525k60985l17065l62616l28694j91573j14624k71604
13244E9615769o24697j006241j319771j548445j599179j352952q71179l97774
13236E0895531j67775k38541m90376p43885q72640q76642q33887p56653n99527
13227D5315605l52397m2194L02099O25957Q15259P83545N61803K55736q0464m54065
13217D7730884q24714j085377j130982r69763p85403p85886r61625j073261r33691
$$ plain form
13208 39180182 38584408 38362925 38401094 38479413 38374590 37965734 37261743 36337887 35308637
13199 35308637 34356756 33712442 33539970 33826929 34423258 35191555 36064161 36975388 37786943
13190 37786943 38294208 38340090 37931635 37219078 36366675 35466995 34581454 33825224 33355931
13181 33355931 33282749 33628792 34324551 35182631 35976064 36572132 36922855 37005664 36848933 36528114
13171 36528114 36087635 35541328 34943581 34383647 33932092 33638766 33560832 33724805 34063886
13162 34063886 34440949 34703126 34727512 34459094 33872564 32954530 31801782 30653283 29726669
13153 29726669 29081124 28716524 28678639 28942197 29282428 29405907 29232589 28929634 28689262
13144 28689262 28634651 28850591 29338067 29957449 30499421 30807240 30819979 30537496 29941665 28997164
$$ packed form
13208C9180182n95774k21483L8169P8319j04823m08856p03991r23856j029250
13199C5308637r51881o44314j72472K86959N96329P68297Q72606R11227Q11555
13190C7786943N07265M5882m08455p12557q52403q99680q85541p56230m69293
13181C3355931p3182L46043O95759Q58080P93433N96068L50723Q2809j56731l20819
13171C6528114m40479n46307n97747n59934m51555k93326p7934J63973L39081
13162C4063886L77063K62177K4386k68418n86530r18034j152748j148499r26614
13153B9726669o45545l64600l7885K63558L40231J23479j73318l02955k40372
13144B8689262n4611K15940M87476O19382N41972L07819J2739k82483n95831r44501
$$ plain form
13134 28997164 27750709 26334647 24861637 23424219 22149252 21115202 20293560 19618940
13126 19618940 19039182 18497476 17953670 17508685 17400837 17755061 18456438 19293995 20076575
13117 20076575 20608533 20702367 20289952 19470994 18430229 17353180 16437305 15852005 15637398
13108 15637398 15716325 15957682 16200785 16299120 16177259 15851232 15382818 14796512 14093374 13302878
13098 13302878 12465079 11596397 10696071 9807108 9072336 8699899 8855940 9563419 10651734
13089 10651734 11802354 12712612 13260398 13517228 13623690 13685720 13792019 14039436 14458643
13080 14458643 14962774 15425938 15734460 15749296 15340457 14535521 13557911 12638018 11832031
13071 11832031 11045743 10202159 9367829 8702951 8343534 8351634 8719827 9422139 10428613
$$ packed form
13134B8997164j246455j416062j473010j437418j274967j034050q21642o74620
13126A9618940n79758n41706n43806m44985j07848L54224P01377Q37557P82580
13117B0076575N31958R3834m12415q18958j040765j077049r15875n85300k14607
13108A5637398P8927K41357K43103R8335j21861l26027m68414n86306p03138p90496
13098A3302878q37799q68682r00326q88963p34772l72437J56041P07479J088315
13089A0651734J150620R10258N47786K56830J06462O2030J06299K47417M19207
13080A4458643N04131M63164L08522J4836m08839q04936r77610r19893q05987
13071A1832031p86288q43584q34330o64878l59417Q100L68193P02312J006474
$$ plain form
13062 10428613 11638456 12851254 13836542 14415501 14512848 14220369 13818045 13647892 13893790
13053 13893790 14474365 15147686 15707876 16051909 16104834 15765232 14913502 13474323 11570303
13044 11570303 9589406 7997561 7076186 6812343 6991172 7383781 7871196 8441697 9098342
13035 9098342 9765962 10278471 10459575 10251242 9756473 9125958 8449640 7818562 7395649
13026 7395649 7275474 7279724 7020595 6225680 4964794 3548222 2232006 1072836 35324
13017 35324 -901128 -1731994 -2412326 -2839799 -2905328 -2552134 -1794689 -740868 392318 1332676
13007 1332676 1903375 2137781 2244006 2495647 3161186 4400928 6138755 8101977 9973402
12998 9973402 11467250 12376789 12633934 12350630 11799745 11280114 10977412 10929462 11062013
$$ packed form
13062A0428613J209843J212798R85288N78959R7347k92479m02324j70153K45898
13053A3893790N80575O73321N60190L44033N2925l39602q51730j439179j904020
13044A1570303j980897j591845r21375k63843J78829L92609M87415N70501O56645
13035I098342O67620N12509J81104k08333m94769o30515o76318o31078m22913
13026G395649j20175M250k59129p94915j260886j416572j316216j159170j037512
13017C5324r36452q30866o80332m27473o5529L53194P57445J053821J133186R40358
13007A332676N70699K34406J06225K51641O65539J239742J737827J963222J871425
12998I973402J493848R09539K57145k83304n50885n19631l02702m7950J32551
$$ plain form
12989 11062013 11254662 11418778 11527723 11573357 11525368 11305016 10812969 10064484 9255029 8674147
12979 8674147 8553995 8951776 9743990 10658638 11348671 11576809 11377952 10999976 10670277
12970 10670277 10444173 10250602 10023990 9808101 9746476 9950878 10386893 10888738 11285145
12961 11285145 11500404 11552240 11507464 11443781 11411312 11393267 11351926 11279304 11145515 10896524
12951 10896524 10503211 9912167 9004828 7679376 5945213 3960303 2015186 403343
12943 403343 -759589 -1540291 -2027956 -2243638 -2163436 -1774493 -1130415 -358700 395660 1050716
12933 1050716 1628373 2217720 2889014 3620641 4275202 4671212 4745024 4650492 4668033 4995238
12923 4995238 5609202 6311691 6890224 7273586 7552710 7798369 7961018 8043780 8211447 8617208
$$ packed form
12989A1062013J92649J64116J08945M5634m7989k20352m92047p48485q09455n80882
12979H674147j20152L97781P92214R14648O90033K28138j98857l77976l29699
12970A0670277k26104j93571k26612k15889o1625K04402M36015N01845L96407
12961A1285145K15259N1836m4776o3683l2469j8045m1341p2622j33789k48991
12951A0896524l93313n91044r07339j325452j734163j984910j945117j611843
12943D03343j162932p80702m87665k15682Q0202L88943O44078P71715P54360O55056
12933A050716N77657N89347O71294P31627O54561L96010P3812r4532J7541L27205
12923D995238O13964P02489N78533L83362K79124K45659J62649Q2762J67667M05761
$$ plain form
12913 8617208 9190293 9678488 9917879 9988923 10076280 10246846 10420663 10500638 10460854 10359112
12903 10359112 10302178 10342975 10379424 10195951 9655500 8853010 8035613 7382502 6917457 6563806
12893 6563806 6234201 5950163 5867469 6112796 6602708 7121107 7575607 8042239 8616997 9341038
12883 9341038 10209333 11156404 11969198 12315931 11980293 10983603 9495142 7740772 5961423
12874 5961423 4339919 2926828 1689369 623799 -220000 -790594 -1057666 -973373 -493427
12865 -493427 335241 1404068 2623267 3891649 5076119 6073093 6857922 7464664 7939081
12856 7939081 8320111 8636262 8899653 9143155 9452575 9880486 10347802 10678986 10723703 10467980
12846 10467980 10014473 9449317 8831997 8273854 7892635 7754567 7911321 8355446 8931409
$$ packed form
12913H617208N73085M88195K39391P1044Q7357J70566J73817P9975l9784j01742
12903A0359112n6934M0797L6449j83473n40451q02490q17397o53111m65045l53651
12893F563806l29605k84038q2694K45327M89912N18399M54500M66632N74758P24041
12883I341038Q68295R47071Q12794L46733l35638r96690j488461j754370j779349
12874E961423j621504j413091j237459j065570q43799n70594k67072Q4293M79946
12865d93427Q28668J068827J219199J268382J184470R96974P84829O06742M74417
12856G939081L81030L16151K63391K43502L09420M27911M67316L31184M4717k55723
12846A0467980m53507n65156o17320n58143l81219j38068J56754M44125N75963
$$ plain form
12837 8931409 9431803 9789006 10124446 10598644 11200255 11720849 11926225 11693915 11016633
12828 11016633 9963888 8643544 7168176 5679986 4368494 3375747 2701200 2258875
12820 2258875 2011594 1993242 2239062 2756712 3518396 4432998 5351117 6114075 6614178 6856588
12810 6856588 6962762 7097232 7374271 7775365 8153539 8383700 8501316 8631880 8803574
12801 8803574 8892843 8749479 8310250 7594586 6691809 5794781 5152550 4883113 4850789 4774747
12791 4774747 4431060 3799864 3069855 2481441 2151891 2039873 2036345 2030851 1930472 1688533
12781 1688533 1286846 741734 193864 -154591 -213245 -23938 314801 709893 1092467 1354650
12771 1354650 1331230 945137 329355 -240421 -490147 -244665 504183 1576096 2689804
$$ packed form
12837H931409N00394L57203L35440M74198O01611N20594K05376k32310o77282
12828A1016633j052745j320344j475368j488190j311492r92747o74547m42325
12820B258875k47281j8352K45820N17650P61684R14602R18119P62958N00103K42410
12810F856588J06174J34470K77039M01094L78174K30161J17616J30564J71694
12801H803574Q9269j43364m39229p15664r02777q97028o42231k69437l2324p6042
12791D774747l43687o31196p30009n88414l29550j12018l528n494j00379k41939
12781A688533m01687n45112n47870l48455n8654J89307L38739L95092L82574K62183
12771A354650k3420l86093o15782n69776k49726K45482P48848J071913J113708
$$ plain form
12762 2689804 3565753 3991683 3898803 3395138 2649882 1771889 859763 81865 -380528 -416749
12752 -416749 40361 1021362 2434411 4025997 5466870 6497088 7034919 7209339 7259480
12743 7259480 7315795 7328082 7250319 7152709 7061811 6864540 6470650 5930289 5391038 5045946
12733 5045946 5028207 5301131 5769933 6408227 7164211 7864372 8276917 8269173 7890030 7297157
12723 7297157 6680195 6243222 6160145 6523819 7312451 8322594 9205287 9715168 9865972
12714 9865972 9792995 9563966 9140666 8458585 7513211 6372398 5140818 3892576 2621652
12705 2621652 1322972 103144 -865572 -1464720 -1670952 -1527906 -1112284 -554058 -59747
12696 -59747 149569 -74353 -785728 -1924202 -3301903 -4693025 -5930714 -6899741 -7512469
$$ packed form
12762B689804Q75949M25930r2880n03665p45256q77993r12126p77898m62393l6221
12752d16749M57110R81001J413049J591586J440873J030218N37831J74420N0141
12743G259480N6315J2287p7763r7610r0898j97271l93890n40361n39251l45092
12733E045946j7739K72924M68802O38294P55984P00161M12545p744l79143n92873
12723G297157o16962m36973q3077L63674P88632J010143Q82693N09881J50804
12714I865972p2977k29029m23300o82081r45374j140813j231580j248242j270924
12705B621652j298680j219828r68716n99148k06232J43046M15622N58226M94311
12696e9747K09316k23922p11375j138474j377701j391122j237689r69027o12728
$$ plain form
12687 -7512469 -7741714 -7649070 -7295888 -6603350 -5462065 -3996876 -2555947 -1423631 -657918
12678 -657918 -197331 -4088 -36962 -181314 -301981 -325769 -248773 -95238 121071 444890
12668 444890 973004 1774312 2852536 4142406 5517012 6837422 7994235 8889797 9435700
12659 9435700 9617783 9537661 9373982 9269791 9222933 9081291 8660701 7877902 6825380 5784074
12649 5784074 5068537 4763138 4702926 4701852 4704822 4776605 5005102 5406377 5887198 6321806
12639 6321806 6693433 7078778 7454785 7643624 7500873 7044167 6361681 5534124 4707405
12630 4707405 4086320 3765627 3686686 3789514 4069266 4487393 4942792 5323802 5542118 5536133
12620 5536133 5286979 4844565 4341141 3982221 3954740 4306353 4911939 5552772 6055311 6354011
$$ packed form
12687g512469k29245R2644L53182O92538J141285J465189J440929J132316P65713
12678f57918M60587J93243l2874j44352j20667k3788P6996J53535K16309L23819
12668D44890N28114Q01308J078224J289870J374606J320410J156813Q95562N45903
12659I435700J82083q0122j63679j04191m6858j41642m20590p82799j052522j041306
12649E784074p15537l05399o0212j074K970P1783K28497M01275M80821M34608
12639F321806L71627L85345L76007J88839j42751m56706o82486q27557q26719
12630D707405o21085l20693p8941J02828K79752M18127M55399L81010K18316n985
12620E536133k49154m42414n03424l58920k7481L51613O05586O40833N02539K98700
$$ plain form
12610 6354011 6429464 6286789 6071165 6039718 6340853 6924625 7635518 8328092 8916735 9367311
12600 9367311 9656737 9753323 9640489 9357721 8987036 8562815 8055305 7456034 6809494 6198256
12590 6198256 5734445 5497758 5440342 5431193 5426832 5467978 5517440 5436606 5071918 4317735 3186117
12579 3186117 1884319 802529 305281 498588 1233305 2226021 3149059 3740921 3868016
12570 3868016 3520003 2855778 2206881 1906194 2100741 2756533 3775869 4988401 6080589
12561 6080589 6728338 6853644 6699392 6641381 6936090 7601065 8468971 9337303 10088824 10694655
12551 10694655 11143743 11420641 11550134 11630499 11783289 12055157 12380736 12627278 12672297 12482092
12541 12482092 12123825 11705824 11311683 10942807 10555303 10148512 9767437 9463773 9250320
$$ packed form
12610F354011P5453j42675k15624l1447L01135N83772P10893O92574N88643M50576
12600I367311K89426R6586j12834k82768l70685m24221n07510n99271o46540o11238
12590F198256m63811k36687n7416r149m361M1146M9462q0834l64688p54183j131618
12579C186117j301798j081790m97248J93307P34717R92716R23038N91862J27095
12570C868016l48013o64225o48897l00687J94547O55792J019336J212532J092188
12561F080589O47749J25306j54252n8011K94709O64975Q67906Q68332P51521O05831
12551A0694655M49088K76898J29493Q0365J52790K71868L25579K46542M5019j90205
12541A2482092l58267m18001l94141l68876l87504m06791l81075l03664k13453
$$ plain form
12532 9250320 9060875 8784389 8337046 7661422 6742623 5686877 4693051 3903708 3304636
12523 3304636 2784258 2268799 1761750 1328518 1088920 1168589 1616538 2334903 3117319 3807391
12513 3807391 4433079 5132834 5917334 6589128 6899060 6723337 6127100 5304365 4462773
12504 4462773 3746522 3228648 2933202 2831373 2854960 2964842 3167668 3455178 3767988 3989421
12494 3989421 3965786 3565673 2734214 1537956 177252 -1041918 -1788227 -1820962 -1054320
12485 -1054320 438763 2434304 4613237 6674080 8413019 9747896 10655798 11073653
12477 11073653 10979034 10563476 10134389 9835359 9594417 9314598 9025714 8825296 8717801
12468 8717801 8565934 8155876 7310467 6024420 4494247 3024395 1878935 1139469 680619
$$ packed form
12532I250320j89445k76486m47343o75624r18799j055746r93826p89343n99072
12523C304636n20378n15459n07049m33232k39598P9669M47949P18365P82416O90072
12513C807391O25688O99755P84500O71794L09932j75723n96237q22735q41592
12504D462773p16251n17874k95446j01829K3587J09882K02826K87510L12810K21433
12494C989421k3635m00113q31459j196258j360704j219170p46309l2735P66642
12485a054320J493083J995541K178933K060843J738939J334877R07902M17855
12477A1073653r4619m15558m29087k99030k40942k79819k88884k00418j07495
12468H717801j51867m10058q45409j286047j530173j469852j145460p39466m58850
$$ plain form
12459 680619 272975 -224100 -766065 -1237552 -1532258 -1553116 -1303915 -936809 -641032 -551414
12449 -551414 -750351 -1283843 -2106985 -3001682 -3660769 -3918334 -3805800 -3391637 -2690570 -1704282
12439 -1704282 -471531 908275 2261645 3372182 4092147 4400568 4330462 3937337 3352177
12430 3352177 2775710 2389149 2288658 2457747 2796995 3239527 3859572 4818944 6156783
12421 6156783 7668914 9013624 9891139 10159397 9909006 9461532 9209708 9359214 9745635
12412 9745635 9925422 9501315 8367304 6696128 4797748 2988641 1472323 290296
12404 290296 -607257 -1199834 -1316202 -822128 182192 1419686 2585590 3453131 3914277
12395 3914277 3941526 3570524 2908080 2100685 1314696 733293 515986 744044 1375231 2230685
$$ packed form
12459F80619m07644m97075n41965m71487k94706k0858K49201L67106K95777Q9618
12449e51414j98937n33492q23142q94697o59087k57565J12534M14163P01067R86288
12439a704282J232751J379806J353370J110537P19965L08421p0106l93125n85160
12430C352177n76467l86561j00491J69089L39248M42532O20045R59372J337839
12421F156783J512131J344710Q77515K68258k50391m47474k51824J49506L86421
12412I745635J79787m24107j134011j671176j898380j809107j516318j182027
12404B90296q97553n92577j16368M94074J004320J237494J165904Q67541M61146
12395C914277K7249l71002o62444q07395p85989n81403k17307K28058O31187Q55454
$$ plain form
12385 2230685 3075611 3732529 4127825 4274549 4214711 3959794 3513167 2903916 2142313 1221578
12375 1221578 185259 -874496 -1857548 -2658447 -3184200 -3414903 -3428161 -3320665 -3104406
12366 -3104406 -2743101 -2279888 -1864675 -1671547 -1781003 -2102786 -2446118 -2687813 -2853027
12357 -2853027 -3037992 -3274824 -3484373 -3579618 -3581679 -3598818 -3757367 -4090079 -4435706 -4549167
12347 -4549167 -4299010 -3734793 -2999300 -2167272 -1197782 -68524 1098036 2060775 2608439
12338 2608439 2699548 2470105 2107092 1684333 1141563 423572 -429868 -1279371 -1908925 -2126734
12328 -2126734 -1898979 -1368134 -764536 -303653 -87910 -73904 -99967 1840 249282 529677
12318 529677 736989 860774 1027655 1391591 1915559 2350604 2417774 1967433 1033212 -198331
$$ packed form
12385B230685Q44926O56918L95296J46724n9838k54917m46627o09251p61603r20735
12375A221578j036319j059755r83052q00899n25753k30703j3258J07496K16259
12366c104406L61305M63213M15213J93128j09456l21783l43332k41695j65214
12357b853027j84965k36832k09549r5245k061j7139j58549l32712l45627j13461
12347d549167K50157N64217P35493Q32028R69490J129258J166560R62739N47664
12338B608439R1109k29443l63013m22759n42770p17991q53440q49503o29554k17809
12328b126734K27755N30845O03598M60883K15743J4006k6063J01807K47442K80395
12318E29677K07312J23785J66881L63936N23968M35045O7170m50341r34221j231543
$$ plain form
12308 -198331 -1472610 -2574131 -3410940 -4048569 -4597904 -5007551 -5059292 -4601467 -3720760
12299 -3720760 -2670971 -1687326 -899833 -380006 -189571 -338883 -709879 -1059954 -1136882
12290 -1136882 -839175 -262089 445466 1232990 2107289 2988983 3711869 4169127 4398215
12281 4398215 4504508 4518337 4341220 3873526 3200403 2580918 2244742 2257201 2571679 3113826
12271 3113826 3814732 4637553 5538635 6377635 6930222 7007182 6560753 5713079 4661701
12262 4661701 3592703 2674356 2003260 1532652 1162491 877685 698302 585652 494483
12253 494483 438879 464081 583522 720194 729622 550412 302746 182912 274516 486829
12243 486829 648193 656700 572136 501166 414310 191806 -208573 -735685 -1312714 -1862984
$$ packed form
12308a98331j274279j101521q36809o37629n49335m09647n1741M57825Q80707
12299c720760J049789R83645P87493N19827J90435j49312l70996l50075p6928
12290a136882K97707N77086P07555P87524Q74299Q81694P22886M57258K29088
12281D398215J06293J3829j77117m67694o73123o19485l36176J2459L14478N42147
12271C113826P00906Q22821R01082Q39000N52587P6960m46429q47674j051378
12262D661701j068998r18347o71096m70608l70161k84806j79383j12650r1169
12253D94483n5604K5202J19441J36672R428j79210k47666j19834R1604K12313
12243D86829J61364Q507q4564p0970q6856k22504m00379n27112n77029n50270
$$ plain form
12233 -1862984 -2359970 -2859209 -3435814 -4142994 -5004643 -5958665 -6855595 -7567244 -8106765
12224 -8106765 -8596756 -9111625 -9613122 -9984563 -10060475 -9675254 -8775061 -7489763 -6066736
12215 -6066736 -4767431 -3765040 -3032449 -2390239 -1725625 -1091779 -599567 -315844 -199076
12206 -199076 -43376 419674 1328065 2600398 4015416 5363113 6480499 7218963 7479384
12197 7479384 7271184 6705278 5918965 5059992 4319838 3855930 3686875 3729163 3919151 4234454
12187 4234454 4589486 4777881 4598237 4014085 3151744 2216822 1442065 1026851 1049914 1450967
12177 1450967 2098439 2839168 3517174 4009571 4277945 4348131 4215894 3855628 3313094 2682347
12167 2682347 2006385 1240120 296505 -856087 -2128424 -3351799 -4407382 -5295976 -6075954
$$ packed form
12233a862984m96986m99239n76605p07180q61649r54022q96930p11649n39521
12224h106765m89991n14869n01497l71441p5912L85221R00193J285298J423027
12215f066736J299305J002391P32591O42210O64614O33846M92212K83723J16768
12206a99076J55700M63050R08391J272333J415018J347697J117386P38464K60421
12197G479384k08200n65906p86313q58973p40154m63908j69055M2288J89988L15303
12187D234454L55032J88395j79644n84152q62341r34922p74757m15214K3063M01053
12177A450967O47472P40729O78006M92397K68374P0186j32237l60266n42534o30747
12167B682347o75962p66265r43615j152592j272337j223375j055583q88594p79978
$$ plain form
12158 -6075954 -6774359 -7339958 -7631056 -7534974 -7139028 -6689075 -6375759 -6223373 -6147461 -6062893
12148 -6062893 -5959578 -5897817 -5940634 -6100807 -6324274 -6522871 -6639360 -6671129 -6664062 -6637255
12138 -6637255 -6478307 -6016047 -5190013 -4054549 -2703761 -1283447 15212 1039374 1753160
12129 1753160 2261263 2762558 3440453 4378897 5544096 6777833 7848733 8605237 9033599
12120 9033599 9137703 8915992 8478246 8028627 7689785 7398715 6990583 6385457 5664505
12111 5664505 4996836 4564199 4523534 4937780 5717028 6619026 7335704 7635047 7427482 6757874
12101 6757874 5758559 4575437 3302812 1976562 621878 -727063 -2024783 -3162363
12093 -3162363 -3951336 -4215206 -3904417 -3136179 -2164310 -1286269 -704796 -454151 -446744 -588112
$$ packed form
12158f075954o98405n65599k91098R6082L95946M49953L13316J52386P5912Q4568
12148f062893J03315O1761m2817j60173k23467j98597j16489l1769P067K6807
12138f637255J58948M62260Q26034J135464J350788J420314J298659J024162P13786
12129A753160N08103N01295O77895R38444J165199J233737J070900P56504M28362
12120I033599J04104k21711m37746m49619l38842k91070m08132o05126p20952
12111E664505o67669m32637m0665M14246P79248R01998P16678K99343k07565o69608
12101F757874r99315j183122j272625j326250j354684j348941j297720j137580
12093c162363p88973k63870L10789P68238R71869Q78041N81473K50645P407j41368
$$ plain form
12083 -588112 -870836 -1318763 -1874552 -2431552 -2915717 -3274096 -3416461 -3196895 -2506128 -1399765
12073 -1399765 -69198 1264492 2397463 3164945 3470817 3353263 2999718 2641119 2444970
12064 2444970 2467216 2670017 2993777 3369349 3654483 3620791 3071698 2011413 703450
12055 703450 -484777 -1347377 -1906088 -2261366 -2463061 -2503110 -2396108 -2217294 -2062355 -1992656
12045 -1992656 -2033834 -2200995 -2449132 -2613577 -2518542 -2145256 -1620440 -1080710 -611046 -270648
12035 -270648 -90400 -51512 -96943 -128194 -10364 315413 738470 1054716 1151539 1116388
12025 1116388 1168143 1476745 2018088 2619279 3089034 3243994 2941492 2217950 1306018 414163
12015 414163 -453771 -1452695 -2684269 -3991210 -4998992 -5372363 -4996111 -3960052 -2483583
$$ packed form
12083e88112k82724m47927n55789n57000m84165l58379j42365K19566O90767J106363
12073a399765J330567J333690J132971P67482L05872j17554l53545l58599j96149
12064B444970K2246K02801L23760L75572K85134l3692n49093j060285j307963
12055G03450j188227q62600n58711l55278k01695m0049J07002J78814J54939O9699
12045a992656m1178j67161k48137j64445R5035L73286N24816N39730M69664L40398
12035b70648J80248L8888m5431l1251J17830L25777M23057L16246R6823l5151
12025A116388N1755L08602N41343O01191M69755J54960l02502p23542r11932q91855
12015D14163q67934r98924j231574j306941j007782l73371L76252J036059J476469
$$ plain form
12006 -2483583 -897912 436040 1269197 1522345 1267786 683778 44854 -311884 -179729
11997 -179729 355999 1038265 1684428 2277326 2856115 3432218 4021208 4567545 4859546 4711188
11987 4711188 4202016 3625402 3224690 3029329 2871856 2507632 1763796 621692 -770610
11978 -770610 -2126365 -3124838 -3572651 -3525951 -3215415 -2830632 -2430656 -2027799 -1689997 -1516422
11968 -1516422 -1486214 -1413224 -1087608 -418278 513808 1526534 2457997 3198258 3673700 3813099
11958 3813099 3523171 2785267 1771179 769462 -23494 -636844 -1275620 -2054841 -2791593
11949 -2791593 -3190495 -3175801 -2918577 -2612465 -2379418 -2336470 -2565902 -3009456 -3474430 -3740111
11939 -3740111 -3675325 -3279563 -2639800 -1915924 -1345191 -1155665 -1412630 -1947522 -2501065 -2934773
$$ packed form
12006b483583J585671J333952Q33157K53148k54559n84008o38924l56738J32155
11997a79729N35728O82266O46163N92898N78789N76103N88990N46337K92001j48358
11987D711188n09172n76614m00712j95361j57473l64224p43836j142104j392302
11978g70610j355755r98473m47813M6700L10536L84783L99976M02857L37802J73575
11968a516422L0208P2990L25616O69330R32086J012726R31463P40261M75442J39399
11958C813099k89928p37904j014088j001717p92956o13350o38776p79221p36752
11949b791593l98902J4694K57224L06112K33047M2948k29432m43554m64974k65681
11939c740111O4786L95762O39763P23876N70733J89526k56965n34892n53543m33708
$$ plain form
11929 -2934773 -3243016 -3428577 -3457988 -3271295 -2790061 -1956762 -820810 401274 1418145
11920 1418145 2000659 2031305 1516713 589908 -564284 -1825004 -3147903 -4418686 -5339359
11911 -5339359 -5575493 -5024945 -3881803 -2466649 -1070524 112705 1031489 1752944 2368520
11902 2368520 2935156 3451765 3860728 4108055 4151155 3900868 3283647 2382550 1440391 693497
11892 693497 220035 -62561 -271998 -426243 -441737 -233736 213196 815315 1386349 1687262
11882 1687262 1520935 847927 -157404 -1166812 -1856716 -2064026 -1787749 -1117924 -203034
11873 -203034 799833 1778560 2648097 3298126 3595637 3465282 2971344 2308944 1703090
11864 1703090 1272095 950204 553514 -29258 -699137 -1238163 -1537619 -1704803 -1931228
$$ packed form
11929b934773l08243j85561k9411J86693M81234Q33299J135952J222084J016871
11920A418145N82514L0646n14592r26805j154192j260720j322899j270783r20673
11911e339359k36134N50548J143142J415154J396125J183229R18784P21455O15576
11902B368520N66636N16609M08963K47327M3100k50287o17221r01097r42159p46894
11892F93497m73462k82596k09437j54245j5494K08001M46932O02119N71034L00913
11882A687262j66327o73008j005331j009408o89904k07310K76277O69825R14890
11873b03034J002867R78727Q69537O50029K97511j30355m93938o62400o05854
11864A703090m30995l21891l96690n82772o69879n39026k99456j67184k26425
$$ plain form
11855 -1931228 -2275140 -2605265 -2748673 -2660713 -2472784 -2395907 -2524775 -2730581 -2769999 -2468334
11845 -2468334 -1870761 -1258287 -958970 -1132942 -1717633 -2551757 -3480244 -4331704 -4927865
11836 -4927865 -5174668 -5108806 -4840563 -4476932 -4126121 -3935452 -4060599 -4592133 -5499527 -6612622
11826 -6612622 -7676803 -8496227 -9044678 -9445039 -9852591 -10350002 -10938409 -11568705 -12195109
11817 -12195109 -12782864 -13204145 -13244357 -12773763 -11809013 -10405643 -8636456 -6704984 -4931513
11808 -4931513 -3556901 -2617052 -2018452 -1650507 -1422150 -1261292 -1132422 -1058070 -1067674 -1148347
11798 -1148347 -1278248 -1459497 -1677557 -1885060 -2048386 -2176029 -2303936 -2457748 -2615008
11789 -2615008 -2679317 -2554529 -2256295 -1932983 -1788256 -1932342 -2271818 -2578596 -2676898 -2535976
$$ packed form
11855a931228l43912l30125j43408Q7960J87929P6877j28868k05806l9418L01665
11845b468334N97573O12474K99317j73972n84691q34124r28487q51460n96161
11836d927865k46803O5862K68243L63631L50811J90669j25147n31534r07394j113095
11826f612622j064181q19424n48451m00361m07552m97411n88407o30296o26404
11817a2195109n87755m21281m0212M70594R64750J403370J769187J931472J773471
11808d931513J374612R39849N98600L67945K28357J60858J28870P4352r604q0673
11798a148347j29901j81249k18060k07503j63326j27643j27907j53812j57260
11789b615008o4309J24788K98234L23312J44727j44086l39476l06778r8302J40922
$$ plain form
11779 -2535976 -2248375 -1958665 -1737952 -1536845 -1292149 -1017569 -809238 -764227 -839245 -858670
11769 -858670 -683218 -359310 -111177 -146442 -490089 -1028268 -1639622 -2245761 -2825324 -3369826
11759 -3369826 -3771185 -3867395 -3598801 -3041812 -2366513 -1767319 -1365684 -1157162 -1009615 -714597
11749 -714597 -109199 821885 1945580 3063505 4015354 4715373 5127580 5279287 5298202
11740 5298202 5345066 5472930 5576973 5475754 5063578 4415566 3740838 3261199 3100076 3230261
11730 3230261 3527498 3825614 3943714 3753857 3238003 2486674 1688635 1077228 791856
11721 791856 819830 1085813 1544944 2186766 2978418 3827645 4604808 5205294 5583101 5768118
11711 5768118 5891592 6084754 6299303 6323555 6026109 5505123 4933754 4373701 3825329 3318779
$$ packed form
11779b535976K87601K89710K20713K01107K44696K74580K08331M5011p5018j9425
11769h58670J75452L23908K48133l5265l43647n38179o11354o06139n79563n44502
11759c369826m01359r6210K68594N56989O75299N99194M01635K08522J47547K95018
11749g14597O05398R31084J123695J117925R51849P00019M12207J51707J8915
11740E298202M6864J27864J04043j01219m12176o48012o74728m79639j61123J30185
11730C230261K97237K98116J18100j89857n15854p51329p98039o11407k85372
11721G91856K7974K65983M59131O41822P91652Q49227P77163O00486L77807J85017
11711E768118J23474J93162K14549K4252k97446n20986n71369n60053n48372n06550
$$ plain form
11701 3318779 2870854 2435764 1977321 1556109 1241717 972792 600582 43852 -654919
11692 -654919 -1371681 -1941937 -2218518 -2176452 -1949339 -1715791 -1567938 -1467559 -1247871 -695330
11682 -695330 225316 1266234 2080047 2404403 2145938 1398215 298340 -1056562 -2489319
11673 -2489319 -3743514 -4685988 -5400171 -6049252 -6681211 -7202002 -7512325 -7586183 -7446173
11664 -7446173 -7166938 -6879325 -6719347 -6784195 -7081700 -7501014 -7876502 -8076065 -8032875 -7704724
11654 -7704724 -7087787 -6346491 -5784651 -5584658 -5665832 -5833798 -5985267 -6157883 -6426879 -6734672
11644 -6734672 -6837359 -6463158 -5539124 -4286898 -3070617 -2127131 -1443235 -860193 -258433
11635 -258433 337823 833369 1228417 1593646 1914598 2103408 2101986 1911276 1611291 1341029
$$ packed form
11701C318779m47925m35090m58443m21212l14392k68925l72210n56730o98771
11692f54919p16762n70256k76581M2066K27113K33548J47853J00379K19688N52541
11682f95330R20646J040918Q13813L24356k58465p47723j099875j354902j432757
11673b489319j254195r42474p14183o49081o31959n20791l10323p3858J40010
11664g446173K79235K87613J59978o4848k97505m19314l75488j99563M3190L28151
11654g704724O16937P41296N61840J99993q1174j67966j51469j72616k68996l07793
11644f734672j02687L74201R24034J252226J216281R43486O83896N83042O01760
11635b58433N96256M95546L95048L65229L20952J88810j422j90710k99985k70262
$$ plain form
11625 1341029 1207626 1248854 1453267 1725974 1881360 1785220 1466011 1019057 486238 -109150
11615 -109150 -709965 -1270351 -1804338 -2382680 -3095697 -3987891 -4981503 -5884045 -6561583 -7103980
11605 -7103980 -7707377 -8392527 -8955375 -9190739 -9104290 -8904464 -8824262 -8909808 -8923445 -8531671
11595 -8531671 -7616988 -6396781 -5263851 -4482963 -4009193 -3549471 -2766669 -1501413 112388
11586 112388 1718114 2972579 3761363 4178334 4317572 4123144 3463698 2351085 1052056
11577 1052056 -54171 -761060 -1160466 -1445536 -1657476 -1720653 -1655133 -1615837 -1736504 -2014751
11567 -2014751 -2324142 -2475223 -2307923 -1772324 -906213 182240 1283590 2164998 2704675
11558 2704675 2911184 2835903 2501474 1895593 1034065 18766 -1006112 -1938957 -2732660
$$ packed form
11625A341029j33403M1228K04413K72707J55386r6140l19209m46954n32819n95388
11615a09150o00815n60386n33987n78342p13017q92194r93612r02542o77538n42397
11605g103980o03397o85150n62848k35364Q6449J99826Q0202q5546j3637L91774
11595h531671R14683J220207J132930P80888M73770M59722P82802J265256J613801
11586A12388J605726J254465P88784M16971J39238j94428o59446j112613j299029
11577A052056j106227p06889l99406k85070k11940o3177O5520L9296j20667k78247
11567b014751l09391j51081J67300N35599Q66111J088453J101350Q81408N39677
11558B704675K06509p5281l34429o05881q61528j015299j024878r32845p93703
$$ plain form
11549 -2732660 -3343925 -3704338 -3745171 -3488450 -3067225 -2607608 -2147655 -1652560 -1087470 -511027
11539 -511027 -78215 56126 -164456 -645202 -1213906 -1781549 -2359760 -2939746 -3426860 -3655896
11529 -3655896 -3468046 -2842329 -1952609 -1053558 -277786 426244 1148037 1862816 2423331
11520 2423331 2715127 2801610 2841512 2932564 3063830 3094452 2821855 2213455 1507803 977894
11510 977894 670301 432659 126422 -245896 -543961 -549876 -123973 641418 1477652 2097107
11500 2097107 2276113 1933025 1189615 311067 -463704 -1028768 -1348604 -1391763 -1151362 -632954
11490 -632954 149685 1111556 2061774 2788159 3222272 3497273 3843896 4446585 5350172 6481810
11480 6481810 7728046 8951662 10006193 10817374 11393327 11727991 11801248 11670937 11456119
$$ packed form
11549b732660o11265l60413m0833K56721M21225M59617M59953M95095N65090N76443
11539e11027M32812J34341k20582m80746n68704n67643n78211n79986m87114k29036
11529c655896J87850O25717Q89720Q99051P75772P04030P21793P14779N60515
11520B423331K91796Q6483L9902R1052J31266L0622k72597o08400p05652n29909
11510I77894l07593k37642l06237l72318k98065n915M25903P65391Q36234O19455
11500B097107J79006l43088p43410q78548p74771n65064l19836m3159K40401N18408
11490f32954P82639R61871R50218P26385M34113K75001L46623O02689R03587J131638
11480F481810J246236J223616J054531Q11181N75953L34664P3257j30311k14818
$$ plain form
11471 11456119 11204836 10822232 10148019 9090790 7683595 6056761 4354818 2689759
11463 2689759 1237374 239810 -203805 -229236 -64608 104117 173945 128546 2933 -173794
11453 -173794 -400569 -687928 -1073039 -1630518 -2398617 -3273196 -4018402 -4497728 -4846700 -5294570
11443 -5294570 -5881274 -6453305 -6856558 -7034783 -7030029 -6975283 -7042809 -7290478 -7528678 -7402780
11433 -7402780 -6656192 -5352690 -3839567 -2453030 -1321665 -413281 371989 1129183 1890642
11424 1890642 2622084 3237244 3636331 3788188 3768670 3701831 3643483 3499758 3096717 2360736
11414 2360736 1421297 514640 -185478 -604801 -732789 -578129 -151350 484097 1204792
11405 1204792 1909557 2561567 3150734 3672442 4140570 4563095 4854810 4842940 4401559 3522701
$$ packed form
11471A1456119k51283l82604o74213j057229j407195j626834j701943j665059
11463B689759j452385r97564m43615k5431J64628J68725O9828m5399j25613j76727
11453a73794k26775k87359l85111n57479p68099q74579p45206m79326l48972m47870
11443e294570n86704n72031m03253j78225M754N4746o7526k47669k38200J25898
11433g402780P46588J303502J513123J386537J131365R08384P85270P57194P61459
11424A890642P31442O15160L99087J51857j9518o6839n8348j43725m03041p35981
11414B360736r39439r06657p00118m19323j27988J54660M26779O35447P20695
11405A204792P04765O52010N89167N21708M68128M22525K91715j1870m41381q78858
$$ plain form
11395 3522701 2275474 776180 -812407 -2340248 -3741480 -4988005 -5977454 -6552276
11387 -6552276 -6613912 -6119524 -5054815 -3501847 -1660071 240283 2012762 3509496 4602624
11378 4602624 5196564 5267112 4909812 4313755 3613999 2786834 1731311 424647 -1023722
11369 -1023722 -2423153 -3568414 -4294673 -4539197 -4364488 -3885188 -3194808 -2378877 -1541113
11360 -1541113 -764190 -84635 434603 615888 264981 -567344 -1540270 -2286164 -2637188
11351 -2637188 -2656293 -2559230 -2575729 -2838708 -3337575 -3913272 -4348072 -4508073 -4416213 -4198510
11341 -4198510 -3970948 -3768056 -3534468 -3195095 -2767624 -2379148 -2138041 -2035936 -1992329 -1972786
11331 -1972786 -2050399 -2309072 -2719852 -3140641 -3390568 -3342577 -2991842 -2456929 -1921537 -1524680
$$ packed form
11395C522701j247227j499294j588587j527841j401232j246525r89449n74822
11387f552276o1636M94388J064709J552968J841776J900354J772479J496734J093128
11378D602624N93940P0548l57300n96057o99756q27165j055523j306664j448369
11369a023722j399431j145261p26259k44524J74709M79300O90380Q15931Q37764
11360a541113P76923O79555N19238J81285l50907q32325r72926p45894l51024
11351b637188j9105R7063j6499k62979m98867n75697m34800j60001R1860K17703
11341d198510K27562K02892K33588L39373M27471L88476K41107J02105M3607J9543
11331a972786p7613k58673m10780m20789k49927M7991L50735N34913N35392L96857
$$ plain form
11321 -1524680 -1296467 -1218964 -1291909 -1491870 -1718517 -1853422 -1850990 -1723176 -1468163 -1055940
11311 -1055940 -476684 242184 1092149 2070479 3074983 3888445 4265421 4068152 3420767
11302 3420767 2648135 1963505 1325503 646436 635 -417843 -476217 -206310 250635 761177
11292 761177 1230231 1549319 1619715 1435167 1080264 699905 494664 598813 946147 1355288
11282 1355288 1689082 1894314 2003684 2139279 2396615 2710559 2901014 2851852 2636386 2441405
11272 2441405 2370980 2378087 2370099 2317012 2279311 2343225 2475754 2449868 2012376 1121686 -59516
11261 -59516 -1346234 -2620028 -3837296 -5046376 -6324657 -7652584 -8867595 -9709243 -9892667
11252 -9892667 -9244483 -7872678 -6162982 -4560838 -3333745 -2496185 -1939438 -1604056 -1510160
$$ packed form
11321a524680K28213P7503p2945j99961k26647j34905K432J27814K55013M12223
11311a055940N79256P18868Q49965R78330J004504Q13462L76976j97269o47385
11302C420767p72632o84630o38002o79067o45801m18478n8374K69907M56945N10542
11292G61177M69054L19088P0396j84548l54903l80359k05241J04149L47334M09141
11282A355288L33794K05232J09370J35595K57336L13944J90455m9162k15466j94981
11272B441405p0425P107p988n3087l7701O3914J32529k5886m37492q90690j181202
11261e9516j286718j273794j217268j209080j278281j327927j215011q41648j83424
11252i892667O48184J371805J709696J602144J227093Q37560N56747L35382R3896
$$ plain form
11243 -1510160 -1652805 -1970875 -2443145 -3079854 -3778692 -4322571 -4540623 -4378472 -3880286
11234 -3880286 -3203609 -2564432 -2114192 -1912718 -1999822 -2422009 -3155670 -4011879 -4666995 -4870770
11224 -4870770 -4628762 -4115757 -3437174 -2575156 -1535664 -418401 671182 1712579 2764609
11215 2764609 3904487 5150922 6410781 7509184 8291877 8699188 8794726 8781736 8900958
11206 8900958 9249656 9705951 9987814 9805291 9043507 7877420 6650803 5556980 4534995
11197 4534995 3492246 2482501 1669821 1174616 940657 785494 559911 176944 -437822
11188 -437822 -1300258 -2319405 -3336062 -4217619 -4896453 -5292378 -5294344 -4850828 -4031395 -2998189
11178 -2998189 -1926883 -931378 -43134 731676 1335490 1675361 1740672 1652963 1565725 1549387
$$ packed form
11243a510160j42645l18070m72270o36709o98838n43879k18052J62151M98186
11234c880286O76677O39177M50240K01474q7104m22187p33661q56209o55116k03775
11224d870770K42008N13005O78583Q62018J039492J117263J089583J041397J052030
11215B764609J139878J246435J259859J098403P82693M07311R5538j2990J19222
11206H900958L48698M56295K81863j82523p61784j166087j226617j093823j021985
11197D534995j042749j009745q12680m95205k33959j55163k25583l82967o14766
11188d37822q62436j019147j016657q81557o78834l95925j966M43516Q19433J033206
11178b998189J071306R95505Q88244P74810O03814L39871O5311q7709q7238j6338
$$ plain form
11168 1549387 1560625 1515844 1423429 1389802 1480354 1628939 1654414 1372397 739505 -79978
11158 -79978 -766114 -1003830 -669020 99641 988423 1660490 1892136 1636776 985759 66987
11148 66987 -1003203 -2060916 -2893691 -3336225 -3342720 -2985838 -2409237 -1808987 -1346576 -1068107
11138 -1068107 -1021210 -1285047 -1774923 -2196990 -2238202 -1712259 -613268 873549 2464057
11129 2464057 3911498 5070188 5888538 6385575 6607804 6594131 6415347 6205654 6084871
11120 6084871 6098962 6251009 6475542 6589326 6401889 5899609 5299456 4883071 4745859 4777940
11110 4777940 4880800 5064461 5342280 5669352 6011054 6395320 6837786 7246568 7464752
11101 7464752 7403506 7101937 6646448 6081984 5463897 4912451 4524536 4310757 4249282 4337863
$$ packed form
11168A549387J1238m4781r2415l3627R0552J48585K5475k82017o32892q19483
11158g9978o86136k37716L34810P68661Q88782O72067K31646k55360o51017r18772
11148F6987j070190j057713q32775m42534o495L56882N76601O00250M62411K78469
11138a068107M6897k63837m89876m22067m1212N25943J098991J486817J590508
11129B464057J447441J158690Q18350M97037K22229j3673j78784k09693j20783
11120F084871J4091J52047K24533J13784j87437n02280o00153m16385j37212L2081
11110D777940J02860J83661K77819L27072L41702L84266M42466M08782K18184
11101G464752o1246l01569m55489n64464o18087n51446l87915k13779o1475Q8581
$$ plain form
11091 4337863 4570919 4900793 5239210 5507684 5679184 5799257 6002631 6381233 6817289
11082 6817289 7056612 6952009 6580476 6137309 5801875 5677121 5757231 5941352 6113366 6230274
11072 6230274 6300701 6294812 6166731 5936254 5667269 5366903 4975863 4481088 3973515 3518668
11062 3518668 3015422 2294688 1318123 220948 -781373 -1535569 -2067398 -2540031 -3090475
11053 -3090475 -3700316 -4200324 -4414848 -4332527 -4136915 -4048871 -4155453 -4384003 -4589236 -4634408
11043 -4634408 -4408782 -3882685 -3174279 -2442045 -1746993 -1087128 -489736 -38121 163522
11034 163522 61828 -291821 -752124 -1171287 -1487824 -1663684 -1602600 -1259141 -769731 -344188
11024 -344188 -90107 -31455 -204295 -620189 -1167437 -1647588 -1918687 -1951238 -1745815 -1285734
$$ packed form
11091D337863K33056L29874L38417K68474J71500J20073K03374L78602M36056
11082F817289K39323j04603l71533m43167l35434j24754Q0110J84121J72014J16908
11072F230274P0427n889j28081k30477k68985l00366l91040m94775n07573m54847
11062C518668n03246p20734r76565j097175j002321p54196n31829m72633n50444
11053c090475o09841n00008k14524Q2321J95612Q8044j06582k28550k05233m5172
11043d634408K25626N26097P08406P32234O95052O59865N97392M51615K01643
11034A63522j01694l53649m60303m19163l16537j75860O1084L43459M89410M25543
11024c44188K54081N8652j72840m15894n47248m80151k71099l2551K05423M60081
$$ plain form
11014 -1285734 -603120 211659 1134438 2284506 3782516 5529925 7205605 8502679 9354054
11005 9354054 9872465 10098164 9939664 9351058 8418394 7255924 5926319 4488542 3102245
10996 3102245 2016327 1390757 1164818 1130569 1130142 1161941 1317121 1695251 2360144 3272309
10986 3272309 4269375 5148712 5731564 5869296 5512953 4810718 4070912 3604750 3559781 3859015
10976 3859015 4272843 4535721 4473165 4043163 3288705 2316346 1328182 591902 259884 225353
10966 225353 190593 -111272 -693428 -1291779 -1587017 -1444160 -996409 -551636 -373112 -549234
10956 -549234 -1079325 -1951641 -3054814 -4131270 -4917383 -5311140 -5405060 -5379654 -5333045 -5176914
10946 -5176914 -4736617 -3970053 -3044754 -2199831 -1564093 -1132240 -885242 -836359 -957877 -1139847
$$ packed form
11014a285734O82614Q14779R22779J150068J498010J747409J675680J297074Q51375
11005I354054N18411K25699j58500n88606r32664j162470j329605j437777j386297
10996C102245j085918o25570k25939l4249m27L1799J55180L78130O64893R12165
10986C272309R97066Q79337N82852J37732l56343p02235p39806m66162m4969K99234
10976C859015M13828K62878o2556m30002p54458r72359r88164p36280l32018l4531
10966B25353l4760l01865n82156n98351k95238J42857M47751M44773J78524j76122
10956e49234n30091q72316j103173j076456p86113l93757r3920K5406M6609J56131
10946e176914M40297P66564R25299Q44923O35738M31853K46998M8883j21518j81970
$$ plain form
10936 -1139847 -1242332 -1161411 -806063 -95404 929977 2051218 2955295 3367083 3160706
10927 3160706 2414264 1389057 420249 -246608 -567663 -688458 -841974 -1248055 -2017134
10918 -2017134 -3073254 -4199396 -5167822 -5851056 -6227012 -6251051 -5807648 -4881567 -3692540
10909 -3692540 -2541800 -1591397 -855027 -305206 39834 91191 -226383 -879678 -1676394
10900 -1676394 -2310222 -2563739 -2464362 -2210065 -2002411 -1954891 -2049601 -2149045 -2114759 -1909860
10890 -1909860 -1581318 -1209425 -910922 -829763 -1058968 -1596224 -2325175 -3022972 -3488106 -3688586
10880 -3688586 -3794928 -4072646 -4653662 -5370936 -5867494 -5848756 -5225619 -4135494 -2913766
10871 -2913766 -1945023 -1429629 -1323696 -1513486 -1951098 -2607803 -3395885 -4217470 -5034524
$$ packed form
10936a139847j02485Q0921L55348P10659J025381J121241R04077M11788k06377
10927C160706p46442j025207r68808o66857l21055j20795j53516m06081p69079
10918b017134j056120j126142r68426o83234l75956k4039M43403R26081J189027
10909c692540J150740R50403P36370N49821L45040N1357l17574o53295p96716
10900a676394o33828k53517R9377K54297K07654M7520r4710r9444L4286K04899
10890a909860L28542L71893K98503Q1159k29205n37256p28951o97797m65134k00480
10880c688586j06342k77718n81016p17274m96558J8738O23137J090125J221728
10871b913766R68743N15394J05933j89790m37612o56705p88082q21585q17054
$$ plain form
10862 -5034524 -5802346 -6398391 -6687709 -6635433 -6306103 -5770233 -5073372 -4296399 -3597956 -3155640
10852 -3155640 -3025549 -3063974 -3056000 -2890811 -2574573 -2193291 -1936617 -2080231 -2803388 -3981319
10842 -3981319 -5213176 -6085007 -6407681 -6258470 -5891642 -5571752 -5385876 -5250932 -5089454
10833 -5089454 -4872581 -4545454 -4037691 -3314669 -2366373 -1199534 109143 1368583 2334882
10824 2334882 2869740 3038138 3013875 2911011 2754807 2528237 2160986 1553284 645761 -573769
10814 -573769 -2088714 -3826221 -5638705 -7319749 -8628855 -9344864 -9337775 -8581009 -7124366
10805 -7124366 -5110833 -2833118 -716387 837416 1655520 1877528 1824285 1746629 1654414
10796 1654414 1419989 1019136 564801 176457 -54695 -21803 348306 1009146 1837571 2741771
$$ packed form
10862e034524p67822n96045k89318N2276L29330N35870O96861P76973O98443M42316
10852c155640J30091l8425P974J65189L16238L81282K56674j43614p23157j177931
10842c981319j231857q71831l22674J49211L66828L19890J85876J34944J61478
10833e089454K16873L27127N07763P23022R48296J166839J308677J259440R66299
10824B334882N34858J68398k4263j02864j56204k26570l67251o07702r07523j219530
10814e73769j514945j737507j812484j681044j309106p16009P089P56766J456643
10805g124366K013533K277715K116731J553803Q18104K22008n3243p7656r2215
10796A654414k34425m00853m54335l88344k31152L2892L70109O60840Q28425R04200
$$ plain form
10786 2741771 3648691 4404163 4817343 4850717 4681991 4555105 4614608 4873813 5263513 5681993
10776 5681993 6068804 6461992 6957836 7627308 8449983 9253129 9716649 9514278 8530456
10767 8530456 6983897 5309529 3929632 3100546 2869001 3117575 3599512 4022219 4208480
10758 4208480 4113446 3719066 2995846 1960229 769709 -288748 -976150 -1277933 -1389124
10749 -1389124 -1491782 -1553024 -1428189 -1102782 -716752 -437362 -371706 -501455 -677482 -720650
10739 -720650 -551958 -263189 -72300 -166233 -531063 -948009 -1184383 -1172973 -1004484 -772938
10729 -772938 -535537 -358733 -263580 -185740 -26372 263308 597244 786144 749290 647592
10719 647592 727305 1071190 1552918 1990970 2287228 2458188 2571898 2664127 2734124 2817049
$$ packed form
10786B741771R06920P55472M13180L3374j68726j26886N9503K59205L89700M18480
10776E681993L86811L93188M95844O69472Q22675Q03146M63520k02371r83822
10767H530456j546559j674368j379897q29086k31545K48574M81937M22707J86261
10758D208480r5034l94380p23220j035617j190520j058457o87402l01783j11191
10749a389124j02658o1242J24835L25407L86030K79390O5656j29749j76027m3168
10739g20650J68692K88769J90889r3933l64830m16946k36374J1410J68489K31546
10729g72938K37401J76804R5153P7840J59368K89680L33936J88900l6854j01698
10719F47592P9713L43885M81728M38052K96258J70960J13710R2229O9997Q2925
$$ [...]
##END NTUPLES=NMR SPECTRUM
##END=
