##TITLE=31P ikalashn
94-2024-BAU
18.11.2024
##JCAMPDX= 6.0         $$ Bruker NMR JCAMP-DX V2.0
##DATA TYPE= NMR SPECTRUM
##DATA CLASS= NTUPLES
##ORIGIN= UXNMR, Bruker Analytische Messtechnik GmbH
##OWNER= root
$$ TOPSPIN		Version 1.3
$$ 2024-11-18 14:11:24.390 +0400  Irina@DPX200
$$ Compression mode = diff/dup
##.OBSERVE FREQUENCY= 81.01967998063
##.OBSERVE NUCLEUS= ^31P
##.ACQUISITION MODE= SIMULTANEOUS
##.ACQUISITION SCHEME= undefined
##.AVERAGES= 64
##.DIGITISER RES= 17
##SPECTROMETER/DATA SYSTEM= spect
##.PULSE SEQUENCE= zgpg
##.SOLVENT NAME= D2O
##.SHIFT REFERENCE= INTERNAL, D2O, 1, 298.5841
##AUDIT TRAIL= $$ (NUMBER, WHEN, WHO, WHERE, WHAT)
$$ ##TITLE= Audit trail, TOPSPIN		Version 1.3
$$ ##JCAMPDX= 5.01
$$ ##ORIGIN= Bruker BioSpin GmbH
$$ ##OWNER= Irina
$$ $$ F:/spectra/data/iren/nmr/P31dec/1/pdata/1/auditp.txt
$$ ##AUDIT TRAIL=  $$ (NUMBER, WHEN, WHO, WHERE, VERSION, WHAT)
(   1,<2024-11-18 14:09:10.343 +0400>,<Irina>,<DPX200>,<TOPSPIN 1.3>,
      <acquisition in progress>)
(   2,<2024-11-18 14:10:51.921 +0400>,<Irina>,<DPX200>,<TOPSPIN 1.3>,
      <Start of raw data processing
       efp BC_mod = 2 LB = 10 FT_mod = 6 PKNL = 1 PHC0 = 141.076 PHC1 = 139.8143 SI = 32K 
       data hash MD5: 32K
       29 66 2C 08 05 F8 F2 94 B6 73 6E 44 EE 90 A0 EF>)
(   3,<2024-11-18 14:10:54.343 +0400>,<Irina>,<DPX200>,<TOPSPIN 1.3>,
      <apk 
       data hash MD5: 32K
       28 D1 2A A7 97 94 A1 E7 8C 8C 13 12 35 EC EF C0>)
(   4,<2024-11-18 14:11:04.578 +0400>,<Irina>,<DPX200>,<TOPSPIN 1.3>,
      <pk fgphup PHC0 = -12.2 PHC1 = 0 
       data hash MD5: 32K
       44 0C A6 4A EF DF 41 30 2D 21 11 DA F3 A1 61 72>)
(   5,<2024-11-18 14:11:06.421 +0400>,<Irina>,<DPX200>,<TOPSPIN 1.3>,
      <abs n ABSG = 5 
       data hash MD5: 32K
       22 65 A7 32 50 30 4F BE CE 22 1B E4 00 A7 AD 81>)
$$ ##END=
$$ 
$$ $$ hash MD5
$$ $$ 9D 66 85 EA 24 8D 2F 65 01 D6 CF AB B2 B2 55 C4
##$RELAX= 
##$RELAX= 
##$RELAX= 
##$RELAX= 
##$RELAX= 
##$RELAX= 
##$RELAX= 
##$RELAX= 
##$RELAX= 
##$RELAX= 
##$RELAX= 
$$ Bruker specific parameters
$$ --------------------------
##$DU= <F:/spectra>
##$EXPNO= 1
##$NAME= <P31dec>
##$PROCNO= 1
##$TYPE= <nmr>
##$USER= <iren>
##$AMP= (0..31)
100 100 100 100 100 100 100 100 100 100 100 100 100 100 100 100 100 100 
100 100 100 100 100 100 100 100 100 100 100 100 100 100 
##$ANAVPT= -1
##$AQSEQ= 0
##$AQ_mod= 1
##$AUNM= <au_zg>
##$AUTOPOS= <>
##$BF1= 81.014009
##$BF2= 200.13
##$BF3= 200.13
##$BF4= 200.13
##$BF5= 200.13
##$BF6= 200.13
##$BF7= 200.13
##$BF8= 200.13
##$BYTORDA= 1
##$CFDGTYP= 0
##$CFRGTYP= 5
##$CHEMSTR= <none>
##$CNST= (0..63)
1 1 145 1 1 1 1 1 1 1 1 1 1 1 1 1 1 1 1 1 1 1 1 1 1 1 1 1 1 1 1 1 1 1 
1 1 1 1 1 1 1 1 1 1 1 1 1 1 1 1 1 1 1 1 1 1 1 1 1 1 1 1 1 1 
##$CPDPRG= <waltz16>
##$CPDPRG1= <>
##$CPDPRG2= <waltz16>
##$CPDPRG3= <>
##$CPDPRG4= <mlev>
##$CPDPRG5= <mlev>
##$CPDPRG6= <mlev>
##$CPDPRG7= <mlev>
##$CPDPRG8= <mlev>
##$CPDPRGB= <>
##$CPDPRGT= <>
##$D= (0..63)
$$ [...]
##$SW_h= 37037.037037037
##$TD= 32768
##$TD0= 1
##$TE= 300
##$TE2= 300
##$TE3= 300
##$TEG= 300
##$TL= (0..7)
0 120 53 12 22 120 120 120 
##$TP= (0..7)
150 150 150 150 150 150 150 150 
##$TP07= 0
##$TPNAME0= <>
##$TPNAME1= <>
##$TPNAME2= <>
##$TPNAME3= <>
##$TPNAME4= <>
##$TPNAME5= <>
##$TPNAME6= <>
##$TPNAME7= <>
##$TPOAL= (0..7)
0.5 0.5 0.5 0.5 0.5 0.5 0.5 0.5 
##$TPOFFS= (0..7)
0 0 0 0 0 0 0 0 
##$TUNHIN= 0
##$TUNHOUT= 0
##$TUNXOUT= 0
##$USERA1= <user>
##$USERA2= <user>
##$USERA3= <user>
##$USERA4= <user>
##$USERA5= <user>
##$V9= 5
##$VALIST= <valist>
##$VCLIST= <CCCCCCCCCCCCCCC>
##$VD= 0
##$VDLIST= <DDDDDDDDDDDDDDD>
##$VPLIST= <PPPPPPPPPPPPPPP>
##$VTLIST= <TTTTTTTTTTTTTTT>
##$WBST= 1024
##$WBSW= 4
##$XGAIN= (0..3)
0 0 0 0 
##$XL= 0
##$YL= 0
##$YMAX_a= 699
##$YMIN_a= -9274
##$ZGOPTNS= <>
##$ZL1= 120
##$ZL2= 120
##$ZL3= 120
##$ZL4= 120
##$ABSF1= 298.5841
##$ABSF2= -158.5842
##$ABSG= 5
##$ABSL= 5
##$ALPHA= 0
##$AQORDER= 0
##$ASSFAC= 0
##$ASSFACI= 0
##$ASSFACX= 0
##$ASSWID= 0
##$AUNMP= <proc_1d>
##$AXLEFT= 0
##$AXRIGHT= 0
##$AXTYPE= 0
##$AXUNIT= <>
##$AZFE= 0.1
##$AZFW= 0.5
##$BCFW= 0
##$BC_mod= 2
##$BYTORDP= 0
##$COROFFS= 0
##$CY= 12.5935478210449
##$DATMOD= 1
##$DC= 0
##$DFILT= <>
##$DTYPP= 0
##$F1P= 47.1127640792319
##$F2P= -24.0371245302204
##$FCOR= 0.5
##$FTSIZE= 32768
##$FT_mod= 6
##$GAMMA= 0
##$GB= 0
##$INTBC= 1
##$INTSCL= 7.269226e-011
##$ISEN= 30
##$LB= 10
##$LEV0= 0
##$LPBIN= 0
##$MAXI= 12.09355
##$MC2= 0
##$MEAN= 0
##$ME_mod= 0
##$MI= 0.7550151
##$NCOEF= 0
##$NC_proc= -12
##$NLEV= 6
##$NOISF1= 298.5841
##$NOISF2= 270.0111
##$NSP= 0
##$NTH_PI= 0
##$NZP= 0
##$OFFSET= 298.5841
##$PC= 1.4
##$PHC0= 118.6724
##$PHC1= 177.7834
##$PH_mod= 1
##$PKNL= yes
##$PPARMOD= 0
##$PPDIAG= 0
##$PPIPTYP= 0
##$PPMPNUM= 100
##$PPRESOL= 1
##$PSCAL= 0
##$PSIGN= 0
##$REVERSE= no
##$SF= 81.014009
##$SI= 32768
##$SIGF1= 270.0111
##$SIGF2= -158.5842
##$SINO= 77.54984
##$SIOLD= 32768
##$SREGLST= <31P.CDCl3>
##$SSB= 0
##$STSI= 32768
##$STSR= 0
##$SW_p= 37037.037037037
##$SYMM= 0
##$S_DEV= 0
##$TDeff= 32768
##$TDoff= 0
##$TI= <>
##$TILT= no
##$TM1= 0
##$TM2= 0
##$TOPLEV= 0
##$USERP1= <user>
##$USERP2= <user>
##$USERP3= <user>
##$USERP4= <user>
##$USERP5= <user>
##$WDW= 1
##$XDIM= 32768
##$YMAX_p= 291624177
##$YMIN_p= -19186052
$$ End of Bruker specific parameters
$$ ---------------------------------
##NTUPLES= NMR SPECTRUM
##VAR_NAME=  FREQUENCY,     SPECTRUM/REAL,   SPECTRUM/IMAG
##SYMBOL=    X,             R,               I
##VAR_TYPE=  INDEPENDENT,   DEPENDENT,       DEPENDENT
##VAR_FORM=  AFFN,          ASDF,            ASDF
##VAR_DIM=   32768,         32768,           32768
##UNITS=     HZ,            ARBITRARY UNITS, ARBITRARY UNITS
##FACTOR=    1.13031516577767, 1,            1
##FIRST=     37037.037037037, -2312328,      15819148
##LAST=      0,             -2245240,        6595985
##MIN=       0,             -19186052,       0
##MAX=       37037.037037037, 291624177,     0
$$ Real data points
##PAGE= N=1
##DATA TABLE= (X++(R..R)), XYDATA
$$ [...]
$$ plain form
15856 10456628 9624354 8767819 8075268 7535584 7001427 6378018 5699919 5063845 4540924
15847 4540924 4145821 3851258 3616474 3415710 3243854 3118293 3044600 2904182 2440307 1487225
15837 1487225 181023 -1091425 -1911172 -2059528 -1611932 -828612 -3152 588546 710792
15828 710792 296347 -449508 -1186050 -1659686 -1809373 -1777020 -1814973 -2108324 -2675367 -3424038
15818 -3424038 -4247638 -5063861 -5818141 -6471398 -6995180 -7356688 -7476340 -7242562 -6619794
15809 -6619794 -5728635 -4807365 -4088582 -3705932 -3681170 -3917890 -4216338 -4400867 -4438346 -4371792
15799 -4371792 -4196503 -3862041 -3339817 -2641517 -1800855 -849174 161360 1088014 1755008
15790 1755008 2091724 2106409 1803139 1254671 649921 200372 49774 201204 522834 895146
$$ packed form
15856A0456628q32274q56535o92551n39684n34157o23409o78099o36074n22921
15847D540924l95103k94563k34784k00764j71856j25561p3693j40418m63875r53082
15837A487225j306202j272448q19747j48356M47596P83320Q25460N91698J22246
15828G10792m14445p45855p36542m73636j49687L2353l7953k93351n67043p48671
15818c424038q23600q16223p54280o53257n23782l61508j19652K33778O22768
15809f619794Q91159R21270P18783L82650K4762k36720k98448j84529l7479O6554
15799d371792J75289L34462N22224O98300Q40662R51681J010534R26654O66994
15790A755008L36716J4685l03270n48468o04750m49549j50598J51430L21630L72312
$$ plain form
15780 895146 1278548 1631276 1885675 1950276 1701727 1122774 438206 -9851 -26807 341532
15770 341532 913686 1401468 1425190 725547 -650405 -2435488 -4370050 -6300439 -8125589
15761 -8125589 -9698340 -10792778 -11234489 -11018075 -10244864 -9003750 -7355667 -5424842 -3430928
15752 -3430928 -1608962 -142308 863063 1370945 1395977 1003339 312204 -503922 -1220954
15743 -1220954 -1623273 -1628212 -1317425 -837341 -312399 198232 702613 1195920 1582267 1732149
15733 1732149 1631429 1402949 1174523 994299 845094 668756 410392 81264 -267785
15724 -267785 -619839 -967026 -1233201 -1290628 -1050340 -502165 307150 1270506 2248740 3189076
15714 3189076 4157776 5208061 6247708 7089892 7623743 7893092 8056187 8329739 8889539
$$ packed form
15780H95146L83402L52728K54399O4601k48549n78953o84568m48057j6956L68339
15770C41532N72154M87782K3722o99643j375952j785083j934562j930389j825150
15761h125589j572751j094438m41711K16414P73211J241114J648083J930825J993914
15752c430928J821966J466654J005371N07882K5032l92638o91135q16126p17032
15743a220954m02319m939L10787M80084N24942N10631N04381M93307L86347J49882
15733A732149j00720k28480k28426j80224j49205j76338k58364l29128l49049
15724b67785l52054l47187k66175n7427K40288N48175Q09315R63356R78234R40336
15714C189076R68700J050285J039647Q42184N33851K69349J63095K73552N59800
$$ plain form
15705 8889539 9733444 10673904 11483252 11998445 12121471 11851062 11333762 10770366 10247519
15696 10247519 9724784 9157173 8598854 8197599 8068674 8189050 8455258 8790598 9153700
15687 9153700 9503431 9793095 9975055 10019061 9915554 9642902 9183290 8591617 7993206 7475008
15677 7475008 6996722 6425828 5664500 4731286 3691391 2527836 1158565 -393174 -1896589
15668 -1896589 -3013183 -3510860 -3383561 -2790441 -1943118 -1048001 -281821 199923 272339
15659 272339 -72448 -672555 -1288373 -1779082 -2173765 -2546484 -2831789 -2817276 -2372968 -1643304
15649 -1643304 -908457 -322256 118111 426410 562058 495704 270496 9362 -143569 -99456
15639 -99456 176101 703085 1492816 2503190 3611908 4681211 5607218 6286609 6625021
$$ packed form
15705H889539Q43905R40460Q09348N15193J23026k70409n17300n63396n22847
15696A0247519n22735n67611n58319m01255j28925J20376K66208L35340L63102
15687I153700L49731K89664J81960M4006j03507k72652m59612n91673n98411n18198
15677G475008m78286n70894p61328r33214j039895j163555j369271j551739j503415
15668a896589j116594m97677J27299N93120Q47323Q95117P66180M81744P2416
15659B72339l44787o00107o15818m90709l94683l72719k85305J4513M44308P29664
15649a643304P34847N86201M40367L08299J35648o6354k25208k61134j52931M4113
15639i9456K75557N26984P89731J010374J108718J069303R26007O79391L38412
$$ plain form
15630 6625021 6597043 6275258 5841925 5544981 5552665 5831026 6197465 6460017 6454571 6056089
15620 6056089 5282598 4343394 3498059 2902225 2564610 2360281 2123166 1791436 1441605
15611 1441605 1163845 964892 796456 641114 564408 644813 871888 1124498 1229180 1104003
15601 1104003 866512 757350 947659 1427428 2050334 2645840 3086529 3286160 3187776 2792179
15591 2792179 2171836 1422322 626345 -136783 -804146 -1341911 -1693255 -1749319 -1427119 -754442
15581 -754442 133481 1053349 1832293 2368345 2677405 2850661 2945126 2944827 2853982 2774245 2830553
15570 2830553 3054202 3381136 3767550 4215192 4664673 4987270 5096680 5002468 4747444 4313760
15560 4313760 3602444 2538976 1234675 -15365 -934474 -1432231 -1551924 -1293441 -601007
$$ packed form
15630F625021k7978l21785m33333k96944P684K78361L66439K62552n446l98482
15620F056089p73491r39204q45335n95834l37615k04329k37115l31730l49831
15611A441605k77760j98953j68436j55342p6706Q0405K27075K52610J04682j25177
15601A104003k37491j09162J90309M79769O22906N95506M40689J99631r8384l95597
15591B792179o20343p49514p95977p63128o67363n37765l51344n6064L22200O72677
15581g54442Q87923R19868P78944N36052L09060J73256R4465k99r0845p9737N6308
15570B830553K23649L26934L86414M47642M49481L22597J09410r4212k55024m33684
15560D313760p11316j063468j304301j250040r19109m97757j19693K58483O92434
$$ plain form
15551 -601007 476607 1728045 2882082 3730837 4169583 4151466 3654677 2727963 1567282
15542 1567282 459872 -435412 -1182820 -1886819 -2545954 -3135418 -3674588 -4163082 -4586027
15533 -4586027 -4999214 -5491952 -6066950 -6637546 -7145038 -7627158 -8130447 -8599823 -8901121
15524 -8901121 -8899853 -8513942 -7770286 -6821377 -5871718 -5050474 -4339976 -3649009 -2960538 -2350361
15514 -2350361 -1844636 -1373356 -899898 -459090 -51654 356593 807657 1402840 2207179
15505 2207179 3099598 3863748 4369178 4575774 4435869 3921696 3139861 2275332 1434970
15496 1434970 644626 -44421 -533945 -762378 -738916 -504929 -104066 456592 1198659 2067258
15486 2067258 2892133 3467743 3637416 3365038 2764982 2026371 1312348 707530 229029
$$ packed form
15551f01007J077614J251438J154037Q48755M38746j8117m96789r26714j160681
15542A567282j107410q95284p47408p03999o59135n89464n39170m88494m22945
15533d586027m13187m92738n74998n70596n07492m82120n03289m69376l01298
15524h901121J268L85911P43656R48909R49659Q21244P10498O90967O88471O10177
15514b350361N05725M71280M73458M40808M07436M08247M51064N95183Q04339
15505B207179Q92419P64150N05430K06596j39905n14173p81835q64529q40362
15496A434970p90344o89047m89524k28433K3462K33987M00863N60658P42067Q68599
15486B067258Q24875N75610J69673k72378o00056p38611p14023o04818m78501
$$ plain form
15477 229029 -84252 -155249 24363 350012 659305 800728 701780 400766 1379 -378514
15467 -378514 -610986 -611994 -426916 -203529 -58224 56881 343146 966006 1836184 2610491
15457 2610491 2971374 2881151 2532656 2094394 1546101 783659 -134284 -922633 -1295828 -1207613
15447 -1207613 -827465 -356061 49430 240524 124408 -246596 -703185 -1091750 -1348420
15438 -1348420 -1460407 -1432266 -1295777 -1090193 -814089 -436398 13277 392797 551512 463655
15428 463655 193462 -213147 -712518 -1163767 -1387811 -1332091 -1098865 -880703 -891846 -1283957
15418 -1283957 -2085906 -3209718 -4497751 -5778465 -6906566 -7738913 -8145314 -8100921 -7702003
15409 -7702003 -7096917 -6451448 -5938930 -5732547 -5969612 -6673825 -7722112 -8852521 -9755115
$$ packed form
15477B29029l13281p0997J79612L25649L09293J41423r8948l01014l99387l79893
15467c78514k32472j008J85078K23387J45305J15105K86265O22860Q70178P74307
15457B610491L60883r0223l48495m38262n48293p62442r17943p88349l73195Q8215
15447a207613L80148M71404M05491J91094j16116l71004m56589l88565k56670
15438a348420j11987K8141J36489K05584K76104L77691M49675L79520J58715q7857
15428D63655k70193m06609m99371m51249k24044N5720K33226K18162j1143l92111
15418a283957q01949j123812j288033j280714j128101q32347m06401M4393L98918
15409g702003O05086O45469N12518K06383k37065p04213j048287j130409r02594
$$ plain form
15400 -9755115 -10256879 -10381558 -10195304 -9681085 -8819623 -7700148 -6485628 -5328082 -4354630
15391 -4354630 -3661923 -3280126 -3176733 -3295430 -3571342 -3955086 -4429149 -4952535 -5403453
15382 -5403453 -5628195 -5560074 -5242704 -4732944 -4047294 -3194931 -2221284 -1272426 -603042 -463214
15372 -463214 -928844 -1784232 -2634278 -3217100 -3579317 -3924177 -4349177 -4770194 -5028030 -5048785
15362 -5048785 -4939838 -4876992 -4938434 -5151514 -5593162 -6278758 -7003871 -7436928 -7375929 -6883625
15352 -6883625 -6221404 -5671346 -5328450 -4980599 -4245665 -2897094 -1068650 837592 2410123
15343 2410123 3398302 3719465 3482787 3001043 2607250 2468230 2612792 3035501 3733794
15334 3733794 4701847 5842080 6895204 7592498 7870819 7851187 7698701 7563710 7538395
$$ packed form
15400i755115n01764j24679J86254N14219Q61462J119475J214520J157546R73452
15391d354630O92707L81797J03393j18697k75912l83744m74063n23386m50918
15382e403453k24742O8121L17370N09760O85650Q52363R73647R48858O69384J39828
15372d63214m65630q55388q50046n82822l62217l44860m25000m21017k57836k0755
15362e048785J08947O2846o1442k13080m41648o85596p25113m33057O0999M92304
15352f883625O62221N50058L42896L47851P34934J348571J828444J906242J572531
15343B410123R88179L21163k36678m81744l93793j39020J44562M22709O98293
15334C733794R68053J140233J053124O97294K78321j9632j52486j34991k5315
$$ plain form
15325 7538395 7610350 7672007 7580973 7274073 6875933 6628256 6661162 6880898 7067708 7027014
15315 7027014 6705029 6244455 5900356 5868504 6171032 6678690 7247135 7792504 8207534 8274044
15305 8274044 7761420 6614007 5006504 3258550 1707413 559547 -189723 -662960 -961965
15296 -961965 -1085057 -969827 -688251 -501665 -606553 -916684 -1200789 -1343392 -1383229 -1391429
15286 -1391429 -1406363 -1458881 -1582993 -1790683 -2125900 -2708781 -3593249 -4605423 -5417374 -5769992
15276 -5769992 -5583759 -4953053 -4123886 -3381186 -2867931 -2574494 -2449021 -2393788 -2286197 -2084642
15266 -2084642 -1826040 -1576968 -1409018 -1348903 -1351174 -1314866 -1145506 -851137 -570272 -456497
15256 -456497 -530832 -690785 -802165 -751351 -489261 -14793 655348 1396967 1928479 2004745
$$ packed form
15325G538395P1955O1657r1034l06900l98140k47677L2906K19736J86810m0694
15315G027014l21985m60574l44099l1852L02528N07658N68445N45369M15030O6510
15305H274044n12624j147413j607503j747954j551137j147866p49270m73237k99005
15296i61965j23092J15230K81576J86586j04888l10131k84105j42603l9837q200
15286a391429j4934n2518j24112k07690l35217n82881q84468j012174q11951l52618
15276e769992J86233O30706Q29167P42700N13255K93437J25473N5233J07591K01555
15266b084642K58602K49072J67950O0115k271L6308J69360K94369K80865J13775
15256d56497p4335j59953j11380N0814K62090M74468O70141P41619N31512P6266
$$ plain form
15246 2004745 1610299 927476 196090 -386251 -649418 -438932 275341 1337627 2502646
15237 2502646 3540664 4282292 4650250 4668345 4433681 4059160 3652689 3359064 3314709 3493191
15227 3493191 3675894 3655142 3435401 3160160 2886440 2575033 2293859 2272825 2707819 3557748
15217 3557748 4551012 5368558 5807774 5789095 5307646 4444163 3346090 2117652 739864
15208 739864 -849522 -2614218 -4405133 -6034839 -7297774 -7979678 -7952346 -7271412 -6165440
15199 -6165440 -4926680 -3802190 -2928533 -2299239 -1801009 -1345107 -976177 -804522 -881956
15190 -881956 -1137937 -1378273 -1421348 -1260969 -1053047 -993464 -1234716 -1819907 -2645741 -3504105
15180 -3504105 -4170593 -4495337 -4448093 -4148803 -3849505 -3776162 -3950564 -4216069 -4415192 -4491871
$$ packed form
15246B004745l94446o82823p31386n82341k63167K10486P14273J062286J165019
15237B502646J038018P41628L67958J8095k34664l74521m06471k93625m4355J78482
15227C493191J82703k0752k19741k75241k73720l11407k81174k1034M34994Q49929
15217C557748R93264Q17546M39216j8679m81449q63483j098073j228438j377788
15208G39864j589386j764696j790915j629706j262935o81904K7332O80934J105972
15199f165440J238760J124490Q73657O29294M98230M55902L68930J71655p7434
15190h81956k55981k40336m3075J60379K07922N9583k41252n85191q25834q58364
15180c504105o66488l24744M7244K99290K99298P3343j74402k65505j99123p6679
$$ plain form
15170 -4491871 -4469018 -4380793 -4248493 -4112955 -4021712 -3998326 -4030554 -4036434 -3890923 -3507136 -2851466
15159 -2851466 -1922299 -775799 452842 1602561 2576565 3349969 3882154 4125229 4144307
15150 4144307 4130871 4315808 4844439 5626071 6349039 6704051 6571676 6018233 5196060 4267388
15140 4267388 3387513 2669227 2115076 1616331 1063038 449233 -158778 -707961 -1158719
15131 -1158719 -1421052 -1364199 -893572 36424 1407046 3058007 4730887 6206502 7357377
15122 7357377 8136093 8535118 8563814 8227849 7456949 6115950 4166383 1805290 -601938
15113 -601938 -2724870 -4414292 -5675313 -6559212 -7098001 -7287652 -7139305 -6747123 -6292750
15104 -6292750 -5963469 -5809202 -5718433 -5545235 -5194518 -4615861 -3806283 -2871297 -2033106 -1492524
$$ packed form
15170d491871K2853Q8225J32300J35538R1243K3386l2228n880J45511L83787O55670
15159b851466R29167J146500J228641J149719R74004P73404N32185K43075J9078
15150D144307j3436J84937N28631P81632P22968L55012j32375n53443q22173r28672
15140D267388q79875p18286n54151m98745n53293o13805o08011n49183m50758
15131a158719k62333N6853M70627R29996J370622J650961J672880J475615J150875
15122G357377P78716L99025K8696l35965p70900j340999j949567k361093k407228
15113f01938k122932j689422j261021q83899n38789j89651J48347L92182M54373
15104f292750L29281J54267R0769J73198L50717N78657Q09578R34986Q38191N40582
$$ plain form
15094 -1492524 -1277959 -1277673 -1405842 -1684834 -2182067 -2894536 -3716131 -4544748 -5376503 -6262683
15084 -6262683 -7234343 -8256668 -9206254 -9864738 -10002832 -9575615 -8793825 -7929898 -7055491
15075 -7055491 -6006422 -4602718 -2863854 -1004026 747685 2268199 3491509 4325034
15067 4325034 4673727 4540982 4086500 3578907 3240328 3100723 3045285 2980324 2912055 2916074
15057 2916074 3043434 3245306 3399754 3427792 3340756 3164833 2872603 2380046 1649636 830978
15047 830978 198701 -80416 -43006 156307 323420 256602 -140766 -733377 -1228716 -1376192
15037 -1376192 -1099694 -504749 190163 730381 954754 921314 830156 820238 908723 1088937
15027 1088937 1396397 1854320 2353542 2646231 2537575 2046290 1387294 837758 557466
$$ packed form
15094a492524K14565K86j28169k78992m97233p12469q21595q28617q31755q86180
15084f262683r71660j022325r49586o58484j38094M27217P81790Q63927Q74407
15075g055491J049069J403704J738864J859828J751711J520514J223310Q33525
15067D325034L48693j32745m54482n07593l38579j39605n5438o4961o8269M019
15057B916074J27360K01872J54448K8038q7036j75923k92230m92557p30410q18658
15047H30978o32277k79117L7410J99313J67113o6818l97368n92611m95339j47476
15037a376192K76498N94945O94912N40218K24373l3440r1158r918Q8485J80214
15027A088937L07460M57923M99222K92689j08656m91285o58996n49536k80292
$$ plain form
15018 557466 500097 519852 534142 548153 576090 604799 629805 692236 839314 1024786 1129840
15007 1129840 1101925 995334 877505 746377 586518 458619 452711 596254 869215 1265082
14997 1265082 1775110 2323379 2773331 3019387 3031321 2797843 2311493 1656873 1045262 701611
14987 701611 703623 930437 1178813 1339692 1458909 1671588 2122681 2857928 3715885 4367750
14977 4367750 4516981 4102323 3285958 2262720 1159159 68823 -912417 -1683026 -2182702
14968 -2182702 -2512334 -2966032 -3814888 -5034061 -6312401 -7329179 -7967415 -8279267 -8316248
14959 -8316248 -8022326 -7297671 -6143878 -4718637 -3235304 -1812342 -456264 800144
14951 800144 1826089 2479577 2687114 2456794 1880987 1140312 443148 -105843 -537404
$$ packed form
15018E57466n7369J9755J4290J4011K7937K8709K5006O2431J47078J85472J05054
15007A129840k7915j06591j17829j31128j59859j27899n908J43543K72961L95867
14997A265082N10028N48269M49952K46056J1934k33478m86350o54620o11611l43651
14987G01611K012K26814K48376J60879J19217K12679M51093P35247Q57957O51865
14977D367750J49231m14658q16365j023238j103561j090336r81240p70609m99676
14968b182702l29632m53698q48856j219173j278340j016778o38236l11852l6981
14959h316248K93922P24655J153793J425241J483333J422962J356078J256408
14951H00144J025945O53488K07537k30320n75807p40675o97164n48991m31561
$$ plain form
14942 -537404 -903646 -1196398 -1371945 -1431630 -1453571 -1491274 -1492446 -1387371 -1172385 -884465
14932 -884465 -576301 -323486 -180349 -113117 -34298 84762 186694 247142 357835 584771
14922 584771 783896 675692 87036 -885061 -1897281 -2571945 -2720088 -2388774 -1784837
14913 -1784837 -1213868 -998447 -1315552 -2102340 -3158136 -4275800 -5275497 -6045474 -6583950
14904 -6583950 -6953651 -7163776 -7145303 -6865940 -6369832 -5729687 -5011901 -4265003 -3533140 -2909706
14894 -2909706 -2556749 -2595099 -3021343 -3752720 -4665440 -5606348 -6417435 -6965527 -7177495 -7042474
14884 -7042474 -6563589 -5737807 -4614759 -3291125 -1825849 -269038 1255304 2587894
14876 2587894 3626719 4359280 4817787 5064348 5247399 5523237 5839181 5921329 5510383
$$ packed form
14942e37404l66242k92752j75547n9685k1941l7703j172J05075K14986K87920
14932h84465L08164K52815J43137O7232P8819J19060J01932O0448J10693K26936
14922E84771J99125j08204n88656r72097j012220o74664j48143L31314O03937
14913a784837N70969K15421l17105p86788j055796j117664r99697p69977n38476
14904f583950l69701k10125J8473K79363M96108O40145P17786P46898P31863O23434
14894b909706L52957l8350m26244p31377r12720r40908q11087n48092k11968J35021
14884g042474M78885Q25782J123048J323634J465276J556811J524342J332590
14876B587894J038825P32561M58507K46561J83051K75838L15944Q2148m10946
$$ plain form
14867 5510383 4549210 3151997 1468923 -344308 -2060755 -3394688 -4169387 -4443529 -4416037
14858 -4416037 -4267073 -4123467 -4096115 -4300233 -4828331 -5616756 -6396544 -6901050 -7073027 -7032714
14848 -7032714 -6883286 -6588990 -6051680 -5250158 -4278292 -3285562 -2392806 -1633016 -970803
14839 -970803 -402352 -16783 75778 -153738 -642651 -1270398 -1884349 -2372162 -2740526 -3053129
14829 -3053129 -3336129 -3618720 -3993372 -4588503 -5475115 -6580763 -7714015 -8695340 -9429340
14820 -9429340 -9826553 -9770878 -9256546 -8478136 -7731814 -7248723 -7085096 -7130289 -7226540 -7257034
14810 -7257034 -7111752 -6645661 -5776313 -4594848 -3279378 -1958000 -732838 278695 1021921
14801 1021921 1559990 2036748 2587609 3221374 3785422 4126190 4251001 4264611 4234939 4168041
$$ packed form
14867E510383r61173j397213j683074j813231j716447j333933p74699k74142K7492
14858d416037J48964J43606K7352k04118n28098p88425p79788n04506j71977M0313
14848g032714J49428K94296N37310Q01522R71866R92730Q92756P59790O62213
14839i70803N68451L85569R2561k29516m88913o27747o13951m87813l68364l12603
14829c053129k83000k82591l74652n95131q86612j105648j133252r81325p34000
14820i429340l97213N5675N14332P78410P46322M83091J63627m5193r6251l0494
14810g257034J45282M66091Q69348J181465J315470J321378J225162J011533P43226
14801A021921N38069M76758N50861O33765N64048L40768J24811J3610k9672o6898
$$ plain form
14791 4168041 4042843 3828718 3482128 2973081 2352166 1710351 1079871 479446 -11841
14782 -11841 -323547 -496765 -621800 -686353 -602749 -370148 -82463 211086 550649 937600
14772 937600 1221467 1200236 810017 138633 -689614 -1560478 -2324333 -2802106 -2916146 -2778299
14762 -2778299 -2612130 -2599208 -2815818 -3262140 -3866013 -4468968 -4870157 -4917785 -4578723 -3921182
14752 -3921182 -3045608 -2083412 -1190357 -463712 79626 391493 308137 -299502 -1297724 -2341557
14742 -2341557 -3148987 -3659356 -3991219 -4294734 -4618662 -4888830 -4955450 -4704717 -4179607 -3543319
14732 -3543319 -2929660 -2354593 -1715035 -880159 130637 1102174 1788851 2085822 2061333
14723 2061333 1900604 1844739 2130214 2901648 4071430 5273096 6097455 6363563 6117901
$$ packed form
14791D168041j25198k14125l46590n09047o20915o41815o30480o00425m91287
14782a1841l11706j73218j25035o4553Q3604K32601K87685K93549L39563L86951
14772I37600K83867k1231l90219o71384q28247q70864p63855m77773j14040J37847
14762b778299J66169J2922k16610m46322o03873o02955m01189m7628L39062O57541
14752c921182Q75574R62196Q93055P26645N43338L11867q3356o07639r98222j043833
14742b341557q07430n10369l31863l03515l23928k70168o6620K50733N25110O36288
14732c543319O13659N75067O39558Q34876J010796R71537O86677K96971k4489
14723B061333j60729n5865K85475P71434J169782J201666Q24359K66108k45662
$$ plain form
14714 6117901 5491695 4627398 3673663 2771208 2038765 1545419 1276535 1164647 1102262 910785
14704 910785 428726 -350128 -1314739 -2352768 -3356647 -4202719 -4807512 -5176476 -5343857
14695 -5343857 -5343153 -5262618 -5218097 -5252713 -5323667 -5426226 -5678093 -6187913 -6877581 -7519839 -7905764
14684 -7905764 -7930941 -7603429 -7021535 -6311260 -5564907 -4870812 -4402013 -4359836 -4782856 -5466214
14674 -5466214 -6118587 -6558774 -6723221 -6623441 -6351124 -6014594 -5634218 -5104741 -4289959 -3161145
14664 -3161145 -1835960 -502329 694748 1700251 2520613 3169751 3625944 3856342 3878375
14655 3878375 3773592 3641170 3534621 3420257 3170547 2626822 1702054 413326 -1157501
14646 -1157501 -2872086 -4542611 -6015729 -7231121 -8158582 -8750367 -8996793 -8978491 -8807226
$$ packed form
14714F117901o26206q64297r53735r02455p32443m93346k68884j11888o2385j91477
14704I10785m82059p78854r64611j038029j003879q46072o04793l68964j67381
14695e343857P04Q0535M4521l4616p0954j02559k51867n09820o89668o42258l85925
14684g905764k5177L27512N81894P10275P46353O94095M68799M2177m23020o83358
14674e466214o52373m40187j64447R9780K72317L36530L80376N29477Q14782J128814
14664c161145J325185J333631J197077J005503Q20362O49138M56193K30398K2033
14655C878375j04783j32422j06549j14364k49710n43725r24768j288728j570827
14646a157501j714585j670525j473118j215392r27461n91785k46426J8302J71265
$$ plain form
14637 -8807226 -8500191 -7990698 -7284803 -6501818 -5754627 -5084692 -4504092 -4043011 -3750424
14628 -3750424 -3691512 -3962196 -4592747 -5422249 -6160965 -6554217 -6489104 -6019448 -5336954 -4713314
14618 -4713314 -4388620 -4453304 -4820245 -5301356 -5727407 -6019242 -6168864 -6214992 -6227209 -6226684
14608 -6226684 -6144307 -5916652 -5562455 -5146912 -4734455 -4331145 -3872266 -3280807 -2499380 -1515193
14598 -1515193 -322587 1135413 2845068 4600424 6116797 7224072 7928615 8284169
14590 8284169 8250285 7772126 6919428 5847090 4689320 3546975 2542345 1829883 1545604
14581 1545604 1722551 2197217 2657077 2890214 2936258 2922507 2857139 2610482 2004990 966145
14571 966145 -344717 -1597097 -2526814 -3085871 -3402022 -3637666 -3883901 -4164244 -4511022
$$ packed form
14637h807226L07035N09493P05895P82985P47191O69935N80600M61081K92587
14628c750424N8912k70684o30551q29502p38716l93252O5113M69656O82494O23640
14618d713314L24694o4684l66941m81111m26051k91835j49622m6128j2217N25
14608f226684Q2377K27655L54197M15543M12457M03310M58879N91459P81427R84187
14598a515193J192606J458000J709655J755356J516373J107275P04543L55554
14590H284169l3884m78159q52698j072338j157770j142345j004630p12462k84279
14581A545604J76947M74666M59860K33137M6044j3751o5368k46657o05492j038845
14571I66145j310862j252380r29717n59057l16151k35644k46235k80343l46778
$$ plain form
14562 -4511022 -4981819 -5584807 -6218240 -6667227 -6713542 -6308581 -5619165 -4885210 -4227002 -3614159
14552 -3614159 -2957954 -2133618 -1023615 331892 1698892 2829971 3596091 3934928 3814940
14543 3814940 3301799 2577414 1861140 1315666 989134 853246 858489 939844 1046648 1179012
14533 1179012 1362134 1585099 1783999 1899717 1885126 1639164 1062698 201735 -750662 -1579788
14523 -1579788 -2144505 -2428419 -2567555 -2763825 -3131378 -3627417 -4126856 -4547775 -4895211
14514 -4895211 -5256075 -5743403 -6335986 -6779629 -6757177 -6153145 -5099553 -3840500 -2620289
14505 -2620289 -1597446 -816326 -286940 -7990 85732 98985 101609 105467 112836 149982 189611
14494 189611 120277 -112207 -411951 -621590 -619143 -345305 172669 826179 1462198 1928718
$$ packed form
14562d511022m70797o02988o33433m48987m6315M04961O89416P33955O58208O12843
14552c614159O56205Q24336J110003J355507J367000J131079P66120L38837j19988
14543C814940n13141p24385p16274n45474l26532j35888N243Q1355J06804J32364
14533A179012J83122K22965J98900J15718j4591k45962n76466q60963r52397q29126
14523a579788n64717k83914j39136j96270l67553m96039m99439m20919l47436
14514d895211l60864m87328n92583m43643K2452O04032J053592J259053J220211
14505b620289J022843P81120N29386K78950R3722J3253K624L858P369L7146L9629
14494A89611o9334k32484k99744k09639K447K73838N17974O53510O36019M66520
$$ plain form
14484 1928718 2141053 2147688 2097154 2115177 2242868 2446567 2634611 2703588 2592456 2327601
14474 2327601 2072695 2039446 2267502 2625560 3026245 3481213 4019890 4649735 5320022 5916196
14464 5916196 6352063 6638133 6817820 6890177 6823031 6624291 6391155 6242412 6191937 6130019
14454 6130019 5927450 5583483 5262539 5120620 5188558 5488115 6108131 7093588 8323679
14445 8323679 9517833 10364319 10645930 10274891 9296778 7888259 6302502 4777314 3491511
14436 3491511 2582349 2152958 2227514 2719710 3465363 4271735 4981358 5535557 5939569 6210289
14426 6210289 6426842 6728578 7149750 7512766 7551069 7132892 6365454 5495222 4758984 4302811
14416 4302811 4160564 4290937 4590157 4873643 4919133 4561681 3784993 2753017 1746591
$$ packed form
14484A928718K12335O635n0534J8023J27691K03699J88044O8977j11132k64855
14474B327601k54906l3249K28056L58058M00685M54968N38677O29845O70287N96174
14464E916196M35867K86070J79687P2357o7146j98740k33136j48743n0475o1918
14454F130019k02569l43967l20944j41919O7938K99557O20016R85457J230091
14445H323679J194154Q46486K81611l71039r78113j408519j585757j525188j285803
14436C491511r09162m29391P4556M92196P45653Q06372P09623N54199M04012K70720
14426F210289K16553L01736M21172L63016L8303m18177p67438q70232p36238m56173
14416D302811j42247J30373K99220K83486M5490l57452p76688j031976j006426
$$ plain form
14407 1746591 1046823 811176 1009589 1493300 2102498 2700729 3157314 3360331 3289028 3053719
14397 3053719 2793111 2510870 2094359 1477074 723101 4987 -445669 -447340 16185 858313
14387 858313 1996902 3303419 4542496 5459439 5925142 5995923 5844592 5612701 5329509
14378 5329509 4967674 4551291 4232416 4247002 4700454 5428211 6135122 6641390 6968952 7224937
14368 7224937 7432672 7462301 7153592 6521990 5754767 4997225 4280582 3642681 3174395 2946234
14358 2946234 2952174 3116304 3310020 3393874 3344976 3335027 3591835 4179575 4966269 5770777
14348 5770777 6430285 6778309 6723223 6296955 5597178 4777959 4016507 3384874 2793519 2107273
14338 2107273 1331938 652601 305676 447188 1093892 2106501 3187404 3974904 4221969
$$ packed form
14407A746591o99768k35647J98413M83711O09198N98231M56585K03017p1303k35309
14397C053719k60608k82241m16511o17285p53973p18114m50656j671M63525Q42128
14387H58313J138589J306517J239077R16943M65703P0781j51331k31891k83192
14378E329509l61835m16383l18875J4586M53452P27757P06911N06268L27562K55985
14368G224937K07735K9629l08709o31602p67223p57542p16643o37901m68286k28161
14358B946234N940J64130J93716Q3854m8898r949K56808N87740P86694Q04508
14348E770777O59508L48024n5086m26268o99777q19219p61452o31633n91355o86246
14338B107273p75335o79337l46925J41512O46704J012609J080903P87500K47065
$$ plain form
14329 4221969 3926958 3308506 2634536 2077999 1694960 1451403 1246605 974242 613245
14320 613245 240561 -65720 -323338 -667252 -1281059 -2242231 -3394700 -4393029 -4893095
14311 -4893095 -4745038 -4032475 -2973942 -1821600 -806811 -107333 146436 -120876 -840942
14302 -840942 -1740256 -2410146 -2560512 -2259300 -1833534 -1528277 -1375907 -1358918 -1487478 -1720172
14292 -1720172 -1965317 -2173093 -2332946 -2397935 -2292964 -1951509 -1309897 -347016 824269
14283 824269 1932328 2616105 2571055 1727545 299941 -1328930 -2755418 -3664507 -3934984
14274 -3934984 -3687704 -3165203 -2539780 -1830488 -962515 64742 1040445 1658948 1782074
14265 1782074 1484336 919161 263199 -315982 -767371 -1200737 -1710877 -2179186 -2349311
$$ packed form
14329D221969k95011o18452o73970n56537l83039k43557k04798k72363l60997
14320F13245l72684l06281k57618l43914o13807r61172j152469r98329n00066
14311d893095J48057P12563J058533J152342J014789O99478K53769k67312p20066
14302h40942q99314o69890j50366L01212M25766L05257J52370J6989j28560k32694
14292a720172k45145k07776j59853o4989J04971L41455O41612R62881J171285
14283H24269J108059O83777m5050q43510j427604j628871j426488r09089k70477
14274c934984K47280N22501O25423P09292Q67973J027257R75703O18503J23126
14265A782074k97738n65175o55962n79181m51389m33366n10140m68309j70125
$$ plain form
14256 -2349311 -2080972 -1476398 -765434 -143948 238564 220125 -316131 -1298652 -2418473
14247 -2418473 -3285974 -3686380 -3674590 -3449038 -3172573 -2922307 -2726209 -2595472 -2546325 -2554273
14237 -2554273 -2545491 -2494843 -2456004 -2490981 -2614386 -2790849 -2957072 -2992605 -2673825 -1765302
14227 -1765302 -239541 1638006 3464428 4908313 5852486 6408144 6758859 7009180 7169593
14218 7169593 7193869 7047664 6786607 6511228 6226466 5828715 5232296 4463832 3649735 2928870
14208 2928870 2360317 1880677 1388695 908119 587069 512418 625650 843838 1145529 1502907
14198 1502907 1860104 2228471 2698706 3343738 4179479 5162518 6157971 6940821 7251285
14189 7251285 6896882 5889672 4511549 3181175 2205834 1651000 1409479 1324330 1272790
$$ packed form
14256b349311K68339O04574P10964O21486L82512j8439n36256r82521j119821
14247b418473q67501m00406J1790K25552K76465K50266J96098J30737M9147p948
14237b554273Q782N0648L8839l4977j23405j76463j66223l5533L18780R08523
14227a765302J525761J877547J826422J443885R44173N55658L50715K50321J60413
14218G169593K4276j46205k61057k75379k84762l97751n96419p68464q14097p20865
14208B928870n68553m79640m91982m80576l21050p4651J13232K18188L01691L57378
14198A502907L57197L68367M70235O45032Q35741R83039R95453P82850L10464
14189G251285l54403j007210j378123j330374r75341n54834k41521q5149n1540
$$ plain form
14180 1272790 1188988 1023109 729417 301293 -254027 -958135 -1803345 -2719754 -3626613 -4452753
14170 -4452753 -5162003 -5835691 -6669685 -7769614 -8973392 -9953076 -10443710 -10391372 -9976816
14161 -9976816 -9485009 -9108498 -8864337 -8669685 -8445056 -8138646 -7706491 -7136790 -6462172
14152 -6462172 -5730836 -5047855 -4622103 -4695117 -5358762 -6400284 -7392535 -7955312 -7919580 -7315513
14142 -7315513 -6292483 -5089308 -3980798 -3127395 -2518378 -2051696 -1595200 -1006812 -135681
14133 -135681 1103039 2600165 4094651 5418152 6602801 7675801 8524302 9042197 9244862
14124 9244862 9180863 8842519 8238283 7485579 6760059 6175795 5765206 5501339 5247618 4821374
14114 4821374 4183114 3473900 2867443 2413360 2053937 1773488 1586051 1406589 1108583
$$ packed form
14180A272790q3802j65879k93692m28124n55320p04108q45210r16409r06859q26140
14170d452753p09250o73688q33994j099929j203778r79684m90634N2338M14556
14161i976816M91807L76511K44161J94652K24629L06410M32155N69701O74618
14152f462172P31336O82981M25752p3014o63645j041522r92251n62777L5732O04067
14142g315513J023030J203175J108510Q53403O09017M66682M56496N88388Q71131
14133a35681J238720J497126J494486J323501J184649J073000Q48501N17895K02665
14124I244862o3999l38344o04236p52704p25520n84264m10589k63867k53721m26244
14114D821374o38260p09214o06457m54083l59423k80449j87437j79462k98006
$$ plain form
14105 1108583 684540 274257 68215 194300 684778 1505867 2547524 3610210 4470248
14096 4470248 4971231 5075668 4869313 4506591 4120540 3762253 3398888 2914630 2136146
14087 2136146 972009 -455294 -1852490 -2925131 -3538258 -3750103 -3709075 -3550447 -3337974
14078 -3337974 -3037389 -2590080 -2033522 -1527041 -1228698 -1170050 -1291548 -1550826 -1909045 -2223887
14068 -2223887 -2276080 -1955141 -1353170 -636104 115398 878193 1606935 2247907 2749299 3043645
14058 3043645 3013799 2529211 1594753 419091 -701450 -1561496 -2120591 -2451746 -2662239
14049 -2662239 -2823245 -2962012 -3102841 -3230656 -3216584 -2867070 -2104533 -1053107 25367
14040 25367 833457 1176046 1069494 712738 337957 96316 45660 167520 380555 555188
$$ packed form
14105A108583m24043m10283k06042J26085M90478Q21089J041657J062686Q60038
14096D470248N00983J04437k06355l62722l86051l58287l63365m84258p78484
14087B136146j164137j427303j397196j072641o13127k11845M1028J58628K12473
14078c337974L00585M47309N56558N06481K98343N8648j21498k59278l58219l14842
14068b223887n2193L20939O01971P17066P51502P62795P28742O40972N01392K94346
14058C043645k9846m84588r34458j175662j120541q60046n59095l31155k10493
14049b662239j61006j38767j40829j27815J4072L49514P62537J051426J078474
14040B5367Q08090L42589j06552l56756l74781k41641n0656J21860K13035J74633
$$ plain form
14030 555188 593205 522332 433607 346443 221411 67392 -75152 -225580 -421661 -597215
14020 -597215 -600204 -373137 -42274 228103 430570 712684 1181404 1781777 2382834 2896448
14010 2896448 3278982 3500058 3584863 3635345 3721869 3787613 3721728 3448588 2896794 2044517
14000 2044517 1054643 214409 -290527 -505260 -597025 -641072 -578189 -312086 249796 1179323
13990 1179323 2425099 3750891 4845494 5491452 5674876 5578912 5463150 5503355 5683109
13981 5683109 5817429 5645876 4955092 3761142 2361188 1139696 318532 -141812 -436926
13972 -436926 -705845 -905664 -947233 -907870 -953629 -1144482 -1438608 -1802494 -2265942 -2855256
13962 -2855256 -3498633 -4065333 -4483770 -4781277 -4989956 -5030902 -4805565 -4360725 -3847665 -3363072
$$ packed form
14030E55188L8017p0873q8725q7164j25032j54019j42544j50428j96081j75554
14020e97215k989K27067L30863K70377K02467K82114M68720O00373O01057N13614
14010B896448L82534K21076Q4805N0482Q6524O5744o5885k73140n51794q52277
14000B044517r89874q40234n04936k14733r1765m4047O2883K66103N61882R29527
13990A179323J245776J325792J094603O45958J83424r5964j15762M0205J79754
13981E683109J34320j71553o90784j193950j399954j221492q21164m60344k95114
13972d36926k68919j99819m1569L9363m5759j90853k94126l63886m63448n89314
13962b855256o43377n66700m18437k97507k08679m0946K25337M44840N13060M84593
$$ plain form
13952 -3363072 -2863252 -2219007 -1327058 -158436 1210574 2566833 3632025 4201216 4234717
13943 4234717 3875555 3372380 2947731 2736712 2802642 3139619 3671331 4299686 4922765 5450220
13933 5450220 5895583 6347798 6832085 7304755 7718200 8017721 8146570 8050477 7682753 7087623
13923 7087623 6419419 5816164 5291584 4770054 4199346 3621938 3178794 3046921 3325040
13914 3325040 3932806 4598067 4960242 4754554 3935923 2653444 1165016 -257858 -1446942
13905 -1446942 -2382949 -3120746 -3720756 -4216366 -4596808 -4850985 -4999659 -5080097 -5142102 -5244220
13895 -5244220 -5378508 -5437229 -5362962 -5240194 -5171310 -5169675 -5137390 -4884917 -4272583 -3350569
13885 -3350569 -2301426 -1322783 -613129 -333776 -510612 -1014667 -1652748 -2264472 -2766671
$$ packed form
13952c363072M99820O44245Q91949J168622J369010J356259J065192N69191L3501
13943D234717l59162n03175m24649k11019O5930L36977N31712O28355O23079N27455
13933E450220M45363M52215M84287M72670M13445K99521J28849r6093l67724n95130
13923G087623o68204o03255n24580n21530n70708n77408m43144j31873K78119
13914C325040O07766O65261L62175k05688q18631j282479j488428j422874j189084
13905a446942r36007p37797o00010m95610l80442k54177j48674q0438o2005j02118
13895e244220j34288n8721P4267J22768O8884J635L2285K52473O12334R22014
13885c350569J049143R78643P09654K79353j76836n04055o38081o11724n02199
$$ plain form
13876 -2766671 -3156801 -3495987 -3887028 -4396076 -4994725 -5578574 -6000421 -6136013 -5946010
13867 -5946010 -5488184 -4917005 -4434896 -4172297 -4142275 -4304859 -4616909 -5040050 -5523364 -5958592
13857 -5958592 -6168860 -5987669 -5332863 -4202640 -2658848 -848144 969358 2464061 3397316
13848 3397316 3773294 3830066 3895363 4242958 4999018 6077626 7226208 8141682 8552431
13839 8552431 8337071 7638560 6759583 5942655 5305066 4902105 4745981 4749281 4707170 4413140
13829 4413140 3806822 2980176 2115363 1445802 1111799 1020079 966012 859512 768303 816407
13819 816407 1073522 1495262 1925259 2157249 2077218 1770379 1453922 1306450 1373058 1610117
13809 1610117 1962226 2365535 2743589 3075826 3439768 3898657 4410342 4932198 5512941
$$ packed form
13876b766671l90130l39186l91041n09048n98649n83849m21847j35592J90003
13867e946010M57826N71179M82109K62599L0022j62584l12050m23141m83314m35228
13857e958592k10268J81191O54806J130223J543792J810704J817502J494703R33255
13848C397316L75978N6772O5297L47595P56060J078608J148582R15474M10749
13839H552431k15360o98511q78977q16928o37589m02961j56124L300m2111k94030
13829D413140o06318q26646q64813o69561l34003r1720n4067j06500r1209M8104
13819H16407K57115M21740M29997K31990q0031l06839l16457j47472O6608K37059
13809A610117L52109M03309L78054L32237L63942M58889N11685N21856N80743
$$ plain form
13800 5512941 6227579 7049882 7844397 8508487 9058964 9544813 9927383 10091842 9929848
13791 9929848 9368929 8410339 7208004 6026720 5063686 4371164 3940465 3768337 3834384
13782 3834384 4066241 4380809 4734951 5105940 5435461 5643448 5716183 5688696 5522505 5087973
13772 5087973 4276781 3113989 1787541 584648 -266470 -754023 -1032961 -1190936 -1132135
13763 -1132135 -736468 -55341 723767 1469247 2198668 2976472 3782549 4539868 5232680
13754 5232680 5887559 6441995 6738202 6715420 6518336 6340315 6277138 6359109 6608156 7004813
13744 7004813 7460882 7860181 8104461 8182847 8232702 8449134 8847503 9165834 9079665 8485332
13734 8485332 7561061 6626259 5950397 5597008 5425729 5313584 5314004 5520977 5925747 6489936
$$ packed form
13800E512941P14638Q22303P94515O64090N50477M85849L82570J64459j61994
13791I929848n60919r58590j202335j181284r63034o92522m30699j72128O6047
13782C834384K31857L14568L54142L70989L29521K07987P2735k7487j66191m34532
13772E087973q11192j162792j326448j202893q51118m87553k78938j57975N8801
13763a132135L95667O81127P79108P45480P29421P77804Q06077P57319O92812
13754E232680O54879N54436K96207k2782j97084j78021o3177Q1971K49047L96657
13744G004813M56069L99299K44280P8386M9855K16432L98369L18331q6169n94333
13734H485332r24271r34802o75862l53389j71279j12145M20K06973M04770N64189
$$ plain form
13724 6489936 7196755 7991712 8851008 9906993 11315632 13002718 14673560 16042552 16989325
13715 16989325 17537845 17728808 17578661 17177215 16664787 16115079 15550719 14975790 14334534
13706 14334534 13524890 12502119 11377614 10355129 9572589 9088362 8936913 9111311 9522835
13697 9522835 10010200 10418927 10682007 10835793 10948371 11020983 10962568 10653962 10078075 9419093
13687 9419093 8953163 8772186 8680608 8382788 7746303 6879664 5991948 5258945 4796056 4657966
13677 4657966 4833604 5272647 5918344 6734711 7713751 8801042 9835843 10617205 11005210
13668 11005210 10998219 10748927 10442147 10134905 9726728 9095084 8274751 7464247 6848772 6475210
13658 6475210 6305432 6309134 6472797 6749395 6996100 7008221 6678632 6127398 5633441 5388232
$$ packed form
13724F489936P06819P94957Q59296J055985J408639J687086J670842J368992R46773
13715A6989325N48520J90963j50147m01446n12428n49708n64360n74929o41256
13706A4334534q09644j022771j124505j022485p82540m84227j51449J74398M11524
13697I522835M87365M08727K63080J53786J12578P2612n8415l08606n75887o58982
13687I419093m65930j80977r1578k97820o36485q66639q87716p33003m62889j38090
13677D657966J75638M39043O45697Q16367R79040J087291J034801P81362L88005
13668A1005210o991k49292l06780l07242m08177o31644q20333q10504o15475l73562
13658F475210j69778L702J63663K76598K46705J2121l29589n51234m93957k45209
$$ plain form
13648 5388232 5349783 5368542 5374535 5391042 5444897 5520356 5569892 5534232 5378824 5144924 4966419
13637 4966419 4984200 5207224 5519366 5824222 6107363 6391539 6735039 7238090 7926733 8646783
13627 8646783 9158661 9281825 8943362 8215367 7295549 6397336 5674211 5171295 4810089
13618 4810089 4499259 4275570 4294868 4679666 5395245 6277464 7123652 7777033 8172841 8357028
13608 8357028 8504043 8809648 9320869 9935669 10508231 10878424 10905944 10573631 10006158 9347243
13598 9347243 8671030 8038129 7556029 7343202 7478242 7959098 8698005 9575291 10476411
13589 10476411 11272704 11788395 11856594 11481920 10892282 10359649 9994904 9747498 9563380
13580 9563380 9459216 9448571 9491345 9537207 9549167 9473471 9272251 9033757 8962261 9183127
$$ packed form
13648E388232l8449J8759N993J6507N3855P5459M9536l5660j55408k33900j78505
13637D966419J7781K23024L12142L04856K83141K84176L43500N03051O88643P20050
13627H646783N11878J23164l38463p27995r19818q98213p23125n02916l61206
13618D810089l10830k23689J9298L84798P15579Q82219Q46188O53381L95808J84187
13608H357028J47015L05605N11221O14800N72562L70193K7520l32313n67473o58915
13598I347243o76213o32901m82100k12827J35040M80856P38907Q77286R01120
13589A0476411P96293N15691O8199l74674n89638n32633l64745k47406j84118
13580I563380j04164j0645M2774M5862J1960p5696k01220k38494p1496K20866
$$ plain form
13570 9183127 9621361 10082322 10405329 10577798 10735438 11017724 11431894 11860189 12132403
13561 12132403 12118731 11814565 11323117 10744934 10106438 9391413 8624114 7887532 7245332
13552 7245332 6730709 6414896 6399159 6750495 7477891 8521982 9707117 10727603 11297383
13543 11297383 11366025 11120204 10765930 10380876 9940955 9416767 8848002 8335048 7971032
13534 7971032 7781124 7712986 7725586 7879629 8269858 8874841 9531713 10077979 10457813 10720697
13524 10720697 11027698 11597851 12553905 13833252 15236151 16541389 17567901 18222902 18624536
13515 18624536 19107754 19989223 21343256 22978370 24534572 25657599 26215777 26382580 26486265
13506 26486265 26800221 27429897 28328689 29428394 30710521 32156527 33722488 35369959
$$ packed form
13570I183127M38234M60961L23007J72469J57640K82286M14170M28295K72214
13561A2132403j3672l04166m91448n78183o38496p15025p67299p36582o42200
13552G245332n14623l15813j5737L51336P27396J044091J185135J020486N69780
13543A1297383O8642k45821l54274l85054m39921n24188n68765n12954l64016
13534G971032j89908o8138J2600J54043L90229O04983O56872N46266L79834K62884
13524A0720697L07001N70153R56054J279347J402899J305238J026512O55001M01634
13515A8624536M83218Q81469J354033J635114J556202J123027N58178J66803J03685
13506B6486265L13956O29676Q98792J099705J282127J446006J565961J647471
$$ plain form
13498 35369959 37117118 39080950 41404077 44150031 47371410 51218587 55839702 61208999
13490 61208999 67145266 73468739 80128778 87223898 94910684 103269583 112213905 121434395
13482 121434395 130413468 138473594 144749583 148284474 148375581 144875051 138205659 129145591
13474 129145591 118575511 107357855 96306639 86122486 77238315 69691184 63215896
13467 63215896 57507692 52397738 47837182 43790683 40150197 36763661 33530573 30411909
13459 30411909 27420054 24658818 22294507 20420154 18934758 17582434 16155248 14638152
13451 14638152 13146757 11818419 10812352 10307519 10390822 10983494 11893572 12898687 13786526
13442 13786526 14370925 14550986 14352932 13920181 13493958 13334264 13587827 14235681 15181661
$$ packed form
13498C5369959J747159J963832K323127K745954L221379L847177M621115N369297
13490F1208999N936267O323473O660039P095120P686786Q358899Q944322R220490
13482A21434395Q979073Q060126O275989L534891R1107l500530o669392r060068
13474A29145591j0570080j1217656j1051216j0184153q884171p547131o475288
13467F3215896n708204n109954m560556m046499l640486l386536l233088l118664
13459C0411909k991855k761236k364311j874353j485396j352324j427186j517096
13451A4638152j491395j328338j006067n04833Q3303N92672R10078J005115Q87839
13442A3786526N84399J80061j98054m32751m26223j59694K53563O47854R45980
$$ plain form
13433 15181661 16324012 17562749 18844944 20179805 21595813 23101541 24669605 26239950
13425 26239950 27733432 29104508 30432661 31959280 33972481 36612216 39785075 43229667
13417 43229667 46634485 49794438 52753889 55754248 59004400 62558088 66435241 70816829
13409 70816829 76042190 82404466 90033674 98953504 109076906 120042972 131086137 141087881
13401 141087881 148793341 153110680 153388554 149550133 142086844 131987385 120520931 108863609
13393 108863609 97824489 87844579 79071937 71388540 64572390 58487240 53058526 48198882
13385 48198882 43846270 40011357 36716039 33859602 31210332 28585767 25986088 23536596
13377 23536596 21378360 19602119 18203875 17098378 16203120 15466867 14825383 14216271 13643122
$$ packed form
13433A5181661J142351J238737J282195J334861J416008J505728J568064J570345
13425B6239950J493482J371076J328153J526619K013201K639735L172859L444592
13417D3229667L404818L159953K959451L000359L250152L553688L877153M381588
13409G0816829N225361O362276P629208Q919830J0123402J0966066J1043165J0001744
13401A41087881P705460M317339K77874l838421p463289j0099459j1466454j1657322
13393A08863609j1039120r979910q772642p683397o816150o085150n428714m859644
13385D8198882m352612l834913l295318k856437k649270k624565k599679k449492
13377B3536596k158236j776241j398244j105497q95258p36253o41484o09112n73149
$$ plain form
13368 13643122 13164294 12801905 12508909 12240317 11987527 11704272 11257309 10498625 9383680
13359 9383680 8039521 6716395 5632565 4876668 4405718 4057882 3674234 3274341 3039753
13350 3039753 3139012 3578981 4167368 4621030 4767914 4654747 4432762 4212930 4081714 4180071
13340 4180071 4661095 5542994 6684922 7915600 9091393 10050365 10629430 10784030 10662398
13331 10662398 10484232 10353047 10200272 9837573 9066760 7801203 6106249 4173720 2274544
13322 2274544 681805 -428092 -1030072 -1187849 -960934 -441823 153209 553127 644955
13313 644955 540992 424143 406683 512372 726062 1029239 1398290 1817525 2251125 2580816
13303 2580816 2661223 2454732 2047536 1537790 1007520 581642 380186 384371 458447 573499
$$ packed form
13368A3643122m78828l62389k92996k68592k52790k83255m46963p58684j114945
13359I383680j344159j323126j083830p55897m70950l47836l83648l99893k34588
13350C039753R9259M39969N88387M53662J46884j13167k21985k19832j31216R8357
13340D180071M81024Q81899J141928J230678J175793R58972N79065J54600j21632
13331A0662398j78166j31185j52775l62699p70813j265557j694954j932529j899176
13322B274544j592739j109897o01980j57777K26915N19111N95032L99918R1828
13313F44955j03963j16849j7460J05689K13690L03177L69051M19235M33600L29691
13303B580816Q0407k06491m07196n09746n30270m25878k01456M185P4076J15052
$$ plain form
13293 573499 904649 1580283 2419751 3048855 3262213 3211785 3201411 3394981 3778207 4250570
13283 4250570 4701854 5087714 5456748 5885090 6373229 6808086 7029885 6922510 6448369
13274 6448369 5674719 4772575 3897185 3073549 2249449 1443688 817189 580354 823582
13265 823582 1449885 2289729 3236110 4226173 5177902 6008339 6720091 7452957 8405044 9658433
13255 9658433 11067674 12329958 13194457 13607075 13650995 13395298 12831630 11956183 10857577
13246 10857577 9645554 8351455 6976272 5581314 4281638 3176047 2285774 1576908
13238 1576908 1053605 797660 888371 1291179 1843549 2337142 2640477 2751232 2730878 2642086
13228 2642086 2528100 2420144 2368644 2401743 2428568 2267531 1817594 1192162 700253 675363
$$ packed form
13293E73499L31150O75634Q39468O29104K13358n0428j0374J93570L83226M72363
13283D250570M51284L85860L69034M28342M88139M34857K21799j07375m74141
13274F448369p73650r02144q75390q23636q24100q05761o26499k36835K43228
13265H23582O26303Q39844R46381R90063R51729Q30437P11752P32866R52087J253389
13255I658433J409241J262284Q64499M12618M3920k55697n63668q75447j098606
13246A0857577j212023j294099j375183j394958j299676j105591q90273p08866
13238A576908n23303k55945R0711M02808N52370M93593L03335J10755k0354q8792
13228B642086j13986j07956n1500L3099K6825j61037m49937o25432m91909k4890
$$ plain form
13218 675363 1284419 2475130 4064688 5871113 7777789 9674153 11384332 12729805
13210 12729805 13648292 14217704 14594137 14911315 15205847 15480937 15819973 16369311 17189899
13201 17189899 18176432 19168076 20092193 21009079 22069312 23374181 24827948 26216658 27432720
13192 27432720 28513323 29526293 30514657 31475584 32299427 32777092 32810076 32608334 32538848
13183 32538848 32846594 33605581 34795209 36332589 38102483 40004183 41971483 43959490
13175 43959490 45952436 48004316 50243781 52836174 55925888 59595803 63906837 68963747
13167 68963747 74948282 82086355 90559248 100510858 112113541 125538891 140888563 158172280
13159 158172280 177285708 197947203 219570558 241130387 261103919 277537593 288306244
$$ packed form
13218F75363O09056J190711J589558J806425J906676J896364J710179J345473
13210A2729805R18487N69412L76433L17178K94532K75090L39036N49338Q20588
13201A7189899R86533R91644R24117R16886J060233J304869J453767J388710J216062
13192B7432720J080603J012970R88364R60927Q23843M77665L2984k01742o9486
13183C2538848L07746P58987J189628J537380J769894J901700J967300J988007
13175D3959490J992946K051880K239465K592393L089714L669915M311034N056910
13167F8963747N984535P138073Q472893R951610J1602683J3425350J5349672J7283717
13159A58172280J9113428K0661495K1623355K1559829J9973532J6433674J0768651
$$ plain form
13152 288306244 291624177 286726063 274310925 256317158 235139854 212825496 190712771
13145 190712771 169568325 149846782 131798123 115507534 100975015 88178322 77053893
13138 77053893 67458462 59214247 52157325 46086421 40757765 35988160 31698400 27842049
13130 27842049 24360144 21193533 18290686 15636945 13327040 11526153 10268708 9365846
13122 9365846 8545588 7627338 6603950 5623798 4878388 4449139 4218566 3946020 3479965
13113 3479965 2912198 2491375 2424951 2813721 3630195 4672427 5690383 6563858 7248534
13104 7248534 7661916 7739373 7512367 7038336 6349966 5535843 4775597 4247901 4001058 3925427
13094 3925427 3850893 3673520 3465313 3424991 3667269 4151114 4770690 5369947 5738373 5710305
$$ packed form
13152B88306244L317933m898114j2415138j7993767k1177304k2314358k2112725
13145A90712771k1144446j9721543j8048659j6290589j4532519j2796693j1124429
13138G7053893r595431q244215p056922o070904n328656m769605m289760l856351
13130B7842049l481905l166611k902847k653741k309905j800887j257445r02862
13122I365846q20258r18250j023388r80152p45410m29249k30573k72546m66055
13113C479965n67767m20823o6424L88770Q16474J042232J017956Q73475O84676
13104G248534M13382P7457k27006m74031o88370q14123p60246n27696k46843p5631
13094C925427p4534j77373k08207m0322K42278M83845O19576N99257L68426k8068
$$ plain form
13084 5710305 5254483 4469454 3539213 2675351 1993465 1439934 923386 477963 243277
13075 243277 347441 848043 1709582 2783473 3854201 4697504 5146581 5209341 5102857
13066 5102857 5077527 5234449 5552063 5980160 6434691 6776107 6863112 6627345 6087545 5323329
13056 5323329 4457241 3638542 2999857 2592424 2395334 2422490 2786521 3609007 4854836
13047 4854836 6312850 7790599 9222864 10532373 11532629 12075219 12194260 11991001 11476436
13038 11476436 10664787 9699681 8774564 8023407 7467373 7012074 6530937 5948151 5263340
13029 5263340 4513853 3709856 2810710 1753906 548212 -639218 -1523919 -1865460 -1640915
13020 -1640915 -1077531 -512577 -225629 -337940 -805062 -1477097 -2173971 -2729438 -3001692
$$ packed form
13084E710305m55822p85029r30241q63862o81886n53531n16548m45423k34686
13075B43277J04164N00602Q61539J073891J070728Q43303M49077O2760j06484
13066E102857k5330J56922L17614M28097M54531L41416Q7005k35767n39800p64216
13056E323329q66088q18699o38685m07433j97090K7156L64031Q22486J245829
13047D854836J458014J477749J432265J309509J000256N42590J19041k03259n14565
13038A1476436q11649r65106r25117p51157n56034m55299m81137n82786o84811
13029E263340p49487q03997q99146j056804j205694j187430q84701l41541K24545
13020a640915N63384N64954K86948j12311m67122o72035o96874n55467k72254
$$ plain form
13011 -3001692 -2920333 -2529410 -1913638 -1105161 -148424 840141 1761294 2571933 3207300 3539240
13001 3539240 3475838 3079602 2526211 1966709 1439510 897126 324928 -196350 -568724 -790584
12991 -790584 -978880 -1267255 -1682360 -2144379 -2558658 -2842566 -2925993 -2813762 -2582935 -2284527
12981 -2284527 -1921658 -1501419 -1068442 -712814 -530983 -569539 -789397 -1085351 -1324658 -1360568
12971 -1360568 -1053286 -314514 798407 2028939 3039993 3610746 3696300 3366509 2773339
12962 2773339 2102718 1506443 1067588 748298 407226 -52876 -599823 -1154147 -1655205
12953 -1655205 -2037920 -2269956 -2415332 -2586117 -2836142 -3142301 -3422293 -3549494 -3450328 -3192357
12943 -3192357 -2932904 -2782778 -2716047 -2668865 -2716407 -3047360 -3761010 -4746012 -5766463 -6573700
$$ packed form
13011c001692Q1359L90923O15772Q08477R56737R88565R21153Q10639O35367L31940
13001C539240o3402l96236n53391n59502n27199n42384n72198n21278l72374k21860
12991g90584j88296k88375m15105m62019m14279k83908q3427J12231K30827K98408
12981b284527L62869M20239M32977L55628J81831l8556k19858k95954k39307l5910
12971a360568L07282P38772J112921J230532J011054N70753Q5554l29791n93170
12962B773339o70621n96275m38855l19290l41072m60102n46947n54324n01058
12953a655205l82715k32036j45376j70785k50025l06159k79992j27201R9166K57971
12943c192357K59453J50126O6731M7182m7542l30953p13650r85002j020451q07237
$$ plain form
12933 -6573700 -6919801 -6616211 -5693668 -4465163 -3347352 -2594568 -2190514 -1962670 -1745678
12924 -1745678 -1472123 -1224145 -1168480 -1359645 -1661763 -1909243 -2025657 -2006554 -1924981 -1904794
12914 -1904794 -2030665 -2296252 -2614656 -2844802 -2831725 -2520565 -2034253 -1565110 -1199536 -898596
12904 -898596 -615156 -342526 -99291 32339 -78279 -502293 -1246334 -2296766 -3553435
12895 -3553435 -4782857 -5732520 -6292966 -6547407 -6678354 -6835216 -7084014 -7403278 -7671231
12886 -7671231 -7713770 -7410165 -6747317 -5802031 -4728453 -3752531 -3052804 -2583967 -2118091
12877 -2118091 -1488619 -691191 238982 1284419 2356443 3281735 3887703 4049882 3738580
12868 3738580 3082975 2326349 1675978 1213497 903426 623531 210238 -473398 -1456832
$$ packed form
12933f573700l46101L03590R22543J228505J117811P52784M04054K27844K16992
12924a745678K73555K47978N5665j91165l02118k47480j16414J9103Q1573K0187
12914a904794j25871k65587l18404k30146J3077L11160M86312M69143L65574L00940
12904h98596K83440K72630K43235J31630j10618m24014p44041j050432j256669
12895c553435j229422r49663n60446k54441j30947j56862k48798l19264k67953
12886g671231m2539L03605O62848R45286J073578R75922O99727M68837M65876
12877b118091O29472P97428R30173J045437J072024R25292O05968J62179l11302
12868C738580o55605p56626o50371m62481l10071k79895m13293o83636r83434
$$ plain form
12859 -1456832 -2641274 -3897600 -5176710 -6495264 -7840189 -9137981 -10274458 -11101063
12851 -11101063 -11480992 -11364531 -10841073 -10108702 -9355471 -8700027 -8206252 -7856699 -7542328
12842 -7542328 -7171107 -6776665 -6459938 -6281851 -6263134 -6362512 -6407767 -6181824 -5566583 -4537486
12832 -4537486 -3144496 -1574465 -144229 846838 1241201 1014930 251702 -879416 -2200258
12823 -2200258 -3590140 -4983895 -6306756 -7467767 -8439238 -9270244 -10020389 -10680392 -11136069
12814 -11136069 -11241630 -10954526 -10378341 -9629278 -8673799 -7374803 -5734749 -4058544 -2818830
12805 -2818830 -2317843 -2470069 -2910685 -3277034 -3422851 -3451805 -3584865 -3975224 -4630987 -5439558
12795 -5439558 -6174253 -6555445 -6442141 -5938227 -5264694 -4583245 -3949447 -3337351 -2656716
$$ packed form
12859a456832j184442j256326j279110j318554j344925j297792j136477q26605
12851a1101063l79929J16461N23458P32371P53231O55444M93775L49553L14371
12842g542328L71221L94442L16727J78087J8717r9378m5255K25943O15241J029097
12832d537486J392990J570031J430236R91067L94363k26271p63228j131118j320842
12823b200258j389882j393755j322861j161011r71471q31006p50145o60003m55677
12814a1136069j05561K87104N76185P49063R55479J298996J640054J676205J239714
12805b818830N00987j52226m40616l66349j45817k8954j33060l90359o55763q08571
12795e439558p34695l81192J13304N03914O73533O81449O33798O12096O80635
$$ plain form
12786 -2656716 -1806230 -807129 141447 819250 1146902 1173847 955751 489905 -206141 -1015470
12776 -1015470 -1784726 -2426475 -2897076 -3138567 -3119262 -2885650 -2518866 -2072437 -1613143 -1277139
12766 -1277139 -1200308 -1369642 -1605357 -1716479 -1630840 -1401249 -1128986 -903954 -824111 -1014995
12756 -1014995 -1539450 -2242089 -2757467 -2756144 -2170240 -1215802 -235596 538984 1101185 1539064
12746 1539064 1845733 1914774 1678364 1150833 362900 -650550 -1810443 -2992735 -4079553
12737 -4079553 -5005376 -5756921 -6344358 -6738426 -6886214 -6831868 -6736034 -6763445 -6967022 -7287611
12727 -7287611 -7665546 -8070420 -8410438 -8539653 -8402935 -8112404 -7837578 -7651597 -7532792
12718 -7532792 -7451516 -7386914 -7313608 -7203969 -7025449 -6746875 -6361725 -5907055 -5473350 -5194279
$$ packed form
12786b656716Q50486R99101R48576O77803L27652K6945k18096m65846o96046q09329
12776a015470p69256o41749m70601k41491J9305K33612L66784M46429M59294L36004
12766a277139P6831j69334k35715j11122Q5639K29591K72263K25032P9843j90884
12756a014995n24455p02639n15378J323N85904R54438R80206P74580N62201M37879
12746A539064L06669O9041k36410n27531p87933j013450j159893j182292j086818
12737d079553r25823p51545n87437l94068j47788N4346R5834k7411k03577l20589
12727g287611l77935m04874l40018j29215J36718K90531K74826J85981J18805
12718g532792Q1276O4602P3306J09639J78520K78574L85150M54670M33705K79071
$$ plain form
12708 -5194279 -5160205 -5319167 -5510790 -5602798 -5566346 -5423551 -5192579 -4896048 -4559211 -4162816
12698 -4162816 -3644592 -2990929 -2277122 -1625413 -1168790 -1008503 -1149959 -1494471 -1901318
12689 -1901318 -2243393 -2443829 -2497770 -2438330 -2293362 -2097441 -1934194 -1924195 -2144022 -2594502
12679 -2594502 -3228110 -3962591 -4689413 -5298063 -5722513 -6006476 -6263315 -6533605 -6785911
12670 -6785911 -7035046 -7311803 -7574283 -7785428 -7982629 -8186489 -8312814 -8215008 -7810040 -7183506
12660 -7183506 -6562459 -6152488 -5983533 -5937495 -5925317 -5979246 -6189614 -6576521 -7048350 -7538760
12650 -7538760 -8070544 -8581198 -8827669 -8601693 -7982472 -7269094 -6707045 -6351647 -6097348
12641 -6097348 -5749881 -5160382 -4365557 -3558585 -2933523 -2555769 -2309101 -1993270 -1531046
$$ packed form
12708e194279L4074j58962j91623r2008L6452J42795K30972K96531L36837L96395
12698d162816N18224O53663P13807O51709M56623J60287j41456l44512m06847
12689a901318l42075k00436n3941N9440J44968J95921J63247R999k19827m50480
12679b594502o33608p34481p26822o08650m24450k83963k56839k70290k52306
12670f785911k49135k76757k62480k11145j97201k03860j26325R7806M04968O26534
12660g183506O21047M09971J68955M6038J2178n3929k10368l86907m71829m90410
12650g538760n31784n10654k46471K25976O19221P13378N62049L55398K54299
12641f097348L47467N89499P94825Q06972O25062L77754K46668L15831M62224
$$ plain form
12632 -1531046 -1040403 -706313 -624016 -724111 -820156 -780139 -660410 -640889 -854524 -1307700
12622 -1307700 -1892875 -2404527 -2593009 -2288981 -1506752 -455310 554901 1290405 1723613
12613 1723613 1981156 2168434 2258964 2133498 1724221 1121582 532184 157275 85727 260328
12603 260328 516478 664748 590759 308601 -60846 -332062 -299792 151335 958077 1936267
12593 1936267 2910283 3767112 4401161 4659069 4426363 3763816 2879501 1957669 1055179
12584 1055179 155009 -723157 -1486959 -2035811 -2339298 -2513107 -2799565 -3366237 -4138142
12575 -4138142 -4865013 -5348579 -5584074 -5672217 -5648774 -5460910 -5064557 -4461037 -3684366 -2821816
12565 -2821816 -2011129 -1398227 -1096632 -1145225 -1469765 -1887664 -2241084 -2566844 -3004205 -3589950
$$ packed form
12632a531046M90643L34090Q2297j00095r6045M0017J19729J9521k13635m53176
12622a307700n85175n11652j88482L04028P82229J051442J010211P35504M33208
12613A723613K57543J87278R0530j25466m09277o02639n89398l74909p1548J74601
12603B60328K56150J48270p3989k82158l69447k71216L2270M51127Q06742R78190
12593A936267R74016Q56829O34049K57908k32706o62547q84315r21832r02490
12584A055179r00170q78166p63802n48852l03487j73809k86458n66672p71905
12575d138142p26871m83566k35495q8143K3443J87864L96353O03520P76671Q62550
12565b821816Q10687O12902L01595m8593l24540m17899l53420l25760m37361n85745
$$ plain form
12555 -3589950 -4227679 -4753781 -5050400 -5152027 -5167918 -5128837 -4997034 -4751170 -4398745 -3963646
12545 -3963646 -3475511 -2990496 -2641317 -2587345 -2883895 -3406457 -3945326 -4381726 -4720976 -4979348
12535 -4979348 -5086576 -4939853 -4518561 -3898473 -3191408 -2512014 -1984203 -1690572 -1607937 -1638436
12525 -1638436 -1679772 -1685865 -1709216 -1848538 -2097244 -2281641 -2180462 -1694080 -910030 -40103
12515 -40103 698087 1192225 1459224 1556368 1502625 1312586 1045872 784373 606380 581895
12505 581895 768440 1197070 1816145 2434628 2794912 2742219 2298546 1598586 798085 23582
12495 23582 -632806 -1114934 -1447792 -1766494 -2262620 -3046513 -4018006 -4905634 -5434516 -5475824
12485 -5475824 -5056287 -4251883 -3146503 -1874025 -648417 256410 614292 393692 -239905
$$ packed form
12555c589950o37729n26102k96619j01627j5891L9081J31803K45864L52425M35099
12545c963646M88135M85015L49179N3972k96550n22562n38869m36400l39250k58372
12535d979348j07228J46723M21292O20088P07065O79394N27811K93631Q2635l0499
12525a638436m1336o093k3351j39322k48706j84397J01179M86382P84050Q69927
12515d0103P38190M94138K66999R7144n3743j90039k66714k61499j77993k4485
12505E81895J86545M28630O19075O18483L60284n2693m43673o99960q00501p74503
12495B3582o56388m82128l32858l18702m96126p83893r71493q87628n28882m1308
12485e475824M19537Q04404J105380J272478J225608R04827L57882k20600o33597
$$ plain form
12476 -239905 -1077299 -1975894 -2834228 -3545286 -4030737 -4266259 -4252357 -4049534 -3795728 -3603949
12466 -3603949 -3477687 -3317094 -2987100 -2425784 -1685250 -873811 -90939 589172 1093065
12457 1093065 1344913 1304243 989055 478909 -73048 -502644 -743540 -813818 -735898 -521151
12447 -521151 -163204 338842 891776 1300970 1416577 1276959 1036254 749534 346318 -204304
12437 -204304 -830886 -1433526 -1973487 -2524822 -3159470 -3750101 -4015116 -3803491 -3282791 -2784533
12427 -2784533 -2510863 -2455286 -2562363 -2851500 -3347916 -4002680 -4704398 -5274419 -5500235 -5294511
12417 -5294511 -4791457 -4212143 -3693395 -3300895 -3093942 -3093345 -3238773 -3408380 -3466116 -3315507
12407 -3315507 -2940602 -2395832 -1784811 -1284878 -1125905 -1434827 -2101291 -2847598 -3410798
$$ packed form
12476b39905q37394q98595q58334p11058m85451k35522J3902K02823K53806J91779
12466c603949J26262J60593L29994N61316P40534Q11439P82872O80111N03893
12457A093065K51848m0670l15188n10146n51957m29596k40896p0278P7920K14747
12447e21151L57947N02046N52934M09194J15607j39618k40705k86720m03216n50622
12437b04304o26582o02640n39961n51335o34648n90631k65015K11625N20700M98258
12427b784533K73670N5577j07077k89137m96416o54764p01718n70021k25816K05724
12417e294511N03054N79314N18748L92500K06953N97j45428j69607n7736J50609
12407c315507L74905N44770O11021M99933J58973l08922o66464p46307n63200
$$ plain form
12398 -3410798 -3660658 -3647642 -3564166 -3581458 -3736134 -4013414 -4439202 -5015128 -5630426 -6085428
12388 -6085428 -6175475 -5784840 -4975917 -3978300 -3041958 -2321789 -1912762 -1877918 -2177753 -2678790
12378 -2678790 -3254078 -3845731 -4440380 -5026005 -5599093 -6159735 -6692245 -7179863 -7635322
12369 -7635322 -8109601 -8679448 -9366085 -10075762 -10681736 -11103835 -11320618 -11343898 -11183004 -10845226
12359 -10845226 -10308982 -9502041 -8416456 -7217737 -6132582 -5301506 -4735117 -4314807 -3911586
12350 -3911586 -3557103 -3459484 -3826464 -4654735 -5716703 -6750727 -7617737 -8320079 -8892157
12341 -8892157 -9287444 -9380904 -9042702 -8254471 -7181775 -6064262 -5008317 -3922702 -2684039
12332 -2684039 -1348493 -136333 746303 1194272 1188833 762929 1079 -940343 -1876292
$$ packed form
12398c410798k49860J3016Q3476j7292j54676k77280m25788n75926o15298m55002
12388f085428r0047L90635Q08923R97617R36342P20169M09027L4844k99835n01037
12378b678790n75288n91653n94649n85625n73088n60642n32510m87618m55459
12369g635322m74279n69847o86637p09677o05974m22099k16783k3280J60894L37778
12359a0845226N36244Q06941J085585J198719J085155Q31076N66389M20310M03221
12350c911586L54483R7619l66980q28271j061968j034024q67010p02342n72078
12341h892157l95287r3460L38202P88231J072696J117513J055945J085615J238663
12332b684039J335546J212160Q82636M47969n439m25904p61850r41422r35949
$$ plain form
12323 -1876292 -2663050 -3222293 -3534386 -3626538 -3579520 -3471411 -3265239 -2888424 -2404828 -1973839
12313 -1973839 -1684336 -1488486 -1235240 -794948 -248828 128704 119145 -278137 -889735 -1489984
12303 -1489984 -1903630 -2031342 -1825840 -1298886 -570198 165264 780821 1279819 1680049
12294 1680049 1892979 1775413 1285639 584340 -11765 -223357 -53084 188402 193331 -73004
12284 -73004 -430918 -694830 -820289 -859112 -807220 -586696 -164679 322441 600100 431893
12274 431893 -246779 -1284788 -2400982 -3385441 -4189314 -4855449 -5435409 -5929230 -6258159
12265 -6258159 -6305602 -6000720 -5372957 -4535349 -3669158 -3031889 -2855382 -3186056 -3866767 -4674732
12255 -4674732 -5430263 -6004058 -6347040 -6557198 -6811937 -7160829 -7435891 -7403867 -6969084 -6192899
$$ packed form
12323a876292p86758n59243l12093r2152M7018J08109K06172L76815M83596M30989
12313a973839K89503J95850K53246M40292N46120L77532r559l97282o11598o00249
12303a489984m13646j27712K05502N26954P28688P35462O15557M98998M00230
12294A680049K12930j17566m89774p01299n96105k11592J70273K41486M929k66335
12284g3004l57914k63912j25459l8823N1892K20524M22017M87120K77659j68207
12274D31893o78672j038009j116194r84459q03873o66135n79960m93821l28929
12265f258159m7443L04882O27763Q37608Q66191O37269J76507l30674o80711q07965
12255d674732p55531n73795l42982k10158k54739l48892k75062L2024M34783P76185
$$ plain form
12245 -6192899 -5194508 -4134813 -3200745 -2481807 -1914923 -1386788 -873132 -518404 -580003
12236 -580003 -1231224 -2398621 -3797610 -5080980 -5958277 -6304860 -6220534 -5929302 -5603502
12227 -5603502 -5266798 -4842685 -4276719 -3568112 -2751205 -1904216 -1085087 -269536 580077
12218 580077 1414333 2115276 2568668 2693335 2484530 2008688 1328157 494789 -403317 -1236980
12208 -1236980 -1838995 -2002216 -1553208 -481659 996986 2525456 3786407 4623151 5010105
12199 5010105 5011358 4800081 4629534 4687285 4940576 5188350 5248175 5049274 4613771 3997659
12189 3997659 3279572 2608479 2196483 2188402 2520504 2932723 3158134 3102919 2821133 2413810
12179 2413810 2007286 1720296 1615468 1702724 1966794 2371954 2831675 3196737 3331903 3199745
$$ packed form
12245f192899R98391J059695R34068P18938N66884N28135N13656L54728o1599
12236e80003o51221j167397j398989j283370q77297l46583Q4326K91232L25800
12227e603502L36704M24113N65966P08607Q16907Q46989Q19129Q15551Q49613
12218E80077Q34256P00943M53392J24667k08805m75842o80531q33368q98106q33663
12208a236980o02015j63221M49008J071549J478645J528470J260951Q36744L86954
12199E010105J253k11277j70547N7751K53291K47774N9825j98901m35503o16112
12189C997659p18087o71093m11996q081L32102M12219K25411n5215k81786m07323
12179B413810m06524k86990j04828Q7256K64070M05160M59721L65062J35166j32158
$$ plain form
12169 3199745 2820650 2214949 1439071 631109 -500 -238432 17464 611408 1188727
12160 1188727 1444084 1272489 736474 -7580 -726191 -1151418 -1141784 -776740 -224056 394861
12150 394861 967946 1362900 1473330 1239436 628676 -374831 -1709658 -3161857 -4416683
12141 -4416683 -5194060 -5382774 -5143853 -4828695 -4717751 -4850397 -5074600 -5212010 -5219200 -5235457
12131 -5235457 -5476016 -6067166 -6904716 -7661506 -8028560 -7946089 -7570910 -7084420 -6537855 -5849783
12121 -5849783 -4957597 -3933041 -2955926 -2218128 -1839268 -1830875 -2131182 -2669473 -3363474 -4082858
12111 -4082858 -4643628 -4862246 -4664744 -4120063 -3363917 -2495844 -1561138 -627153 222986
12102 222986 1001664 1835834 2821732 3887859 4819205 5386013 5458965 5050991 4271161 3226921
$$ packed form
12169C199745l79095o05701p75878q07962o31609k37932K55896N93944N77319
12160A188727K55357j71595n36015p44054p18611m25227R634L65044N52684O18917
12150C94861N73085L94954J10430k33894o10760j003507j334827j452199j254826
12141d416683p77377j88714K38921L15158J10944j32646k24203j37410p190j6257
12131e235457k40559n91150q37550p56790l67054Q2471L75179M86490N46565O88072
12121e849783Q92186J024556R77115P37798L78860Q393l00307n38291o94001p19384
12111d082858n60770k18618J97502N44681P56146Q68073R34706R33985Q50139
12102B22986P78678Q34170R85898J066127R31346N66808P2952m07974p79830j044240
$$ plain form
12092 3226921 1980755 614421 -721830 -1878120 -2799159 -3513004 -4088949 -4596161 -5015709
12083 -5015709 -5209224 -5038464 -4519799 -3822374 -3114192 -2433563 -1731698 -1016350 -414949
12074 -414949 -89780 -106136 -387317 -771886 -1120950 -1383084 -1594721 -1859320 -2258237 -2743055
12064 -2743055 -3131442 -3234258 -2987613 -2428813 -1654049 -870099 -333653 -178354 -323374
12055 -323374 -541433 -655841 -664247 -685403 -866525 -1336659 -2172947 -3348953 -4684854 -5867663
12045 -5867663 -6588001 -6712826 -6349962 -5730185 -4993509 -4127963 -3154713 -2248670 -1568632
12036 -1568632 -1079555 -673911 -379160 -296865 -392025 -448499 -193575 508412 1531911 2593002
12026 2593002 3475856 4159815 4719206 5143724 5351635 5355334 5330089 5516459 6032971 6755659
$$ packed form
12092C226921j246166j366334j336251j156290r21039p13845n75945n07212m19548
12083e015709j93515J70760N18665O97425P08182O80629P01865P15348O01401
12074d14949L25169j6356k81181l84569l49064k62134k11637k64599l98917m84818
12064b743055l88387j02816K46645N58800P74764P83950N36446J55299j45020
12055c23374k18059j14408q406k1156j81122m70134q36288j176006j335901j182809
12045e867663p20338j24825L62864O19777P36676Q65546R73250R06043O80038
12036a568632M89077M05644K94751Q2295r5160n6474K54924P01987J023499J061091
12026B593002Q82854O83959N59391M24518K07911L699k5245J86370N16512P22688
$$ plain form
12016 6755659 7412716 7776019 7770610 7477187 7084908 6799051 6675505 6519691 6025169 5033572
12006 5033572 3659895 2213320 1010369 211004 -217769 -393774 -400251 -286149 -88971
11997 -88971 188207 546065 950628 1352611 1652973 1669385 1233761 308484 -973246 -2331027
11987 -2331027 -3423768 -3974109 -3881003 -3224831 -2174222 -892965 512023 1952779 3266218
11978 3266218 4238355 4751542 4850047 4674059 4305808 3686135 2769083 1685395 699989
11969 699989 51958 -193081 -175370 -109691 -127093 -222867 -248020 -15578 454216 870242
11959 870242 907385 412891 -643505 -2262015 -4324995 -6502945 -8366485 -9560349 -9895303
11950 -9895303 -9416780 -8420952 -7302379 -6303736 -5378535 -4302925 -2974867 -1565669 -350577
$$ packed form
12016F755659O57057L63303n409k93423l92279k85857j23546j55814m94522r91597
12006E033572j373677j446575j202951p99365m28773j76005o477J14102J97178
11997h8971K77178L57858M04563M01983L00362J6412m35624r25277j281730j357781
11987b331027j092741n50341R3106O56172J050609J281257J404988J440756J313439
11978C266218R72137N13187R8505j75988l68251o19673r17052j083688r85406
11969F99989o48031k45039J7711O5679j7402r5774k5153K32442M69794M16026
11959H70242L7143m94494j056396j618510k062980k177950j863540j193864l34954
11950i895303M78523R95828J118573R98643R25201J075610J328058J409198J215092
$$ plain form
11941 -350577 514227 1052395 1419042 1754292 2045637 2219973 2314515 2469536 2812263 3358663
11931 3358663 4021908 4690658 5238476 5521620 5459900 5106387 4582071 3982949 3362861 2730490
11921 2730490 2074630 1420032 870708 569348 559446 695702 715677 430354 -148104 -869567
11911 -869567 -1559987 -2073209 -2307763 -2204546 -1793957 -1286163 -1043544 -1330812 -2070864 -2910104
11901 -2910104 -3523993 -3872090 -4159614 -4601421 -5297084 -6233652 -7285382 -8239651 -8889063
11892 -8889063 -9162209 -9131536 -8837677 -8241272 -7379213 -6413710 -5531700 -4862875 -4436425 -4161385
11882 -4161385 -3892032 -3545309 -3128810 -2679163 -2224982 -1829941 -1592461 -1554987 -1683142 -1910880
11872 -1910880 -2172444 -2425742 -2615004 -2646043 -2426328 -1930792 -1241964 -515781 55010 290579
$$ packed form
11941c50577Q64804N38168L66647L35250K91345J74336R4542J55021L42727N46400
11931C358663O63245O68750N47818K83144o1720l53513n24316n99122o20088o32371
11921B730490o55860o54598n49324l01360r902J36256J9975k85323n78458p21463
11911h69567o90420n13222k34554J03217M10589N07794K42619k87268p40052q39240
11901b910104o13889l48097k87524m41807o95663r36568j051730r54269o49412
11892h889063k73146L0673K93859N96405Q62059R65503Q82010O68825M26450K75040
11882d161385K69353L46723M16499M49647M54181L95041K37480L7474j28155k27738
11872a910880k61564k53298j89262l1039K19715M95536O88828P26183N70791K35569
$$ plain form
11862 290579 146480 -253174 -696880 -976813 -960154 -595226 81826 928258 1744999 2379018
11852 2379018 2764724 2902313 2867471 2822249 2914869 3131325 3261358 3069464 2525721 1828610
11842 1828610 1237449 940814 1011807 1404026 1965634 2466478 2690651 2554484 2161606 1781252
11832 1781252 1661632 1781373 1885626 1795190 1596995 1525262 1698211 1969232 2018643 1625031
11822 1625031 862110 -11612 -765150 -1258551 -1432319 -1301762 -933764 -409081 208873
11813 208873 874632 1577983 2363566 3253710 4144335 4823453 5101029 4910486 4308932 3418978
11803 3418978 2360565 1194003 -88638 -1473818 -2872230 -4207162 -5447580 -6512645
11795 -6512645 -7240442 -7490189 -7260011 -6684028 -5914083 -5067895 -4283222 -3686630 -3280031
$$ packed form
11862B90579j44099l99654m43706k79933J6659L64928O77052Q46432Q16741O34019
11852B379018L85706J37589l4842m5222R2620K16456J30033j91894n43743o97111
11842A828610n91161k96635P0993L92219N61608N00844K24173j36167l92878l80354
11832A781252j19620J19741J04253r0436j98195p1733J72949K71021M9411l93612
11822A625031p62921q73722p53538m93401j73768J30557L67998N24683O17954
11813B08873O65759P03351P85583Q90144Q90625O79118K77576j90543o01554q89954
11803C418978j058413j166562j282641j385180j398412j334932j240418j065065
11795f512645p27797k49747K30178N75983P69945Q46188P84673N96592M06599
$$ plain form
11786 -3280031 -2988688 -2795998 -2750263 -2890360 -3215463 -3697900 -4264446 -4776252 -5072257 -5024865
11776 -5024865 -4587016 -3849516 -3007966 -2211415 -1459075 -625349 391262 1527792 2605789
11767 2605789 3433810 3841838 3769190 3335698 2740125 2130944 1598845 1200163 977815 1010095
11757 1010095 1405744 2170908 3077017 3763856 3995224 3752696 3181681 2538783 2061030
11748 2061030 1810935 1639654 1348890 957741 677852 590633 506946 179931 -430060 -1119726
11738 -1119726 -1596955 -1704555 -1543848 -1369572 -1370764 -1545990 -1790665 -2054683 -2368742 -2748325
11728 -2748325 -3108153 -3308788 -3282467 -3095137 -2907423 -2852161 -2939278 -3082419 -3223265 -3407092
11718 -3407092 -3743943 -4319599 -5073079 -5753804 -6068153 -5883864 -5314088 -4647698 -4190687
$$ packed form
11786c280031K91343J92690M5735j40097l25103m82437n66546n11806k96005M7392
11776e024865M37849P37500Q41550P96551P52340Q33726J016611J136530J077997
11767B605789Q28021M08028p2648m33492n95573o09181n32099l98682k22348L2280
11757A010095L95649P65164R06109O86839K31368k42528n71015o42898m77753
11748B061030k50095j71281k90764l91149k79889q7219q3687l27015o09991o89666
11738a119726m77229j07600J60707J74276j192j75226k44675k64018l14059l79583
11728b748325l59828k00635K6321J87330J87714N5262q7117j43141j40846j83827
11718c407092l36851n75656p53480o80725l14349J84289N69776O66390M57011
$$ plain form
11709 -4190687 -4139604 -4549227 -5322041 -6196339 -6862184 -7141072 -7016529 -6586560 -6067909 -5713121
11699 -5713121 -5642467 -5773822 -5869759 -5629854 -4810706 -3339472 -1361703 787266 2696527
11690 2696527 4049104 4734286 4845384 4631181 4389319 4299726 4328797 4305756 4119857 3837455
11680 3837455 3611990 3498342 3419483 3332864 3307795 3417143 3682618 4108552 4687997 5407116
11670 5407116 6222132 6997284 7522507 7602835 7127464 6098587 4665292 3124040 1825922
11661 1825922 1022847 779258 998684 1436572 1733007 1579356 880597 -246236 -1551248
11652 -1551248 -2702517 -3385356 -3454009 -3008155 -2289140 -1490933 -751941 -225394 11743
11643 11743 21422 -75811 -152061 -117047 -1688 66477 -14534 -261513 -611874 -948697 -1167056
$$ packed form
11709d190687N1083m09623p72814q74298o65845k78888J24543M29969N18651L54788
11699e713121P0654j31355r5937K39905Q19148J471234J977769K148969J909261
11690B696527J352577O85182J11098k14203k41862q9593K9071k3041j85899k82402
11680C837455k25465j13648p8859q6619k5069J09348K65475M25934N79445P19119
11670E407116Q15016P75152N25223Q0328m75371j028877j433295j541252j298118
11661A825922q03075k43589K19426M37888K96435j53651o98759j126833j305012
11652a551248j151269o82839o8653M45854P19015P98207P38992N26547K37137
11643A1743R679r7233p6250L5014J15359O8165q1011k46979l50361l36823k18359
$$ plain form
11632 -1167056 -1243058 -1230581 -1193047 -1153235 -1111392 -1065093 -1004138 -885602 -618281 -100166 705459
11621 705459 1718515 2787050 3752101 4470354 4862120 4987821 4981590 4875233 4576252 4004362
11611 4004362 3195950 2298135 1477405 808727 213763 -475462 -1333791 -2239749 -2987380
11602 -2987380 -3466076 -3751793 -4022510 -4361983 -4690578 -4867447 -4862170 -4805210 -4816874 -4849597
11592 -4849597 -4737268 -4367729 -3784204 -3087327 -2324753 -1513730 -702828 -35705 275764
11583 275764 149487 -232143 -550244 -541357 -68240 899564 2290449 3882377 5324139
11574 5324139 6288156 6599585 6265691 5477861 4555194 3772346 3201224 2725838 2181820
11565 2181820 1474807 616712 -298925 -1183656 -1979829 -2569752 -2750363 -2328470 -1252477
$$ packed form
11632a167056p6002J2477L7534L9812M1843M6299O0955J18536K67321N18115Q05625
11621G05459J013056J068535R65051P18253L91766J25701o231j06357k98981n71890
11611D004362q08412q97815q20730o68678n94964o89225q58329r05958p47631
11602b987380m78696k85717k70717l39473l28595j76869N277N6960j1664l2723
11592d849597J12329L69539N83525O96877P62574Q11023Q10902O67123L11469
11583B75764j26277l81630l18101Q887M73117R67804J390885J591928J441762
11574E324139R64017L11429l33894p87830r22667p82848n71122m75386n44018
11565B181820p07013q58095r15637q84731p96173n89923j80611M21893J075993
$$ plain form
11556 -1252477 291232 1952802 3429075 4575431 5375320 5865366 6058838 5911582 5407591
11547 5407591 4677203 3960413 3415715 3002364 2530143 1829573 944896 156890 -231958
11538 -231958 -163707 104334 174745 -200363 -945463 -1791369 -2523313 -3062010 -3446396 -3821634
11528 -3821634 -4348162 -5026080 -5658661 -6050041 -6193266 -6203703 -6104479 -5768770 -5076067 -4045519
11518 -4045519 -2811345 -1561060 -488796 265181 611351 495341 -64321 -953161 -1958486
11509 -1958486 -2831255 -3452782 -3934574 -4476205 -5145705 -5834774 -6374413 -6630882 -6567345 -6280179
11499 -6280179 -5934628 -5678609 -5604489 -5759380 -6185838 -6899423 -7794528 -8639758 -9202863 -9344939
11489 -9344939 -9071555 -8548241 -7978255 -7438039 -6877410 -6268224 -5673332 -5131753 -4583782
$$ packed form
11556a252477J543709J661570J476273J146356P99889M90046J93472j47256n03991
11547E407591p30388p16790n44698m13351m72221p00570q84677p88006l88848
11538b31958O8251K68041P0411l75108p45100q45906p31944n38697l84386l75238
11528c821634n26528o77918o32581l91380j43225j0437R9224L35709O92703J030548
11518d045519J234174J250285J072264P53977L46170j16010n59662q88840j005325
11509a958486q72769o21527m81792n41631o69500o89069n39639k56469O3537K87166
11499f280179L45551K56019P4120j54891m26458p13585q95105q45230n63105j42076
11489i344939K73384N23314N69986N40216N60629O09186N94892N41579N47971
$$ plain form
11480 -4583782 -3969153 -3321400 -2731249 -2236827 -1783309 -1308012 -835074 -418358 3169
11471 3169 584710 1375221 2212072 2847705 3140417 3093325 2785656 2340725 1885486 1475430
11461 1475430 1105567 787751 587702 576375 684890 681306 408473 -26574 -365881 -439986
11451 -439986 -289713 -136602 -200727 -489200 -834097 -1108463 -1283834 -1358051 -1349746 -1332159
11441 -1332159 -1412505 -1660246 -2046994 -2422105 -2550185 -2271401 -1643277 -868945 -156039 320598
11431 320598 438938 147536 -545256 -1538545 -2620096 -3571084 -4282728 -4770517 -5166594
11422 -5166594 -5661177 -6317581 -6989261 -7484204 -7745226 -7847255 -7862640 -7791701 -7645227 -7490077
11412 -7490077 -7367369 -7255184 -7111882 -6878483 -6492443 -5965173 -5419332 -5019706 -4824898
$$ packed form
11480d583782O14629O47753N90151M94422M53518M75297M72938M16716M21527
11471C169N81541P90511Q36851O35633K92712m7092l07669m44931m55239m10056
11461A475430l69863l17816k00049j1327J08515l584k72833m35047l39307p4105
11451d39986J50273J53111o4125k88473l44897k74366j75371p4217Q305J7587
11441a332159q0346k47741l86748l75111j28080K78784O28124P74332P12906M76637
11431C20598J18340k91402o92792r93289j081551r50988p11644m87789l96077
11422e166594m94583o56404o71680m94943k61022j02029j5385P0939J46474J55150
11412g490077J22708J12185J43302K33399L86040N27270N45841L99626J94808
$$ plain form
11403 -4824898 -4694701 -4400209 -3822391 -3055919 -2384967 -2110565 -2321811 -2844652 -3405473
11394 -3405473 -3819290 -4063888 -4196407 -4206607 -3997323 -3500497 -2735938 -1768455 -716258
11385 -716258 188939 683489 641281 103487 -780642 -1723712 -2286462 -2127314 -1317577 -279176
11375 -279176 569596 1041093 1195227 1223024 1240247 1201653 1000261 587592 48842 -446470
11365 -446470 -795811 -1035014 -1271054 -1592519 -2025616 -2546879 -3179867 -4008944 -5014889
11356 -5014889 -5993760 -6735749 -7190796 -7383840 -7303918 -6944172 -6368471 -5704192 -5101125 -4720382
11346 -4720382 -4677236 -4887838 -5025044 -4732175 -3920556 -2853980 -1893951 -1188611 -665797
11337 -665797 -251711 6279 37611 -109843 -326600 -596036 -993504 -1553424 -2212792 -2930039
$$ packed form
11403d824898J30197K94492N77818P66472O70952K74402k11246n22841n60821
11394c405473m13817k44598j32519j0200K09284M96826P64559R67483J052197
11385g16258R05197M94550m2208n37794q84129r43070n62750J59148Q09737J038401
11375b79176Q48772M71497J54134K7797J7223l8594k01392m12669n38750m95312
11365d46470l49341k39203k36040l21465m33097n21263o32988q29077j005945
11356e014889r78871p41989m55047j93044P9922L59746N75701O64279O03067L80743
11346d720382M3146k10602j37206K92869Q11619J066576R60029P05340N22814
11337f65797M14086K57990L1332j47454k16757k69436l97468n59920o59368p17247
$$ plain form
11327 -2930039 -3760280 -4726525 -5687580 -6385219 -6613772 -6356108 -5764869 -5005832 -4157917
11318 -4157917 -3268442 -2419038 -1695261 -1155583 -835161 -733245 -794166 -913108 -992619 -1016864
11308 -1016864 -1052992 -1153940 -1286869 -1367908 -1303260 -996251 -395043 407165 1149096 1560018
11298 1560018 1555827 1224783 668548 -31573 -764802 -1428672 -1972083 -2338551 -2404964 -2070681
11288 -2070681 -1389972 -557730 219335 815419 1164873 1216672 953406 425996 -240462 -859898
11278 -859898 -1260336 -1410383 -1433212 -1440452 -1406221 -1237312 -882437 -323148 466533 1488281
11268 1488281 2692108 4001533 5299278 6381070 7023304 7148755 6884496 6414441 5825384
11259 5825384 5120182 4342056 3655176 3269380 3267427 3516732 3768893 3849980 3751923 3499942
$$ packed form
11327b930039q30241r66245r61055o97639k28553K57664N91239P59037Q47915
11318d157917Q89475Q49404P23777N39678L20422J01916o0921j18942p9511k4245
11308a016864l6128j00948j32929q1039O4648L07009O01208Q02208P41931M10922
11298A560018m191l31044n56235p00121p33229o63870n43411l66468o6413L34283
11288b070681O80709Q32242P77065N96084L49454N1799k63266n27410o66458o19436
11278h59898m00438j50047k2829p240L4231J68909L54875N59289P89681J021748
11268A488281J203827J309425J297745J081792O42234J25451k64259m70055n89057
11259E825384p05202p78126o86880l85796j953K49305K52161Q1087r8057k51981
$$ plain form
11249 3499942 3028118 2276878 1263580 38238 -1300472 -2584235 -3674551 -4531003 -5103988
11240 -5103988 -5282435 -5031911 -4525478 -4083822 -3952545 -4125647 -4382474 -4473935 -4277455 -3854814
11230 -3854814 -3401791 -3109990 -3074295 -3308743 -3755133 -4249321 -4546857 -4471989 -4044254 -3367023
11220 -3367023 -2464332 -1360592 -209665 821491 1707123 2521832 3314940 4082883 4851835
11211 4851835 5668391 6513205 7318845 8020212 8551137 8820999 8681652 7957702 6590540
11202 6590540 4719737 2583662 367409 -1826121 -3908008 -5796157 -7429130 -8749354
11194 -8749354 -9729706 -10404394 -10807639 -10917677 -10693550 -10122187 -9249292 -8153859 -6869609
11185 -6869609 -5405795 -3847898 -2386840 -1189005 -247782 563891 1341980 2081151 2690883
$$ packed form
11249C499942m71824p51240j013298j225342j338710j283763j090316q56452n72985
11240e103988j78447K50524N06433M41656J31277j73102k56827r1461J96480M22641
11230c854814M53023K91801L5695k34448m46390m94188k97536P4868M27735O77231
11220c367023R02691J103740J150927J031156Q85632Q14709P93108P67943P68952
11211D851835Q16556Q44814Q05640P01367N30925K69862j39347p23950j367162
11202F590540j870803k136075k216253k193530k081887j888149j632973j320224
11194h749354r80352o74688m03245j10038K24127N71363Q72895J095433J284250
11185f869609J463814J557897J461058J197835R41223Q11673P78089P39171O09732
$$ plain form
11176 2690883 3074157 3208139 3135122 2905612 2570372 2201335 1871103 1629676 1500111 1454051
11166 1454051 1400434 1197613 687142 -197395 -1325852 -2467140 -3462538 -4239035 -4719633
11157 -4719633 -4748364 -4163215 -3013382 -1665693 -615089 -147260 -206604 -525413 -831390
11148 -831390 -1009063 -1128761 -1351865 -1766822 -2270046 -2655238 -2802284 -2719040 -2463600 -2060636
11138 -2060636 -1457515 -608054 400244 1374937 2155737 2666757 2851713 2628020 1941704
11129 1941704 835029 -539904 -1977701 -3291913 -4322901 -4948336 -5120384 -4859802 -4215138
11120 -4215138 -3248568 -2081414 -932324 -57771 407813 574373 709104 1046654 1698072
11111 1698072 2630475 3649798 4448617 4765705 4515758 3766676 2689111 1543655 618141
$$ packed form
11176B690883L83274J33982p3017k29510l35240l69037l30232k41427j29565m6060
11166A454051n3617k02821n10471q84537j128457j141288r95398p76497m80598
11157d719633k8731N85149J149833J347689J050604M67829n9344l18809l05977
11148h31390j77673j19698k23104m14957n03224l85192j47046Q3244K55440M02964
11138b060636O03121Q49461J008298R74693P80800N11020J84956k23693o86316
11129A941704j106675j374933j437797j314212j030988o25435j72048K60582O44664
11120d215138R66570J167154J149090Q74553M65584J66560J34731L37550O51418
11111A698072R32403J019323P98819L17088k49947p49082j077565j145456r25514
$$ plain form
11102 618141 122731 147593 679528 1603911 2682567 3595735 4122832 4313334 4467928 4893933
11092 4893933 5636631 6472718 7131366 7504735 7666679 7743423 7821812 7908056 7909406 7673596
11082 7673596 7086779 6173485 5079567 3963127 2957071 2187716 1707390 1427628 1221433
11073 1221433 1098457 1215371 1679680 2388077 3134501 3826307 4473087 5026768 5347037
11064 5347037 5281451 4745134 3803831 2689738 1643182 718582 -209234 -1247761 -2358001
11055 -2358001 -3404044 -4245913 -4814021 -5134580 -5250824 -5160263 -4863969 -4406352 -3838794
11046 -3838794 -3200845 -2532100 -1856845 -1154626 -394449 367266 972064 1294627 1333600 1121139
11036 1121139 636295 -119938 -1021967 -1847152 -2383231 -2499739 -2196771 -1688867 -1350105
$$ packed form
11102F18141m95410K4862N31935R24383J078656R13168N27097J90502J54594M26005
11092D893933P42698Q36087O58648L73369J61944P6744P8389Q6244J350k35810
11082G673596n86817r13294j093918j116440j006056p69355m80326k79762k06195
11073A221433j22976J16914M64309P08397P46424O91806O46780N53681L20269
11064E347037o5586n36317r41303j114093j046556r24600r27816j038527j110240
11055b358001j046043q41869n68108l20559j16244R0561K96294M57617N67558
11046c838794O37949O68745O75255P02219P60177P61715O04798L22563L8973k12461
11036A121139m84844p56233r02029q25185n36079j16508L02968N07904L38762
$$ plain form
11027 -1350105 -1431142 -1867363 -2383814 -2710901 -2679966 -2223400 -1380399 -274382 942729
11018 942729 2143585 3223646 4017770 4306914 4003831 3311533 2625837 2239200 2153511
11009 2153511 2180983 2150897 1984655 1684809 1332980 1048781 899513 869803 939862 1139036
10999 1139036 1484268 1900867 2252442 2455933 2528203 2511309 2377569 2066345 1585816 980832
10989 980832 219601 -787829 -2021924 -3299555 -4399186 -5181559 -5652040 -5942066 -6201354
10980 -6201354 -6498032 -6853205 -7329973 -7963471 -8631518 -9119809 -9289141 -9116011 -8634226
10971 -8634226 -7937377 -7234500 -6790201 -6771569 -7165464 -7820082 -8551781 -9190924 -9554816 -9503896
10961 -9503896 -9070702 -8471624 -7953486 -7646538 -7537838 -7521607 -7529282 -7640131 -7980690 -8545772
$$ packed form
11027a350105q1037m36221n16451l27087L0935M56566Q43001J106017J217111
11018I42729J200856J080061P94124K89144l03083o92298o85696l86637q5689
11009B153511K7472l0086j66242k99846l51829k84199j49268k9710P0059J99174
10999A139036L45232M16599L51575K03491P2270j6894j33740l11224m80529o04984
10989I80832p61231j007430j234095j277631j099631p82373m70481k90026k59288
10980f201354k96678l55173m76768o33498o68047m88291j69332J73130M81785
10971h634226O96849P02877M44299J8632l93895o54618p31699o39143l63892N0920
10961i503896M33194N99078N18138L06948J08700J6231p675j10849l40559n65082
$$ plain form
10951 -8545772 -9208695 -9891409 -10624229 -11395700 -12047757 -12440531 -12657107 -12897069 -13226435
10942 -13226435 -13543759 -13699247 -13562869 -13031775 -12057806 -10704777 -9149692 -7557161 -5971991
10933 -5971991 -4419032 -3013556 -1893470 -1149762 -845281 -992831 -1492818 -2131655 -2675020
10924 -2675020 -3004155 -3133159 -3111973 -2967010 -2683998 -2237072 -1689498 -1237895 -1101025 -1394352
10914 -1394352 -2105582 -3097761 -4127773 -4969964 -5535197 -5822116 -5826912 -5544265 -4990386 -4201616
10904 -4201616 -3241716 -2226427 -1272930 -448019 197250 610215 755982 644221 369571
10895 369571 69015 -221447 -603108 -1185870 -1996049 -2991780 -4059838 -5033166 -5783242
10886 -5783242 -6270271 -6547977 -6756920 -7079994 -7633416 -8340136 -8953194 -9248685 -9184511 -8880683
$$ packed form
10951h545772o62923o82714p32820p71471o52057l92774k16576k39962l29366
10942a3226435l17324j55488J36378N31094R73969J353029J555085J592531J585170
10933e971991J552959J405476J120086P43708L04481j47550m99987o38837n43365
10924b675020l29135j29004K1186J44963K83012M46926N47574M51603J36870k93327
10914a394352p11230r92179j030012q42191n65233k86919m796K82647N53879P88770
10904d201616R59900J015289R53497Q24911O45269M12965J45767j11761k74650
10895C69571l00556k90462l81661n82762q10179r95731j068058r73328p50076
10886e783242m87029k77706k08943l23074n53422p06720o13058k95491O4174L03828
$$ plain form
10876 -8880683 -8499581 -8128824 -7707435 -7067463 -6117012 -4975014 -3870093 -2952938 -2287099
10867 -2287099 -1962492 -2070373 -2536038 -3065754 -3298882 -3022089 -2282698 -1352413 -568945
10858 -568945 -149132 -118372 -363076 -684396 -875604 -905437 -965938 -1227230 -1623385 -1937629
10848 -1937629 -2046707 -1977859 -1728548 -1209098 -409342 514020 1382252 2134824 2795630 3395855
10838 3395855 3942238 4442893 4953479 5553760 6277502 7070622 7804755 8366518 8745468
10829 8745468 9006902 9180289 9233128 9169348 9078671 9041738 9071864 9203236 9503233 9941390
10819 9941390 10299001 10261161 9614974 8373499 6773314 5133888 3665914 2425054 1415203
10810 1415203 615808 -92235 -874790 -1798070 -2766951 -3598655 -4167018 -4458318 -4507211 -4328913
$$ packed form
10876h880683L81102L70757M21389O39972R50451J141998J104921R17155O65839
10867b287099L24607j07881m65665n29716k33128K76793P39391R30285P83468
10858e68945M19813L0760k44704l21320j91208k9833o0501k61292l96155l14244
10848a937629j09078O8848K49311N19450P99756R23362Q68232P52572O60806O00225
10838C395855N46383N00655N10586O00281P23742P93120P34133N61763L78950
10829H745468K61434J73387N2839o3780r0677l6933L0126J31372K99997M38157
10819I941390L57611l7840o46187j241475j600185j639426j467974j240860j009851
10810A415203p99395p08043p82555r23280r68881q31704n68363k91300m8893J78298
$$ plain form
10800 -4328913 -3917764 -3299035 -2576987 -1925540 -1519567 -1416905 -1516610 -1664723 -1758057 -1796782
10790 -1796782 -1877291 -2120417 -2558391 -3059336 -3418527 -3527001 -3429972 -3223501 -2920218 -2497050
10780 -2497050 -2021304 -1571439 -1110295 -593651 -92149 286806 493756 543825 484128 358736
10770 358736 216129 133445 144381 174082 161220 139431 156582 254546 508489 976557 1607318
10759 1607318 2216604 2582169 2637707 2531295 2437805 2423611 2517789 2781660 3225353 3713586
10749 3713586 4016684 3960051 3536963 2885955 2190027 1607833 1244450 1086263 1025645 1051144
10739 1051144 1272145 1701883 2176036 2510182 2611826 2440730 1976897 1244651 314991
10730 314991 -717009 -1725405 -2538960 -3012765 -3137320 -3031900 -2856036 -2741028 -2713297
$$ packed form
10800d328913M11149O18729P22048O51447M05973J02662r9705j48113r3334l8725
10790a796782q0509k43126m37974n00945l59191j08474R7029K06471L03283M23168
10780b497050M75746M49865M61144N16644N01502L78955K06950N0069n9697j25392
10770C58736j42607q2684J0936K9701j2862k1789J7151R7964K53943M68068O30761
10759A607318O09286L65565N5538j06412r3490j4194R4178K63871M43693M88233
10749C713586L03098n6633m23088o51008o95928n82194l63383j58187o0618K5499
10739A051144K21001M29738M74153L34146J01644j71096m63833p32246r29660
10730C14991j032000j008396q13555m73805j24555J05420J75864J15008K7731
$$ plain form
10721 -2713297 -2666510 -2448351 -2003264 -1468640 -1106955 -1140162 -1637070 -2483591 -3449606 -4337760
10711 -4337760 -5066230 -5585096 -5804324 -5658897 -5178475 -4474334 -3719796 -3107559 -2783942
10702 -2783942 -2845674 -3306792 -4013940 -4665758 -4961783 -4733469 -3976852 -2853338 -1649601
10693 -1649601 -641385 45091 458398 769352 1159754 1681348 2215960 2535419 2433272
10684 2433272 1900208 1180831 608018 329665 197753 -53244 -555077 -1244035 -1954242
10675 -1954242 -2516638 -2826290 -2895927 -2859291 -2863497 -2939377 -3037091 -3174628 -3456360 -3955869
10665 -3955869 -4604876 -5193299 -5503336 -5431385 -4980738 -4236582 -3406531 -2781577 -2533675 -2533384
10655 -2533384 -2414188 -1875439 -907280 242902 1229500 1805438 1951352 1798712 1467800
$$ packed form
10721b713297M6787K18159M45087N34624L61685l3207m96908q46521r66015q88154
10711d337760p28470n18866k19228J45427M80422P04141P54538O12237L23617
10702b783942o1732m61118p07148o51818k96025K28314P56617J123514J203737
10693a649601J008216O86476M13307L10954L90402N21594N34612L19459j02147
10684B433272n33064p19377n72813k78353j31912k50997n01833o88958p10207
10675a954242n62396l09652o9637L6636m206p5880r7714j37537k81732m99509
10665c955869o49007n88423l10037P1951M50647P44156Q30051O24954K47902K91
10655b533384J19196N38749R68159J150182R86598N75938J45914j52640l30912
$$ plain form
10646 1467800 1010115 489483 21988 -339447 -663013 -1002708 -1280466 -1365989 -1192371 -750832
10636 -750832 -90583 647542 1284618 1684189 1770231 1509937 929066 155582 -587295 -1039754
10626 -1039754 -1020701 -566692 59572 574702 876010 987675 893088 523496 -106663 -816525
10616 -816525 -1360823 -1630486 -1679435 -1542148 -1130738 -336438 804878 2016841 2860738
10607 2860738 2979938 2336001 1254957 243114 -315803 -386545 -217200 -69584 -58643
10598 -58643 -160066 -282126 -334884 -271919 -113039 37715 29645 -212372 -593060 -922399
10588 -922399 -1163671 -1535571 -2273290 -3382779 -4675170 -5935432 -7031385 -7938716 -8663799
10579 -8663799 -9115864 -9130127 -8664123 -7841120 -6770707 -5511274 -4190267 -2970791 -1933631
$$ packed form
10646A467800m57685n20632m67495l61435l23566l39695k77758q5523J73618M41539
10636g50832O60249P38125O37076L99571Q6042k60294n80871p73484p42877m52459
10626a039754J9053M54009O26264N15130L01308J11665r4587l69592o30159p09862
10616h16525n44298k69663m8949J37287M11410P94300J141316J211963Q43897
10607B860738J19200o43937j081044j011843n58917p0742J69345J47616J0941
10598e8643j01423j22060n2758O2965J58880J50754q070k42017l80688l29339
10588i22399k41272l71900p37719j109489j292391j260262j095953r07331p25083
10579h663799m52065j4263M66004Q23003J070413J259433J321007J219476J037160
$$ plain form
10570 -1933631 -1061012 -270954 503270 1159162 1437744 1195408 599696 -750 -389979
10561 -389979 -612102 -797281 -989762 -1178629 -1382212 -1658223 -2039779 -2425701 -2604235 -2429091
10551 -2429091 -1919323 -1227572 -563510 -116969 -21885 -346266 -1035370 -1879330 -2600437 -2999573
10541 -2999573 -3046798 -2868215 -2636254 -2456537 -2382105 -2487027 -2854638 -3524217 -4478886 -5653888
10531 -5653888 -6927537 -8114002 -9016067 -9547244 -9774239 -9797400 -9625820 -9186799 -8437435
10522 -8437435 -7408466 -6185021 -4907897 -3690246 -2542540 -1419929 -297783 792219
10514 792219 1741058 2394325 2643778 2502727 2134271 1732206 1337540 896991 485593 305608
10504 305608 459278 806570 1037789 882014 320094 -402145 -975897 -1231478 -1184990 -966106
$$ packed form
10570a933631Q72619P90058P74224O55892K78582k42336n95712o00446l89229
10561c89979k22123j85179j92481j88867k03583k76011l81556l85922j78534J75144
10551b429091N09768O91751O64062M46541R5084l24381o89104q43960p21107l99136
10541b999573m7225J78583K31961J79717P4432j04922l67611o69579r54669j175002
10531e653888j273649j186465r02065n31177k26995k3161J71580M39021P49364
10522h437435J028969J223445J277124J217651J147706J122611J122146J090002
10514G92219R48839O53267K49453j41051l68456m02065l94666m40549m11398j79985
10504C05608J53670L47292K31219j55775n61920p22239n73752k55581M6488K18884
$$ plain form
10494 -966106 -721808 -512105 -269266 138060 777893 1526431 2150866 2531018 2667082 2563655
10484 2563655 2236741 1733316 1087615 284919 -685795 -1716269 -2627568 -3355415 -3939545
10475 -3939545 -4342375 -4410152 -4019581 -3255309 -2434601 -1902577 -1783959 -1915681 -1989700 -1765561
10465 -1765561 -1199012 -404367 479032 1356934 2178773 2944231 3671199 4316441 4787725
10456 4787725 5030991 5080125 5009097 4801064 4325357 3518930 2542932 1707016 1262035 1265259
10446 1265259 1560940 1875389 1986183 1844693 1564003 1260202 964036 741269 768994 1229335
10436 1229335 2162277 3430564 4818516 6152031 7339127 8333352 9061356 9392723 9222997
10427 9222997 8606288 7785554 7005935 6311732 5605920 4802491 3898267 2973839 2182063
$$ packed form
10494i66106K44298K09703K42839M07326O39833P48538O24435L80152J36064j03427
10484B563655l26914n03425o45701q02696r70714j030474r11299p27847n84130
10475c939545m02830o7777L90571P64272Q20708N32024J18618j31722p4019K24139
10465a765561N66549P94645Q83399Q77902Q21839P65458P26968O45242M71284
10456D787725K43266M9134p1028k08033m75707q06427r75998q35916m44981L224
10446A265259K95681L14449J10794j41490k80690l03801k96166k22767K7725M60341
10436A229335R32942J268287J387952J333515J187096R94225P28004L31367j69726
10427I222997o16709q20734p79619o94203p05812q03429r04224r24428p91776
$$ plain form
10418 2182063 1749205 1866205 2520064 3484600 4432526 5045816 5134954 4755814 4200183 3762497
$$ packed form
10418B182063m32858J17000O53859R64536R47926O13290Q9138l79140n55631m37686
$$ [...]
##END NTUPLES=NMR SPECTRUM
##END=
