##TITLE=31P ikalashn
92-2024-BAU
18.10.2024
##JCAMPDX= 6.0         $$ Bruker NMR JCAMP-DX V2.0
##DATA TYPE= NMR SPECTRUM
##DATA CLASS= NTUPLES
##ORIGIN= UXNMR, Bruker Analytische Messtechnik GmbH
##OWNER= root
$$ TOPSPIN		Version 1.3
$$ 2024-10-18 13:43:57.312 +0400  Irina@DPX200
$$ Compression mode = diff/dup
##.OBSERVE FREQUENCY= 81.01967998063
##.OBSERVE NUCLEUS= ^31P
##.ACQUISITION MODE= SIMULTANEOUS
##.ACQUISITION SCHEME= undefined
##.AVERAGES= 32
##.DIGITISER RES= 17
##SPECTROMETER/DATA SYSTEM= spect
##.PULSE SEQUENCE= zgpg
##.SOLVENT NAME= D2O
##.SHIFT REFERENCE= INTERNAL, D2O, 1, 298.5841
##AUDIT TRAIL= $$ (NUMBER, WHEN, WHO, WHERE, WHAT)
$$ ##TITLE= Audit trail, TOPSPIN		Version 1.3
$$ ##JCAMPDX= 5.01
$$ ##ORIGIN= Bruker BioSpin GmbH
$$ ##OWNER= Irina
$$ $$ F:/spectra/data/iren/nmr/P31dec/1/pdata/1/auditp.txt
$$ ##AUDIT TRAIL=  $$ (NUMBER, WHEN, WHO, WHERE, VERSION, WHAT)
(   1,<2024-10-18 13:43:30.828 +0400>,<Irina>,<DPX200>,<TOPSPIN 1.3>,
      <created by zg
	started at 2024-10-18 13:42:35.437 +0400,
	POWCHK disabled, PULCHK disabled
       terminated by command 'halt'
       configuration hash MD5:
       BE 6D 3F 07 2A EA 11 49 91 17 2B D3 AF B3 58 0D
       data hash MD5: 32K
       16 92 E5 F2 8B 40 92 AB 54 C8 E8 B8 39 24 8B 5D>)
(   2,<2024-10-18 13:43:43.484 +0400>,<Irina>,<DPX200>,<TOPSPIN 1.3>,
      <Start of raw data processing
       efp BC_mod = 2 LB = 6 FT_mod = 6 PKNL = 1 PHC0 = -10.6365 PHC1 = 376.4153 SI = 32K 
       data hash MD5: 32K
       2B E6 EC 7C AE B1 C8 ED 38 91 76 A9 07 DC 5E A9>)
(   3,<2024-10-18 13:43:48.234 +0400>,<Irina>,<DPX200>,<TOPSPIN 1.3>,
      <abs n ABSG = 5 
       data hash MD5: 32K
       B2 E0 99 7A 44 30 D0 35 2A F6 BD 4B 78 81 62 01>)
$$ ##END=
$$ 
$$ $$ hash MD5
$$ $$ E9 2F 5C 79 52 A9 A1 9B 40 20 39 C1 EE 9B 41 21
##$RELAX= 
##$RELAX= 
##$RELAX= 
##$RELAX= 
##$RELAX= 
##$RELAX= 
##$RELAX= 
##$RELAX= 
##$RELAX= 
##$RELAX= 
##$RELAX= 
$$ Bruker specific parameters
$$ --------------------------
##$DU= <F:/spectra>
##$EXPNO= 1
##$NAME= <P31dec>
##$PROCNO= 1
##$TYPE= <nmr>
##$USER= <iren>
##$AMP= (0..31)
100 100 100 100 100 100 100 100 100 100 100 100 100 100 100 100 100 100 
100 100 100 100 100 100 100 100 100 100 100 100 100 100 
##$ANAVPT= -1
##$AQSEQ= 0
##$AQ_mod= 1
##$AUNM= <au_zg>
##$AUTOPOS= <>
##$BF1= 81.014009
##$BF2= 200.13
##$BF3= 200.13
##$BF4= 200.13
##$BF5= 200.13
##$BF6= 200.13
##$BF7= 200.13
##$BF8= 200.13
##$BYTORDA= 1
##$CFDGTYP= 0
##$CFRGTYP= 5
##$CHEMSTR= <none>
##$CNST= (0..63)
1 1 145 1 1 1 1 1 1 1 1 1 1 1 1 1 1 1 1 1 1 1 1 1 1 1 1 1 1 1 1 1 1 1 
1 1 1 1 1 1 1 1 1 1 1 1 1 1 1 1 1 1 1 1 1 1 1 1 1 1 1 1 1 1 
##$CPDPRG= <waltz16>
##$CPDPRG1= <>
##$CPDPRG2= <waltz16>
##$CPDPRG3= <>
##$CPDPRG4= <mlev>
##$CPDPRG5= <mlev>
##$CPDPRG6= <mlev>
##$CPDPRG7= <mlev>
##$CPDPRG8= <mlev>
##$CPDPRGB= <>
##$CPDPRGT= <>
##$D= (0..63)
0 1 0 0 0 0 0 0 0 0.06 0 0.03 2e-005 3e-006 0 0 0.0002 0 0 0 0 0 0 0 0 
0 0 0 0 0 0 0 0 0 0 0 0 0 0 0 0 0 0 0 0 0 0 0 0 0 0 0 0 0 0 0 0 0 0 0 
0 0 0 0 
$$ [...]
##$SW_h= 37037.037037037
##$TD= 32768
##$TD0= 1
##$TE= 300
##$TE2= 300
##$TE3= 300
##$TEG= 300
##$TL= (0..7)
0 120 53 12 22 120 120 120 
##$TP= (0..7)
150 150 150 150 150 150 150 150 
##$TP07= 0
##$TPNAME0= <>
##$TPNAME1= <>
##$TPNAME2= <>
##$TPNAME3= <>
##$TPNAME4= <>
##$TPNAME5= <>
##$TPNAME6= <>
##$TPNAME7= <>
##$TPOAL= (0..7)
0.5 0.5 0.5 0.5 0.5 0.5 0.5 0.5 
##$TPOFFS= (0..7)
0 0 0 0 0 0 0 0 
##$TUNHIN= 0
##$TUNHOUT= 0
##$TUNXOUT= 0
##$USERA1= <user>
##$USERA2= <user>
##$USERA3= <user>
##$USERA4= <user>
##$USERA5= <user>
##$V9= 5
##$VALIST= <valist>
##$VCLIST= <CCCCCCCCCCCCCCC>
##$VD= 0
##$VDLIST= <DDDDDDDDDDDDDDD>
##$VPLIST= <PPPPPPPPPPPPPPP>
##$VTLIST= <TTTTTTTTTTTTTTT>
##$WBST= 1024
##$WBSW= 4
##$XGAIN= (0..3)
0 0 0 0 
##$XL= 0
##$YL= 0
##$YMAX_a= 5271
##$YMIN_a= -5567
##$ZGOPTNS= <>
##$ZL1= 120
##$ZL2= 120
##$ZL3= 120
##$ZL4= 120
##$ABSF1= 298.5841
##$ABSF2= -158.5842
##$ABSG= 5
##$ABSL= 5
##$ALPHA= 0
##$AQORDER= 0
##$ASSFAC= 0
##$ASSFACI= 0
##$ASSFACX= 0
##$ASSWID= 0
##$AUNMP= <proc_1d>
##$AXLEFT= 0
##$AXRIGHT= 0
##$AXTYPE= 0
##$AXUNIT= <>
##$AZFE= 0.1
##$AZFW= 0.5
##$BCFW= 0
##$BC_mod= 2
##$BYTORDP= 0
##$COROFFS= 0
##$CY= 12.5935478210449
##$DATMOD= 1
##$DC= 0
##$DFILT= <>
##$DTYPP= 0
##$F1P= 47.1127640792319
##$F2P= -24.0371245302204
##$FCOR= 0.5
##$FTSIZE= 32768
##$FT_mod= 6
##$GAMMA= 0
##$GB= 0
##$INTBC= 1
##$INTSCL= 7.269226e-011
##$ISEN= 30
##$LB= 6
##$LEV0= 0
##$LPBIN= 0
##$MAXI= 12.09355
##$MC2= 0
##$MEAN= 0
##$ME_mod= 0
##$MI= 0.7550151
##$NCOEF= 0
##$NC_proc= -9
##$NLEV= 6
##$NOISF1= 298.5841
##$NOISF2= 270.0111
##$NSP= 0
##$NTH_PI= 0
##$NZP= 0
##$OFFSET= 298.5841
##$PC= 1.4
##$PHC0= -10.6365
##$PHC1= 376.4153
##$PH_mod= 1
##$PKNL= yes
##$PPARMOD= 0
##$PPDIAG= 0
##$PPIPTYP= 0
##$PPMPNUM= 100
##$PPRESOL= 1
##$PSCAL= 0
##$PSIGN= 0
##$REVERSE= no
##$SF= 81.014009
##$SI= 32768
##$SIGF1= 270.0111
##$SIGF2= -158.5842
##$SINO= 77.54984
##$SIOLD= 32768
##$SREGLST= <31P.CDCl3>
##$SSB= 0
##$STSI= 32768
##$STSR= 0
##$SW_p= 37037.037037037
##$SYMM= 0
##$S_DEV= 0
##$TDeff= 32768
##$TDoff= 0
##$TI= <>
##$TILT= no
##$TM1= 0
##$TM2= 0
##$TOPLEV= 0
##$USERP1= <user>
##$USERP2= <user>
##$USERP3= <user>
##$USERP4= <user>
##$USERP5= <user>
##$WDW= 1
##$XDIM= 32768
##$YMAX_p= 516553906
##$YMIN_p= -1691026
$$ End of Bruker specific parameters
$$ ---------------------------------
##NTUPLES= NMR SPECTRUM
##VAR_NAME=  FREQUENCY,     SPECTRUM/REAL,   SPECTRUM/IMAG
##SYMBOL=    X,             R,               I
##VAR_TYPE=  INDEPENDENT,   DEPENDENT,       DEPENDENT
##VAR_FORM=  AFFN,          ASDF,            ASDF
##VAR_DIM=   32768,         32768,           32768
##UNITS=     HZ,            ARBITRARY UNITS, ARBITRARY UNITS
##FACTOR=    1.13031516577767, 1,            1
##FIRST=     37037.037037037, -333656,       1506881
##LAST=      0,             -41782,          -1410952
##MIN=       0,             -1691026,        0
##MAX=       37037.037037037, 516553906,     0
$$ Real data points
##PAGE= N=1
##DATA TABLE= (X++(R..R)), XYDATA
$$ [...]
15672a9755n8394M0669L7541p8683q3158L021K5505N5106J14403J27856Q9853
15661B53964N4470N0303J4334k5435m8526j27389k04571j54825l7721l600k7327
15650b56323l806J5475j5188m6017l9305m4236r4935o0138Q8310K02807J68565
15639h4791J6876o4809P835Q4835O6088P205l1017j7588Q0225J93133K16490J09317
15627E83799o9402j82734j57480q9667r5955j17925n5135R297p5896k39452l61148
15616h51698l38532j36661N4173Q3940k7952r3688n088J52168K48942J96850J10538
15605f07008Q4911Q5649J10053R2801J5337o0045j19404j22727o1264j8873m6492
15594f47062q4973n2868J2737L5744k3512q7843q2881J0851J38467K14458J90099
$$ plain form
15672 -19755 -78149 -37480 61 -78622 -161780 -158759 -133254 -78148 36255 164111 253964
15661 253964 308434 358737 373071 347636 299110 171721 -32850 -187675 -225396 -228996 -256323
15650 -256323 -260129 -244654 -259842 -305859 -345164 -389400 -484335 -544473 -456163 -253356 -84791
15639 -84791 -67915 -132724 -124889 -40054 26034 33239 2222 -15366 64859 257992 474482 583799
15627 583799 514397 331663 174183 84516 -11439 -129364 -184499 -175202 -251098 -490550 -851698
15616 -851698 -1190230 -1326891 -1272718 -1188778 -1216730 -1310418 -1315506 -1163338 -914396 -717546 -607008
15605 -607008 -522097 -436448 -326395 -233594 -218257 -278302 -397706 -520433 -581697 -600570 -647062
15594 -647062 -732035 -784903 -772166 -736422 -759934 -847777 -930658 -919807 -781340 -566882 -376783
15583c76783J48728R2723N472m0529m9427m5184k0769J8712K8600O314l1988n7271
15571c21402n3927l8396k3040l6833j05456j27474q8318m5783N5802J50348J57266
15560d77213J58616J24653O186r6630j21719q1234K9211J32542J50525J36693
15550c8370J07775P2501K3003r7220k09214k41239j69289p624J00073J23494J51661
15539a84449J75939R8541p1869j97611k39501k26248j39726P389J36277J34871
15529e06387L6137k638r458q3101j18846j8132R4690R1214Q1537J81997L01498
15518D8511K81028J55359Q778j27001k23771k08021q9113K2468R0242J31091J45380
15507B34951J61190J77932J54705R5459P3299M0066k2405K4480J50473J74145
$$ plain form
15583 -376783 -228055 -135332 -129860 -170389 -219816 -265000 -285769 -267057 -238457 -232143 -264131 -321402
15571 -321402 -375329 -413725 -436765 -473598 -579054 -706528 -794846 -840629 -784827 -634479 -477213
15560 -477213 -318597 -193944 -187758 -284388 -406107 -487341 -458130 -325588 -175063 -38370
15550 -38370 69405 141906 164909 67689 -141525 -382764 -552053 -559677 -459604 -336110 -184449
15539 -184449 -8510 90031 18162 -179449 -418950 -645198 -784924 -777535 -641258 -506387
15529 -506387 -470250 -472888 -482346 -565447 -684293 -702425 -607735 -516521 -434984 -252987 48511
15518 48511 329539 484898 493676 366675 142904 -65117 -154230 -131762 -41520 89571 234951
15507 234951 396141 574073 728778 824237 897536 937602 915197 939677 1090150 1264295
15497A264295O6065m3015r7092j34415j60198j07010k0267K0139K1973o781k1774
15486G81920K6751Q5235M8332l0934o7453j17491k01920k04677j29633o7745k7126
15475I5259l4329p4197j22102j37876p9494j1070K8990J26357K60451L26373L00333
15464F78695J81159k0680j91325k16851j50215n6815J0594j4169m9838N930Q3579
15453B60064P1913L659l3515l8076p2755j15522j43858j53578j21429q0124k6270
15442d49491O1086J33641J25964K7083p2373r5192r1298r6369n0236Q3546K01154
15431b22485K12795J44552N2535M9721J04210P0005N45K4916J17234J02682m4244
15420F12466j57229j49960r0167n3518k4923j576J9183N0743R2110R4248N2920
$$ plain form
15497 1264295 1330360 1287345 1190253 1055838 895640 788630 768363 788502 810475 803694 781920
15486 781920 808671 893906 942238 911304 843851 726360 524440 319763 190130 122385 95259
15475 95259 60930 -13267 -135369 -273245 -352739 -363809 -334819 -208462 51989 378362 678695
15464 678695 859854 839174 647849 430998 280783 223968 234562 220393 170555 176485 260064
15453 260064 331977 335636 302121 264045 191290 75768 -68090 -221668 -343097 -423221 -449491
15442 -449491 -388405 -254764 -128800 -101717 -174090 -269282 -360580 -456949 -507185 -423639 -222485
15431 -222485 -9690 134862 187397 237118 341328 411333 411878 436794 554028 656710 612466
15420 612466 455237 305277 215110 161592 136669 135093 154276 205019 297129 391377 444297
15409D44297L386m0648m9642o5247j17822j46779j60775j93483j80060p0280J04382
15398d72671K47566K77000K08939J26385O7805K8274m9473j70030k36296k40853
15388b13354j68067n5040L8607J02169R0683J4872J3582P1397P4993K5343l1264
15377c6079r3584j80010k08332p6381J13865K18613K17536J66347J41502J37762
15367D01239J53585J46804N9245k4020n4750p3733q8697p6061n6003q8595j34712
15356A64302j22811k9638J05072J57100J50908J40815Q9872j5032j04118j28341
15346D08129j49989j53933j51752j75503j69775j17050p2126l3682J7890M1960
15336e55831M9532R0922J12498R4480J27295J52835J04441J25886K11282J51979
$$ plain form
15409 444297 447683 407035 357393 292146 174324 27545 -133230 -326713 -506773 -577053 -472671
15398 -472671 -225105 51895 260834 387219 455024 483298 433825 263795 27499 -213354
15388 -213354 -381421 -436461 -397854 -295685 -205002 -190130 -176548 -105151 -30158 -4815 -36079
15377 -36079 -129663 -309673 -518005 -594386 -480521 -261908 -44372 121975 263477 401239
15367 401239 554824 701628 760873 736853 682103 608370 519673 443612 387609 299014 164302
15356 164302 41491 11853 116925 274025 424933 565748 655620 640588 536470 408129
15346 408129 258140 104207 -47545 -223048 -392823 -509873 -581999 -615681 -597791 -555831
15336 -555831 -506299 -415377 -302879 -208399 -81104 71731 176172 302058 513340 665319
15326F65319l7252j63424j23607J261R7939J36727J03308o8473k64025k96750
15316E1023k15803j29349m1482L7377M1084J0722m522k3910p082Q2790J68661
15305c0491J36449j0179j45824j94944j64834p5267N3580J54515J45174Q7240
15295d4581L7249k3238j04226j87072k10761j78927j45053r9014P924J42754K41232
15284e63713K71043K39627J70064P9178m3921j68591j96350q9031J9498o018j31287
15273d19501k01743j78740j36945r4163j8105P0684R0199J20631J43912O7840
15263e55931n6000j25542q1688M6663J98387K42656J92910J44116P7140l5815
15253D6896r5084Q794J76351J68461K0167l9160J7203J02118J60276J24743m0928
$$ plain form
15326 665319 628067 464643 341036 342297 440236 576963 680271 611798 347773 51023
15316 51023 -164780 -294129 -335611 -298234 -257150 -246428 -250950 -274860 -281942 -199152 -30491
15305 -30491 105958 95779 -50045 -244989 -409823 -485090 -431510 -276995 -131821 -44581
15295 -44581 -7332 -30570 -134796 -321868 -532629 -711556 -856609 -955623 -947699 -804945 -563713
15284 -563713 -292670 -53043 117021 196199 152278 -16313 -212663 -301694 -282196 -288214 -419501
15273 -419501 -621244 -799984 -936929 -1031092 -1049197 -978513 -888314 -767683 -623771 -555931
15263 -555931 -611931 -737473 -819161 -772498 -574111 -331455 -138545 5571 82711 46896
15253 46896 -48188 -39394 136957 305418 325585 286425 303628 405746 566022 690765 649837
15242F49837k21876k44138j32257q098L8212k6477j14512j08117j2183O0527J17357
15231a725J64636R0736o8110j54687j08814j7400L6237J9332n5629o7957q159
15220a71540Q0290J83610K11855J50394J4077j55207k19812j76734j46987j30370
15210c60424n9025P5451K21645K17926P6420m6582q8540j30392j79735j74911
15200d48167j06880J7993J27878J35653Q0402j3643j18411j00915J6403P4505
15190c35182L2853O642N3979R4832R0285N5582r587m5767j02491j62695j23707
15179d45256J0288R5834M0247j13208k07619k06724k08003j51450j8545Q6378
15169a118058J35980J49253J57583J19466P5475Q4057J21256J14593K1969j05460
$$ plain form
15242 649837 427961 183823 51566 43468 81680 55203 -59309 -167426 -179609 -119082 -1725
15231 -1725 162911 253647 185537 30850 -77964 -95364 -59127 -39795 -95424 -163381 -171540
15220 -171540 -91250 92360 304215 454609 468686 313479 93667 -83067 -230054 -360424
15210 -360424 -419449 -343998 -122353 95573 171993 125411 36871 -93521 -273256 -448167
15200 -448167 -555047 -537054 -409176 -273523 -193121 -206764 -325175 -426090 -409687 -335182
15190 -335182 -302329 -295687 -241708 -146876 -56591 -1009 -10596 -56363 -158854 -321549 -445256
15179 -445256 -434968 -339134 -298887 -412095 -619714 -826438 -1034441 -1185891 -1204436 -1118058
15169 -1118058 -982078 -832825 -675242 -555776 -480301 -396244 -274988 -160395 -138426 -243886
15159b43886j42368n4239M3002Q5722O9300K3635k5934l3040P383l09l6885J5052
15147b92567Q8472O8017l6022j02032l9830R1595K13780K63379K32297J33990
15137F21079N4552J2820R66K1168o3919k29632k75162j64101k0767J25849K22127
15126C04980J46191l6065j63836j72328j06359m0179K3328J9176k4195k2181p732
15115g9200k674K456O455j2748o7086j06816q5606K3308J34179J58410J39537
15104A10215J23934J48097J45893M2599p9364j25382j29109j49436j56660j10675
15094a79888k7521L6747J12405J83809J85480J16091N0739O0265R9098R5852O2203
15083G95280P8904J01086K5455p9566j31938j30578j15534j07951p8186r0052
$$ plain form
15159 -243886 -386254 -440493 -397491 -311769 -242469 -218834 -244768 -277808 -270425 -270734 -307619 -292567
15147 -292567 -204095 -136078 -172100 -274132 -313962 -222367 -8587 254792 487089 621079
15137 621079 675631 688451 689417 710585 646666 417034 141872 -22229 -42996 82853 304980
15126 304980 451171 415106 251270 78942 -27417 -67596 -44268 -25092 -49287 -71468 -79200
15115 -79200 -81874 -79418 -72963 -85711 -152797 -259613 -345219 -321911 -187732 -29322 110215
15104 110215 234149 382246 528139 570738 491374 365992 236883 87447 -69213 -179888
15094 -179888 -207409 -170662 -58257 125552 311032 427123 477862 538127 637225 733077 795280
15083 795280 874184 975270 1000725 921159 789221 658643 543109 435158 356972 266920
15073B66920j34436j57372r8944J746M6885L5986L900l9369n9947P334J33991
15062F694J97537J46771N9223L4737K6744l7977j33364j52811m4600O0908L2558
15051A96420k1703K6542K4627r5082k16347k80756k82922k18883r6702L2017J36188
15040g96601K42798K69173J07566r7120j69410j50972r2209m4961J2730J05706
15030f13300J91646J95871Q8510l9470o6259l1741j7021j3119M6471J16796O8929
15019g2687n1761j03356j33594k44703l17669k71304k08611j40369k0500J48883
15009a415671L08488L82545K95635R2329o3577r4446m1156N9572J56438J35596
14999a84247l2205k16141k44014j36248j7771K8543O4929P9332P6458J00539Q8957
$$ plain form
15073 266920 132484 -24888 -123832 -122086 -75201 -39215 -35315 -74684 -134631 -127297 6694
15062 6694 204231 351002 410225 444962 471706 433729 300365 147554 102954 163862 196420
15051 196420 174717 201259 225886 130804 -85543 -366299 -649221 -868104 -964806 -932789 -796601
15040 -796601 -553803 -284630 -177064 -274184 -443594 -594566 -686775 -731736 -719006 -613300
15030 -613300 -421654 -225783 -137273 -176743 -243002 -274743 -291764 -304883 -258412 -141616 -72687
15019 -72687 -124448 -227804 -361398 -606101 -923770 -1195074 -1403685 -1544054 -1564554 -1415671
15009 -1415671 -1107183 -724638 -429003 -336674 -400251 -494697 -535853 -476281 -319843 -184247
14999 -184247 -216452 -432593 -676607 -812855 -830626 -802083 -737154 -657822 -581364 -480825 -391868
14988c91868M7946J1329j9179J7626P3546N9991N3806R3877J31594J40995J06236
14977C25899J9006n9140q0680n7387j01140j89777j82528j08400j04398j78636
14967g17181j91215j06876j6776Q3476J55820J56327J01987L3707p49l2250r5469
14956f29199j28441r4616N523J19769J65521J22362J0649r4732j09911n9640r176
14945g01891Q8630J69471J34317O5180M1683J9056j3417n1597p0163n0682k4677
14934c94090k7481m9745q5896j54923k28774k65760k08949q0475O5035J52417
14924a278641J78247J80444J45202J36241J70201J44062M2013o6414q5910k893
14914d37448R6460J45067N2269n7032p2863p6664o6271K250P8214J31303K07120
$$ plain form
14988 -391868 -343922 -332593 -351772 -334146 -260600 -200609 -146803 -52926 78668 219663 325899
14977 325899 344905 285765 205085 147698 46558 -143219 -325747 -434147 -538545 -717181
14967 -717181 -908396 -1015272 -1032048 -948572 -792752 -636425 -534438 -500731 -501480 -533730 -629199
14956 -629199 -757640 -852256 -846733 -726964 -561443 -439081 -428432 -523164 -633075 -692715 -701891
14945 -701891 -613261 -443790 -309473 -244293 -202610 -183554 -196971 -248568 -318731 -369413 -394090
14934 -394090 -421571 -471316 -557212 -712135 -940909 -1206669 -1415618 -1496093 -1431058 -1278641
14924 -1278641 -1100394 -919950 -774748 -638507 -468306 -324244 -282231 -348645 -434555 -437448
14914 -437448 -340988 -195921 -143652 -200684 -273547 -350211 -416482 -414232 -336018 -204715 2405
14903B405K47806J44676j7344j27496j78650j72678j24307j08474j12439n8974
14893e05475k2948n9279j15892j34062j08689m2951k9485p4330m7128O7793J22717
14882i49729P6810M4964N0862R4635J44888K14835K62768K11208Q4415k8952j02571
14871A04133j80882j75744o9002K6225J9976l0319n6447o4051q877N2434M0188
14860c42366o845n0390l4106k57k2833j5661q177p6852j89350k28658j52624k9202
14848a157321J33784K31371J99759J81911J74732J30052J01599M1301n7431r4482
14838a14725q9440j07850j24835q9343j0896J7703l9193j10665n6284Q6267J47377
14827d91884J35985J55577K23348L19738L21431J75180j346j11641j03989K9684
$$ plain form
14903 2405 250211 394887 377543 250047 71397 -101281 -225588 -334062 -446501 -505475
14893 -505475 -528423 -587702 -703594 -837656 -946345 -989296 -1018781 -1093111 -1140239 -1072446 -949729
14882 -949729 -872919 -827955 -777093 -682458 -537570 -322735 -59967 151241 235656 206704 104133
14871 104133 -76749 -252493 -321495 -295270 -275294 -305613 -362060 -426111 -434988 -382554 -342366
14860 -342366 -349211 -399601 -433707 -433964 -456797 -472458 -480635 -557487 -746837 -975495 -1128119 -1157321
14848 -1157321 -1023537 -792166 -592407 -410496 -235764 -105712 -4113 37188 -20243 -114725
14838 -114725 -204165 -312015 -436850 -526193 -537089 -519386 -558579 -669244 -725528 -639261 -491884
14827 -491884 -355899 -200322 23026 342764 664195 839375 838029 726388 622399 652083
14817F52083J26107O9793p6401k09720k23593j43408o5727j6712M3241J55971
14807C11634K52313K37392J11447j2451l3088k281j443p9023j54971j99204k17961
14796B12364k02126j53718j44697j63643j36377n3893N1483J27383J21506N8127
14786b83591p081o0477o0125k4551M982L7171O3793N6701J6298K8004M1701K0244
14774a66931M6635Q0853P7681O6699L1277L1753R0686O5754m7603j25627j13375
14763C7802j04633j37857j07871L3179K00606K80814K06423J10442Q9427R5143
14753G03475M9043m5877j12095j43096j01232k543N9944M4045K9740J03490J58705
14742G43599J23843Q8279N5552m489r5545j90659k43774k50969k38146k13235
$$ plain form
14817 652083 778190 847983 771582 561862 338269 194861 129134 112422 155663 311634
14807 311634 563947 801339 912786 900335 867247 864966 863523 784500 629529 430325 212364
14796 212364 10238 -143480 -288177 -451820 -588197 -642090 -590607 -463224 -341718 -283591
14786 -283591 -290672 -351149 -411274 -435825 -430843 -393672 -329879 -273178 -256880 -228876 -187175 -166931
14774 -166931 -120296 -39443 38238 104937 136214 167967 258653 324407 276804 151177 37802
14763 37802 -66831 -204688 -312559 -279380 -78774 202040 408463 518905 608332 703475
14753 703475 752518 706641 594546 451450 350218 347675 407619 451664 481404 584894 743599
14742 743599 867442 955721 1011273 1006784 911239 720580 476806 225837 -12309 -225544
14732b25544j22598L7042J52276J58278R7306O0982P3220J13891J00142J5082
14722D60077n7933j11947j44590j20048n8442J571O2478O4453J3q5243j56096
14711a45707j62613j25519m8804M3743P0999N1210Q6112J55959J75210J30839
14701B31429N48j60010k30553j97403j33239q2023k6997P754R954K4781N8192
14690d97567R9126J00931O4427O5075Q8433R2815O7938O9755J08465R2771j5825
14679C36344j15883j38020j67640k13971j43903L4549J92357K56177J84426J9580
14669B44016j20676j28346k7020M8991N1314p724o5215m7415K1348Q3118R2037
14658A44428P7266J02338J41293J19170N2598J0943k5032j14186j98065j59050
$$ plain form
14732 -225544 -348142 -311100 -158824 -546 96760 157742 230962 344853 444995 460077
14722 460077 402144 290197 145607 25559 -32883 -31312 31166 95619 95632 10389 -145707
14711 -145707 -308320 -433839 -482643 -438900 -367901 -316691 -230579 -74620 100590 231429
14701 231429 231977 71967 -158586 -355989 -489228 -571251 -598248 -590494 -580540 -555759 -497567
14690 -497567 -398441 -297510 -233083 -168008 -79575 13240 81178 150933 259398 352169 336344
14679 336344 220461 82441 -85199 -299170 -443073 -408524 -216167 40010 224436 244016
14669 244016 123340 -5006 -32026 16965 68279 60555 -4660 -52075 -30727 52391 144428
14658 144428 221694 324032 465325 584495 637093 648036 623004 508818 310753 151703
14648A51703l6586N880n4588r3757n3819k378k4266q4179j11714j02078o1934
14637d67716m6355n4946q0939n0649O3965J51002J15835K8327k98L9809Q8334
14626b13631J14895R0844M7406k830j11015k22084k20814j36552n0664j4006r2045
14615h10496k10453k12292p0842R0543K10301K71203K61112K17815K00441J73515
14605A20847P3198l1590p2556o8536m5676l9506o0159l5794M8875Q8160J1545
14594a1192o8926l2019J9507o3681k38371l42080k93146j88338o9140L9299Q7521
14583a160566Q4111J07907J27834P5686o208j00618j91599k04596n5799J90245
14573a133603L42337L54414K75853J19246m7884j12793L91J38340J58945Q3188
$$ plain form
14648 151703 115117 120997 66409 -27348 -81167 -83545 -107811 -191990 -303704 -405782 -467716
14637 -467716 -514071 -569017 -649956 -700605 -636640 -485638 -369803 -341476 -341774 -301965 -213631
14626 -213631 -98736 -7892 39514 36684 -74331 -296415 -517229 -653781 -704445 -718451 -810496
14615 -810496 -1020949 -1233241 -1304083 -1213540 -1003239 -732036 -470924 -253109 -52668 120847
14605 120847 194045 162455 89899 21363 -24313 -63819 -123978 -159772 -110897 -22737 -11192
14594 -11192 -80118 -112137 -92630 -156311 -394682 -736762 -1029908 -1218246 -1287386 -1248087 -1160566
14583 -1160566 -1076455 -968548 -840714 -765028 -771236 -871854 -1063453 -1268049 -1323848 -1133603
14573 -1133603 -791266 -436852 -160999 -41753 -89637 -202430 -202039 -63699 95246 178434
14563A78434p4141j91236j93586j53809q6165k5594j8691k2668m098K3754N4207
14552e13593O8495M5813N061K6411R0931J04764O5187K8530K6220j851p6593j25992
14540b56617j13312n3163L0341J47904K34436J81633P3148M8227O0601L3784r029
14529C77953l7122q7690j93743k58644k32198j81969j34740j01459l1490P0971
14519h10131P1428Q513N4670J63236J54702L3035j00917j21929k935M9394N7748
14508d43186J74569K68609J97368N9944k2026n4495p1250o9006n1677o7923j38811
14497b17884k04708j75845m2388P3639Q4398K0671M451O4258R6202M8343K967
14486b45896L0573P1299J19669J34960P2520L0161L2193k7100j77044k90119k61290
$$ plain form
14563 178434 104293 -86943 -280529 -434338 -520503 -546097 -564788 -587456 -591554 -567800 -513593
14552 -513593 -445098 -399285 -394224 -367813 -276882 -172118 -106931 -78401 -52181 -54032 -130625 -256617
14540 -256617 -369929 -423092 -392751 -244847 -10411 171222 244370 292597 353198 386982 377953
14529 377953 340831 253141 59398 -199246 -431444 -613413 -748153 -849612 -881102 -810131
14519 -810131 -738703 -730190 -675520 -512284 -357582 -324547 -425464 -547393 -550328 -500934 -443186
14508 -443186 -268617 -8 197360 257304 235278 180783 109533 40527 -11150 -79073 -217884
14497 -217884 -422592 -598437 -640825 -567186 -482788 -462117 -457666 -393408 -297206 -248863 -245896
14486 -245896 -215323 -144024 -24355 110605 183125 213286 245479 218379 41335 -248784 -510074
14475e10074j26240M728Q3748J00492J03604J57959J70053J31337J09878J13876
14465C39361J18026Q5096R667r406P5291J10514j9144j61144k20106k10352j81987
14454f4184j53795q0586J2665N6041M1029O7366Q6162L6174M3119J39564K28994
14443D12549J93305M9212o9174q8543j7184L1469l4550j40424j83866j31507k1729
14432d42Q5643J66570J29124n6688k21967k24965j30158k3442O5099J33412K02342
14421A24528K08294J14536K5185k0218p2553j13323j26331j62080k11996j96670
14411d30628j34196r1025q3056p1865Q985J00253J73246K05601J75928R1596K618
14400e2543k1874L5503Q1434O7333M3009K106m6285l4364j4413K3763Q5251O3360
$$ plain form
14475 -510074 -636314 -631586 -547838 -447346 -343742 -185783 -15730 115607 225485 339361
14465 339361 457387 542483 552150 542744 618035 728549 709405 548261 328155 117803 -64184
14454 -64184 -217979 -298565 -285900 -229859 -188830 -121464 -35302 872 43991 183555 412549
14443 412549 605854 655066 585892 497349 480165 511634 477084 336660 152794 21287 -442
14432 -442 85201 251771 380895 324207 102240 -122725 -252883 -276325 -211226 -77814 124528
14421 124528 332822 447358 472543 452325 379772 266449 140118 -21962 -233958 -430628
14411 -430628 -564824 -655849 -738905 -810770 -801785 -701532 -528286 -322685 -146757 -55161 -52543
14400 -52543 -74417 -38914 42520 109853 152862 154968 108683 74319 59906 83669 168920 232280
14388B32280k0307k8506l0065j24564j62349l0787J42274J52249P5664O7641M2071
14377C15601k2462m6513M095J03159J76540K06935J36615k4685j53151k06631
14367D89503j93741j21943k2802M4708N7962O9016J11027J58098J61772J12242
14357H65842L8044k5802l3463K3842N5098j7482j43575k13573k10332j52550p7044
14346A09005o8855q9294q4384l3170Q6338K35169K77021J81749P1734K3645K883
14335G11841o2830j20764j15369j38970k18886j90682j5791J19760J38836J55659
14325B62804J88206K01439K02845J36458L7288k733m9354j18701j29702p7287
14315F51263k9015k1727k3086K037N6279J21203Q7182j7205l4120n1784j56397
$$ plain form
14388 232280 211973 183467 153402 28838 -133511 -164298 -22024 130225 205889 273530 315601
14377 315601 293139 246626 250721 353880 530420 737355 873970 849285 696134 489503
14367 489503 295762 173819 151017 195725 253687 322703 433730 591828 753600 865842
14357 865842 903886 878084 844621 868463 923561 906079 762504 548931 338599 186049 109005
14346 109005 40150 -49144 -133528 -166698 -80360 154809 431830 613579 685313 708958 711841
14335 711841 649011 528247 412878 273908 55022 -135660 -151451 -31691 107145 262804
14325 262804 451010 652449 855294 991752 1029040 1026307 976953 858252 728550 651263
14315 651263 622248 600521 577435 579472 635751 756954 844136 826931 792811 741027 584630
14304E84630k02988j26010p586M4864q123J254Q4198L7419j27770k14605j94160
14293a28877j61262q9354L6546R3524L9055r362m8800n8447l000K2922J6188J1009
14281b79858m366j8837l4264j01058j79487k32921k11502n1634J55828K75630
14271f82469K77537K42594J83263P0336l8993j11508j87801j86168q0693P349
14261e06553K612p228Q0736R2610o5273k04490j98761p3288j7264q4805j39170
14250a120874j01622k8676M1107J57326K58062K38487Q8641q6527j58740r6415
14240h09231M0019J15427Q7763N4149P9256J07203L5344p8852j33469j36239o2288
14229g00918q88j9415m9259k5655N3361J09576J88210K72787K23672R3882K3642
$$ plain form
14304 584630 381642 255632 248046 292910 284787 286041 370239 407658 279888 65283 -128877
14293 -128877 -290139 -379493 -342947 -249423 -210368 -219730 -268530 -326977 -329977 -307055 -290867 -279858
14281 -279858 -284224 -303061 -337325 -438383 -617870 -850791 -1062293 -1113927 -958099 -682469
14271 -682469 -404932 -162338 20925 91261 52268 -59240 -247041 -433209 -513902 -506553
14261 -506553 -503941 -511169 -430433 -337823 -403096 -607586 -806347 -879635 -896899 -981704 -1120874
14250 -1120874 -1222496 -1251172 -1210065 -1052739 -794677 -556190 -467549 -554076 -712816 -809231
14240 -809231 -769212 -653785 -566022 -511873 -432617 -325414 -290070 -368922 -502391 -638630 -700918
14229 -700918 -701806 -721221 -770480 -796135 -742774 -633198 -444988 -172201 51471 145353 168995
14218A68995q482j11817k42577k56647j74358r6021k6977O2465J26382J15533
14208d43504J8717p8789q7577j3183J18369K15104J95500Q1443p1696j87919j66461
14197d19996o6229J6200N4603O1486O4514J00279J22927P2075P7727J43808J39055
14186C66449P3957N311n8140p7449o7399p7266l2775M1629M4704M1085K8171l529
14174B84748N594n10m5878j27726j54268r2688k9160K0782N7874M2739k2560p6176
14162a37229m3153K5219p077r5696j26428r4821j080J08582J54801Q7177K7669
14151a02036L3673J5298n652K243O0812J05274O6018j7314j05699j59860j15039
14140b22282K6463J68190J73228M9128r8053j62157j14699m2988l7952q6399j41152
$$ plain form
14218 168995 160513 48696 -193881 -450528 -624886 -720907 -747884 -685419 -559037 -443504
14208 -443504 -424787 -503576 -591153 -604336 -485967 -270863 -75363 6080 -65616 -253535 -419996
14197 -419996 -486225 -470025 -415422 -353936 -289422 -189143 -66216 5859 83586 227394 366449
14186 366449 440406 445717 387577 310128 242729 165463 132688 174317 219021 260106 288277 284748
14174 284748 290342 289832 243954 116228 -38040 -130728 -159888 -139106 -81232 -38493 -61053 -137229
14162 -137229 -180382 -155163 -162240 -257936 -384364 -479185 -480265 -371683 -216882 -129705 -102036
14151 -102036 -68363 -53065 -58717 -56474 4338 109612 175630 158316 52617 -107243 -222282
14140 -222282 -195819 -27629 145599 194727 96674 -65483 -180182 -223170 -261122 -347521 -488673
14129d88673j52423j52324j95530k28567j73552n6411O9467J45045J24631O4007
14119a044330L4052j6499p5932m6354L4917Q0501P6587Q7559J42628J37206O3353
14108e26312O8908J66471K34621J98718J17883N4820K9138l962o0047p1235k5688
14097A83315o823k8031m4950m4945k9795J2315P0110J40949J57798N9027l7713
14086D31257o983J12611K04280J70187M0650n2693p2929q5369o6403m5938j30475
14075D98195j70319q9077m9666j09815j89222j96563o7513J28665K11763J10218
14065G6666k4917l9226l325J4370M225J0477K1864k150j9186r126N9755J11818
14053B01245P6129J4085l8658n4510j2997L4456Q0283J13623R8509L7937j6592
$$ plain form
14129 -488673 -641096 -793420 -988950 -1217517 -1391069 -1447480 -1378013 -1232968 -1108337 -1044330
14119 -1044330 -1010278 -1026777 -1102709 -1149063 -1114146 -1033645 -957058 -869499 -726871 -589665 -526312
14108 -526312 -457404 -290933 -56312 142406 260289 315109 344247 340285 280238 209003 183315
14097 183315 176492 148461 103511 58566 28771 41086 111196 252145 409943 468970 431257
14086 431257 424274 536885 741165 911352 952002 899309 826380 741011 674608 628670 498195
14075 498195 327876 238799 189133 79318 -109904 -306467 -373980 -245315 -33552 76666
14065 76666 51749 12523 9198 23568 27793 38270 60134 57984 38798 29672 89427 201245
14053 201245 277374 291459 252801 198291 185294 219750 300033 413656 512165 550102 533510
14042E33510o519K0961j5671m6221n5258j06595j04494n5290r7488j79587j52201
14031b64853j5106J18594J71408J10389K4953k5733q9800j85105k60884k28775
14021f44912q3885P0038J43530J04110o4063j51861p7453q936K3832P0111P7951
14010e41538J7238l1822k9073o989j6815j5155L0548P3723M0798q663n69R665
13998d78652j8629J166Q6225J35479N8012m0754l2774L4456J31153K13644K04917
13987B94243J18565L7457J7142K6663j0359j06972j44877j12629p1521p528Q49
13976D1033o6731j45178j77150j14673J4821J10442Q0600m9375j61252j50470
13966f17933l5703P1545Q0858M0604K1948P482m1646p1548n6152l6306J4055M9389
$$ plain form
14042 533510 526991 547952 532281 486060 430802 324207 219713 164423 66935 -112652 -264853
14031 -264853 -279959 -161365 10043 120432 145385 119652 29852 -155253 -416137 -644912
14021 -644912 -728797 -658759 -515229 -411119 -475182 -627043 -704496 -713432 -689600 -619489 -541538
14010 -541538 -524300 -556122 -585195 -592184 -608999 -624154 -593606 -519883 -479085 -487748 -488317 -478652
13998 -478652 -497281 -496115 -409890 -274411 -216399 -257153 -289927 -255471 -124318 89326 294243
13987 294243 412808 450265 467407 494070 483711 376739 231862 119233 47712 40184 41033
13976 41033 -25698 -170876 -348026 -462699 -447878 -337436 -256836 -306211 -467463 -617933
13966 -617933 -653636 -582091 -501233 -460629 -438681 -431199 -472845 -544393 -600545 -636851 -622796 -573407
13954e73407M0308O8664J34737J30177L0325j28330k36995j99886j23659j42822
13944a000888j19615R2481L02456L26662J98521M3511m2460p5420m6098M0348
13934b80502P7918J07947J71645J71133J29129J05212O5077j9530j00448j28986
13924B98595j35372p6572J2877N9230Q4519J04678J26142J01926M4427J578l0046
13913E91982o886O3271j0967j97414l19263k94767j81801r1182k7613K9964M8994
13902c95682J9605n781J0490K9648K0920J5601L3403M0747r787o4643k5484O3706
13890b67257J02313J23961J58843J85118J83386J32198j3676j74326k13497j36851
13880H0212j1742Q3569J00444L9005m9633m1312j969M8603J67930J74121K9180
$$ plain form
13954 -573407 -533099 -464435 -329698 -199521 -169196 -297526 -534521 -734407 -858066 -1000888
13944 -1000888 -1120503 -1028022 -725566 -398904 -200383 -156872 -199332 -274752 -320850 -280502
13934 -280502 -202584 -94637 77008 248141 377270 482482 547559 528029 427581 298595
13924 298595 163223 86651 99528 158758 243277 347955 474097 576023 620450 622028 591982
13913 591982 585096 648367 637400 439986 120723 -174044 -355845 -447027 -474640 -444676 -395682
13902 -395682 -376077 -381858 -371368 -341720 -320800 -305199 -271796 -231049 -240836 -305479 -330963 -267257
13890 -267257 -164944 -40983 117860 302978 486364 618562 604886 430560 217063 80212
13880 80212 68470 152039 252483 291488 241855 200543 198574 247177 415107 589228 618408
13869F18408r6479r0106R211O8127N9333K9944K5755j2978j35062j83763o4092
13858B28298J37895K40766J78533J8986j36376k16389k57481k71585k86134k75711
13848f39198j70584l6349P1105J47229J45192P2055J4899M5528R8716O6489q774
13837a93692J271Q1368Q8356M2600K2898K9958K1031l7084m6650k704J2165j2453
13825G064n5656r2574j11070j09386j17722j17944n7356K2428L4595p902o10M9784
13813e56349O8715R6005J35325J35823R7811R2075J39809J81727J76346J45658
13803G12945N9389j01415k53116l34749l23993k46560j74531j12699o843J38747
13793f42825K79336L29218K26522N1221n5740l3863L5075J35169J86527J52368
$$ plain form
13869 618408 521929 431823 441034 509161 568494 598438 624193 611215 476153 292390 228298
13858 228298 366193 606959 785492 804478 668102 451713 194232 -77353 -363487 -639198
13848 -639198 -809782 -846131 -775026 -627797 -482605 -410550 -395651 -350123 -251407 -184918 -193692
13837 -193692 -192421 -111053 -22697 19903 42801 72759 93790 56706 10056 7352 19517 7064
13825 7064 -48592 -141166 -252236 -361622 -479344 -597288 -654644 -632216 -597621 -605523 -606133 -556349
13813 -556349 -487634 -391629 -256304 -120481 -22670 69405 209214 390941 567287 712945
13803 712945 772334 670919 417803 83054 -240939 -487499 -662030 -774729 -781572 -642825
13793 -642825 -363489 -34271 192251 243472 187732 153869 188944 324113 510640 663008
13783F63008J37954J18406N4541R787L6002k431k07330l38857k85375j63727n5542
13772c3564q128n152n967K8198Q7659J35243J80899J80927P8429k5852q7883j10847
13760D13962j0233O1481j3943j33534j91175j12199M4261R0823k4707j45446j72788
13749a93498j06152K1014J17598J14225L4207o0345p9348m8623l6002m0083n0162
13738c27169k1553P5390J80858K22235K15812J98082J86619J29585j6971j68124
13728F74764k49729k62205k13886r5499K8189P9952O8652r655n2103N7040J84371
13717B09891J78663J45163Q9306m3238j74551k26159k04935j50355r6867r6899
13707c69981q7771J4973J70153K21356J33974J1580n8670m7072k9708k7851r497
$$ plain form
13783 663008 800962 919368 973909 983696 1019698 1017267 809937 471080 185705 21978 -33564
13772 -33564 -41692 -46844 -52811 -24613 63046 198289 379188 560115 638544 612692 524809 413962
13760 413962 403729 465210 451267 317733 126558 14359 58620 149443 124736 -20710 -193498
13749 -193498 -299650 -278636 -161038 -46813 -12606 -72951 -152299 -200922 -236924 -277007 -327169
13738 -327169 -348722 -273332 -92474 129761 345573 543655 730274 859859 842888 674764
13728 674764 425035 162830 -51056 -146555 -118366 -38414 30238 20583 -31520 25520 209891
13717 209891 388554 533717 623023 579785 405234 179075 -25860 -176215 -273082 -369981
13707 -369981 -457752 -442779 -272626 -51270 82704 94284 35614 -11458 -41166 -69017 -78514
13696g8514m1817r2114o5172M9049J61377J78934J33450Q6435L6417k7195j01076
13685B39774j72201k01734j70025j21145o8785k5966m286k8872q0712n5016M5667
13674f43301J09496J14328R2641Q9223J29395J65085J47736J39366J39756P3046
13664E56771p2929j60305r7097J6596Q1496R6306J15023J37137P1673q0587k00132
13653D63952k35156j83194r0807J4033J22644J35764M8025l4540r2050j14533
13643C4138q6142n461P6169P4261M1070O084l9136M306R1287J03817R9376N6229
13631D55998o3060j47521k27238l11873k62460j25289k7833L2622R6100J52877
13621d27677J88998K15916K58789L17197L08662J89369R0886P3244N4212j1682
$$ plain form
13696 -78514 -120331 -212445 -277617 -228568 -67191 111743 245193 331628 368045 340850 239774
13685 239774 67573 -134161 -304186 -425331 -494116 -520082 -524368 -553240 -633952 -688968 -643301
13674 -643301 -533805 -419477 -326836 -237613 -108218 56867 204603 343969 483725 556771
13664 556771 483842 323537 226440 243036 324532 420838 535861 672998 744671 664084 463952
13653 463952 228796 45602 -45205 -31172 91472 227236 275261 240721 148671 34138
13643 34138 -52004 -57465 18704 92965 134035 140119 100983 105289 196576 300393 399769 455998
13631 455998 392938 245417 18179 -293694 -556154 -681443 -709276 -676654 -580554 -427677
13621 -427677 -238679 -22763 236026 553223 861885 1051254 1142140 1215384 1269596 1257914
13611A257914r5788j73839j76289r1834J79O0365P5870O2718N8539L1032p9502
13600I29365k04204k09447j14634J4470J11845Q8250L2613L852k8429p7108p5916
13589D70657M0059R0404J6362m6166o8086o5381p47P2018M2701m6369r0234r3271
13577C21947j13732j05729m8717K9626R1419Q5115K1481j6418n4954j20114j45829
13566e5905r0985m2937m0257j4204O0541J51888K04498J63936O5778L5940J15158
13555E53451J55965Q0329n3208j56040j36140n529J17975J14182n273j68083k87732
13544B09897k42584j98694k86191l16963j89340k1234O1485M9988l1303o7132
13534a032071j3148K9253K1447N2364J42491K25708K42474J80706R6220K3775
$$ plain form
13611 1257914 1162126 988287 811998 720164 720343 780708 856578 919296 977835 1008867 929365
13600 929365 725161 515714 401080 415550 527395 615645 648258 652110 623681 546573 470657
13589 470657 510716 601120 617482 571316 503230 437849 437102 509120 551821 505452 415218 321947
13577 321947 208215 102486 53769 83395 174814 259929 281410 264992 210038 89924 -55905
13566 -55905 -146890 -189827 -230084 -244288 -183747 -31859 172639 336575 402353 438293 553451
13555 553451 709416 789745 736537 580497 444357 438828 556803 670985 665712 497629 209897
13544 209897 -32687 -231381 -517572 -834535 -1023875 -1045109 -983624 -933636 -964939 -1032071
13534 -1032071 -1045219 -1015966 -994519 -942155 -799664 -573956 -331482 -150776 -54556 -30781
13524c0781k0400k3540m059l3821o4079K5467J61742K29438K41016K03744K8233
13513G12960j63152k05563j54447q9396q935O1020J04346J32699P2397o2047j29109
13502B70773j22386j25008j54830j51671j01422q9730p5090R583R2493J29823
13492c17465J89484K49560K32004J74973J22332P8501o586j67537l20974l46102
13482a11810k38081j25200q9410j06113j05538o7681K5677J07422J31903J40499
13472d38332J19593O8504j3568q3645m6812P2086J47060J07437N6242J24297K31948
13461C44810K07933N5844j19611j99076j14882O5316K33421K91896K40250R8054
13451A103955o2933j40005j76758j62606q9194J8363Q8553O0028L7961J8169p8536
$$ plain form
13524 -30781 -51181 -74721 -78780 -112601 -176680 -151213 10529 239967 480983 684727 712960
13513 712960 549808 344245 189798 100402 91467 152487 256833 389532 461929 399882 270773
13502 270773 148387 23379 -131451 -283122 -384544 -474274 -549364 -539781 -447288 -317465
13492 -317465 -127981 121579 353583 528556 650888 729389 722803 555266 234292 -111810
13482 -111810 -349891 -475091 -564501 -670614 -776152 -843833 -818156 -710734 -578831 -438332
13472 -438332 -318739 -250235 -263803 -347448 -394260 -322174 -175114 -67677 -11435 112862 344810
13461 344810 552743 608587 488976 289900 175018 240334 473755 765651 1005901 1103955
13451 1103955 1041022 901017 724259 561653 472459 490822 579375 639403 677364 695533 616997
13440F16997j96142k46281j37028P4704J59514Q0786j5163m2735k3620m498j4439
13429B52095k606O9224J59210K10391J19173j02621k13378j91034j01126J6018
13419B15346q099p9084q5334o6809l3446k728J2544J5614N6290Q6511M4730j6304
13407A39231l4331O2394J73073J98477J71794O5646o6613j31607j48119j19081
13397C10864m2522K8763L9425J04n6900j50908j73060l5333P1183L2041m5731
13386b2074o8061q3592j56843k04216j27733J7685J25320J50358J07035J9806
13376b42315n9594o7816p5394p7447l2524r99K1808J21967K78343K88871P7624
13365B32524j40004j81047j02623p3227r8133p4956k0325M640l7492j07690j26017
$$ plain form
13440 616997 420855 174574 37546 112250 271764 352550 337387 294652 271032 266534 252095
13429 252095 249489 318713 477923 688314 807487 704866 491488 300454 199328 215346
13419 215346 207247 128163 42829 -23980 -57426 -60154 -47610 -31996 24294 110805 155535 139231
13407 139231 104900 167294 340367 538844 710638 776284 709671 578064 429945 310864
13397 310864 268342 297105 336530 336634 279734 128826 -44234 -79567 -8384 23657 -22074
13386 -22074 -90135 -173727 -330570 -534786 -662519 -644834 -519514 -369156 -262121 -242315
13376 -242315 -301909 -369725 -445119 -522566 -555090 -556089 -534281 -412314 -133971 154900 232524
13365 232524 92520 -88527 -191150 -264377 -362510 -437466 -457791 -453151 -490643 -598333 -724350
13354g24350p0675K5959Q9208J64863K43535K14095J16371J04756J89235K00413
13344E53410J34775P2296P386p4308j58521j41949j166J00245O2934k2202k5730
13333E07170j4569m9415p8064p9969q6871r8739p2735n8803J685J37584J88977
13322B96251J02914l5386j23352j21960m4595M4113R6843J00697N4582K4009Q425
13311D02541n3219j66797j92268r6436J2628Q1782J28359J59372K04921K32709
13301G13592J75405M2732q4285j11362m8928j6251o3307j09753j04395k7041O5405
13290D31812R6155M7994Q71l2659r7559j49433j37934q6377j1740N9541M7412
13279A68083J6302P0353J52881J76937J25971M1754p817r408L2502O2293K9055
$$ plain form
13354 -724350 -795025 -769066 -679858 -514995 -271460 -57365 59006 163762 352997 553410
13344 553410 688185 760481 767867 693559 535038 393089 391923 492168 555102 532900 507170
13333 507170 492601 443186 365122 285153 198282 99543 26808 -31995 -30310 107274 296251
13322 296251 399165 363779 240427 118467 73872 117985 214828 315525 370107 394116 402541
13311 402541 349322 182525 -9743 -106179 -93551 -11769 116590 275962 480883 713592
13301 713592 888997 931729 847444 736082 687154 670903 607596 497843 393448 366407 431812
13290 431812 527967 575961 576832 544173 446614 297181 159247 72870 61130 120671 168083
13279 168083 184385 254738 407619 584556 710527 752281 744464 735056 767558 829851 858906
13268H58906l8062r8710j52894j98666j87289q1892L9894n112k03565l05650j95109
13257e68149J388K09412L65328L79437K12123J0643r5818j43822j27241l0719
13247B12582K9587k1180o4186j746J49125K38621J65542K4109j03129j86714j32530
13236C10081J62O9035Q5155N9804j8497p5515o2071m1719j3806L9381O1985L7263
13224D51258k410l2924q0729j31349j34392j17668j07423l6398N9922J14331J37718
13213A19936J44496J38130J04586J01202J39910J82722J49343L7186o2121j10272
13203I45118j84517k54366k36884k12686k24327j94241q7969N6829J33531Q1229
13193a78283K8419L8602O5780M9140J4852j460r574l051M8555R3146P7156J8212
$$ plain form
13268 858906 820844 722134 569240 370574 183285 101393 141287 136175 -67390 -373040 -568149
13257 -568149 -566761 -357349 7979 387416 599539 610182 514364 370542 243301 212582
13247 212582 242169 220989 156803 155057 304182 542803 708345 732454 629325 442611 310081
13236 310081 310243 379278 464433 524237 505740 430225 368154 326435 312629 352010 413995 451258
13224 451258 448848 415924 335195 203846 69454 -48214 -155637 -192035 -132113 -17782 119936
13213 119936 264432 402562 507148 608350 748260 930982 1080325 1117511 1055390 945118
13203 945118 760601 506235 269351 56665 -167662 -361903 -449872 -393043 -259512 -178283
13193 -178283 -149864 -111262 -45482 3658 18510 17050 7476 4425 52980 146126 223282 241494
13181B41494n5426m7727P6249J98587J83794N9180n4321r0006p0034l4731m3715
13170C63344j00033q3574L0063J07213R0258L8531L252m0210l8168J1422J2312
13159C94410j9175M3035J15662P7693K8707N3253R2401K1361j09823k30647k83457
13148A83420k25614j21893k6910O7857J30848J48723R6606R3194J62571J47252
13138F56054K5401n8588n2918q1196o7860M1004N1066P28Q6966J45353K2594j33333
13126F35271j44415m0080N8487J09681J27624R9646M9076N1659O8170O9927R0591
13115A175637P8730n487m5944k5185k0996m6961o9626j14665j85428k07675k18531
13104C13869j97476n7427J13769J66014J04901n654j27850j95292j83321j41688
$$ plain form
13181 241494 186068 138341 214590 413177 596971 656151 601830 511824 441790 407059 363344
13170 363344 263311 179737 209800 317013 407271 445802 449054 408844 370676 382098 394410
13159 394410 375235 418270 533932 611625 640332 693585 785986 807347 697524 466877 183420
13148 183420 -42194 -164087 -190997 -123140 7708 156431 253037 346231 508802 656054
13138 656054 681455 622867 569949 488753 420893 461897 512963 513691 600657 746010 768604 635271
13126 635271 490856 450776 509263 618944 746568 846214 895290 946949 1015119 1085046 1175637
13115 1175637 1254367 1248880 1202936 1177751 1156755 1109794 1040168 925503 740075 532400 313869
13104 313869 116393 58966 172735 338749 443650 437996 310146 114854 -68467 -210155
13094b10155p9333k432N6720P3178J00593J21668P5809L0543Q467p20N8696J24621
13082C57655Q7676K3955k210J673J1958L4002R6688J00337Q808o4863j00732j45265
13070D09682j67851j33693q2467o6283o0011j2833Q0257J37624O3794j7899o59
13059A49661N5854N8761L1563L7537R7327K06638K49885J95637J35134J17970
13049A335967O1146p6601k10414k95538l34751k64887p3858J52343L30961L42050
13039I66418J76774M341m3134j6537M285j0152q7936j42981q7159j9014l3660
13028G11245p7498n5315P937P090j882R9999K25542K44425J48219K5713j4024
13017A321451L3698J15821J43800J03219K3030o4348n9973p951k4057j00751j21473
$$ plain form
13094 -210155 -289488 -291920 -235200 -162022 -61429 60239 136048 166591 175058 174338 233034 357655
13082 357655 445331 469286 467076 468749 480707 514709 611397 711734 720542 655679 554947 409682
13070 409682 241831 108138 25671 -40612 -100623 -113456 -33199 104425 168219 150320 149661
13059 149661 205515 264276 295839 333376 430703 637341 887226 1082863 1217997 1335967
13049 1335967 1397113 1320512 1110098 814560 479809 214922 141064 293407 624368 966418
13039 966418 1143192 1147533 1104399 1087862 1092147 1081995 994059 851078 763919 744905 711245
13028 711245 633747 578432 586369 593459 591577 691576 917118 1161543 1309762 1335475 1321451
13017 1321451 1355149 1470970 1614770 1717989 1741019 1676671 1616698 1608747 1584690 1483939 1362466
13006A362466n7671K0201N3643M6409k8513j15656r5754m9043m9200l8083M2850
12995A091649J20261J21421O5634K0960r522p7090j85062k16367j65063r7063
12985F69758o177O9616J04397J73660K05790J24447O6382J13112J79464J09962
12975A810411n7955j58096j66973j29773o3182K8690R3550M8050r4628j86014
12965A124080j37482L097J25472J41052Q4914L3190K3661K3645j155m6329k8294
12954A345851O7528J45769J68868J51163J29819J47561J42594O0931m2373j62669
12944B155042k66109k37804j17251m896O2182J17634J78192J82955J09037P4539
12934B253521J19661R7567j2314m1370P4009J84994J89847R1585k4788j13877
$$ plain form
13006 1362466 1304795 1324996 1378639 1425048 1396535 1280879 1185125 1136082 1086882 1048799 1091649
12995 1091649 1211910 1333331 1398965 1419925 1410403 1333313 1148251 931884 766821 669758
12985 669758 663581 733197 837594 1011254 1217044 1341491 1407873 1520985 1700449 1810411
12975 1810411 1752456 1594360 1427387 1297614 1234432 1263122 1356672 1404722 1310094 1124080
12965 1124080 986598 989695 1115167 1256219 1341133 1374323 1397984 1421629 1420474 1374145 1345851
12954 1345851 1413379 1559148 1728016 1879179 2008998 2156559 2299153 2360084 2317711 2155042
12944 2155042 1888933 1651129 1533878 1528982 1591164 1708798 1886990 2069945 2178982 2253521
12934 2253521 2373182 2470749 2458435 2417065 2491074 2676068 2865915 2957500 2932712 2818835
12924B818835j67541j68441j41284j03910o5069l4762m1991m9293o016L1951J7048
12913B089527J0480K0898R1506J50309P8657n675l0331m3213k41Q8778R8188P7030
12901B625913J12173J28460J11657Q7215M3428j6132m0718m3307r2772k01276
12891B714641k96342k58552j13049j9250n558J9320J37820K82385K58494J11418
12881B831327j3266r6954j04312k2635Q6158J30294P3452J3660M0181J05454J10849
12870C154208N6476l0763j34923j89855j43748m8565O4267J54371J91535J75393
12860C248396J54135J49620R2140k5140r2077q2916j4131K5640J5779N9089J17137
12849C647672J09152J04230K01675K85317K00573j3780j88122k16727j27591r0608
$$ plain form
12924 2818835 2651294 2482853 2341569 2237659 2172590 2137828 2095837 2046544 2040528 2072479 2089527
12913 2089527 2100007 2120905 2212411 2362720 2441377 2435702 2405371 2362158 2361917 2450695 2548883 2625913
12901 2625913 2738086 2866546 2978203 3065418 3108846 3092714 3051996 3008689 2915917 2714641
12891 2714641 2418299 2159747 2046698 2027448 2021890 2041210 2179030 2461415 2719909 2831327
12881 2831327 2818061 2721107 2616795 2594160 2680318 2810612 2884064 2897724 2937905 3043359 3154208
12870 3154208 3210684 3179921 3044998 2855143 2711395 2662830 2727097 2881468 3073003 3248396
12860 3248396 3402531 3552151 3644291 3619151 3527074 3444158 3430027 3455667 3471446 3530535 3647672
12849 3647672 3756824 3861054 4062729 4348046 4548619 4534839 4346717 4129990 4002399 3911791
12839C911791j27104j01751k7057R6025J77253J13771N0611J23361K40206K28429
12829D685535J16621M3119M0212N9272J4912n3946p7718p8245n8710q92M4162
12818D734322O1022R5301J73343K28856K00709J50310J06689O0686k9419j12080
12808E669739j12217o3623n6785q1865q7494m8951M7382J14593Q6293k7104j38368
12797E301600j00752M6970J40217J18154N6596N4065J36209K24725K28441J24361
12787F330586m0881j45057j69887j19838p805K4831m5529r2533p6674l2982N3512
12776E677743J41061J48539J14635Q5081L3760K3693O9369N2674l933J3432N5009
12765F411063L5757J2698N8559J46569J60966P1526p319l2261o998L2991L5018
$$ plain form
12839 3911791 3784687 3682936 3655879 3751904 3929157 4042928 4093539 4216900 4457106 4685535
12829 4685535 4802156 4845275 4885487 4944759 4959671 4905725 4828007 4749762 4691052 4690160 4734322
12818 4734322 4795344 4890645 5063988 5292844 5493553 5643863 5750552 5811238 5781819 5669739
12808 5669739 5557522 5493899 5437114 5355249 5267755 5218804 5266186 5380779 5467072 5439968 5301600
12797 5301600 5200848 5247818 5388035 5506189 5562785 5616850 5753059 5977784 6206225 6330586
12787 6330586 6289705 6144648 5974761 5854923 5847118 5871949 5826420 5733887 5657213 5624231 5677743
12776 5677743 5818804 5967343 6081978 6167059 6200819 6224512 6293881 6346555 6342622 6356054 6411063
12765 6411063 6446820 6459518 6518077 6664646 6825612 6897138 6889819 6857558 6850560 6883551 6918569
12754F918569K6337N0370R6701J41058J17986J6706o7379l5689J14327K38184
12744G617170K23674J51705J43952J74551J89175J73180J11270Q7325P3457O5214
12734I010673J01016J38707J38638J00091Q8441O8062N716o4096m8778O2121J45889
12723I746480J77835J61448J52001K02176K10765J84055K02282K44476J71314
12714A1452832K9417n4330p3459r1130r8250k572J76632L04164L36069L95767
12704A2375140M68731N08404N39597M73476K87861J28247J16760K32456L50697
12695A5481369L91910L70734L53547L04098K10093K03242L00757L53081L70466
12686A8339297M58959N07532M49081L59084K94073K76695L46658M90667N92071
$$ plain form
12754 6918569 6944906 6995276 7091977 7233035 7351021 7367727 7300348 7264659 7378986 7617170
12744 7617170 7840844 7992549 8136501 8311052 8500227 8673407 8784677 8872002 8945459 9010673
12734 9010673 9111689 9250396 9389034 9489125 9577566 9645628 9651344 9587248 9538470 9600591 9746480
12723 9746480 9924315 10085763 10237764 10439940 10650705 10834760 11037042 11281518 11452832
12714 11452832 11482249 11427919 11354460 11263330 11165080 11162508 11339140 11643304 11979373 12375140
12704 12375140 12843871 13352275 13891872 14365348 14653209 14781456 14898216 15130672 15481369
12695 15481369 15873279 16244013 16597560 16901658 17111751 17314993 17615750 17968831 18339297
12686 18339297 18798256 19305788 19754869 20113953 20408026 20684721 21031379 21522046 22114117
12677B2114117N67209M07994K74490K40960K21782K76268M46640N65234N74308
12668B5689002N66003N40570M67298L95070L69891L95200N15229P23511Q93880
12659C0555654R04017Q62987Q74152Q63914Q15022P89051P33326O48425O17676
12650C7664224O94024Q85508J113336J344145J551227J690604J710207J636644
12642D8289919J611361J710442J943842K214643K401110K557947K662742K632312
12634F6024318K583192K668189K919559L287030L691376M061228M388601M731099
12626I4354592N149855N588837N958046O319264O814618P485396Q293697R162770
12618A49127075J0031100J0990086J2122228J3367050J4715345J6131134J7550964
$$ plain form
12677 22114117 22681326 23089320 23363810 23604770 23826552 24102820 24549460 25114694 25689002
12668 25689002 26255005 26795575 27262873 27657943 28027834 28423034 28938263 29661774 30555654
12659 30555654 31459671 32322658 33196810 34060724 34875746 35664797 36398123 37046548 37664224
12650 37664224 38358248 39243756 40357092 41701237 43252464 44943068 46653275 48289919
12642 48289919 49901280 51611722 53555564 55770207 58171317 60729264 63392006 66024318
12634 66024318 68607510 71275699 74195258 77482288 81173664 85234892 89623493 94354592
12626 94354592 99504447 105093284 111051330 117370594 124185212 131670608 139964305 149127075
12618 149127075 159158175 170148261 182270489 195637539 210352884 226484018 244034982
12611B44034982J9012060K0510609K1971784K3298268K4340079K4941085K5007245
12604D03116112K4457177K3137334K0955060J7849341J3824174R134936M079772
12597E16553906j135471o245005j1032964j5368365j9038436k1772590k3530578
12590D18430497k4541271k4995658k4937155k4370549k3320242k1876127k0321419
12583B54068076j8840430j7449520j6153097j4901601j3730780j2572032j1333504
12576A49087112j0144810r169071q407597p772572p226076o688865o122418n649873
12568H7905830n246990m816921m366506l954452l678787l476713l232957l012850
12560E6119654k896816k755213k515920k294061k083706j796890j538030j411466
$$ plain form
12611 244034982 263047042 283557651 305529435 328827703 353167782 378108867 403116112
12604 403116112 427573289 450710623 471665683 489515024 503339198 512474134 516553906
12597 516553906 515418435 509173430 498140466 482772101 463733665 441961075 418430497
12590 418430497 393889226 368893568 343956413 319585864 296265622 274389495 254068076
12583 254068076 235227646 217778126 201625029 186723428 172992648 160420616 149087112
12576 149087112 138942302 129773231 121365634 113593062 106366986 99678121 93555703 87905830
12568 87905830 82658840 77841919 73475413 69520961 65842174 62365461 59132504 56119654
12560 56119654 53222838 50467625 47951705 45657644 43573938 41777048 40239018 38827552
12552C8827552j392286j499215j594791j550949j450692j332702j201398j053226
12544B7752293q90076p27996n70820m47263m96989p33378r24225r60785q66028
12535B1134733o80279n27827m45515l95941l73020l58498l06429k77815k96891
12526A7472518k63972k02268j54304j12913j36103k19043l27508l83425l27674
12517A5345308k88204l67459m22370l57294k40717j79468k50224m21993n64717
12508A2252862n99858n96648n55066m00755k54275k18399k02777k02122k61130
12499H961832l17577l47659l57250l52048l15741k87168k58388j79107q7139o0058
12489F399697r8075j32012j88689k18990j85743j33171n7529J878j7319p7036
$$ plain form
12552 38827552 37435266 35936051 34341260 32790311 31339619 30006917 28805519 27752293
12544 27752293 26862217 26134221 25563401 25116138 24619149 23885771 22961546 22000761 21134733
12535 21134733 20454454 19926627 19481112 19085171 18712151 18353653 18047224 17769409 17472518
12526 17472518 17208546 17006278 16851974 16739061 16602958 16383915 16056407 15672982 15345308
12517 15345308 15057104 14689645 14267275 13909981 13669264 13489796 13239572 12817579 12252862
12508 12252862 11653004 11056356 10501290 10100535 9846260 9627861 9425084 9222962 8961832
12499 8961832 8644255 8296596 7939346 7587298 7271557 6984389 6726001 6546894 6459755 6399697
12489 6399697 6301622 6169610 5980921 5761931 5576188 5443017 5385488 5387366 5370047 5293011
12479E293011j08978j04526n1991l3197o5739r4291m5705N0880K8985q0145j60163
12468D628141j58969r1743k9011J5799M9547M5653r839p3169j32004j96906k19877
12457C827622j85877j17821k789J08631J18119P4955R6090J86720K05383J05463
12447D416496J4483m7752j07157j17594m8750J4665K6911L2859M1334K5109l7898
12436D212706q1639l4256P7821J09586P5817P3139N8487J7769m0795j56342k77834
12425D034459k72842j36875j3453j3395q2017j23378q8928J9209P3364M7843N0818
12414C494805J38310J99942J79243R1448o4582k54602l37507k43073q6228L7374
12404C155130J01482R6771J10625J96736K74226K41373Q3932o9250j20800r4530
$$ plain form
12479 5293011 5184033 5079507 5027516 4994319 4928580 4834289 4788584 4839464 4868449 4788304 4628141
12468 4628141 4469172 4377429 4348418 4364217 4413764 4459417 4449578 4376409 4244405 4047499 3827622
12457 3827622 3641745 3523924 3521135 3629766 3747885 3822840 3918930 4105650 4311033 4416496
12447 4416496 4430979 4383227 4276070 4158476 4109726 4124391 4151302 4184161 4225495 4250604 4212706
12436 4212706 4131067 4096811 4174632 4284218 4360035 4433174 4491661 4509430 4468635 4312293 4034459
12425 4034459 3761617 3624742 3611289 3597894 3515877 3392499 3303571 3322780 3396144 3443987 3494805
12414 3494805 3633115 3833057 4012300 4103748 4039166 3784564 3447057 3203984 3117756 3155130
12404 3155130 3256612 3353383 3464008 3660744 3934970 4176343 4260275 4191025 4070225 3975695
12394C975695p48P5375O8677N2382J8198J8034J17712K42939K65943J43900k000
12383D976107j25703k12532k67507l31404l08350j90343q9562o3585m3468J5779
12373C359432R0614J17763Q1884L3519p9822k22951l25470l34566k47231j53155
12363B320017p2444m3030o1283j0592R5077J57940J25760L173o4739p8216j36301
12352B235362j89111j28922L411J52924K16615J29276M7628N443p5019j82110
12342B215497k36319j89880j21603j23258j94351k37736j30985L9375Q5577K4132
12332A130449j6684J3524N0863J9134j5341l4316n0060o6877j02707j19083j01413
12321G07489m3478N3674P9447J2564o0357j03081j48326k12759k34120j56465
$$ plain form
12394 3975695 3974947 4050322 4118999 4171381 4189579 4207613 4325325 4568264 4834207 4978107 4976107
12383 4976107 4850404 4637872 4370365 4038961 3730611 3540268 3450706 3387121 3343653 3359432
12373 3359432 3450046 3567809 3649693 3683212 3603390 3380439 3054969 2720403 2473172 2320017
12363 2320017 2247573 2204543 2143260 2132668 2227745 2385685 2511445 2514618 2449879 2371663 2235362
12352 2235362 2046251 1917329 1920740 2073664 2290279 2419555 2467183 2472626 2397607 2215497
12342 2215497 1979178 1789298 1667695 1544437 1350086 1112350 981365 1020740 1106317 1130449
12332 1130449 1113765 1127289 1178152 1197286 1181945 1147629 1097569 1030692 927985 808902 707489
12321 707489 664011 717685 797132 809696 749339 646258 497932 285173 51053 -105412
12311a05412J9390J72216K10398J53885J19222J27173Q0055R547L672O2030J07384
12300I59560J05941P0337k973p3215o1277M5358J31651J19858P8010O1032J4812
12289A449094n1528l2555L1677O5971L8678l0760o0343k5231K517n7235j76694
12278A153591k16710j57475o1167O6724J70428J72569Q3768k5083k4105L8101
12268A200641K2977p0815k30798k91223j94731o9719J3597M7118M3276O879j6861
12257D60341K9142P5035P5001L6587N2249J16497J46525J13186K4111n9699q4012
12246I84963p0633o4624m0097j3219j1513n7604j58080k91528l53620k90438k20963
12235e87356j52774n3196K4209R2160K01254K35318J77066J11579L9711m883K8872
$$ plain form
12311 -105412 -86022 86194 296592 450477 569699 696872 776927 786474 790146 852176 959560
12300 959560 1065501 1135838 1132865 1059650 998373 1043731 1175382 1295240 1373250 1434282 1449094
12289 1449094 1397566 1365011 1396688 1462659 1501337 1470577 1410234 1385003 1387520 1330285 1153591
12278 1153591 936881 779406 718239 784963 955391 1127960 1211728 1186645 1162540 1200641
12268 1200641 1223618 1152803 922005 630782 436051 366332 379929 427047 470323 477202 460341
12257 460341 489483 564518 639519 676106 728355 844852 991377 1104563 1128674 1068975 984963
12246 984963 914330 849706 809609 796390 784877 727273 569193 277665 -75955 -366393 -587356
12235 -587356 -740130 -793326 -769117 -676957 -475703 -240385 -63319 48260 87971 83088 111960
12224A11960R3451J05045J02163J09890Q3303M7531R0970J64542J71104J73388
12214A253347J42937L6230n6870q9048j11764k06619k88348k93870k40857j66331
12204b1193p0605L1392P3954J325j14831j27015k4366Q4919J73476J94121J64444
12193C65621J39262O6123k8176p4172q5420m3568O2087J00281N2207k9614j34687
12182C89944j80529q2386K4620J7801j0491K4082R8924J83650K08518J04960j7471
12171G61622o7048o5951m2338j6032O674L922j2461l628l5840j10416j41980r2758
12159A83766j7064L5273R8821J97338K83219K51150O8418q3248j33989j61195
12149G22489j86479j97027j61816j25693j49416j96080j52729m8255N4328J66994
$$ plain form
12224 111960 205411 310456 412619 522509 605812 653343 744313 908855 1079959 1253347
12214 1253347 1396284 1432514 1375644 1286596 1174832 968213 679865 385995 145138 -21193
12204 -21193 -91798 -60406 13548 14873 -99958 -226973 -251339 -166420 7056 201177 365621
12193 365621 504883 571006 542830 468658 383238 339670 401757 502038 554245 524631 389944
12182 389944 209415 127029 151649 169450 158959 183041 281965 465615 674133 779093 761622
12171 761622 694574 628623 586285 570253 576927 580849 568388 564760 528920 418504 276524 183766
12159 183766 166702 201975 300796 498134 781353 1032503 1100921 1017673 883684 722489
12149 722489 536010 338983 177167 51474 -97942 -294022 -446751 -495006 -440678 -273684
12139b73684K45990K98436K91211J57745K7241n319K2503M0299l2484j21286r5872
12128E54780l1833m012k0747k2616P571K7989j3895j23086j26682n4167l5250
12117A58052m4012l0445m6351p2558n5437n2895r4177j00799l2809L1331N4768
12106b85332R958r2788j48441j51295j81602j53285P405K03264L74700L87887
12096b9529K09997K6468K055J12108J90717J63618O1652q9189j92086j59702r4159
12085B01950o4806o232J11193J83093Q1294j47227l25451l21711k18114j57371
12075f63382j38021j00015J3267J23772J38926R7457J02459J34138K01546K92959
12065B03106K57826J21501L0043n4669j35773j53863q9976j9573K7103P2599Q7775
$$ plain form
12139 -273684 -27694 270742 561953 719698 746939 741620 764123 804422 771938 650652 554780
12128 554780 522947 518935 498188 475572 483143 511132 497237 374151 247469 193302 158052
12117 158052 114040 83595 37244 -35314 -90751 -143646 -237823 -338622 -371431 -340100 -285332
12106 -285332 -275374 -368162 -516603 -667898 -849500 -1002785 -995380 -792116 -417416 -29529
12096 -29529 180468 206936 208991 321099 511816 675434 737086 647897 455811 296109 201950
12085 201950 137144 130912 242105 425198 506492 359265 33814 -287897 -506011 -663382
12075 -663382 -801403 -901418 -888151 -764379 -625453 -527996 -425537 -291399 -89853 203106
12065 203106 460932 582433 612476 557807 422034 268171 178195 158622 185725 258324 346099
12054C46099P3793R7553J10032l155j60626k25007j85647j00104j4871N2371J22086
12043A12524J70020J53850J08415R0414L7877q7626j20195l1934K4115j0162q4082
12032C63216j25439j42270k15004k71179j90231p4337P856O3779N2741R707l6336
12021e57497m7982j2321l2395j22216j45727p8335L890Q0217R6793J00225J54722
12010e60626K51264K91426K40153J74758J34238J22315Q0033N7279R9534J33320
12000A023694J02457k201q8064n9627M9291J31948J26464j195j75825k83624k49633
11989E73685j10167L137L6318J2198J4396J2060l4826p1490r0512j20094j68569
11978E6136j68844j60093j52688j20574o1632M8143J51965J71587J24739J04775
$$ plain form
12054 346099 419892 517445 627477 624322 463696 238689 53042 -47062 -61933 -9562 112524
12043 112524 282544 436394 544809 635223 673100 585474 465279 433345 457460 447298 363216
12032 363216 237777 95507 -119497 -390676 -580907 -655244 -647388 -583609 -530868 -521161 -557497
12021 -557497 -605479 -617800 -650195 -772411 -918138 -996473 -992583 -912366 -815573 -715348 -560626
12010 -560626 -309362 -17936 222217 396975 531213 653528 733561 790840 890374 1023694
12000 1023694 1126151 1123950 1035886 976259 1025550 1157498 1283962 1282767 1106942 823318 573685
11989 573685 463518 466655 502973 515171 529567 541627 506801 435311 344799 224705 56136
11978 56136 -112708 -272801 -425489 -546063 -607695 -559552 -407587 -236000 -111261 -6486
11968f486J88592K36191J04478q3806j22167l0523O6351J20287P6779k8705o0832
11957D60159K2477Q0709J3279p5211j23234j07944j5551O7687Q2447M5227M1395
11946D91440N7069L8525j3850r8014k10464k86228k71456k22211j46488l1441
11936f93118J053p4056j06748k4250J00518K00781K09739J50071Q4776J1572r2800
11925b32462j79779j68019j12671n4814M0078J10609J11418J25722J26792P8798
11915a54328K1414J3257K9002k532P231N8229L9342l3566q3264j73187k16166
11904d94568j32352n1288m096P4899J56647J63797J56073J75686J72729J19369
11894C36896J05474J47872J51386P6760l9159j66297l29807m30721l74429j97104
$$ plain form
11968 -6486 182106 418297 522775 438969 316802 286279 352630 472917 549696 520991 460159
11957 460159 482636 563345 576624 501413 378179 270235 254684 322371 404818 450045 491440
11946 491440 548509 587034 573184 475170 264706 -21522 -292978 -515189 -661677 -693118
11936 -693118 -692065 -766121 -872869 -897119 -796601 -595820 -386081 -236010 -151234 -139662 -232462
11925 -232462 -412241 -580260 -692931 -747745 -707667 -597058 -485640 -359918 -233126 -154328
11915 -154328 -132914 -119657 -90655 -93187 -85956 -27727 11615 -21951 -105215 -278402 -494568
11904 -494568 -626920 -678208 -682304 -607405 -450758 -286961 -130888 44798 217527 336896
11894 336896 442370 590242 741628 818388 779229 612932 283125 -147596 -522025 -719129
11884g19129K8583K19312L32836L48182K60979J25400L7749m283l3162n2012n8545
11873D85910k4134L6801N5360M9684L5814k1103p5622j23182j78259j64381r5350
11862a8462j7994P2933J68583J76748R9010M4959L7692N8433K0714m1997j7578
11851E83041M5861K9913p7214j72636k32203k11178r3909M3562J85829K88041
11841C89107K87860J95149N0036j04395j97279k15761j94459j27652j8706N0032
11831A13932J3738q4856j14230r3447r4396r6043k4782R0988J30977M2444m1788
11820a57463m0605Q183P6218J25150J03384j6329j23171j25288p9433n0701j8056
11809b98111p796k7976k0310K9862J20469J73297Q7781l1977n4542o0266l7271
$$ plain form
11884 -719129 -690546 -471234 -138398 209784 470763 596163 633912 629629 596467 544455 485910
11873 485910 461776 498577 553937 603621 639435 618332 542710 419528 241269 76888 -18462
11862 -18462 -36456 36477 205060 381808 480818 525777 563469 621902 642616 600619 583041
11851 583041 628902 658815 581601 408965 176762 -34416 -128325 -84763 101066 389107
11841 389107 676967 872116 922152 817757 620478 404717 210258 82606 63900 113932
11831 113932 127670 42814 -71416 -164863 -259259 -355302 -380084 -289096 -158119 -115675 -157463
11820 -157463 -198068 -189885 -113667 11483 114867 98538 -24633 -149921 -229354 -280055 -298111
11809 -298111 -305907 -333883 -354193 -324331 -203862 -30565 57216 25239 -29303 -89569 -126840
11798a26840Q3633J74562J20369l8922j47189j51115o9056J004o0450k00489k22412
11787f36905j47630o9732M7565K19239L27368K28834N0181r2247j90223j86500
11777d50050l9924J63918K70025K02497J2795j15546j24469r3686r0868j08476
11767c73784j05864r2782n4310N50N8361M2087r0995k17601k32075j53311j8493
11756a238217J44429K87199L03144K30443J57563K2049j44859j57850L5510K24067
11746a36522K35345J53248R9126O3868n596m0685o455K2502K5952N5931N8734
11735E25448m4752j74242k00513j01750J5412N9692J9342n7890n2448Q6504J97881
11724B72684J47762R856n2830n5050p3497q9339j27305j74206j19379j8174K7372
$$ plain form
11798 -126840 -43207 131355 251724 212802 65613 -85502 -154558 -153554 -214004 -414493 -636905
11787 -636905 -784535 -854267 -806702 -587463 -260095 -31261 18920 -73327 -263550 -450050
11777 -450050 -489974 -326056 -56031 146466 159261 43715 -80754 -174440 -265308 -373784
11767 -373784 -479648 -572430 -626740 -626190 -567829 -525742 -616737 -834338 -1066413 -1219724 -1238217
11756 -1238217 -1093788 -806589 -503445 -273002 -115439 -93390 -238249 -396099 -360589 -136522
11746 -136522 98823 252071 351197 415065 409469 368784 362329 384831 410783 466714 525448
11735 525448 480696 306454 105941 4191 19603 79295 98637 40747 -11701 74803 272684
11724 272684 420446 430302 377472 322422 248925 159586 32281 -141925 -261304 -279478 -252106
11713b52106N0146Q7089J33419J12724Q7158J33620J10231j0291j78614k73846
11703d70k61538j74370k8103J22092K40185L05762L07874K35703J07496k272n8127
11692G94232r0392p6501o5261j04900j48007j40808j03416k0423J10201J92272
11682C46997J52381J5665j67343k99997k87457k16624j55680j6031J29975R0518
11672d07596k9342m5273o869j3871l2647K8979R8009O3069J99K7332R6606R7674
11660a23730K3645m2138n9074q7856j52609k29649k30164j56262p3779j8201K7421
11649a122396J03854K19383K81611K15552J27969M4448m1878j23373j74521o6075
11639e35426J03020J18023j6453j51809j83852j52120r3281J3609R1354Q9296
$$ plain form
11713 -252106 -201960 -114871 18548 131272 218430 352050 462281 451990 273376 -470
11703 -470 -262008 -436378 -464481 -342389 -102204 203558 511432 747135 854631 852359 794232
11692 794232 703840 627339 562078 457178 309171 168363 64947 44524 154725 346997
11682 346997 499378 515043 347700 47703 -239754 -456378 -612058 -628089 -498114 -407596
11672 -407596 -436938 -482211 -489080 -502951 -535598 -506619 -408610 -345541 -345342 -318010 -221404 -123730
11660 -123730 -100085 -142223 -201297 -289153 -441762 -671411 -901575 -1057837 -1131616 -1149817 -1122396
11649 -1122396 -1018542 -799159 -517548 -301996 -174027 -129579 -171457 -294830 -469351 -535426
11639 -535426 -432406 -314383 -330836 -482645 -666497 -818617 -911898 -898289 -806935 -717639
11629g17639P3730O7125K4850j3532K1919J09309J83064J64426J8209j19598j18928
11618c07065n542Q2313J01274J30391J65953J22951L2293J4077J7902O0096J16403
11607E31046P9915k8691j02290j06931p0533k530Q1108R7063J378r4973r7503
11596B87059r0226j01266q0946n2963l9452R013P9559Q7383N2482L7411k51q1342
11584A06461j50381j26575l7523K8197K9819j0557M3216J54978K21277K12297
11574D71209J33666J4669r0613j01501p102R3705R9985J599j24847j75027j67515
11563A48228j24312k8599L5990K9897j5181j13355j92889j88830j71410j80913
11553h01374j80698q7510R8143K38393K72920K34800J28249j5485j41007j96542
$$ plain form
11629 -717639 -643909 -576784 -551934 -565466 -543547 -434238 -251174 -86748 -68539 -188137 -307065
11618 -307065 -312607 -230294 -129020 1371 167324 290275 322568 336645 354547 414643 531046
11607 531046 610961 582270 479980 373049 302516 299986 381094 478157 479535 384562 287059
11596 287059 196833 95567 14621 -38342 -77794 -68781 10778 98161 150643 188054 187803 106461
11584 106461 -43920 -170495 -208018 -179821 -150002 -160559 -117343 37635 258912 471209
11574 471209 604875 619544 528931 427430 420328 514033 614018 615617 490770 315743 148228
11563 148228 23916 -4683 31307 61204 46023 -67332 -260221 -449051 -620461 -801374
11553 -801374 -982072 -1069582 -971439 -733046 -460126 -225326 -97077 -112562 -253569 -450111
11543d50111j24777J9133O5033Q713r6N8210O2146K9485k6720r1536o2745K4663
11531d88602N2652K5727J0352K3159Q8838J33800R7575M9507M3308P3204J32130
11520B41650J62320K02458K36117J53266k96r7408j35538j07647L615M1105l6597
11509F63045j14844j55739r4929O4023J99524K17497O8413j41673j95616r7072
11499D12629j7970K3340Q7259J29118P5279j7850p5908r2499o2933o1972o4213
11488C34280l6102m8946j10532j82689k20856j93225j05523M045J31855K09683
11478b18010J76434P4751K544O8354J72447J71159J35200P2672R810o8495j41773
11467D55093r4993M2562J27067O8879k3556k5626L2859N3513J9896J4553N0974
$$ plain form
11543 -450111 -574888 -555755 -490722 -482009 -482105 -423895 -361749 -332264 -358984 -450520 -513265 -488602
11531 -488602 -435950 -410223 -399871 -376712 -287874 -154074 -56499 -6992 36316 109520 241650
11520 241650 403970 606428 842545 995811 995515 898107 762569 654922 658537 699642 663045
11509 663045 548201 392462 297533 361556 561080 778577 846990 705317 509701 412629
11499 412629 394659 417999 505258 634376 709655 691805 615897 523398 460465 398493 334280
11488 334280 298178 249232 138700 -43989 -264845 -458070 -563593 -559548 -427693 -218010
11478 -218010 -41576 33175 35719 104073 276520 447679 582879 655551 665361 596866 455093
11467 455093 360100 402662 529729 598608 575052 549426 582285 635798 655694 670247 721221
11456G21221J42782L11187M85749N04163L35528J71574R5771J6262p1554n4172
11446B658511J02122K52703K83213K68828K68487K34729J80036R6134j8611j05713
11436D220439k34511m05418m69152m10436k93264j96876j75441j86543j80407
11427A668391j57818j42790j17371n8875k0738l1935m6730k4028J0959J7914k0802
11416A076177m3801J1472N6491K2343n0409p6241o1991j32059k80066l51019l05727
11405a34830k46373j60315k3264M2359L5140L3199O4618N5408r112o6012r3400
11394e02582j03864o2522K1238J09232J31595N8010N6441J61348K15965J80171
11384B65032J48363J36130Q7858L9926j2887p1037p2853K7249P1472q3931k45668
$$ plain form
11456 721221 864003 1175190 1660939 2165102 2500630 2672204 2767975 2784237 2712683 2658511
11446 2658511 2760633 3013336 3296549 3565377 3833864 4068593 4248629 4344763 4326152 4220439
11436 4220439 3985928 3580510 3111358 2700922 2407658 2210782 2035341 1848798 1668391
11427 1668391 1510573 1367783 1250412 1191537 1170799 1138864 1092134 1068106 1079065 1096979 1076177
11416 1076177 1032376 1043848 1100339 1122682 1072273 996032 934041 801982 521916 170897 -134830
11405 -134830 -381203 -541518 -564782 -522423 -487283 -454084 -389466 -334058 -343170 -409182 -502582
11394 -502582 -606446 -668968 -647730 -538498 -406903 -348893 -292452 -131104 84861 265032
11384 265032 413395 549525 637383 677309 664422 593385 520532 547781 619253 535322 289654
11373B89654k27626j55142j12066q1345o0532l1367k3295n5780m7883k032o101
11362e13515j8978M3914J15584J53217J27615M5465L0712P3731R0777O4165L2622
11351B45309O2909J30283J16972k9934k12467k71775j69873K8704J45333P7087
11341A22548j9925l6172J1050Q0863O0818j3684l358M0993j1698q8927n5518L0179
11329A17169N9244L7279o308m7725k8778M7208J52322K27988J33897r9525k69699
11318C23072l20399k56625j28966m1077j8934k567N2738R5158O7006p623o9649
11307c07866j42611j80759j43184o3029n247J3826J4865L2226P5247Q2430L9872
11296e84230j7465l4986K7013J19485J69105J43629N9920o9170j56468j42661
$$ plain form
11373 289654 62028 -93114 -205180 -286525 -347057 -378424 -401719 -457499 -505382 -507414 -513515
11362 -513515 -532493 -488579 -372995 -219778 -92163 -46698 -15986 57745 148522 212687 245309
11351 245309 308218 438501 555473 525539 313072 41297 -128576 -99872 45461 122548
11341 122548 102623 66451 77501 158364 219182 205498 202140 243133 231435 142508 86990 117169
11329 117169 176413 213692 207384 159659 130881 178089 330411 558399 692296 592771 323072
11318 323072 2673 -253952 -382918 -423995 -442929 -445496 -392758 -297600 -230594 -238217 -307866
11307 -307866 -450477 -631236 -774420 -837449 -842696 -828870 -814005 -781779 -706532 -624102 -584230
11296 -584230 -601695 -636681 -609668 -490183 -321078 -177449 -117529 -186699 -343167 -485828
11286d85828o8818j6056k6476k1697M7141J30596J44322K1253j50143k46037k20386
11275h92129j30973n5035J621R9598J60847J68545J82610J72998Q0594m475k4738
11264b40537k4838j1769L6540O0544J6912k9027l1019N332o089q3111j49917j85777
11252f42756k29696k55627j83911n9374J6294N0199R0451J49603K18330K74846
11242e71641L06012K94462K82120K62313J35043l4082j21797j03738l3387K2282
11232D37587l633l3634N2557J34620Q0844j9529o7634m7299l9213j52635k80244
11221F1787k37343q8189k9150l7737k7632k4002j6175P3893J55100J09981K1545
11210c7922o4449j08348n4709K7988K9385o305j7741J1884N4658Q9717J19930
$$ plain form
11286 -485828 -554646 -570702 -597178 -618875 -571734 -441138 -296816 -275563 -425706 -671743 -892129
11275 -892129 -1023102 -1078137 -1076516 -976918 -816071 -647526 -464916 -291918 -211324 -215799 -240537
11264 -240537 -265375 -277144 -240604 -180060 -163148 -192175 -223194 -217862 -223951 -307062 -456979 -642756
11252 -642756 -872452 -1128079 -1311990 -1371364 -1355070 -1304871 -1214420 -1064817 -846487 -571641
11242 -571641 -265629 28833 310953 573266 708309 674227 552430 448692 415305 437587
11232 437587 433954 400320 452877 587497 668341 648812 581178 533879 494666 342031 61787
11221 61787 -175556 -263745 -292895 -330632 -358264 -382266 -398441 -324548 -169448 -59467 -37922
11210 -37922 -102371 -210719 -265428 -237440 -208055 -214360 -232101 -220217 -165559 -75842 44088
11199D4088J00319M388j06029j50640n8505R2145J73537J49459J1135j63669k83036
11188a86808l23496k53198p3003R3331J60753J11485K1899J458M7875J20482J92416
11177h6806K11578J79042J24393O2322P4013J38951J69964Q3372q8565j71369
11167F96895j54613j14715l5519R739m218q235l1216r0980j17138q7283m5862
11156A6855Q30P6386J18859P0675l572n7438q6195m0247N7889J09433O9854J4795
11144C48124Q577N1411O8331k5924j38690j70960j83282j87916j68988j17233
11134e16550K0051J26087P1926J0729K6456N1302N9944P4437N4249r577j8432
11123d9378J9483k0072o0219M760O6628J03529J64855J58937N6626p3471j79774
$$ plain form
11199 44088 144407 148795 42766 -107874 -166379 -74234 99303 248762 259897 96228 -186808
11188 -186808 -510304 -763502 -836505 -743174 -582421 -470936 -449037 -447579 -399704 -279222 -86806
11177 -86806 124772 303814 428207 490529 564542 703493 873457 956829 868264 696895
11167 696895 542282 427567 392048 401787 397569 389334 358118 267138 150000 62717 16855
11156 16855 17685 94071 212930 283605 280033 222595 136400 96153 154042 263475 333329 348124
11144 348124 356701 408112 476443 450519 311829 140869 -42413 -230329 -399317 -516550
11134 -516550 -496499 -370412 -298486 -287757 -261301 -209999 -150055 -75618 -21369 -30946 -49378
11123 -49378 -29895 -49967 -110186 -105426 -38798 64731 229586 388523 445149 371678 191904
11112A91904j80547r1445K9333J34706J20382M4197J5185M9400N2710Q068k3728
11101C50165m1778m6166n0824J4509J51784J98572J09904J8830j6023j23496k02494
11090C62983o5729J12166J80350K02914J90504J31303P1312L7909J0089l4266
11080A199535j33310k43876j52999P4920J62877P0984n2775j48365k14149k45378
11070C17464j97518p9097N2186R4709O0139M2390K3388L616k4947o8493l1306
11059A92531M0605N3549Q8503J26138O0257n1363j05049r6526n9819J0099P1008
11048C29933O1323L5466J1195n8636j25056j53497j49229r0767q106L8240K118
11037a07016q2462q9502J0529J01112J39169J57106J21792L0325m5591j10814
$$ plain form
11112 191904 11357 -80088 -50755 83951 204333 248530 263715 313115 365825 373893 350165
11101 350165 308387 262221 211397 225906 377690 576262 686166 704996 688973 565477 362983
11090 362983 297254 409420 589770 792684 983188 1114491 1185803 1223712 1233801 1199535
11080 1199535 1066225 822349 669350 744270 907147 978131 925356 776991 562842 317464
11070 317464 119946 40849 93035 187744 247883 290273 313661 317277 292330 223837 192531
11059 192531 233136 286685 375188 501326 561583 510220 405171 308645 248826 258925 329933
11048 329933 391256 426722 437917 379281 254225 100728 -48501 -139268 -147374 -109134 -107016
11037 -107016 -189478 -278980 -268451 -167339 -28170 128936 250728 281053 235462 124648
11027A24648j91281k26293k10752j39934p9121r1751l9075P0293R3036P3748J08298
11016e08184J13572M8474K477k9292m0736q554N2053J48322K24104J83698L1583
11005B17517j12158j24813m0287K1064L7767O0328J15692J33473P1762O446o7701
10994C19090j28646j57987j81384j37122l4937J7792K5969K522k5591j466K8390
10983b73370J9019j730j8284m7189r6726r2735N643R5844O2354k0616L8943J58226
10971a70621J35821N2783K4223k2927q0024j28196j51915j30634p9333o656Q9029
10960d68450J80176K29141J50408K4273L5897R3924N4924q96j7047k0909N430
10949B66871L149m9286j01313j53374j97808k01065j70897q8479R4067L10449
$$ plain form
11027 124648 -66633 -292926 -503678 -643612 -722733 -814484 -853559 -783266 -690230 -616482 -508184
11016 -508184 -394612 -346138 -343661 -372953 -413689 -422243 -370190 -221868 2236 185934 217517
11005 217517 105359 -19454 -59741 -38677 -910 59418 175110 308583 380345 386791 319090
10994 319090 190444 32457 -148927 -286049 -320986 -303194 -277225 -274703 -300294 -301760 -273370
10983 -273370 -254351 -256081 -274365 -321554 -418280 -511015 -505372 -409528 -347174 -367790 -328847 -170621
10971 -170621 -34800 17983 42206 19279 -60745 -188941 -340856 -471490 -550823 -557479 -468450
10960 -468450 -288274 -59133 91275 115548 151445 245369 300293 299397 282350 261441 266871
10949 266871 270020 220734 119421 -33953 -231761 -432826 -603723 -692202 -598135 -287686
10939b87686M17420L34841J49633j5012j67715k46334j89845q3834k4259o929
10929a19720K1548R8455J76225J47397K2065r2128j06702j9911O0325R3300Q9443
10918C70297R2969J26328J17249M3516l7640j29532j96109k04503j42635p2379
10908c2439m9350j4116P1355J82212K32074J91326J00009J1084n0692j25344k56032
10897B60087l03026j99254K2905K79637L76024L10679K27691J63258J04412J5188
10887A257601j06839j61392j69066j91666j94460j44909o3808o822M9225P3440
10877C41304L940q4850j12048j37270j54272q7851n81J9907j3075k6299k1773
10866b72868l2814m2498p3958q7668k6624O1219J07485J14455J65999K45328K45419
$$ plain form
10939 -287686 129734 464575 614208 599196 431481 185147 -4698 -88532 -112791 -119720
10929 -119720 -98172 283 176508 323905 345970 253842 147140 127229 187554 280854 370297
10918 370297 463266 589594 706843 750359 712719 583187 387078 182575 39940 -32439
10908 -32439 -81789 -95905 -24550 157662 389736 581062 681071 692155 641463 516119 260087
10897 260087 -42939 -242193 -219288 60349 436373 747052 974743 1138001 1242413 1257601
10887 1257601 1150762 989370 820304 628638 434178 289269 225461 218639 267864 341304
10877 341304 345244 260394 148346 11076 -143196 -231047 -231628 -211721 -224796 -251095 -272868
10866 -272868 -305682 -348180 -422138 -509806 -536430 -475211 -367726 -253271 -87272 158056 403475
10855D03475J75636Q4290n361j39627k22279j51426j10035j65004j81383j29711
10845d41425p6881k3045K8259L3485k233l1806j0214M7704J22441J94955K21126
10834F2366J91304R0533l5924j15993k03564k99204k94250j36063K2581L1064
10824f87150J3217L8334P7178J25682J17838N7287R681L6847Q8118Q1445K1200
10813b0323n9955q3036p8900n6626k6642N963O2522P9000L8055j9703o1227q7095
10801c07967j26745p7038O8792J16204M5811k8419q4705j18706p8162j5372j2790
10790f19097l1127P133L4733m129l4432n1277n7533j2850o100K7720J77905L04790
10778b64264K95815J85842Q5140j4151j44496k03064j91575j82547j62857k4878
$$ plain form
10855 403475 579111 663401 658040 518413 296134 144708 34673 -130331 -311714 -441425
10845 -441425 -518306 -541351 -513092 -479607 -481840 -513646 -523860 -476156 -353715 -158760 62366
10834 62366 253670 344203 308279 192286 -11278 -310482 -604732 -740795 -718214 -687150
10824 -687150 -673933 -635599 -558421 -432739 -314901 -257614 -247933 -211086 -122968 -41523 -20323
10813 -20323 -80278 -163314 -242214 -298840 -325482 -319519 -256997 -177997 -139942 -159645 -220872 -307967
10801 -307967 -434712 -511750 -442958 -326754 -280943 -309362 -394067 -512773 -590935 -606307 -619097
10790 -619097 -650224 -643091 -608358 -612487 -646919 -698196 -755729 -768579 -774679 -746959 -569054 -264264
10778 -264264 31551 217393 302533 288382 143886 -59178 -250753 -433300 -596157 -621035
10768f21035J56102J85059J39610J02363P6377J08878J91791K62372L09072K62245
10758A172834Q1218j26460k47243k46791j78543j32614j08119k1401O3257J01377
10748C57515J43499J38046P7450o0276k38399k88273k20986j45345j07083m6008
10738c89860N0866N6397J3384l3274p9646n6988N4273J63675J73302J21769M8928
10727A22826m7461p2158m0504k5377l5660r0185j92174k22801j50084q9649n6518
10716h99745l210K1855J559L1815J66896K68772K58942J77838P5716M4985L5314
10705A80737o0724j79383j98708j77803j37354j4805Q0240M7999m033J9423O3466
10694c80945J09448J67769J47878M5529j3114L7392O9113j8110r7296o7530k6081
$$ plain form
10768 -621035 -464933 -279874 -140264 -37901 38476 147354 339145 601517 910589 1172834
10758 1172834 1254052 1127592 880349 633558 455015 322401 214282 192881 256138 357515
10748 357515 501014 639060 716510 656234 417835 129562 -91424 -236769 -343852 -389860
10738 -389860 -338994 -282597 -269213 -302487 -382133 -439121 -384848 -221173 -47871 73898 122826
10727 122826 75365 3207 -37297 -62674 -98334 -188519 -380693 -603494 -753578 -843227 -899745
10716 -899745 -902955 -881100 -879541 -847726 -680830 -412058 -153116 24722 100438 145423 180737
10705 180737 120013 -59370 -258078 -435881 -573235 -588040 -507800 -459801 -463834 -444411 -380945
10694 -380945 -271497 -103728 44150 89679 76565 113957 183070 164960 67664 134 -25947
10683b5947k4670j8882n351j6415m918K8669J16602K36040J96526r807j92143
10672B79704k25804j28110j0718P5725O3908k729j745L0030O708j9386L1997Q4955
10660A84535M5496l3788k8933L344P794K3732M8033N4988J7271o8849j43571j77084
10648f7032k09020k02827r5439O3413J30266Q4699N2017L7781K1318L4456Q7428
10637f2940J28858J44557J32080Q3095Q1855J26111J06643L1218n2737j31472
10627E87268j71144j56187p7141O2418J88282K40753J97575R7658J2630m3778
10617I38334j15029j89726j94220j32339o9927j5496M5933o022j60740k20088
10607a19320j17673K5006P9877Q8631J09779J06021P5631Q387o4654j05792j26267
$$ plain form
10683 -25947 -50617 -69499 -74850 -91265 -96183 -67514 49088 285128 481654 471847 279704
10672 279704 53900 -74210 -84928 -9203 54705 51976 50231 80261 86969 67583 99580 184535
10660 184535 230031 196243 167310 170654 178448 202180 250213 305201 322472 253623 110052 -67032
10648 -67032 -276052 -478879 -574318 -510905 -380639 -295940 -243923 -206142 -184824 -150368 -62940
10637 -62940 65918 210475 342555 425650 507505 633616 740259 771477 718740 587268
10627 587268 416124 259937 182796 245214 433496 674249 871824 969482 982112 938334
10617 938334 823305 633579 439359 307020 237093 221597 267530 261508 100768 -119320
10607 -119320 -236993 -211987 -132110 -43479 66300 172321 247952 256339 191685 85893 -40374
10596d0374j01391l9532K0322Q1989J11155O9784l4565p1443j0534Q8933J54330
10585B28674J15765J4816j18328k48939k67444j58465n0966O288R435j1215R443
10574d70936N3735N2204N9876Q7270J29091J50736J04420K5911m0774n9399l8306
10563E3828N804N8814P0059O4113O2180N2288J14151J63880Q9987k2720j23209
10552E89175j85239j26153m3796m3347l3696J1555j5132m7547J0236P6093N8198
10541B50347m9265j55620j80101j54535j35055j06183j2178O6950O4834L2962
10531c77844K1033J2747M7892J21410J39551Q5144O2116J22347K00191K27628
10521F62215J89530J08373j0959j12351j45420j63161j55747n5844K5017M7092
$$ plain form
10596 -40374 -141765 -181297 -160975 -78986 32169 101953 67388 -4055 -14589 74344 228674
10585 228674 344439 359255 240927 -8012 -275456 -433921 -484887 -478599 -469164 -480379 -470936
10574 -470936 -417201 -364997 -305121 -217851 -88760 61976 166396 192307 151533 92134 53828
10563 53828 59632 118446 188505 252618 314798 367086 481237 645117 735104 712384 589175
10552 589175 403936 277783 233987 190640 156944 168499 153367 105820 116056 192149 250347
10541 250347 201082 45462 -134639 -289174 -424229 -530412 -542590 -475640 -410806 -377844
10531 -377844 -356811 -344064 -296172 -174762 -35211 49933 112049 234396 434587 662215
10521 662215 851745 960118 949159 836808 691388 528227 372480 316636 341653 388745
10511C88745J9075p3678j24099q0178o146L1481L650j9726L3788Q3981O1528Q463
10499C26884l3255p7558o6173J290j4459q8002r3304n8533o7945p9470j8712N0985
10487b18252R9564J70636J81915Q6843j9660Q308N6748K9600L2440Q4020J37400
10476F49562J58455J54630J34556P544j98190k93495k48238j39010J3748J35195
10466C74757J35891J11577J46238J40929M6886r2642k35373l16431k88606j87420
10456a64194j14857q4434K058O5129L4237J1831M7026R5344J16016J12693R0883
10445B11732O0619P5340J42789J63800O5506j04467k45616k54329j42477m1895
10435f8998k0382k4781k0100N46R892o981k8319j9264l2894j57621k65655j89736
$$ plain form
10511 388745 407820 334142 210043 129865 123719 155200 158850 139124 172912 256893 318421 326884
10499 326884 293629 216071 149898 151188 136729 48727 -44577 -103110 -171055 -250525 -269237 -218252
10487 -218252 -118688 51948 233863 320706 301046 309354 366102 395702 428142 512162 649562
10476 649562 808017 962647 1097203 1104747 906557 613062 364824 225814 239562 374757
10466 374757 510648 622225 768463 909392 956278 863636 628263 311832 23226 -164194
10456 -164194 -279051 -363485 -361427 -296298 -262061 -250230 -203204 -107860 8156 120849 211732
10445 211732 272351 347691 490480 654280 719786 615319 369703 115374 -27103 -68998
10435 -68998 -89380 -114161 -134261 -133715 -123823 -130804 -159123 -178387 -211281 -368902 -634557 -824293
10423h24293L1071K09570K30394J63520J20372J26556J80331K03586J22528Q063
10413E71698o3735p1551k4062K861J3221l7729j20139j03505m0196l6511o6720
10402B3632r6529r8439J0861J80481K95413K98108J51769n3433j81762j68113
10392C61988q6329o2889j08962p0804K5778Q8626J49652J38228M2529k1631j1405
10381D44781M913J4469L3730L1485J2941r715k7717J387N0679J44880K48152K52844
10369A202829R8637j53521l15920k91220j96178j27705p6251l4525k9309p2727
10359D110j17436j61414j85699p2058J57978K65596J81628J06883J50639K54592
10349E84819K79017K66917K93790K72312J68035j03207o97299j218379j066843
$$ plain form
10423 -824293 -793222 -583652 -353258 -189738 -69366 57190 237521 441107 563635 571698
10413 571698 507963 436412 412350 415211 428432 390703 270564 167059 126863 90352 23632
10402 23632 -72897 -171336 -160475 20006 315419 613527 765296 711863 530101 361988
10392 361988 275659 212770 103808 33004 58782 147408 297060 435288 477817 456186 444781
10381 444781 449694 464163 497893 529378 542319 532604 504887 506274 556953 701833 949985 1202829
10369 1202829 1301466 1147945 832025 540805 344627 216922 140671 106146 76837 4110
10359 4110 -113326 -274740 -460439 -532497 -374519 -108923 72705 179588 330227 584819
10349 584819 863836 1130753 1424543 1696855 1864890 1761683 1064384 -153995 -1220838
10340a220838m70188M0292K38926J61364P616m9187k1066P6072K38729L08480
10330f89800K47729J94654J63055J16743R4962R0899O5539K8858R57Q725L9914
10319C62235L5957n6535j12321k4924P3386P5858Q0246J18479J39059P4553j17014
10308F48979k68069k87089j84714n800Q5030K644r9794m4043M8294Q5168J05066
10297H5672P6221k589q8446j68594j66519j32409j72246k13670k12492j40595
10287a135667n5243L2005J42942K01652K20763K44693J98656J08057L5825j7876
10277b4193m5790o2443p9140p5032l5964K0994L6794J1398m636L8956Q5996L6353
10265i6707M117O8397J00756q70q5971m5563P3413J67360J06972j5378n9014p4865
$$ plain form
10340 -1220838 -1691026 -1650734 -1411808 -1250444 -1242828 -1292015 -1313081 -1237009 -998280 -689800
10330 -689800 -442071 -247417 -84362 32381 127343 218242 283781 312639 313596 322321 362235
10319 362235 398192 341657 229336 204412 277798 353656 433902 552381 691440 765993 648979
10308 648979 380910 93821 -90893 -96693 -11663 -9019 -108813 -152856 -104562 -19394 85672
10297 85672 161893 159304 70858 -97736 -264255 -396664 -568910 -782580 -995072 -1135667
10287 -1135667 -1190910 -1158905 -1015963 -814311 -593548 -348855 -150199 -42142 -6317 -24193
10277 -24193 -69983 -132426 -211566 -286598 -322562 -301568 -264774 -253376 -258012 -219056 -133060 -96707
10265 -96707 -92590 -24193 76563 75693 -10278 -55841 17572 184932 291904 276526 217512 142647
10253A42647j02583q9175k4777K664o420Q624K2596L8481O1619L5655j2411o0106
10241A6814j26488j48926j00784J2257R0748J08690J51060J73050J66070J12673
10231D55164N6273P5140N3041j0092m5765p8321j14475p2622J9245N4536J02571
10220D94695J81568J51028n279k00931l71832l75345k30875p3387M5464P8185
10210c06709N3996P080l6071n8546k3073Q0610J29761R7061P0897O4275J5606
10199I4887q3323j66846j49374k5451P5228P0798l952j8312O6006J34165J22148
10188A15974J10658J15695J23896J35345J05644O6056N2667M7266j9422j37172
10178G16607k03136j58701o4430O0169J81029J58468M5410m0689j10048j73841
$$ plain form
10253 142647 40064 -49111 -73888 -71224 -77644 -69020 -46424 -7943 53676 89331 76920 16814
10241 16814 -109674 -258600 -359384 -347127 -256379 -147689 3371 176421 342491 455164
10231 455164 511437 586577 639618 629526 583761 505440 390965 318343 337588 392124 494695
10220 494695 676263 827291 822012 621081 249249 -126096 -356971 -430358 -384894 -306709
10210 -306709 -252713 -245633 -281704 -340250 -363323 -282713 -152952 -55891 15006 79281 94887
10199 94887 11564 -155282 -304656 -330107 -254879 -184081 -188033 -206345 -140339 -6174 115974
10188 115974 226632 342327 466223 601568 707212 773268 825935 873201 853779 716607
10178 716607 513471 354770 290340 350509 531538 690006 735416 694727 584679 410838
10168D10838k38947k84694k67132j76082o7566j8391j0392J5761O4316Q2616Q0433
10157d09240O9304N6658O2825Q2559J13777J18733J12108N9562m3050r8587r7488
10146B7161q0442m260J38518K50030K79021K33396J42289N5344j7937o1914j01775
10135H59431j12736l3317N0132O8474K6565p3541j87146k48120k63956k66319
10125a80533k33147j09310N7447J99349K44654J64090J12717J21322R3987N0561
10115E21137j800m4505q218K1550J2348k3885q3485r7316k2333K3109j7532n5112
10103B23958m6057p9629j14211n6542k2573r2086k14808l14081l22709k64887
10093a303625j90093m6825J17724J96135J96488J26663N1922Q874L2261J09243
$$ plain form
10168 410838 171891 -112803 -379935 -556017 -623583 -641974 -652366 -636605 -572289 -489673 -409240
10157 -409240 -339936 -283278 -220453 -137894 -24117 94616 206724 266286 223236 124649 27161
10146 27161 -53281 -57541 80977 331007 610028 843424 985713 1041057 1023120 961206 859431
10135 859431 746695 713378 763510 831984 858549 785008 597862 349742 85786 -180533
10125 -180533 -413680 -522990 -465543 -266194 -21540 142550 255267 376589 470576 521137
10115 521137 519337 474832 466614 488164 500512 476627 393142 295826 273493 296602 279070 223958
10103 223958 177901 98272 -15939 -72481 -95054 -187140 -401948 -716029 -1038738 -1303625
10093 -1303625 -1493718 -1540543 -1422819 -1226684 -1030196 -903533 -851611 -842737 -810476 -701233
10083g01233J87922K22270K00227J24090J1412p8705q0560J371M8094R0606J47297
10072A72791J43699Q3740L1029m4759j50746k52757l04625k48711j11798n789
10062f87926K6607J05978J87498J58885R3127N2884L2522N0753J02415J30569
10052B53312J23015J11189J06732O9727o905p6399p1006K1071Q1596L1934o5856
10041E78410j10123m4501P1803J36160J08595R2628J10034J30150P3578o2292
10031A084442j67879j85766j37879o0685k5970n3003q0217n4321k7492o5341j35985
10020H9904j42002m9954M6574P9823R349l5682l590L7016J02400J64925J83711
10009D82474J26176N474j26626j45721n8390k7247m8698r2518j43642j69856j78091
$$ plain form
10083 -701233 -513311 -291041 -90814 33276 44688 -34017 -114577 -113206 -65112 25494 172791
10072 172791 316490 400230 431259 386500 235754 -17003 -321628 -570339 -682137 -687926
10062 -687926 -661319 -555341 -367843 -208958 -115831 -62947 -30425 20328 122743 253312
10052 253312 376327 487516 594248 663975 657070 580671 509665 530736 612332 644266 578410
10041 578410 468287 423786 495589 631749 740344 832972 943006 1073156 1146734 1084442
10031 1084442 916563 730797 592918 532233 506263 453260 373043 318722 291230 225889 89904
10020 89904 -52098 -102052 -55478 24345 33694 -1988 -5578 31438 133838 298763 482474
10009 482474 608650 614124 487498 341777 283387 256140 207442 114924 -28718 -198574 -376665
9998c76665j24017K8822J68375J11558j33363l55713l25015p8944J39152K25132
9988g20678K33585J73803J03065R1769R7209N9258L0435M9061N7588N8149O3791
9977B97035K2999m5751j9168J3251m0640q9006q6639q0948n2807N677J9386k1997
9965g8608j0952P2249J45494J34342M6894k1501r880R646k6589j9137P4410J14428
9953D30796N6841q6508j91488j70415j10647k6817N6477P7514K1109p5430j19839
9942a38407j25410m1718J64726L16438K86220J10698p8365j44345j05675j02910
9932A41252r2247k5648K7678K9533l5020j10136j71768k41588k03433r1053p3095
9921h45525j45547j93316j79836q5477Q929O9268J15009J11968R9908R3304P4270
$$ plain form
9998 -376665 -500682 -471860 -303485 -191927 -325290 -681003 -1006018 -1084962 -945810 -720678
9988 -720678 -487093 -313290 -210225 -118456 -21247 38011 68446 117507 175095 233244 297035
9977 297035 320034 274283 255115 268366 227726 138720 52081 -28867 -81674 -75997 -56611 -78608
9965 -78608 -89560 -17311 128183 262525 309419 287918 278038 287684 261095 241958 316368 430796
9953 430796 487637 401129 209641 39226 -71421 -98238 -41761 35753 56862 -18568 -138407
9942 -138407 -263817 -305535 -140809 175629 461849 572547 494182 349837 244162 141252
9932 141252 49005 23357 51035 80568 45548 -64588 -236356 -477944 -681377 -772430 -845525
9921 -845525 -991072 -1184388 -1364224 -1449701 -1440772 -1371504 -1256495 -1144527 -1044619 -951315 -877045
9910h77045J36785K72518L28029K91260K12925J41243P7249K6352M789k1385l880
9899E88840O3920J01580N0015k2412p1018j55332k45478k72598k46076j98700
9889d07259j14378m768Q9494J21075R8074P7597M9279P888M5895J50631K48817
9878C62345K52393J25781l4141j67598k11205r8728R8257K83818L63585K86472
9868A260979J50837l687j59687j96252j80628k11481k38621k01357j52315j50371
9858h2583j28292o4059k6503k253R7086J82644J53863K9104n0348p853N0360L1298
9846A82464o5056j51541j39178o8019p6134j53436k12142k82621l01590j80968
9836a448221K1858K48154L77695L13296J43016P3582J67488K44811K65125K66048
$$ plain form
9910 -877045 -740260 -467742 -139713 151547 364472 505715 582964 609316 614105 592720 588840
9899 588840 652760 754340 804355 781943 710925 555593 310115 37517 -208559 -407259
9889 -407259 -521637 -526405 -436911 -315836 -217762 -140165 -90886 -82998 -37103 113528 362345
9878 362345 614738 740519 706378 538780 327575 228847 327104 610922 974507 1260979
9868 1260979 1411816 1408129 1248442 1052190 871562 660081 421460 220103 67788 -82583
9858 -82583 -210875 -274934 -301437 -303690 -206604 -23960 129903 159007 108659 100806 151166 182464
9846 182464 117408 -34133 -173311 -241330 -317464 -470900 -683042 -965663 -1267253 -1448221
9836 -1448221 -1426363 -1178209 -800514 -487218 -344202 -270620 -103132 141679 406804 672852
9826F72852J49665o0614j86795j81868j32354l4551N9914N7157k98p5531j84883
9815H2694k44493k13164j68267o9458L3966M6375J3038k4292m3184k9352J1568
9804f04569M1028J8838m2369m5327M5650J61183K04461J62545J44507J55676J18567
9793C60190N9933j0288j07659j64584j47662j09280j31842j55542p7056O8013
9783d15777J53897J49481J48159J87316J85450Q9792K488m0480n6603K2993P6271
9772E02987r552j24748j56361r4018k309P7982J52159J74284O9426m0879M502
9761E53473Q9293J0083j39517j61739q7828j6884N7456R8998L9252l5450j08114
9750B99023k19033k58804k26619j79260r9292k1654M8594J54089J99394J28860
$$ plain form
9826 672852 822517 761903 575108 393240 260886 226335 286249 343406 343108 267577 82694
9815 82694 -161799 -374963 -543230 -612688 -578722 -532347 -519309 -543601 -586785 -616137 -604569
9804 -604569 -563541 -544703 -587072 -632399 -586749 -425566 -221105 -58560 85947 241623 360190
9793 360190 420123 409835 302176 137592 -10070 -119350 -251192 -406734 -483790 -415777
9783 -415777 -261880 -112399 35760 223076 408526 498318 500806 460326 403723 426716 502987
9772 502987 493435 368687 212326 118308 115999 193981 346140 520424 589850 548971 553473
9761 553473 642766 652849 513332 351593 263765 246881 304337 403335 442587 407137 299023
9750 299023 79990 -178814 -405433 -584693 -683985 -705639 -657045 -502956 -303562 -174702
9740a74702O140o8241l6276L6699M0987j6165r7340j26607q4038J7657J38834
9729c63052K01479K07983J71561R7363J4518o9265j21192q2484l7728l4324k3416
9718c8557N364M9366J02324J44165J58408J55034J41034P6905n5301j66544j49485
9707D22713o5094m2397j15238j49499j23283j06830m3500Q7937K02989K55184
9697C22982K24676R0774l8287j13211j36775j13535q6808m3292l0114m6451k8812
9686A147L5952J41939J49678J2496j09600r4219j8223k4480o4620n5765o9083
9675i4778j02138n5788M1821P5530M1870K8191R8880K24873K79543K38715J25937
9664I02656o246q4720p8792p4096j07796j22611j29064j31661n2983M8052Q3536
$$ plain form
9740 -174702 -168562 -236803 -273079 -236380 -195393 -211558 -308898 -435505 -519543 -501886 -363052
9729 -363052 -161573 46410 217971 315334 329852 260587 139395 56911 19183 -15141 -38557
9718 -38557 -33193 16173 118497 262662 421070 576104 717138 794043 738742 572198 422713
9707 422713 357619 315222 199984 50485 -72798 -179628 -223128 -135191 67798 322982
9697 322982 547658 638432 600145 486934 350159 236624 149816 106524 76410 29959 1147
9686 1147 37099 179038 328716 341212 231612 137393 119170 94690 30070 -25695 -94778
9675 -94778 -196916 -252704 -210883 -135353 -93483 -65292 33588 258461 538004 776719 902656
9664 902656 896410 811690 732898 658802 551006 428395 299331 167670 114687 162739 246275
9653B46275M7568m3215j64696k26651j83800r2178o9572r1561l7469J0774j4949
9642f19474m4920m8802n0546l9167l4450L6601J69097K56615K38668J54113R5687
9631A13422Q7811O2976J207p6529j05879m4183J7410K2103K9519P2131J24441
9620C04429J24148J0036q6046k5774L5390o4772j57535j30622j14136j71380j91625
9609d67887q0734J31368K85630K64220J42740Q694j00722j28560j7855J32568
9599A69462J19220q3366k50248k20072k6015J26794J22164M7242O485m535m2236
9588c5105j05472j02015l2439J8542N3472J06314J23184N4910k6607q7158j21652
9577a54026r4095q088N6865O1664K4536l3172p8399j05858j05082q2899q0142
$$ plain form
9653 246275 293843 250628 85932 -140719 -324519 -416697 -486269 -577830 -615299 -604525 -619474
9642 -619474 -664394 -713196 -763742 -802909 -837359 -800758 -631661 -375046 -136378 17735 113422
9631 113422 201233 264209 265416 188887 83008 38825 56235 78338 107857 179988 304429
9620 304429 428577 438613 352567 326793 362183 297411 139876 9254 -104882 -276262 -467887
9609 -467887 -548621 -417253 -131623 132597 275337 284031 183309 54749 36894 169462
9599 169462 288682 205316 -44932 -265004 -291019 -164225 -42061 5181 11666 7131 -35105
9588 -35105 -140577 -242592 -275031 -256489 -203017 -96703 26481 81391 54784 -32374 -154026
9577 -154026 -248121 -256209 -199344 -137680 -113144 -146316 -224715 -330573 -435655 -518554 -598696
9566e98696j33497j95714k23967k04042q7687Q7905K92589M28729L82205J68416
9556h3759p6171j62783j30500n8546N0707J43879J32928M7878k108J4384J04387
9545a9704J81264J39533K3326n4476q8329j21626r3926K5326O1910J5022m490
9534F3830l3854o0220k9390K5204M5690P992r2915j99021j83467p8347K590O0062
9522d71846O5551L9758J7391q288J1035L8894J3607M3090J15308Q8525o6312j77680
$$ plain form
9566 -598696 -732193 -927907 -1151874 -1355916 -1443603 -1355698 -1063109 -634380 -252175 -83759
9556 -83759 -159930 -322713 -453213 -511759 -461052 -317173 -184245 -136367 -138475 -124091 -19704
9545 -19704 161560 301093 324419 269943 181614 59988 -33938 -8612 53298 68320 63830
9534 63830 29976 -30244 -59634 -34430 11260 19252 -73663 -272684 -456151 -534498 -531908 -471846
9522 -471846 -406295 -366537 -349146 -357434 -346399 -307505 -293898 -250808 -135500 -46975 -113287 -290967
$$ [...]
##END NTUPLES=NMR SPECTRUM
##END=
