##TITLE=31P ikalashn
113-2024
19.12.2024
##JCAMPDX= 6.0         $$ Bruker NMR JCAMP-DX V2.0
##DATA TYPE= NMR SPECTRUM
##DATA CLASS= NTUPLES
##ORIGIN= UXNMR, Bruker Analytische Messtechnik GmbH
##OWNER= root
$$ TOPSPIN		Version 1.3
$$ 2024-12-19 14:09:22.765 +0400  Irina@DPX200
$$ Compression mode = diff/dup
##.OBSERVE FREQUENCY= 81.01967998063
##.OBSERVE NUCLEUS= ^31P
##.ACQUISITION MODE= SIMULTANEOUS
##.ACQUISITION SCHEME= undefined
##.AVERAGES= 32
##.DIGITISER RES= 17
##SPECTROMETER/DATA SYSTEM= spect
##.PULSE SEQUENCE= zgpg
##.SOLVENT NAME= DMSO
##.SHIFT REFERENCE= INTERNAL, DMSO, 1, 298.5841
##AUDIT TRAIL= $$ (NUMBER, WHEN, WHO, WHERE, WHAT)
$$ ##TITLE= Audit trail, TOPSPIN		Version 1.3
$$ ##JCAMPDX= 5.01
$$ ##ORIGIN= Bruker BioSpin GmbH
$$ ##OWNER= Irina
$$ $$ F:/spectra/data/iren/nmr/P31dec/1/pdata/1/auditp.txt
$$ ##AUDIT TRAIL=  $$ (NUMBER, WHEN, WHO, WHERE, VERSION, WHAT)
(   1,<2024-12-19 14:08:12.593 +0400>,<Irina>,<DPX200>,<TOPSPIN 1.3>,
      <acquisition in progress>)
(   2,<2024-12-19 14:09:07.328 +0400>,<Irina>,<DPX200>,<TOPSPIN 1.3>,
      <Start of raw data processing
       efp BC_mod = 2 LB = 8 FT_mod = 6 PKNL = 1 PHC0 = 114.7996 PHC1 = -87.91702 SI = 32K 
       data hash MD5: 32K
       5E 23 D5 DD C5 1B AC 38 5F BB 0F 1C A5 BC F7 E0>)
(   3,<2024-12-19 14:09:09.687 +0400>,<Irina>,<DPX200>,<TOPSPIN 1.3>,
      <apk 
       data hash MD5: 32K
       A5 93 C1 16 4C 51 AB 4D 46 EA C6 83 C0 30 99 AC>)
(   4,<2024-12-19 14:09:11.890 +0400>,<Irina>,<DPX200>,<TOPSPIN 1.3>,
      <abs n ABSG = 5 
       data hash MD5: 32K
       6F 40 FE 58 54 68 23 C2 DC 8A B5 F3 5C 36 D4 E0>)
$$ ##END=
$$ 
$$ $$ hash MD5
$$ $$ 98 8F D3 CC 0C C9 A4 1F 5D 36 81 5B 6E 94 28 2A
##$RELAX= 
##$RELAX= 
##$RELAX= 
##$RELAX= 
##$RELAX= 
##$RELAX= 
##$RELAX= 
##$RELAX= 
##$RELAX= 
##$RELAX= 
##$RELAX= 
$$ Bruker specific parameters
$$ --------------------------
##$DU= <F:/spectra>
##$EXPNO= 1
##$NAME= <P31dec>
##$PROCNO= 1
##$TYPE= <nmr>
##$USER= <iren>
##$AMP= (0..31)
100 100 100 100 100 100 100 100 100 100 100 100 100 100 100 100 100 100 
100 100 100 100 100 100 100 100 100 100 100 100 100 100 
##$ANAVPT= -1
##$AQSEQ= 0
##$AQ_mod= 1
##$AUNM= <au_zg>
##$AUTOPOS= <>
##$BF1= 81.014009
##$BF2= 200.13
##$BF3= 200.13
##$BF4= 200.13
##$BF5= 200.13
##$BF6= 200.13
##$BF7= 200.13
##$BF8= 200.13
##$BYTORDA= 1
##$CFDGTYP= 0
##$CFRGTYP= 5
##$CHEMSTR= <none>
##$CNST= (0..63)
1 1 145 1 1 1 1 1 1 1 1 1 1 1 1 1 1 1 1 1 1 1 1 1 1 1 1 1 1 1 1 1 1 1 
1 1 1 1 1 1 1 1 1 1 1 1 1 1 1 1 1 1 1 1 1 1 1 1 1 1 1 1 1 1 
##$CPDPRG= <waltz16>
##$CPDPRG1= <>
##$CPDPRG2= <waltz16>
##$CPDPRG3= <>
##$CPDPRG4= <mlev>
##$CPDPRG5= <mlev>
##$CPDPRG6= <mlev>
##$CPDPRG7= <mlev>
##$CPDPRG8= <mlev>
##$CPDPRGB= <>
##$CPDPRGT= <>
##$D= (0..63)
0 1 0 0 0 0 0 0 0 0.06 0 0.03 2e-005 3e-006 0 0 0.0002 0 0 0 0 0 0 0 0 
0 0 0 0 0 0 0 0 0 0 0 0 0 0 0 0 0 0 0 0 0 0 0 0 0 0 0 0 0 0 0 0 0 0 0 
0 0 0 0 
##$DATE= 1734602943
##$DBL= (0..7)
120 120 120 11 120 120 24 19 
##$DBP= (0..7)
$$ [...]
##$SW_h= 37037.037037037
##$TD= 32768
##$TD0= 1
##$TE= 300
##$TE2= 300
##$TE3= 300
##$TEG= 300
##$TL= (0..7)
0 120 53 12 22 120 120 120 
##$TP= (0..7)
150 150 150 150 150 150 150 150 
##$TP07= 0
##$TPNAME0= <>
##$TPNAME1= <>
##$TPNAME2= <>
##$TPNAME3= <>
##$TPNAME4= <>
##$TPNAME5= <>
##$TPNAME6= <>
##$TPNAME7= <>
##$TPOAL= (0..7)
0.5 0.5 0.5 0.5 0.5 0.5 0.5 0.5 
##$TPOFFS= (0..7)
0 0 0 0 0 0 0 0 
##$TUNHIN= 0
##$TUNHOUT= 0
##$TUNXOUT= 0
##$USERA1= <user>
##$USERA2= <user>
##$USERA3= <user>
##$USERA4= <user>
##$USERA5= <user>
##$V9= 5
##$VALIST= <valist>
##$VCLIST= <CCCCCCCCCCCCCCC>
##$VD= 0
##$VDLIST= <DDDDDDDDDDDDDDD>
##$VPLIST= <PPPPPPPPPPPPPPP>
##$VTLIST= <TTTTTTTTTTTTTTT>
##$WBST= 1024
##$WBSW= 4
##$XGAIN= (0..3)
0 0 0 0 
##$XL= 0
##$YL= 0
##$YMAX_a= 3262
##$YMIN_a= -495
##$ZGOPTNS= <>
##$ZL1= 120
##$ZL2= 120
##$ZL3= 120
##$ZL4= 120
##$ABSF1= 298.5841
##$ABSF2= -158.5842
##$ABSG= 5
##$ABSL= 5
##$ALPHA= 0
##$AQORDER= 0
##$ASSFAC= 0
##$ASSFACI= 0
##$ASSFACX= 0
##$ASSWID= 0
##$AUNMP= <proc_1d>
##$AXLEFT= 0
##$AXRIGHT= 0
##$AXTYPE= 0
##$AXUNIT= <>
##$AZFE= 0.1
##$AZFW= 0.5
##$BCFW= 0
##$BC_mod= 2
##$BYTORDP= 0
##$COROFFS= 0
##$CY= 12.5935478210449
##$DATMOD= 1
##$DC= 0
##$DFILT= <>
##$DTYPP= 0
##$F1P= 47.1127640792319
##$F2P= -24.0371245302204
##$FCOR= 0.5
##$FTSIZE= 32768
##$FT_mod= 6
##$GAMMA= 0
##$GB= 0
##$INTBC= 1
##$INTSCL= 7.269226e-011
##$ISEN= 30
##$LB= 8
##$LEV0= 0
##$LPBIN= 0
##$MAXI= 12.09355
##$MC2= 0
##$MEAN= 0
##$ME_mod= 0
##$MI= 0.7550151
##$NCOEF= 0
##$NC_proc= -11
##$NLEV= 6
##$NOISF1= 298.5841
##$NOISF2= 270.0111
##$NSP= 0
##$NTH_PI= 0
##$NZP= 0
##$OFFSET= 298.5841
##$PC= 1.4
##$PHC0= 85.29808
##$PHC1= -44.88805
##$PH_mod= 1
##$PKNL= yes
##$PPARMOD= 0
##$PPDIAG= 0
##$PPIPTYP= 0
##$PPMPNUM= 100
##$PPRESOL= 1
##$PSCAL= 0
##$PSIGN= 0
##$REVERSE= no
##$SF= 81.014009
##$SI= 32768
##$SIGF1= 270.0111
##$SIGF2= -158.5842
##$SINO= 77.54984
##$SIOLD= 32768
##$SREGLST= <31P.CDCl3>
##$SSB= 0
##$STSI= 32768
##$STSR= 0
##$SW_p= 37037.037037037
##$SYMM= 0
##$S_DEV= 0
##$TDeff= 32768
##$TDoff= 0
##$TI= <>
##$TILT= no
##$TM1= 0
##$TM2= 0
##$TOPLEV= 0
##$USERP1= <user>
##$USERP2= <user>
##$USERP3= <user>
##$USERP4= <user>
##$USERP5= <user>
##$WDW= 1
##$XDIM= 32768
##$YMAX_p= 466858370
##$YMIN_p= -5678340
$$ End of Bruker specific parameters
$$ ---------------------------------
##NTUPLES= NMR SPECTRUM
##VAR_NAME=  FREQUENCY,     SPECTRUM/REAL,   SPECTRUM/IMAG
##SYMBOL=    X,             R,               I
##VAR_TYPE=  INDEPENDENT,   DEPENDENT,       DEPENDENT
##VAR_FORM=  AFFN,          ASDF,            ASDF
##VAR_DIM=   32768,         32768,           32768
##UNITS=     HZ,            ARBITRARY UNITS, ARBITRARY UNITS
##FACTOR=    1.13031516577767, 1,            1
##FIRST=     37037.037037037, 448852,        -2565800
##LAST=      0,             239746,          2586605
##MIN=       0,             -5678340,        0
##MAX=       37037.037037037, 466858370,     0
$$ Real data points
##PAGE= N=1
##DATA TABLE= (X++(R..R)), XYDATA
$$ [...]
16156a485705R4531K99410L58148L08678K27575J05326K7227O1820Q1812l3063
$$ -1485705 -1391174 -1091764 -733616 -424938 -197363 -92037 -64810 -2990 78822 45759
16146D5759k17093l78434m60622m36492l75618l37108k92379j95112p3567k3586
$$ 45759 -171334 -549768 -1010390 -1446882 -1822500 -2159608 -2451987 -2647099 -2720666 -2744252
16136b744252o0077r9813o3844O7460K46022L64273L05335J03932o1899r4406
$$ -2744252 -2804329 -2904142 -2967986 -2900526 -2654504 -2290231 -1984896 -1880964 -1942863 -2037269
16126b037269n9722o1695j18392j60660j69281j49659j05840r3314j07183q0414
$$ -2037269 -2096991 -2158686 -2277078 -2437738 -2607019 -2756678 -2862518 -2955832 -3063015 -3143429
16116c143429j0125P4968K16546M08585N61634N88987M22641J40514l4428k6648
$$ -3143429 -3153554 -3078586 -2862040 -2453455 -1891821 -1302834 -880193 -739679 -774107 -800755
16106h00755L0044Q051n2361p575J75088L52284L47812J42891q6011j73320j45728
$$ -800755 -770711 -762660 -815021 -822596 -647508 -295224 52588 195479 109468 -63852 -209580
16095b09580r2028R082J35660J96571J83996J49841J75092K67332L49745L02640
$$ -209580 -301608 -292526 -156866 39705 223701 373542 548634 815966 1165711 1468351
16085A468351J2862m40391p68162p82676o09154m63358l63528k49657j15879K4700
$$ 1468351 1481213 1040822 272660 -510016 -1119170 -1582528 -1946056 -2195713 -2311592 -2286892
16075b286892J32068J71154J51896J13775P0645k5514k16496m39306n44790m81511
$$ -2286892 -2154824 -1983670 -1831774 -1717999 -1647354 -1672868 -1889364 -2328670 -2873460 -3354971
16065c354971l43805j87513j2108J70940L22862M01560M28046M78180N43945N23335
$$ -3354971 -3698776 -3886289 -3898397 -3727457 -3404595 -3003035 -2574989 -2096809 -1552864 -1029529
16055a029529L65097J59556N1702O1513R0575N9474j3013m0390n7988j49118k34988
$$ -1029529 -664432 -504876 -453174 -391661 -301086 -241612 -254625 -295015 -353003 -502121 -737109
16044g37109j89664k8710P6772M7830K270K7365P6174P4339M7164N6860J03977
$$ -737109 -926773 -955483 -878711 -830881 -828611 -801246 -725072 -650733 -603569 -546709 -442732
16033d42732J85030L06440M17705M08688K29148l3592k20257l11841l95612m32140
$$ -442732 -257702 48738 466443 875131 1104279 1070687 850430 538589 142977 -289163
16023b89163l73410k66282j50636l331J75448L06768K96295J62110M0273J4396
$$ -289163 -662573 -928855 -1079491 -1082822 -907374 -600606 -304311 -142201 -101928 -87532
16013h7532N3308Q1001O2475N165o7182r6802j3431R9082J12949J09081J88343
$$ -87532 -34224 46777 109252 114417 47235 -49567 -62998 36084 149033 258114 446457
16002D46457K82249L09237K56738J53957L7414q1242k13261l72838n22695n60174
$$ 446457 728706 1037943 1294681 1448638 1486052 1404810 1191549 818711 296016 -264158
15992b64158m30590k17749n2511K7348N5198k4299k31504m56228n58078m46990
$$ -264158 -694748 -912497 -965008 -937660 -882462 -906761 -1138265 -1594493 -2152571 -2599561
15982b599561k19635p2610l6307M8866K82353N33017O02738M49657K17080J04954
$$ -2599561 -2819196 -2891806 -2928113 -2879247 -2596894 -2063877 -1461139 -1011482 -794402 -689448
15972f89448J96891L54904L99638L21674J95631M9385q7534k07584l53578m45142
$$ -689448 -492557 -137653 261985 583659 779290 828675 741141 533557 179979 -265163
15962b65163l32959p3325K03120M17474M84647L81786K13080J45808J89896J88148
$$ -265163 -598122 -671447 -468327 -50853 433794 815580 1028660 1174468 1364364 1552512
15952A552512N5443j22741k56292l44232l81332l48201k60126j48454k8645L4758
$$ 1552512 1607955 1485214 1228922 884690 503358 155157 -104969 -253423 -282068 -247310
15942b47310k6911j43647k57765l78981m65897m70586l86434k13141k827J32243
$$ -247310 -274221 -417868 -675633 -1054614 -1520511 -1991097 -2377531 -2590672 -2593499 -2461256
15932b461256J40765R7610M6610l3697j28943j77694j67600j33286m3358J38407
$$ -2461256 -2320491 -2222881 -2176271 -2209968 -2338911 -2516605 -2684205 -2817491 -2860849 -2722442
15922b722442L42966M85007N57916N29133L48894O6281j91298l12558k70310j19678
$$ -2722442 -2379476 -1894469 -1336553 -807420 -458526 -392245 -583543 -896101 -1166411 -1286089
15912a286089K5404O5633l3977j89989k27064q3453R0255K12593L49800M57722
$$ -1286089 -1260685 -1195052 -1229029 -1419018 -1646082 -1729535 -1639280 -1426687 -1076887 -619165
15902f19165M44338L19118J34092p3467k76984m00733l63841k20891j05532q8481
$$ -619165 -174827 144291 278383 204916 -72068 -472801 -836642 -1057533 -1163065 -1251546
15892a251546j74348l15869m35461m52039l84317l33445l00273j86616P3177L64152
$$ -1251546 -1425894 -1741763 -2177224 -2629263 -3013580 -3347025 -3647298 -3833914 -3760737 -3396585
15882c396585N17206N13716L86237J91820M1366O707R3564K31244L02200K57066
$$ -3396585 -2879379 -2365663 -1979426 -1787606 -1746240 -1739533 -1645969 -1414725 -1112525 -855459
15872h55459J74119J80451L15768M79382M74194K09267j62727m30163n15392m62952
$$ -855459 -681340 -500889 -185121 294261 768455 977722 814995 384832 -130560 -593512
15862e93512l20912j19046M1397R5293J40715K76786M96588O91818P54946O55047
$$ -593512 -914424 -1033470 -992073 -896780 -756065 -479279 17309 709127 1464073 2119120
15852B119120M51728K30275R316j55467k03851k04545k55006l61174m70835n29765
$$ 2119120 2570848 2801123 2810439 2654972 2451121 2246576 1991570 1630396 1159561 629796
15842F29796m95322l29112o9539J42194K22727J65471k1953k45304l62296l81471
$$ 629796 134474 -194638 -264177 -121983 100744 266215 244262 -1042 -363338 -744809
15832g44809m35153n58983o22072n41746m10086k35707L9321L19699M55326M18936
$$ -744809 -1179962 -1738945 -2361017 -2902763 -3312849 -3548556 -3509235 -3189536 -2734210 -2315274
15822b315274L01354K03847J35484N5998k4912r0210q8990P8678L35983M71164
$$ -2315274 -2013920 -1810073 -1674589 -1618591 -1643503 -1733713 -1822703 -1744025 -1408042 -936878
15812i36878M62816L85459K49820M3601j82411k80406j54783J04924K72640J89802
$$ -936878 -474062 -88603 161217 204818 22407 -257999 -412782 -307858 -35218 154584
15802A54584m5474k47427l60482m23453m76864n51582o06190n23349k61616P5249
$$ 154584 109110 -138317 -498799 -922252 -1399116 -1950698 -2556888 -3080237 -3341853 -3266604
15792c266604L39221M78459N75370O40130O18604N61095M76235K58977p0755l00382
$$ -3266604 -2927383 -2448924 -1873554 -1233424 -614820 -53725 422510 681487 610732 310350
15782C10350l14641k06805r7052j101J01323J81701K09021K00912J84959J24142
$$ 310350 -4291 -211096 -308148 -309249 -207926 -26225 182796 383708 568667 692809
15772F92809J2573m9263j2214N3936J14874K18726L97074N44035M99103L14089
$$ 692809 705382 656119 643905 697841 812715 1031441 1428515 1972550 2471653 2785742
15762B785742J61314N7770j18987l69484n98733p47708p43334n34050k14365O4331
$$ 2785742 2947056 3004826 2885839 2516355 1917622 1169914 426580 -107470 -321835 -257504
15752b57504K33050K76572J99759L7055j50823l22389m58794n38404n10034l38607
$$ -257504 -24454 252118 451877 488932 338109 15720 -443074 -981478 -1491512 -1830119
15742a830119j05095N2591J68312L27868M40747L89247K26352J22504J19255J83207
$$ -1830119 -1935214 -1882623 -1714311 -1386443 -945696 -556449 -330097 -207593 -88338 94869
15732I4869K92250L46150K79697J06381j25092k86060k82882j67891p0482o5013
$$ 94869 387119 733269 1012966 1119347 994255 708195 425313 257422 186940 121927
15722A21927j00046j35822k33600l66243l90887l14130k34156j56263q5619o7455
$$ 121927 21881 -113941 -347541 -713784 -1104671 -1418801 -1652957 -1809220 -1894839 -1962294
15712a962294j01197r7367J6507K17229M19846N17494M45574K69595J22489J9103
$$ -1962294 -2063491 -2160858 -2144351 -1927122 -1507276 -989782 -544208 -274613 -152124 -133021
15702a33021o3284q6600o2451m4588k9753k7078j01103k28029l07877k85380j34849
$$ -133021 -196305 -282905 -345356 -389944 -419697 -446775 -547878 -775907 -1083784 -1369164 -1504013
15691a504013R5550K80069L54744L44822L21706L02902K80873K12873J9198k21495
$$ -1504013 -1408463 -1128394 -773650 -428828 -107122 195780 476653 689526 708724 487229
15681D87229l18205k17719l2257J38463K97725L90025K60786m9562l04724l70592
$$ 487229 169024 -48695 -80952 57511 355236 745261 1006047 956485 651761 281169
15671B81169k70835j17370k9811k1295n0756j15130j47945p1556N3899J32031
$$ 281169 10334 -107036 -136847 -158142 -208898 -324028 -471973 -543529 -489630 -357599
15661c57599J88467K87911M05851M25044K92745J03212l3036p4680n8322o7858
$$ -357599 -169132 118779 524630 949674 1242419 1345631 1312595 1237915 1179593 1111735
15651A111735j34441j85010j26656L7600J71815J49969m9995l26742n06421n05878
$$ 1111735 977294 792284 665628 703228 875043 1025012 975017 648275 141854 -364024
15641c64024l71282j99839q6398o5959p5601m1097J2543k811j17105k03176j30240
$$ -364024 -735306 -935145 -1021543 -1087502 -1163103 -1204200 -1191657 -1194468 -1311573 -1514749 -1644989
15630a644989K8050J35282J76400K16743K65565K56464K29948K77305L20226K61649
$$ -1644989 -1616939 -1481657 -1305257 -1088514 -822949 -566485 -336537 -59232 260994 522643
15620E22643J12012o1562j67208j92643k00219j80794r5151J3049R1883J58531
$$ 522643 634655 573093 405885 213242 13023 -167771 -262922 -249873 -157990 541
15610E41K29423K93023L23317K93388K19051J32525O2686K4599K3477J5159r8511
$$ 541 229964 522987 846304 1139692 1358743 1491268 1553954 1578553 1602030 1617189 1518678
15599A518678k90531l48107j94004k3896K6061K2214Q8494J90864J87622P7741
$$ 1518678 1228147 880040 686036 662140 688201 710415 798909 989773 1177395 1255136
15589A255136K8488Q2814J15046P7741K2032K6779R9916J33468N562k87084n49305
$$ 1255136 1283624 1366438 1481484 1559225 1581257 1608036 1707952 1841420 1846982 1559898 1010593
15578A010593n79762m04374j90918p9217r4887j48246j31429o6239m5608r0212
$$ 1010593 430831 26457 -164461 -243678 -338565 -486811 -618240 -684479 -730087 -820299
15568h20299j77800k11091p1867J83528L63502L72114K57075J20205K5675j0412
$$ -820299 -998099 -1209190 -1281057 -1097529 -734027 -361913 -104838 15367 41042 30630
15558C0630K0132R5332J40002J74619K72412K99928J10130k04273m24636m34974
$$ 30630 50762 146094 286096 460715 733127 1033055 1143185 938912 514276 79302
15548G9302k69180q2360j9016k9587q858N1865J73410L43346M21576L35106K07646
$$ 79302 -189878 -272238 -291254 -320841 -329699 -277834 -104424 238922 660498 995604 1203250
15537A203250J52004J53512J87759K45886K54914J49510k7157j72161k30415k23970
$$ 1203250 1355254 1508766 1696525 1942411 2197325 2346835 2319678 2147517 1917102 1693132
15527A693132j88610r0413N4006J28651J33260J65458K44749K91399K19979N3049
$$ 1693132 1504522 1414109 1468115 1596766 1730026 1895484 2140233 2431632 2651611 2704660
15517B704660r4446j35236j20475j28679j58298k13724l28118m73706n72423n57840
$$ 2704660 2610214 2474978 2354503 2225824 2067526 1853802 1525684 1051978 479555 -78285
15507g8285m12159j44022J52584L22941M02880N14916N50121L47632k6471m04707
$$ -78285 -490444 -634466 -481882 -158941 243939 758855 1308976 1656608 1630137 1225430
15497A225430o37729o19580m76124l95254l52986k53176n2726K09528L51316K64197
$$ 1225430 587701 -31879 -508003 -903257 -1256243 -1509419 -1562145 -1352617 -1001301 -737104
15487g37104R0710p717j9823J3635Q8961K38283M03953M04136J49992k45523n77790
$$ -737104 -646394 -654111 -673934 -660299 -571338 -333055 70898 475034 625026 379503 -198287
15476a98287p50911p46999n28819j93401O316p5245k88209l51618k00275k1412
$$ -198287 -949198 -1696197 -2225016 -2418417 -2412101 -2487346 -2775555 -3127173 -3327448 -3348860
15466c348860N6252N7116O0667J22619K33833L97524O42027Q38851P56307M10217
$$ -3348860 -3292608 -3235492 -3174825 -3052206 -2818373 -2420849 -1778822 -939971 -183664 226553
15456B26553L7231j76630j89242p7594q110p2564k28077l61513l79832l12943
$$ 226553 263784 87154 -102088 -179682 -187792 -260356 -488433 -849946 -1229778 -1542721
15446a542721k63186k75678k98538k96079j99398L2203K38928K26903N8556q4444
$$ -1542721 -1805907 -2081585 -2380123 -2676202 -2875600 -2843397 -2604469 -2377566 -2319010 -2403454
15436b403454j58912j69151j18804l5078M5104J07403J97165L25581L95853L13973
$$ -2403454 -2562366 -2731517 -2850321 -2885399 -2840295 -2732892 -2535727 -2210146 -1814293 -1500320
15426a500320J14202r5074j77962n1704K06349M20631N07333N39967N42176M30301
$$ -1500320 -1386118 -1481192 -1659154 -1710858 -1504509 -1083878 -576545 -36578 505598 935899
15416I35899J94403o0187k00402k02946j64510j19437p4369n1394k3161L4751
$$ 935899 1130302 1070115 869713 666767 502257 382820 308451 257057 233896 268647
15406B68647R5990J67382K63728L66781M24725M49073N14539N96937O26256N32657
$$ 268647 364637 532019 795747 1162528 1587253 2036326 2550865 3147802 3774058 4306715
15396D306715L42070J77109O0379k2193m8542q2225k56688n58628q37126r49844
$$ 4306715 4648785 4825894 4886273 4864080 4815538 4733313 4476625 3917997 3080871 2131027
15386B131027q68988o26735k63841R4834L27945L87828K47309j7288k06317k52213
$$ 2131027 1262039 635304 371463 466297 794242 1182070 1429379 1412091 1205774 953561
15376I53561k64495k59797j64968k6669M1753P5527J43282J91721J67296Q9324
$$ 953561 689066 429269 264301 237632 279385 354912 498194 689915 857211 946535
15366I46535k3033j29856j77365j54604j33449k53910n20623p50682p69682o00320
$$ 946535 923502 793646 616281 461677 328228 74318 -446305 -1196987 -1966669 -2566989
15356b566989l38292k2075K84549M78858N00270M15910L63981L76810L97307M11467
$$ -2566989 -2905281 -2927356 -2642807 -2163949 -1663679 -1247769 -883788 -506978 -109671 301796
15346C01796L85606K55320J8943k35382l50592k09844J00000L47922M19992L69503
$$ 301796 687402 942722 961665 726283 375691 165847 265847 613769 1033761 1403264
15336A403264K64895J37168N682j18079k45035l81120n09468n71387m73744j86588
$$ 1403264 1668159 1805327 1811009 1692930 1447895 1066775 557307 -14080 -487824 -674412
15326f74412J52470L20945K56647J15679O4664J54678K89420L07508J66679m9634
$$ -674412 -521942 -200997 55650 171329 235993 390671 680091 987599 1154278 1104644
15316A104644k05081k51137l39574n47412p42206p97168o83234m69403k24240
$$ 1104644 899563 648426 308852 -238560 -980766 -1777934 -2461168 -2930571 -3154811
15307c154811N0051L52762O33484P57679O19862K81563o4602k33126k43222k32999
$$ -3154811 -3104760 -2751998 -2118514 -1360835 -740973 -459410 -524012 -757138 -1000360 -1233359
15297a233359j49861R3476L57218M96737O05097P58599Q05001O27921K82827r7493
$$ -1233359 -1383220 -1289744 -932526 -435789 169308 927907 1732908 2360829 2643656 2546163
15287B546163l74776m89589n00302n35806o30484o85573n74812k69992J42047
$$ 2546163 2171387 1681798 1181496 645690 15206 -670367 -1245179 -1515171 -1373124
15278a373124N14050O55116M98566J76343j06337k52740l21456l54101l18856
$$ -1373124 -859074 -203958 294608 470951 364614 111874 -209582 -563683 -882539
15269h82539k49687j96761j45891j37439k00064j88132k6177J35795J63104N2014
$$ -882539 -1132226 -1328987 -1474878 -1612317 -1812381 -2000513 -2026690 -1890895 -1727791 -1675777
15259a675777j33618k67628k70561j71936j0388J85522L26300L37972K51827J80025
$$ -1675777 -1809395 -2077023 -2347584 -2519520 -2529908 -2344386 -2018086 -1680114 -1428287 -1248262
15249a248262J95618K40328K31074K21515K63912L02505L04013K95276K36726
$$ -1248262 -1052644 -812316 -581242 -359727 -95815 206690 510703 805979 1042705
15240A042705O6386j27987k48879k46595j08104P4055K12015K80547K26719K1359
$$ 1042705 1109091 981104 732225 485630 377526 451581 663596 944143 1170862 1192221
15230A192221k42197m54494n94157o38084n75615m55238l22325j98994j09120
$$ 1192221 950024 495530 -98627 -736711 -1312326 -1767564 -2089889 -2288883 -2398003
15221b398003o4275l0089k097K7307J10930K71080L82190L34480K02245O2804
$$ -2398003 -2462278 -2492367 -2494464 -2467157 -2356227 -2085147 -1702957 -1368477 -1166232 -1103428
15211a103428q4153j75929j23123J5792J36984J90070J60254R9630M8950l0013
$$ -1103428 -1187581 -1363510 -1486633 -1470841 -1333857 -1143787 -983533 -883903 -834953 -864966
15201h64966j68522k98766k92876j25327Q8890K51963L43656L92426L96903K99532
$$ -864966 -1033488 -1332254 -1625130 -1750457 -1661567 -1409604 -1065948 -673522 -276619 22913
15191B2913Q7212j33387k15191j37786j3250M9633K5477o4701j34504p7764M5325
$$ 22913 110125 -23262 -238453 -376239 -389489 -339856 -314379 -379080 -513584 -591348 -546023
15180e46023Q1510O5196J16910K12726K34958J29209n4198k25880k80565j31184
$$ -546023 -464513 -399317 -282407 -69681 165277 294486 240288 14408 -266157 -397341
15170c97341J72619M10784M40106L71337L37139L37753K85554J01419j28335k71101
$$ -397341 -224722 186062 626168 997505 1334644 1672397 1957951 2059370 1931035 1659934
15160A659934k97030k19367j17745r0639j53633k97834m64356n59236n19781l60294
$$ 1659934 1362904 1143537 1025792 935153 781520 483686 19330 -539906 -1059687 -1419981
15150a419981j77737l3524J25215L02147M42516N41752N42343L59096O0652j84985
$$ -1419981 -1597718 -1631242 -1506027 -1203880 -761364 -219612 322731 681827 742479 557494
15140E57494k34647j05146P2446K32723L75725M85637M65914K90768Q1523o5138
$$ 557494 322847 217701 290147 522870 898595 1384232 1850146 2140914 2222437 2157299
15130B157299j99263l44850m28939m02142l01354k47643k99607l69552l20931
$$ 2157299 1958036 1613186 1184247 782105 480751 233108 -66499 -436051 -756982
15121g56982j12198J82101L96856M31415L36338J95894J4968k11393l34278k21632
$$ -756982 -869180 -687079 -290223 141192 477530 673424 688392 476999 142721 -78911
15111g8911L0299K04971K27835J75086J10201M8417j5711j25433k73366l89621
$$ -78911 -48612 156359 384194 559280 669481 717898 702187 576754 303388 -86233
15101h6233m96228o25796o72134m92249j52480R9476J22479K2076j7689N4755
$$ -86233 -582461 -1208257 -1880391 -2372640 -2525120 -2425644 -2303165 -2281089 -2298778 -2244023
15091b244023J27733J24886J58489L07592M88703N94384N90293N02355L39782
$$ -2244023 -2116290 -1991404 -1832915 -1525323 -1036620 -442236 148057 650412 990194
15082I90194J28320m3896r5979l5962O273o4592j96367l03105l37833l22184l21849
$$ 990194 1118514 1074618 978639 942677 948950 884358 687991 384886 47053 -275131 -596980
15071e96980l40787l35131k52049j27846p9206j40662j69084k9256K21233M59903
$$ -596980 -937767 -1272898 -1524947 -1652793 -1731999 -1872661 -2041745 -2071001 -1849768 -1389865
15061a389865O29433O79155N42122K63517p7001m18145n98079n01238k65241j32860
$$ -1389865 -760432 -81277 460845 724362 647361 229216 -368863 -870101 -1135342 -1268202
15051a268202j40243j70846j20012J5956J22183J61494K12839K87052L00008J98349
$$ -1268202 -1408445 -1579291 -1699303 -1683347 -1561164 -1399670 -1186831 -899779 -599771 -401422
15041d01422j031j82125j87903J4027K54059L49541K88340J42982k8635j76169
$$ -401422 -402453 -584578 -772481 -758454 -504395 -154854 133486 276468 247833 71664
15031G1664k17357j34630j4152N9334P4635Q3719J11789J48159K02857K43052
$$ 71664 -145693 -280323 -294475 -235141 -160506 -76787 35002 183161 386018 629070
15021F29070J82348J5975j69419k49417j74437o3282m5783j25673k25932k51425
$$ 629070 811418 827393 657974 408557 234120 170838 125055 -618 -226550 -477975
15011d77975j42663Q1301L78496O23192O37737M01918O3403j99819k61465j30862
$$ -477975 -620638 -539337 -160841 462351 1100088 1502006 1565409 1365590 1104125 973263
15001I73263P1774K06549K12066J67724J13664L4973o0284j67850k65742l46002
$$ 973263 1045037 1251586 1463652 1631376 1745040 1780013 1719729 1551879 1286137 940135
14991I40135l75872l06083j79728p9290K006P7467J25420J66588J94122J09366
$$ 940135 564263 258180 78452 -838 1168 78635 204055 370643 564765 674131
14981F74131j00304k28525j33193O6245J51777L1850k08097m15685m52067k45875
$$ 674131 573827 345302 212109 278354 430131 461981 253884 -161801 -613868 -859743
14971h59743K964N0420o2833j87194k32037j99989j09950L4173J75047K43147
$$ -859743 -856779 -806359 -869192 -1056386 -1288423 -1488412 -1598362 -1564189 -1389142 -1145995
14961a145995K26421J34187m743j54468l00520m24474m48389k84913J7193K96037
$$ -1145995 -919574 -785387 -790130 -944598 -1245118 -1669592 -2117981 -2402894 -2385701 -2089664
14951b089664M23618M25943M41517M80300M45098L44971K45383J52712O0090l595
$$ -2089664 -1666046 -1240103 -798586 -318286 126812 471783 717166 869878 929968 926373
14941I26373j1792K0159J02718K27557L18317L28615K46469J00920n0215j86949
$$ 926373 914581 934740 1037458 1265015 1583332 1911947 2158416 2259336 2209121 2022172
14931B022172k69202k35111j31966j24424k44826l31442l07806k65876k92643
$$ 2022172 1752970 1517859 1385893 1261469 1016643 685201 377395 111519 -181124
14922a81124l58794l56834j57359K57949O71474Q86975R10428Q39099P47908O08558
$$ -181124 -539918 -896752 -1054111 -796162 -124688 762287 1672715 2511814 3259722 3868280
14912C868280L53792J7218k61896l51627k39237q0449m7853j65279l70860o16659
$$ 3868280 4222072 4239290 3977394 3625767 3386530 3306081 3258228 3092949 2722089 2105430
14902B105430q45604r43626q31788o12013m69351n08327o51354p57631p55879
$$ 2105430 1259826 316200 -515588 -1127601 -1596952 -2105279 -2756633 -3514264 -4270143
14893d270143m50393K29840Q46777R58866O72411L72274K70619K56568K08167
$$ -4270143 -4720536 -4490696 -3643919 -2685053 -2012642 -1640368 -1369749 -1113181 -905014
14884i05014J71187J64108J22114K6731n1838o2877M988P5815P4984N0886J04833
$$ -905014 -733827 -569719 -447605 -420874 -472712 -535589 -530601 -454786 -379802 -328916 -224083
14873b24083K43700L53909L65181K89913J27476p8021j69957j07334k2791L525
$$ -224083 19617 373526 738707 1028620 1156096 1078075 908118 800784 777993 781518
14863G81518j1194m0212p4120r6134r8520j37583k33127k47093j31623m304Q3138
$$ 781518 770324 730112 655992 559858 461338 323755 90628 -156465 -288088 -292392 -209254
14852b09254J28908J03614L0484m2195j07466j05714K1707J64929J47693k5282
$$ -209254 -80346 23268 53752 11557 -95909 -201623 -179916 -14987 132706 107424
14842A07424j59165j49027p7615p1016j09780p7574J4844L7073m6321q0379N1252
$$ 107424 -51741 -200768 -278383 -349399 -459179 -536753 -521909 -484836 -531157 -611536 -560284
14831e60284K19234K98562L21997L07833J61427o5068j68206j19740K100R4850
$$ -560284 -341050 -42488 279509 587342 748769 683701 515495 395755 397855 492705
14821D92705O4353l6888m7748Q0033J98948J58709k9657k69124m77734o04047
$$ 492705 557058 520170 472422 552455 751403 910112 880455 611331 133597 -470450
14811d70450n86353m18980j76595P9276K68253L52661L67897K78577Q5256o2338
$$ -470450 -1056803 -1475783 -1652378 -1573102 -1304849 -952188 -584291 -305714 -220458 -282796
14801b82796p8538k0117K6535M0819N2796Q3144J51045K31441K40924J56077P3992
$$ -282796 -361334 -381451 -354916 -314097 -261301 -178157 -27112 204329 445253 601330 675322
14790F75322O0909M5240Q951M8232J71405K76892K90801K25862J63897J47955
$$ 675322 736231 781471 790422 838654 1010059 1286951 1577752 1803614 1967511 2115466
14780B115466J27212N3899p6321k11967k19967n2540J86586L42744L05332Q3001
$$ 2115466 2242678 2296577 2220256 2008289 1788322 1735782 1922368 2265112 2570444 2653445
14770B653445j81801l57795m23355m31750m20809l42540j72893J3322J23598J43403
$$ 2653445 2471644 2113849 1690494 1258744 837935 495395 322502 335824 459422 602825
14760F02825P6054j5231L1341K42073M74938N66857M52715K30819K2418j62432
$$ 602825 678879 663648 694989 937062 1412000 1978857 2431572 2662391 2684809 2522377
14750B522377l23140m37631m80810m04982k38001j11665j20462k48387l64858
$$ 2522377 2199237 1761606 1280796 875814 637813 526148 405686 157299 -207559
14741b07559m07351m32087m18178l10914j17987Q8357K43318L12307K99009K67476
$$ -207559 -614910 -1046997 -1465175 -1776089 -1894076 -1805719 -1562401 -1250094 -951085 -683609
14731f83609K48477K07228J06718l2617j03774l0943J02140J37148M9515o2502
$$ -683609 -435132 -227904 -121186 -153803 -257577 -288520 -186380 -49232 283 -62219
14721f2219r7372j03108j44728j36355m1100N4701O7050m5925k27498k99657j34049
$$ -62219 -159591 -262699 -407427 -543782 -584882 -530181 -463131 -509056 -736554 -1036211 -1170260
14710a170260K33953N63586O16913M56186L06219K61785K49822J78064k7177l47148
$$ -1170260 -936307 -372721 244192 700378 1006597 1268382 1518204 1696268 1669091 1321943
14700A321943o03666o39395n15341m11331l89597l58193k50897j16010q236J2515
$$ 1321943 718277 78882 -436459 -847790 -1237387 -1595580 -1846477 -1962487 -1970723 -1958208
14690a958208p5963j65744j55650o5231J4276P3034K11739L91908N06516N70555
$$ -1958208 -2034171 -2199915 -2355565 -2420796 -2406520 -2333486 -2121747 -1729839 -1223323 -652768
14680f52768N79404M35974J36377r8626r5579O6915K27136K90003K88705L14045
$$ -652768 -73364 362610 498987 400361 304782 371697 598833 888836 1177541 1491586
14670A491586L39826K97287K30995K18903J80389l1401l32718m81446l82230j65169
$$ 1491586 1831412 2128699 2359694 2578597 2758986 2727585 2394867 1913421 1531191 1366022
14660A366022J978P5160J38427K27069K61121J82394n32j96745k88631k75540
$$ 1366022 1368000 1443160 1581587 1808656 2069777 2252171 2251639 2054894 1766263 1490723
14650A490723k84380l30079k55386k6149J79074J84858l9178l47916n21497m71659
$$ 1490723 1206343 876264 620878 594729 773803 958661 919483 571567 50070 -421589
14640d21589k78792j18826p1335r8843j74073k33743j96715p8385K7379P6220
$$ -421589 -700381 -819207 -890542 -989385 -1163458 -1397201 -1593916 -1672301 -1644922 -1568702
14630a568702R0587J43490K10696K47480K56892K04642J32345J24094J70983J60918
$$ -1568702 -1478115 -1334625 -1123929 -876449 -619557 -414915 -282570 -158476 12507 173425
14620A73425k609k12910k72509j37957O2620J75668J31640n7927k52829k73755
$$ 173425 170816 -42094 -314603 -452560 -389940 -214272 -82632 -140559 -393388 -667143
14610f67143j46585m9422o3273r6275k7282J07025J97047J93287J60736K05102
$$ -667143 -813728 -863150 -926423 -1022698 -1049980 -942955 -745908 -552621 -391885 -186783
14600a86783L15754L67482L14715K59819K78910L22539K96469J91095J6764k24659
$$ -186783 128971 496453 811168 1070987 1349897 1672436 1968905 2160000 2176764 1952105
14590A952105m25441m92326m36638l03526j66790k7297J29932K46611K37852O3959
$$ 1952105 1526664 1034338 597700 294174 127384 100087 230019 476630 714482 778441
14580G78441k04021m25336n23860n46610o40365q49968r91071q99605o60733m08276
$$ 778441 574420 149084 -374776 -921386 -1561751 -2411719 -3402790 -4302395 -4963128 -5371404
14570e371404j51362N6545J58333K43692M23090O31836O84658N19734K70847J04766
$$ -5371404 -5522766 -5466221 -5307888 -5064196 -4641106 -4009270 -3324612 -2804878 -2534031 -2429265
14560b429265R7061J92337K33411R1572j80326l44971k31189N4130K66877L09304
$$ -2429265 -2332204 -2139867 -1906456 -1814884 -1995210 -2340181 -2571370 -2517240 -2250363 -1941059
14550a941059L15981M13710N11276M81989L50793J90460K0098j45782k80958m13725
$$ -1941059 -1625078 -1211368 -700092 -218103 132690 323150 343248 197466 -83492 -497217
14540d97217n52245o19816o00379m94185k72779j6760J62885K52252K58580K46444
$$ -497217 -1049462 -1669278 -2269657 -2763842 -3036621 -3053381 -2890496 -2638244 -2379664 -2133220
14530b133220K51133J68020j8455j50706j18620p547J27397L43918N53036N98073
$$ -2133220 -1882087 -1714067 -1732522 -1883228 -2001848 -2009395 -1881998 -1538080 -985044 -386971
14520c86971M58863K12601m1307k52094m07300m53920l57090j99558j34325j97197
$$ -386971 71892 284493 243186 -8908 -416208 -870128 -1227218 -1426776 -1561101 -1758298
14510a758298k72364k70457j92961r9420o817J51373M02814O41293O96615N20684
$$ -1758298 -2030662 -2301119 -2494080 -2593500 -2600317 -2448944 -2046130 -1404837 -708222 -187538
14500a87538K40341L693j10654q4003j7601o9697k37823l57373l23133k49006
$$ -187538 52803 56496 -54158 -138161 -155762 -225459 -463282 -820655 -1143788 -1392794
14490a392794k75041m30544o21357o85660n75362m07556k79661j50418M5640K99514
$$ -1392794 -1667835 -2098379 -2719736 -3405396 -3980758 -4388314 -4667975 -4818393 -4772753 -4473239
14480d473239N34288O85099P07061N43674K32792p9753k91293l12543n6092L90619
$$ -4473239 -3938951 -3253852 -2546791 -2003117 -1770325 -1850078 -2141371 -2453914 -2510006 -2119387
14470b119387P68687Q56827O42488K78809j9738r3398Q403M4703j72429n35426
$$ -2119387 -1350700 -493873 148615 427424 407686 314288 322691 367394 194965 -340461
14460c40461p51921o89435m40088j37611J14902K14450Q9464j48767k62192j32010
$$ -340461 -1092382 -1781817 -2221905 -2359516 -2244614 -2030164 -1940700 -2089467 -2351659 -2483669
14450b483669J75318M56136N56101N19172M50950M55694N72016O39345N13394
$$ -2483669 -2308351 -1852215 -1296114 -776942 -325992 129702 701718 1341063 1854457
14441A854457K87188Q7897m0717j03179j09747n6108N843Q960l8745q2649j35295
$$ 1854457 2141645 2229542 2188825 2085646 1975899 1919791 1925634 1934594 1895849 1813200 1677905
14430A677905k59687m24163n13129m46250k06394J08235L19454L63415K97464
$$ 1677905 1418218 994055 480926 34676 -171718 -63483 255971 619386 916850
14421I16850J46985j14646m13192n68335n15608l45242k08036j89550k29919k25522
$$ 916850 1063835 949189 535997 -32338 -547946 -893188 -1101224 -1290774 -1520693 -1746215
14411a746215j63183q9826l7383j4729r164k4556l9700l4986p1541j39317j22582
$$ -1746215 -1909398 -1999224 -2036607 -2051336 -2060500 -2085056 -2124756 -2159742 -2231283 -2370600 -2493182
14400b493182L4322K69753M90981O05746N27127K74000q60j89054k97978l11643
$$ -2493182 -2458860 -2189107 -1698126 -1092380 -565253 -291253 -292113 -481167 -779145 -1090788
14390a090788k16178p7909L7114J05942J23772Q8711K0687k5902j7728J8451L1192
$$ -1090788 -1306966 -1384875 -1347761 -1241819 -1118047 -1029336 -1008649 -1034551 -1052279 -1033828 -1002636
14379a002636J4276L7080R3062M3242j04632j64648p7283K2958M7461J8049k9552
$$ -1002636 -988360 -951280 -858218 -814976 -919608 -1084256 -1161539 -1138581 -1091120 -1073071 -1102623
14368a102623n5678r1210j51611j63188j01651l0706l5210j21109j88463j71713
$$ -1102623 -1158301 -1249511 -1401122 -1564310 -1665961 -1696667 -1731877 -1852986 -2041449 -2213162
14358b213162p2678J08847L18839M90251O12950O66642O20075M65217J99829j14074
$$ -2213162 -2285840 -2176993 -1858154 -1367903 -754953 -88311 531764 996981 1196810 1082736
14348A082736l70647m73592m00514k51913j26481n9063n0408o2246n4769o2315
$$ 1082736 712089 238497 -162017 -413930 -540411 -599474 -649882 -712128 -766897 -829212
14338h29212r1974j18143j44516j38287n0429R2879J90184J66094N9322P193N1085
$$ -829212 -921186 -1039329 -1183845 -1322132 -1372561 -1279682 -1089498 -923404 -864082 -856889 -805804
14327h05804Q6236P8841O3184j6104k07296l93696l57840m6166L03815M10236
$$ -805804 -719568 -640727 -577543 -593647 -800943 -1194639 -1552479 -1598645 -1294830 -884594
14317h84594K48086L2890k9873Q589K3260M6566J24895K14762K01543L5814j48401
$$ -884594 -636508 -603618 -633491 -624902 -601642 -555076 -430181 -215419 -13876 21938 -126463
14306a26463j88117r5678j3794k2879o8615n7268O70L3426K9386J2691l915k1630
$$ -126463 -314580 -410258 -424052 -446931 -515546 -572814 -572144 -538718 -509332 -496641 -500556 -522186
14294e22186o6097j90090l02828k33036k7481J48828K26495K32791K40938K78524
$$ -522186 -588283 -778373 -1081201 -1314237 -1341718 -1192890 -966395 -733604 -492666 -214142
14284b14142K74367K47780K83980L09251K40381J05566p3575k36676k85094k29996
$$ -214142 60225 308005 591985 901236 1141617 1247183 1173608 936932 651838 421842
14274D21842j60296j74110k81110l90703l80888k31132n1662O2739M7407m3110
$$ 421842 261546 87436 -193674 -584377 -965265 -1196397 -1248059 -1185320 -1137913 -1181023
14264a181023r0789j30035k18708k77988k12452n0578J07728K32106L16546L03690
$$ -1181023 -1271812 -1401847 -1620555 -1898543 -2110995 -2161573 -2053845 -1821739 -1505193 -1201503
14254a201503J76578j3904k36022l97534l57025j36557P8577J30163J05291J86071
$$ -1201503 -1024925 -1038829 -1274851 -1672385 -2029410 -2165967 -2087390 -1957227 -1851936 -1665865
14244a665865L66323N13503N10857L60471J43249o3798j96952k44615k37411j91791
$$ -1665865 -1299542 -786039 -275182 85289 228538 164740 -32212 -276827 -514238 -706029
14234g06029r5690P9442L19043N71897P20630O70382N11174L59848K07107l0472
$$ -706029 -801719 -722277 -403234 168663 889293 1559675 2070849 2430697 2637804 2607332
14224B607332l70832o58032p38908o48639m57476k13072j5531O5530O9768P9322
$$ 2607332 2236500 1578468 839560 190921 -266555 -479627 -495158 -429628 -359860 -280538
14214b80538J53308K96499M19670L98821K43655P4119j09236l57985n70864n66634
$$ -280538 -127230 169269 588939 987760 1231415 1305534 1196298 838313 267449 -299185
14204b99185k97070Q4673L57076M22806L79686L59829L62728L04747J68322l721
$$ -299185 -596255 -511582 -154506 268300 647986 1007815 1370543 1675290 1843612 1839891
14194A839891j71664k96550l41652k56422q5412L9673J07639J50119J29498Q6848
$$ 1839891 1668227 1371677 1030025 773603 688191 727864 835503 985622 1115120 1201968
14184A201968J01732K05674L30257L17185R6523j87069l29178l04673j74358J4838
$$ 1201968 1303700 1509374 1839631 2156816 2253339 2066270 1737092 1432419 1258061 1272899
14174A272899J89432K28257Q0748j10170j67512j20920q9397r6550p8928k3712
$$ 1272899 1462331 1690588 1771336 1661166 1493654 1372734 1283337 1186787 1107859 1084147
14164A084147k7381j35459k57938k91049k12168p6114K2599N910o1761J2104K44881
$$ 1084147 1056766 921307 663369 372320 160152 84038 106637 112547 50786 62890 307771
14153C07771M25353L64569R8833k12458m43687n35506n00098l84966k53854j32928
$$ 307771 733124 1097693 1196526 984068 540381 4875 -495223 -880189 -1134043 -1266971
14143a266971k3895K5572N2443J70988L64000N09490N68692N85573N62257M91868
$$ -1266971 -1290866 -1265294 -1212851 -1041863 -677863 -168373 400319 985892 1548149 2040017
14133B040017M24438L62378K34021P6164j596j0206r9487k94261m48210n13566
$$ 2040017 2464455 2826833 3060854 3137018 3135422 3125216 3025729 2731468 2283258 1769692
14123A769692m91231l60732j81217m8951j3919l9342n2142n8172j49436k97797
$$ 1769692 1278461 917729 736512 687561 673642 634300 582158 523986 374550 76753
14113G6753l42250k24038M683K02295K49664J88807Q8581j8915o2638l0818K1722
$$ 76753 -265497 -489535 -484852 -282557 -32893 155914 244495 225580 162942 132124 153846
14102A53846M2135K5818L9298O6331J7466o2463n4647O6911K46105M01110M85533
$$ 153846 195981 221799 261097 327428 344894 282431 227784 294695 540800 941910 1427443
14091A427443N04234M75211M01744K73960J10339o6213k76199m77745n80348o06677
$$ 1427443 1931677 2406888 2808632 3082592 3192931 3126718 2850519 2372774 1792426 1185749
14081A185749n92314n46064n07491m45305l05181j34826m8515p451R1305K28390
$$ 1185749 593435 47371 -460120 -905425 -1210606 -1345432 -1393947 -1401398 -1310093 -1081703
14071a081703L69665M69809M71274M14032L72986L19139J90531K277k02356l99186
$$ -1081703 -712038 -242229 229045 643077 1016063 1335202 1525733 1528010 1325654 926468
14061I26468n43861n64070m91588m37616l57174j47613P2101J43330R4751M0337
$$ 926468 382607 -181463 -673051 -1110667 -1467841 -1615454 -1543353 -1400023 -1305272 -1264935
14051a264935Q0823K47220L81848L11531J34895O5465J85464L71047L92306J83917
$$ -1264935 -1184112 -936892 -555044 -243513 -108618 -43153 142311 513358 905664 1089581
14041A089581m2423p6700L7336J30313J45266J22619R7279L1369r1463k13207
$$ 1089581 1047158 970458 1007794 1138107 1283373 1405992 1503271 1534640 1443177 1229970
14031A229970k49015j89262j51438j54693p7890R9758L38933N67387O29095M74577
$$ 1229970 980955 791693 640255 485562 407672 507430 846363 1413750 2042845 2517422
14021B517422K15751l0751j75692j68681p2630k3981j01140k62385l38034k52364
$$ 2517422 2733173 2702422 2526730 2358049 2285419 2261438 2160298 1897913 1559879 1307515
14011A307515r3152J28406L66456M64335L55747N2651l35961n77511n40918l03775
$$ 1307515 1214363 1342769 1709225 2173560 2529307 2581958 2245997 1668486 1127568 823793
14001H23793o392J73002Q0364j37886k35336k36629k40346j93803m9905J15319
$$ 823793 817401 990403 1070767 932881 697545 460916 220570 26767 -23138 92181
13991I2181J38409j1337j80954k46267j96713j10511o9715m4136L3197J31897
$$ 92181 230590 219253 38299 -207968 -404681 -515192 -584907 -629043 -595846 -463949
13981d63949K05104K89147L91418M46298M08818K69825P5762p3471o9124L3914
$$ -463949 -258845 30302 421720 868018 1276836 1546661 1622423 1548952 1479828 1513742
13971A513742M1782r0692k25287k60648k11117j01650m045N732o2360j06992m3725
$$ 1513742 1555524 1464832 1239545 978897 767780 666130 662085 667817 605457 498465 454740
13960D54740L7465m83o3721j228P4779j5409j91224j95076M237J43215R7559J2859
$$ 454740 492205 491722 428001 426773 501552 486143 294919 99843 104080 247295 344854 357713
13948C57713m640L4951J22833K12046K11228R4744o8983k01417k34134j77147
$$ 357713 353073 388024 510857 722903 934131 1028875 959892 758475 524341 347194
13938C47194j12050n1243P9405K40614L09918K85977J92908Q170k12771l91825
$$ 347194 235144 183901 263306 503920 813838 1099815 1292723 1300893 1088122 696297
13928F96297n38874n69960l89807r1328J81768L64004M53102M72310M08360K28033
$$ 696297 157423 -412537 -802344 -893672 -711904 -347900 105202 577512 985872 1213905
13918A213905j1863j54899j02587P4741J80470P8497j34527k99261l64867l52739
$$ 1213905 1202042 1047143 944556 1019297 1199767 1278264 1143737 844476 479609 126870
13908A26870k96552k96128m46159o13559n77709l31026l3905K10321L78581M63108
$$ 126870 -169682 -465810 -911969 -1525528 -2103237 -2434263 -2468168 -2257847 -1879266 -1416158
13898a416158M96454N49749O60352P48056O84663M43415J28340j72812l99006
$$ -1416158 -919704 -369955 290397 1038453 1723116 2166531 2294871 2122059 1723053
13889A723053n14501n47856n36254n27492n44851n22008l79909j73326O885J75264
$$ 1723053 1208552 660696 124442 -403050 -947901 -1469909 -1849818 -2023144 -2016259 -1840995
13879a840995L12703L38904L07736L47839M15304L79629K56436J56324J17227
$$ -1840995 -1528292 -1189388 -881652 -533813 -118509 261120 517556 673880 791107
13870G91107R2471N3094K7564lk7659j4653K1529L4394k9084j73989k96686k76713
$$ 791107 883578 936672 964236 964233 936574 921921 943450 977844 948760 774771 478085 201372
13858B01372j09893P7436K11838L01512K89385J19017j48894l58857m24954m03598
$$ 201372 91479 168915 380753 682265 971650 1090667 941773 582916 157962 -245636
13848b45636l54928k79957j30209Q7419K51585L05255K60759J36024l735q1099
$$ -245636 -600564 -880521 -1010730 -923311 -671726 -366471 -105712 30312 26577 -54522
13838e4522q9228p7039n0196R979J32493L13614M17654L26353J11335o3836j22604
$$ -54522 -143750 -220789 -270985 -261006 -128513 185101 602755 929108 1040443 976607 854003
13827H54003p8080j9131r3837l04443m09140k40019N8817K06772J01310r0932
$$ 854003 775923 756792 662955 358512 -50628 -290647 -231830 -25058 76252 -14680
13817a4680j75976r3910R8006K41400J73427j13822m21517m84894k33275J44831
$$ -14680 -190656 -284566 -186560 54840 228267 114445 -307072 -791966 -1025241 -880410
13807h80410L98408M72056M47486L46328J94025O3318j960k7133o0775j48744
$$ -880410 -482002 -9946 437540 783868 977893 1041211 1039251 1012118 951343 802599
13797H02599k70787l30351l02922k85769l22259k94719j45588Q151P5921P2060
$$ 802599 531812 201461 -101461 -387230 -709489 -1004208 -1149796 -1141645 -1065724 -993664
13787i93664Q7667J45686J44486N8003k2511l8298j6755L3063J76400L98124N74405
$$ -993664 -905997 -760311 -615825 -557822 -580333 -618631 -635386 -602323 -425923 -27799 546606
13776E46606N98773M99463L61587J52180j64852m29592m77386l61051k36260j98190
$$ 546606 1145379 1644842 2006429 2158609 1993757 1564165 1086779 725728 489468 291278
13766B91278k24850k73432l63558m89678n55810m69922k28975Q6613L42266M31547
$$ 291278 66428 -207004 -570562 -1060240 -1616050 -2085972 -2314947 -2228334 -1886068 -1454521
13756a454521M05676L85339L84783L62665K68593J36896O5474P2447Q5225M8074
$$ -1454521 -1048845 -663506 -278723 83942 352535 489431 554905 627352 712577 760651
13746G60651J1181J6135j8416j44540k40120k18733j62123j28533j04091q5055
$$ 760651 771832 787967 769551 625011 384891 166158 4035 -124498 -228589 -313644
13736c13644p3098m2905K5081J08518J49652J17061P7134J54358L39764M91013
$$ -313644 -386742 -429647 -404566 -296048 -146396 -29335 47799 202157 541921 1032934
13726A032934M81615K67212l7581k83187m16039m20764l18954j60578J3329J43846
$$ 1032934 1514549 1781761 1744180 1460993 1044954 624190 305236 144658 157987 301833
13716C01833J63918Q3575M353q990L4599J00036J22048M5772j20567k84508l46571
$$ 301833 465751 549326 553679 544689 579288 679324 801372 847144 726577 442069 95498
13705I5498l00579k26389j92960j94496j96497j56747l7889J84787M51446O42154
$$ 95498 -205081 -431470 -624430 -818926 -1015423 -1172170 -1210059 -1025272 -573826 68328
13695F8328O81753N63732L61625J46950n8936k20308k75061k42147k17021k41097
$$ 68328 750081 1313813 1675438 1822388 1763452 1543144 1268083 1025936 808915 567818
13685E67818k93898l15616k55888r7868J54980M06984N21258N03066M36310L36457
$$ 567818 273920 -41696 -297584 -395452 -240472 166512 687770 1190836 1627146 1963603
13675A963603J76242l8562k44532l75075m27646l95333k59862j02256j927M3926
$$ 1963603 2139845 2101283 1856751 1481676 1054030 658697 398835 296579 294652 338578
13665C38578R0540J62577K15003K29711K09510J21297j1763o9175j819Q6858J03886
$$ 338578 429118 591695 806698 1036409 1245919 1367216 1355453 1286278 1284459 1371317 1475203
13654A475203M9615k3824n2259m2652q1452j55187k05302k40843k56014k18594
$$ 1475203 1524818 1500994 1448735 1406083 1324631 1169444 964142 723299 467285 248691
13644B48691j66694j68794k03515j79031m5705J35613K84089L76827M12057L80551
$$ 248691 81997 -86797 -290312 -469343 -515048 -379435 -95346 281481 693538 1074089
13634A074089K77282J80354J80178K55335L43722L29571J32808j54390m13043
$$ 1074089 1351371 1531725 1711903 1967238 2310960 2640531 2773339 2618949 2205906
13625B205906o24659p41666p11266n71762l72918j66540J7622J20380J03823J02181
$$ 2205906 1581247 839581 128315 -443447 -816365 -982905 -965283 -844903 -741080 -638899
13615f38899K19609L85047M73973L98260J58392j44855l84877m80083m24660k68375
$$ -638899 -419290 -34243 439730 837990 996382 851527 466650 -13433 -438093 -706468
13605g06468j13243p7426j61284j99837j04366O3422K58091M14913M36928L10313
$$ -706468 -819711 -897137 -1058421 -1258258 -1362624 -1299202 -1041111 -626198 -189270 121043
13595A21043J03838j07853k86614m26007m77545l63375j01368J99409M00773M03598
$$ 121043 224881 117028 -169586 -595593 -1073138 -1436513 -1537881 -1338472 -937699 -534101
13585e34101K90541K28635K47172K65041K40231K07985J97492J92631J50746M1122
$$ -534101 -243560 -14925 232247 497288 737519 945504 1142996 1335627 1486373 1527495
13575A527495q8664j60359j89120k58085l84428m73796l98760k22076j13158o4215
$$ 1527495 1438831 1278472 1089352 831267 446839 -26957 -425717 -647793 -760951 -825166
13565h25166K3612J74929K78061J99318m8403l05166l93995k72003p7733M7753
$$ -825166 -801554 -626625 -348564 -149246 -197649 -502815 -896810 -1168813 -1246546 -1198793
13555a198793J21411J49520J00875K1092n161Q4821L02100N34717O43681O27116
$$ -1198793 -1077382 -927862 -826987 -805895 -811056 -726235 -424135 110582 754263 1381379
13545A381379N08425L07711R9379r0708l15760n38532o74095p09304o06371l76981
$$ 1381379 1889804 2197515 2296894 2206186 1890426 1351894 677799 -31505 -637876 -1014857
13535a014857j31416P4098K11894K91957L72326M60004N05265M77925L66725J81614
$$ -1014857 -1146273 -1072175 -860281 -568324 -195998 264006 769271 1247196 1613921 1795535
13525A795535K1342J3667J21564J67795O9711n0570m2195L2720O0690M8407m3036
$$ 1795535 1816877 1830544 1952108 2119903 2189614 2139044 2096849 2129569 2190259 2238666 2195630
13514B195630k27897l49377k95107j31443k5245j09553l36937n59986o85875o83159
$$ 2195630 1967733 1618356 1323249 1191806 1166561 1057008 720071 160085 -525790 -1208949
13504a208949n43284l61158k73954k78809k54425j32566O5306K76194L73646L33287
$$ -1208949 -1752233 -2113391 -2387345 -2666154 -2920579 -3053145 -2987839 -2711645 -2337999 -2004712
13494b004712K71111K07520J06181k9734j35247j02219L2357J10864N7295q0680
$$ -2004712 -1733601 -1526081 -1419900 -1449634 -1584881 -1687100 -1654743 -1543879 -1486584 -1567264
13484a567264k00305k12331j04210L8790J53702K64044L51710L37230K16230J00379
$$ -1567264 -1767569 -1979900 -2084110 -2045320 -1891618 -1627574 -1275864 -938634 -722404 -622025
13474f22025Q2915J11563R3062P3335J29919K07667K29470J66560L1556j07142
$$ -622025 -539110 -427547 -334485 -261150 -131231 76436 305906 472466 504022 396880
13464C96880j58656j02455k2071K0950M4834Q3054J36112J66314J86380K38883
$$ 396880 238224 135769 113698 134648 179482 262536 398648 564962 751342 990225
13454I90225L06675L12512K28849J24005O4807M5321M9047O2129Q2733J29124
$$ 990225 1296900 1609412 1838261 1962266 2027073 2072394 2121441 2183570 2266303 2395427
13444B395427J44374M1970j78375l97391m63032l34215p6113J91623L25200K76367
$$ 2395427 2539801 2581771 2403396 2006005 1542973 1208758 1132645 1324268 1649468 1925835
13434A925835J34949L8447P2640J76101K13811J52980P4313R652j05182k55846
$$ 1925835 2060784 2099231 2171871 2347972 2561783 2714763 2789076 2798728 2693546 2437700
13424B437700l16857k66136k52965l43027m50259m88818m20567k35324K4651K43327
$$ 2437700 2120843 1854707 1601742 1258715 808456 319638 -100929 -336253 -311602 -68275
13414f8275L29559L31322L54170M09406M17419L13348J80687J25268J01517O9220
$$ -68275 261284 592606 946776 1356182 1773601 2086949 2267636 2392904 2494421 2563641
13404B563641M2186J1343m4813j70433l21770l64184k65761j07913L2554J07267
$$ 2563641 2605827 2617170 2572357 2401924 2080154 1715970 1450209 1342296 1374850 1482117
13394A482117J62338L01416M75849N23987M03214J74826p8088k35268k58027k01833
$$ 1482117 1644455 1945871 2421720 2945707 3348921 3523747 3445659 3210391 2952364 2750531
13384B750531r0274n700o7086k10681k78767k16249q9097l4273j04618j78016
$$ 2750531 2660257 2654557 2587471 2376790 2098023 1881774 1792677 1758404 1653786 1475770
13374A475770j34161O192J19703J03989k9470j63055j72532r6624k7928O3993
$$ 1475770 1341609 1347801 1467504 1571493 1542023 1378968 1206436 1109812 1081884 1145877
13364A145877J91511L06582L68202L23562K36595K31205K89909K84244J67553
$$ 1145877 1337388 1643970 2012172 2335734 2572329 2803534 3093443 3377687 3545240
13355C545240N3465N8615J55205K59043L78372M70768L74435N3596l85554q04035
$$ 3545240 3598705 3657320 3812525 4071568 4449940 4920708 5295143 5348739 4963185 4159150
13345D159150j019888q90109n17272j67462J4348P4198J32315J97364J63706N9791
$$ 4159150 3139262 2249153 1731881 1564419 1578767 1652965 1785280 1982644 2146350 2206141
13335B206141P7459K42470M00601M58182M35692M33223N25401O44120P02768O80707
$$ 2206141 2283600 2526070 2926671 3384853 3820545 4253768 4779169 5423289 6126057 6806764
13325F806764O50961P46179R65922J120162J082767Q86618N72213J44701k46089
$$ 6806764 7457725 8203904 9169826 10289988 11372755 12259373 12831586 12976287 12730198
13316A2730198m07509l54250k25391j03718k0467K2367P6818K01269L57802M56480
$$ 12730198 12322689 11968439 11743048 11639330 11618863 11641230 11718048 11919317 12277119 12733599
13306A2733599M70918M30622L89877M43471O46299J019819J543691K065337K335780
$$ 12733599 13204517 13635139 14025016 14468487 15114786 16134605 17678296 19743633 22079413
13297B2079413K307962K184306K155106K313406K750525L451997M301656N280887
$$ 22079413 24387375 26571681 28726787 31040193 33790718 37242715 41544371 46825258
13289D6825258O544019Q197279J0295599J2971774J6506866K1239502K7445004
$$ 46825258 53369277 61566556 71862155 84833929 101340795 122580297 150025301
13282A50025301L5254702M4732010N5491468O4874379O5140216M5555210N785084
$$ 150025301 185280003 230012013 285503481 350377860 415518076 461073286 466858370
13275D66858370l4717145n6484992n9397949n3182278m4955912l7370945l0841093
$$ 466858370 432141225 375656233 316258284 263076006 218120094 180749149 149908056
13268A49908056k5253517k0544527j6709731j3708282j1312644r308862p613312
$$ 149908056 124654539 104110012 87400281 73691999 62379355 53070493 45457181
13261D5457181o179598m980186m038856l335994k777475k295249j940760j720741
$$ 45457181 39277583 34297397 30258541 26922547 24145072 21849823 19909063 18188322
13253A8188322j524329j248524r53583p17026n11095l45564k87784l03722l33964
$$ 18188322 16663993 15415469 14461886 13744860 13233765 12888201 12600417 12296695 11962731
13244A1962731m05226n27399o06358n64683l74952j6418M19078P14415P33537
$$ 11962731 11557505 11030106 10423748 9859065 9484113 9467695 9886773 10601188 11334725
13235A1334725N09438J47487k77458o97891j048927j303682j463355j505048j408119
$$ 11334725 11844163 11991650 11714192 11016301 9967374 8663692 7200337 5695289 4287170
13226D287170j236282j099210r56253o74809l08071o9316l6767p6512m9925Q0948
$$ 4287170 3050888 1951678 995425 320616 12545 -56771 -93538 -170050 -219975 -139027
13216a39027K66022L45329K56521J30964N6189P800k0929m1532m7294R516J29674
$$ -139027 126995 472324 728845 859809 915998 923798 902869 861337 814043 823559 953233
13205I53233K65451L56083L28911J69434m77p0130n4560M3612K30607L98104L95531
$$ 953233 1218684 1574767 1903678 2073112 2072635 2002505 1947945 1991557 2222164 2620268 3015799
13194C015799J75318k04223o08868q44627p99581n68636l38222k09954j07722
$$ 3015799 3191117 2986894 2378026 1533399 733818 165182 -173040 -382994 -490716
13185d90716R9498L85054N79799N65110L76253J11362j04225j71337j29057j09439
$$ -490716 -391218 -6164 573635 1138745 1514998 1626360 1522135 1350798 1221741 1112302
13175A112302j46269j49796j21946j63147l01573m54125n25332m34371j81165
$$ 1112302 966033 816237 694291 531144 229571 -224554 -749886 -1184257 -1365422
13166a365422J19155L56971M79968M95931L95274K18513O9171j0982l4512m1798
$$ -1365422 -1246267 -889296 -409328 86603 481877 700390 769561 758579 724067 682269
13156F82269p6810j15520j42639j81308k08846j70411q3728m7121p7251j11813
$$ 682269 605459 489939 347300 165992 -42854 -213265 -296993 -344114 -421365 -533178
13146e33178j47671j57981p5748K6948K6168o0318j20511p0949K0633p778j40744
$$ -533178 -680849 -838830 -914578 -887630 -861462 -921780 -1042291 -1113240 -1092607 -1100385 -1241129
13135a241129j82335p7434J9562P52o7836o2926J8223N9887R9694K15306K82057
$$ -1241129 -1423464 -1500898 -1481336 -1480584 -1548420 -1611346 -1593123 -1533236 -1433542 -1218236 -936179
13124i36179K38861K23673L34745M99561N52559M64547L63128K87760K15034J41917
$$ -936179 -697318 -473645 -138900 360661 913220 1377767 1740895 2028655 2243689 2385606
13114B385606L4343j29693k71391l04911k82536l13710l74792l41389k10687o2432
$$ 2385606 2419949 2290256 2018865 1713954 1431418 1117708 742916 401527 190840 128408
13104A28408P1971J95834L22853L79955K48684l0100k79968m20309m79969m62225
$$ 128408 200379 396213 719066 1099021 1347705 1317605 1037637 617328 137359 -324866
13094c24866m26314m51180m90036m50878k92195k840L78632P01310P73245N95625
$$ -324866 -751180 -1202360 -1692396 -2143274 -2435469 -2438309 -2059677 -1358367 -585122 10503
13084A0503L75002K79224K72081K28629J16830l7962j88271k11600n2689J52293
$$ 10503 385505 664729 936810 1165439 1282269 1244307 1056036 844436 791747 944040
13074I44040J98151P1509n7156j02739j33555j76813j10696J21254L50786M10935
$$ 944040 1142191 1213700 1156544 1053805 920250 743437 632741 753995 1104781 1515716
13064A515716L03167R4115j02950k16230l21585m34390m65832m23232l23755j09584
$$ 1515716 1818883 1912998 1810048 1593818 1272233 837843 372011 -51221 -374976 -484560
13054d84560J81037L92300M47836L92804K75284J08788p1307k12365k97620l72736
$$ -484560 -303523 88777 536613 929417 1204701 1313489 1242182 1029817 732197 359461
13044C59461m90237n20219l07302k2861O3348j6880m1784O3111J50410J04237
$$ 359461 -130776 -650995 -958297 -981158 -917810 -934690 -976474 -913363 -762953 -658716
13034f58716k1952j27160j94006k55157k53152r3371J79238L52478L50331L26145
$$ -658716 -680668 -807828 -1001834 -1256991 -1510143 -1603514 -1424276 -1071798 -721467 -395322
13024c95322L43044K77773O7851j24931j48340j18000j82530l38501n25715o41947
$$ -395322 -52278 225495 293346 168415 20075 -97925 -280455 -618956 -1144671 -1786618
13014a786618n77015l19369r906K10624L08829K98750K16825J48452J78517L37086
$$ -1786618 -2363633 -2683002 -2692908 -2482284 -2173455 -1874705 -1657880 -1509428 -1330911 -993825
13004i93825N45827O93133P05154O14309N40969M45983K05184r7048k91791m08996
$$ -993825 -447998 245135 950289 1564598 2105567 2551550 2756734 2659686 2367895 1958899
12994A958899n20700n52285m01914r8227J87958K84867K18310J59943J08820o5111
$$ 1958899 1438199 885914 484000 385773 573731 858598 1076908 1236851 1345671 1280560
12984A280560l05824m32595m05024l07877j84732m8349M9073L6193q3016j68276
$$ 1280560 974736 542141 137117 -170760 -355492 -403841 -354768 -318575 -401591 -569867
12974e69867j57898j68742j98825j08118P6483K28989L36105M27869M52334L13572
$$ -569867 -727765 -896507 -1095332 -1203450 -1126967 -897978 -561873 -134004 318330 631902
12964F31902M4766j82194k14477m2811J28558R4262p1357j77895j70972q4142
$$ 631902 676668 494474 279997 237186 365744 460006 388649 210754 39782 -44360
12954d4360L958J9719J373N2161J49520J77476J41234P9393m7835j87358j97697
$$ -44360 -40402 -20683 -19310 32851 182371 359847 501081 580474 532639 345281 147584
12943A47584p3639Q8172K38083L68014M97072O26603O20520M30413J68094p9785
$$ 147584 73945 162117 400200 768214 1265286 1891889 2512409 2942822 3110916 3031131
12933C031131k19333j69790L5058K26610J88349p0864l30876m53697m30429l43968
$$ 3031131 2811798 2642008 2677066 2903676 3092025 3021161 2690285 2236588 1806159 1462191
12923A462191k86877k39551j47593o3522q979K0743k492m8904j10678k35628l61636
$$ 1462191 1175314 935763 788170 724648 715669 736412 733920 685016 574338 338710 -22926
12912b2926l67574k75975j45379N246J41176K76204M60355O45305O64630M35605
$$ -22926 -390500 -666475 -811854 -806608 -665432 -389228 71127 716432 1381062 1816667
12902A816667R0432j68364k54604k29448k02849j89338r6449N5268P4773n8160
$$ 1816667 1907099 1738735 1484131 1254683 1051834 862496 766047 821315 896088 837928
12892H37928j19503M7983L56774N92320O59385N81737M04919J76356n2399j61701
$$ 837928 718425 766408 1123182 1715502 2374887 2956624 3361543 3537899 3485500 3323799
12882C323799j00214j2036n0517k23449m01435m73494m83773m72093m24362l84721
$$ 3323799 3223585 3211549 3161032 2937583 2536148 2062654 1578881 1106788 682426 297705
12872B97705l21554j91116p4664o1198j40848j87434j11007K6501R3070K0620
$$ 297705 -23849 -214965 -289629 -350827 -491675 -679109 -790116 -763615 -670545 -649925
12862f49925q7200p2712L8508Q7897J6129j07834j73828j60674j07019J2752J79823
$$ -649925 -737125 -809837 -771329 -683432 -667303 -775137 -948965 -1109639 -1216658 -1203906 -1024083
12851a024083K97728K96477J97322J03851Q4383J32247J59574P5448q2158j86930
$$ -1024083 -726355 -429878 -232556 -128705 -44322 87925 247499 322947 240789 53859
12841E3859k01725j91729j84616j17678J6288J06783J01505O2245J26097L25758
$$ 53859 -147866 -339595 -524211 -641889 -625601 -518818 -417313 -355068 -228971 96787
12831I6787N22209N72025L96957Q5908j69240k96151l62740m30582m82877n04942
$$ 96787 618996 1191021 1587978 1673886 1504646 1208495 845755 415173 -67704 -572646
12821e72646n08754m83700l75248j72592O2858K51038L07865K01680P7662J04389
$$ -572646 -1081400 -1565100 -1940348 -2112940 -2050082 -1799044 -1491179 -1289499 -1211837 -1107448
12811a107448J76273J62850J72343K55304K80874K20726J58772J21634J04874
$$ -1107448 -931175 -768325 -595982 -340678 -59804 160922 319694 441328 546202
12802E46202Q6070Q0090J45333K40315K49181J88241J81736K82580M04441M66552
$$ 546202 632272 712362 857695 1098010 1347191 1535432 1717168 1999748 2404189 2870741
12792B870741M65171M04188L06703J56903j10590m62052p39490q69984q88190
$$ 2870741 3335912 3740100 4046803 4203706 4093116 3631064 2891574 2021590 1133400
12783A133400p81805n74773l94500l29183l23509k37627j5427K25005L14400K47570
$$ 1133400 351595 -223178 -617678 -946861 -1270370 -1507997 -1523424 -1298419 -984019 -736449
12773g36449J34409N7947O2488M7722j45767m25587n28963l60517o1294J66554
$$ -736449 -602040 -544093 -481605 -433883 -579650 -1005237 -1534200 -1894717 -1956011 -1789457
12763a789457K16966J19378k0082o5589J8332Q5272k6202k52098l49014k05826
$$ -1789457 -1572491 -1453113 -1473195 -1538784 -1520452 -1435180 -1461382 -1713480 -2062494 -2268320
12753b268320P9601L46343M64876L88383K24182P9119j8001l9291J5620J33477
$$ -2268320 -2188719 -1842376 -1377500 -989117 -764935 -685816 -703817 -743108 -727488 -594011
12743e94011K52555K87069K67985K82289L11174L11545K69768J87389Q4201j822
$$ -594011 -341456 -54387 213598 495887 807061 1118606 1388374 1575763 1659964 1658142
12733A658142Q97P0839J04457L8187j75414m99931p31206p36631n76570l35907
$$ 1658142 1659039 1729878 1834335 1872522 1697108 1197177 465971 -270660 -847230 -1183137
12723a183137o0249K23532M31294M60416K98770P5172l8196n385J23516L24760
$$ -1183137 -1243386 -1019854 -588560 -128144 170626 245798 207602 202217 325733 650493
12713F50493M47276L13041K6448j91629k70038k82414k73646k32557j86401j55982
$$ 650493 1097769 1410810 1437258 1245629 975591 693177 419531 186974 573 -155409
12703a55409r8078q78O7704Q7330J34064K58199L58315L30401K28802J07604j9076
$$ -155409 -253487 -254365 -186661 -99331 34733 292932 651247 981648 1210450 1318054 1298978
12692A298978r4257q0165j7565J4854J0351O3583K22906L46165K31819q1188l37956
$$ 1298978 1204721 1124556 1106991 1121845 1132196 1195779 1418685 1764850 1996669 1915481 1577525
12681A577525m17139l96013l38358k62284j31973R7131L56283M20554J60028k12640
$$ 1577525 1160386 764373 426015 163731 31758 128889 485172 905726 1065754 853114
12671H53114m36104m73748m05650l06928j94594n0114P4547J17000J60663L00950
$$ 853114 417010 -56738 -462388 -769316 -963910 -1014024 -939477 -822477 -661814 -360864
12661c60864M37321M05427K11848n911j64419k61671l11658l00649k33622j45812
$$ -360864 76457 481884 693732 687821 523402 261731 -49927 -350576 -584198 -730010
12651g30010o5175j5392l6715r8102r2574K7701K15808L45686K88357P6003j35296
$$ -730010 -795185 -810577 -847292 -945394 -1037968 -1010267 -794459 -448773 -160416 -84413 -219709
12640b19709k54853k57148j10091J33625L43229M70335N04358L99873J49637j54120
$$ -219709 -474562 -731710 -841801 -708176 -364947 105388 609746 1009619 1159256 1005136
12630A005136l83630m34285k72539P682K45052L45871L07060J61331l2749k22332
$$ 1005136 621506 187221 -85318 -77636 167416 513287 820347 981678 948929 726597
12620G26597l63471l88722k95503j86142j22845m9854Q0563K62661M17587M44611
$$ 726597 363126 -25596 -321099 -507241 -630086 -679940 -599377 -336716 80871 525482
12610E25482L73722K82377J59062J9980p0540r3024o2259m9211o9881j3944J08622
$$ 525482 899204 1181581 1340643 1360623 1290083 1197059 1134800 1085589 1015708 1001764 1110386
12599A110386J31847K1511r1268r8975j9150K0584l7252j46969l07703m79519
$$ 1110386 1242233 1263744 1172476 1073501 1054351 1074935 1037683 890714 583011 103492
12589A03492n29182l71540p0073K31882M31250M56381K94126R5594N695j3497
$$ 103492 -425690 -797230 -867303 -635421 -204171 252210 546336 641930 647625 634128
12579F34128m0545q2110q5201j5247L6763Q633l7620o5249q1876p9226j5098J13047
$$ 634128 593583 511473 426272 411025 447788 456421 418801 353552 271676 192450 177352 290399
12567B90399K50202L90769M91185N09202M77331L57644R8059k29692n22460p55320
$$ 290399 540601 931370 1422555 1931757 2409088 2766732 2864791 2635099 2112639 1357319
12557A357319q46801o89526l66456m3461K04570L53047L48412J98198M6569j3796
$$ 1357319 510518 -179008 -545464 -588925 -384355 -31308 317104 515302 561871 548075
12547E48075l0131n3187n6373p081N9252J20312J93897K53365K01720M0856j05316
$$ 548075 517944 464757 408384 401303 460555 580867 774764 1028129 1229849 1270705 1165389
12536A165389j92723k63695l52180m30140m33844l55653k22638n8596J02266J70734
$$ 1165389 972666 708971 356791 -73349 -507193 -862846 -1085484 -1144080 -1041814 -871080
12526h71080J13327K7088k6396k5107L7173Q4147P8754O5063m376j84554l37716
$$ -871080 -757753 -730665 -757061 -782168 -744995 -660848 -582094 -517031 -521407 -705961 -1043677
12515a043677k78426j8273K47310L67002L58871L37123M08284M60343L20178J5178
$$ -1043677 -1322103 -1340376 -1093066 -726064 -367193 -30070 378214 838557 1158735 1173913
12505A173913k96196m47025m25179k81264p3744R8987K26466K98979K48427J16977
$$ 1173913 877717 430692 5513 -275751 -349495 -250508 -24042 274937 523364 640341
12495F40341M4866O8761J58508K63482L07408K90239K76968K46615Q4092k18264
$$ 640341 685207 753968 912476 1175958 1483366 1773605 2050573 2297188 2381280 2163016
12485B163016n13202o60271p23353q02008p59176m66573k6285L60494N53440N63400
$$ 2163016 1649814 989543 266190 -535818 -1294994 -1761567 -1787852 -1427358 -873918 -310518
12475c10518N30988N44656N79648N76213N06809M01126K26514p963j28364q8121
$$ -310518 220470 765126 1344774 1920987 2427796 2828922 3055436 3047473 2919109 2830988
12465B830988o4352j63127k68541k48122j57752j52695k23749k43568k25302k62010
$$ 2830988 2766636 2603509 2334968 2086846 1929094 1776399 1552650 1309082 1083780 821770
12455H21770l57408m60864n42140m89612k50926K1727K07480L39325M54569N91275
$$ 821770 464362 3498 -538642 -1028254 -1279180 -1257453 -1049973 -710648 -256079 335196
12445C35196P46917P77091N92192L09655R8896j0460p7932j26219j61282k11421
$$ 335196 1082113 1859204 2451396 2761051 2859947 2849487 2771555 2645336 2484054 2272633
12435B272633l00751m04153m56106m52809m68388m91365m40542l18461j79253
$$ 2272633 1971882 1567729 1111623 658814 190426 -300939 -741481 -1059942 -1239195
12426a239195o5028M676L9433J34419L37736M86051N06167N02014M94633M45797
$$ -1239195 -1304223 -1299547 -1260114 -1125695 -787959 -301908 204259 706273 1200906 1646703
12416A646703L50939K19444O8169o1799r5920q107J12868J52061P5837j9595k4053
$$ 1646703 1997642 2217086 2285255 2223456 2127536 2119429 2232297 2384358 2460195 2440600 2416547
12405B416547j7192j67210m32553o34481p28082p24905n97491l59463m3526K05443
$$ 2416547 2399355 2232145 1799592 1165111 437029 -287876 -885367 -1244830 -1288356 -1082913
12395a082913K57500K36960L31661N15766O17496N87170N10829M17180K33551
$$ -1082913 -825413 -588453 -256792 258974 876470 1463640 1974469 2391649 2625200
12386B625200l2623k54662l34277k80712j97359j86307k28211k16438r6091M2703
$$ 2625200 2592577 2337915 2003638 1722926 1525567 1339260 1111049 894611 798520 841223
12376H41223N5699l1115n7448K8071J79444L81250N89780O73419N52784K84996
$$ 841223 896922 865807 808359 836430 1015874 1397124 1986904 2660323 3213107 3498103
12366C498103o5795m23682o68699p34422o22938l56185m8297J37498J57044O0178
$$ 3498103 3432308 3008626 2339927 1605505 982567 626382 578085 715583 872627 932805
12356I32805p5581j57479j33909l8819P4625J93184L49398N59768P73775Q44111
$$ 932805 857224 699745 565836 527017 601642 794826 1144224 1703992 2477767 3321878
12346C321878O53051L14927N1662r6291k16183l34457m14688l78622k11766n6757
$$ 3321878 3974929 4289856 4341518 4245227 4029044 3694587 3279899 2901277 2689511 2632754
12336B632754p3168k11412k83996k38478j53016n6845K9000P9867J05863P0476
$$ 2632754 2559586 2348174 2064178 1825700 1672684 1615839 1644839 1724706 1830569 1901045
12326A901045n8501j79069k00903k13316l18674m41828m36950k89247o6042J37895
$$ 1901045 1842544 1663475 1462572 1249256 930582 488754 51804 -237443 -303485 -165590
12316a65590K16832J44618j2167j34201j54109j13212p2620l2592Q635L2951K6973
$$ -165590 51242 195860 183693 49492 -104617 -217829 -290449 -323041 -314406 -281455 -254482
12305b54482j3401n2965j1044J12908K21364K64853K72058K70727K21746P9953
$$ -254482 -267883 -320848 -331892 -218984 2380 267233 539291 810018 1031764 1111717
12295A111717r3941k49089l76011l85822k55635o2967J28286J96227r07l40335
$$ 1111717 1017776 768687 392676 6854 -248781 -311748 -183462 12765 11858 -328477
12285c28477m89504l26077n4212J08094J59831J59438J10296O3671J20893K66835
$$ -328477 -817981 -1144058 -1198270 -1090176 -930345 -770907 -660611 -596940 -476047 -209212
12275b09212L88276M10019L38567J81481j20352n22489q26048q83573o95626l76988
$$ -209212 179064 589083 927650 1109131 988779 466290 -359758 -1243331 -1938957 -2315945
12265b315945q1820R1569J38396J44692K20605L72526M86049M59027L38207K56185
$$ -2315945 -2397765 -2306196 -2167800 -2023108 -1802503 -1429977 -943928 -484901 -146694 109491
12255A09491K37121J94144O5978j34110k97623l77233m58743n72858o27029n40452
$$ 109491 346612 540756 606734 472624 175001 -202232 -660975 -1233833 -1860862 -2401314
12245b401314l33506j03932M0447Q7956J33700K42556L38898L33063K54651K11432
$$ -2401314 -2734820 -2838752 -2798305 -2710349 -2576649 -2334093 -1995195 -1662132 -1407481 -1196049
12235a196049K74350L72788L65750K52127J54011J21671P0643p7646k59619l16060
$$ -1196049 -921699 -548911 -183161 68966 222977 344648 415291 337645 78026 -238034
12225b38034k24448j21073q5481j14927k13232l07704k69651j59036j05984q3381
$$ -238034 -462482 -583555 -669036 -783963 -997195 -1304899 -1574550 -1733586 -1839570 -1922951
12215a922951m3280O255M0032P6996J93923L96251N82744O41268M97638J97062
$$ -1922951 -1966231 -1959976 -1919944 -1842948 -1649025 -1252774 -670030 -28762 468876 665938
12205F65938p2858j93368j74434r7432l5627j8738j4146M4129J78570L32012L64806
$$ 665938 593080 399712 225278 127846 92219 73481 59335 103464 282034 614046 978852
12194I78852K15231R649j29152k10554k75299l16653k62830j01111P3129K18306
$$ 978852 1194083 1203732 1074580 864026 588727 272074 9244 -91867 -18738 199568
12184A99568L46369M30451M44880M17253L90547K99551R6182p3266n6849P2246
$$ 199568 545937 976388 1421268 1838521 2229068 2528619 2624801 2551535 2494686 2566932
12174B566932J64611K04939K24441K01862J09332m2263k52390m79806o09763n98035
$$ 2566932 2731543 2936482 3160923 3362785 3472117 3429854 3177464 2697658 2087895 1489860
12164A489860n17327n05768n23035m24177k45633j21710j33932k23458k23246
$$ 1489860 972533 466765 -56270 -480447 -726080 -847790 -981722 -1205180 -1428426
12155a428426m4049K19800L90538M01749L45244L34124M02796M81648M16934J32346
$$ -1428426 -1472475 -1252675 -862137 -460388 -115144 218980 621776 1103424 1520358 1652704
12145A652704k29628m36220l98171k17945p8763j02967k75038m98699o80648p16810
$$ 1652704 1423076 986856 588685 370740 291977 189010 -86028 -584727 -1265375 -1982185
12135a982185n65360l11202o2691K16183O04717R55552R94117P03300L21825N4080
$$ -1982185 -2547545 -2858747 -2921438 -2705255 -2100538 -1144986 -150869 552431 874256 928336
12125I28336l7566l2919k5430j1587M2614J14342J48137J66027K47437L78798
$$ 928336 890770 857851 832421 820834 863448 977790 1125927 1291954 1539391 1918189
12115A918189M63818M49420L44761J61730o1275k35492l15382l62563m26302m56871
$$ 1918189 2382007 2831427 3176188 3337918 3276643 3041151 2725769 2363206 1936904 1480033
12105A480033m50037m39461l81042k16765K6100K51358L48650K64484Q4533n9539
$$ 1480033 1029996 590535 209493 -7272 18828 270186 618836 883320 967853 908314
12095I08314j43740j94735k16406k01386j31211l715Q5645L2374j09718j80637
$$ 908314 764574 569839 353433 152047 20836 17121 102766 135140 25422 -155215
12085a55215q5629P8249J36365R3239N7215M4201o544j49298l04840l20237j79919
$$ -155215 -240844 -162595 -26230 67009 124224 168425 161881 12583 -292257 -612494 -792413
12074g92413j8319O2906O4949M8886R8067K17307L09972L18339K97127L39703
$$ -792413 -810732 -747826 -682877 -633991 -535924 -318617 -8645 309694 606821 946524
12064I46524M45469N07817M25236K20845L1055o5760j41470k92728m54251m44572
$$ 946524 1391993 1899810 2325046 2545891 2576946 2511186 2369716 2076988 1622737 1178165
12054A178165j82493J46585L00378L14302L02699K32971Q5257r8434k38181k38761
$$ 1178165 995672 1142257 1442635 1756937 2059636 2292607 2377864 2279430 2041249 1802488
12044A802488j10700J5733M2572P101n5086j93051m26558o69948p50547n83169
$$ 1802488 1691788 1707521 1750093 1757194 1702108 1509057 1082499 412551 -337996 -921165
12034i21165l33590k02145k11486k87333l26546k41754m7775J08368J17880O4105
$$ -921165 -1254755 -1456900 -1668386 -1955719 -2282265 -2524019 -2571794 -2463426 -2345546 -2281441
12024b281441Q8521J88825K48823J92046K3547j94950l45272l51788k58295j25903
$$ -2281441 -2192920 -2004095 -1755272 -1563226 -1539679 -1734629 -2079901 -2431689 -2689984 -2815887
12014b815887K9091J97513L31862L87258L38759J65146j07489l26048l36079k09055
$$ -2815887 -2786796 -2589283 -2257421 -1870163 -1531404 -1366258 -1473747 -1799795 -2135874 -2344929
12004b344929p2478R6594K76917L58457L02560J42957m0175j26281n4012J50996
$$ -2344929 -2417407 -2320813 -2043896 -1685439 -1382879 -1239922 -1280097 -1406378 -1460390 -1309394
11994a309394M27927O51755O75996M56340J09213j58032k17223j44859o4008k690
$$ -1309394 -881467 -229712 446284 902624 1011837 853805 636582 491723 427715 425025
11984D25025L5279Q1324J51599K20180K43868K01851J45346J51038J83453J13555
$$ 425025 460304 541628 693227 913407 1157275 1359126 1504472 1655510 1838963 1952518
11974A952518p6835k54775k81841j42751P4608K52663K99479K19367N7908j06317
$$ 1952518 1875683 1620908 1339067 1196316 1270924 1523587 1823066 2042433 2100341 1994024
11964A994024j66286q4524L3416M2363n1753r6201r29P5229l1756k26033k98102
$$ 1994024 1827738 1743214 1776630 1818993 1767240 1671039 1670110 1745339 1713583 1487550 1189448
11953A189448k02597j29766j78957k19397j58916p0059l7525l2641p3L5234K4675
$$ 1189448 986851 857085 678128 458731 299815 229756 192231 159590 159517 194751 219426
11942B19426k4833o2304q7285j58936k27476k15037j71485j37723j43652k23291
$$ 219426 194593 132289 45004 -113932 -341408 -556445 -727930 -865653 -1009305 -1232596
11932a232596l58138m88157n05929l61238j68381o4260K0571K15196M79937O93347
$$ -1232596 -1590734 -2078891 -2584820 -2946058 -3114439 -3178699 -3158128 -2942932 -2462995 -1769648
11922a769648P65802P09890O23898N13848K93430k5968k63776k98846k15539j25124
$$ -1769648 -1003846 -293956 329942 843790 1137220 1111252 847476 548630 333091 207967
11912B07967r6256j53667k15002j74576p2064J7581R7977J03271n492j28675k14022
$$ 207967 111711 -41956 -256958 -431534 -503598 -486017 -388040 -284769 -290261 -418936 -632958
11901f32958k79011k87602j19784K83344P42572R81564R13534O51805L36852N3589
$$ -632958 -911969 -1199571 -1319355 -1036011 -293439 688125 1601659 2253464 2590316 2643905
11891B643905j66169l02184l52630l36948k41815l1432K19404L72921L87033K76243
$$ 2643905 2477736 2175552 1822922 1485974 1244159 1212727 1432131 1805052 2192085 2468328
11881B468328P3431j33634l08669n10699p32669q60341q59938p49435n17337j92616
$$ 2468328 2541759 2408125 2099456 1588757 856088 -4253 -864191 -1613626 -2130963 -2323579
11871b323579J40097L73558N21987O39373N83555K55315j02672j61024P5154L14697
$$ -2323579 -2183482 -1809924 -1287937 -648564 -65009 190306 87634 -73390 1764 316461
11861C16461L39255J89977J6972r8128j30513j05173q5081q9952j02814j26315
$$ 316461 655716 845693 862665 764537 634024 528851 443770 353818 251004 124689
11851A24689k14323l37620l82747l73406m06013n04805n70538m65334j59723J84955
$$ 124689 -89634 -427254 -810001 -1183407 -1589420 -2094225 -2664763 -3130097 -3289820 -3104865
11841c104865L72347L82730L34877L38821L90459L94041L09281K06263J68701
$$ -3104865 -2732518 -2349788 -2014911 -1676090 -1285631 -891590 -582309 -376046 -207345
11832b07345J77851J96231K29936K22193J15632o6129k50221l29795k79655j37173
$$ -207345 -29494 166737 396673 618866 734498 668369 418148 88353 -191302 -328475
11822c28475M7950J93915K56444K21060N6422j63876l10017l83445m16761l99347
$$ -328475 -280525 -86610 169834 390894 447316 283440 -26577 -410022 -826783 -1226130
11812a226130k73395j5803K14317K88547K96767L23247L41728L07148K46560K20981
$$ -1226130 -1499525 -1515328 -1301011 -1012464 -715697 -392450 -50722 256426 502986 723967
11802G23967K31449K53486K78289L02597L39104M11852N05160M82445K39698o9110
$$ 723967 955416 1208902 1487191 1789788 2128892 2540744 3045904 3528349 3768047 3698937
11792C698937k55992l26745l64387m56641n75333n44302l07247m4890K8162j06087
$$ 3698937 3442945 3116200 2751813 2295172 1719839 1175537 868290 823400 851562 745475
11782G45475l09700m52241m48010l22925j54821j2405O8750J02897O3719m5725
$$ 745475 435775 -16466 -464476 -787401 -942222 -954627 -885877 -782980 -719261 -764986
11772g64986j27667j19410q9814j21357k17836l26707l82954l26145j37964J07896
$$ -764986 -892653 -1012063 -1101877 -1223234 -1441070 -1767777 -2150731 -2476876 -2614840 -2506944
11762b506944L65816O09757P45605P20435N99828M63610L52661K84803K00359
$$ -2506944 -2141128 -1531371 -785766 -65331 534497 998107 1350768 1635571 1835930
11753A835930K1891k30077m42103n04503m25142k86911j19851Q66m6400k30542
$$ 1835930 1857821 1627744 1185641 681138 255996 -30915 -150766 -149900 -196300 -426842
11743d26842m13865m98127m42790l09541j89375q6782Q484P6183Q0482l673j36586
$$ -426842 -840707 -1338834 -1781624 -2091165 -2280540 -2367322 -2358838 -2282655 -2202173 -2205846 -2342432
11732b342432j56655P4187M22268O53121O86556N41136L26557J82352J04609K6757
$$ -2342432 -2499087 -2424900 -2002632 -1349511 -662955 -121819 204738 387090 491699 518456
11722E18456n4754j26183j90855k42364k32829j16194N0927J62266J94499K13723
$$ 518456 463702 337519 146664 -95700 -328529 -444723 -393796 -231530 -37031 176692
11712A76692K44312K50604K25658J73419J06564K7836j00160k98707n19286o43878
$$ 176692 421004 671608 897266 1070685 1177249 1205085 1104925 806218 286932 -356946
11702c56946n77014l48449n0485K02942L15501K70614J26263K112m8931o0396
$$ -356946 -933960 -1282409 -1332894 -1129952 -814451 -543837 -417574 -415462 -464393 -524789
11692e24789k6402P3386K02286K82439K76221K20520J70218J48398J19279M6617
$$ -524789 -551191 -477805 -275519 6920 283141 503661 673879 822277 941556 988173
11682I88173m383J4739N2420O9408O4360P1206J33332K46113L79951M26443K63299
$$ 988173 983790 998529 1050949 1120357 1184717 1255923 1389255 1635368 2015319 2441762 2705061
11671B705061r2229m78034o82598o04579l36417j12980q1440j26510j19459j04898
$$ 2705061 2612832 2134798 1452200 847621 511204 398224 316784 190274 70815 -34083
11661c4083q2912N112J24677K11367K43498K11335J24612N0355M2080N7902O6556
$$ -34083 -116995 -111883 12794 224161 467659 678994 803606 853961 896041 953943 1020499
11650A020499J37534K85354L97232L70821J65275j39440l52515l37836j62721
$$ 1020499 1158033 1443387 1840619 2211440 2376715 2237275 1884760 1546924 1384203
11641A384203m737L8453k794n2939r4455j40812k19907l12150l12944k02984l4175
$$ 1384203 1379466 1417919 1415125 1362186 1267731 1126919 907012 594862 281918 78934 44759
11630D4759K00012M37139N31727M55484K77671O0878j53418l69213n30450n26675
$$ 44759 244771 681910 1213637 1669121 1946792 2007670 1854252 1485039 954589 427914
11620D27914l52903j43425p1462j41417k20050k50940k85862l95099n08458n61155
$$ 427914 75011 -68414 -139876 -281293 -501343 -752283 -1038145 -1433244 -1941702 -2502857
11610b502857n75435m49439j20767K26979M24950M93699M68387L74868K80128
$$ -2502857 -3078292 -3527731 -3648498 -3421519 -2996569 -2502870 -2034483 -1659615 -1379487
11601a379487K14990J57755P7832L0773J25082L03833L61624K44251R3147K3566
$$ -1379487 -1164497 -1006742 -928910 -898137 -773055 -469222 -107598 136653 229800 253366
11591B53366N584m6376j70495l37543m88302n67117n57806n62006o50605o87911
$$ 253366 258950 212574 42079 -295464 -783766 -1350883 -1908689 -2470695 -3121300 -3809211
11581c809211n47968k57257R1293M16021O67790P66350O26100L03154K1897m4348
$$ -3809211 -4357179 -4614436 -4523143 -4107122 -3439332 -2672982 -2046882 -1743728 -1721831 -1766179
11571a766179M3852J49496K48008L53823M22750L92751K89320K04898J75109J22917
$$ -1766179 -1722327 -1572831 -1324823 -971000 -548250 -155499 133821 338719 513828 636745
11561F36745K4275n3586r6762o1819Q3204J86912J00773q9601j80245j02655L8195
$$ 636745 661020 607434 510672 448853 532057 718969 819742 730141 549896 447241 485436
11550D85436J25838J00430k3339j14862q1399M3943J88112K50510J42354p5448
$$ 485436 611274 711704 688365 573503 492104 536047 724159 974669 1117023 1041575
11540A041575k78259l79305l57847k45348q5222M3025K334k17645m41366n18758
$$ 1041575 763316 384011 26164 -219184 -304406 -261381 -259047 -476692 -918058 -1436816
11530a436816m43495k56281J3685K61558L65311L47648L18657L43537M09983M35838
$$ -1436816 -1880311 -2136592 -2122907 -1861349 -1496038 -1148390 -829733 -486196 -76213 359625
11520C59625L89524K80061J29260k2181j65403k42949j62288n43M0663j13736
$$ 359625 749149 1029210 1158470 1136289 970886 727937 565649 565106 605769 492033
11510D92033l58835n02897m38852k09160P0560K83481L56265L23592K81447K28890
$$ 492033 133198 -369699 -808551 -1017711 -947151 -663670 -307405 16187 297634 526524
11500E26524J03000j12562l61749m86499m06688l02412k98955l22610k90912j80294
$$ 526524 629524 516962 155213 -331286 -737974 -1040386 -1339341 -1661951 -1952863 -2133157
11490b133157L4763L02008M78199N22761M62239L07985J01325q8904j95398j99946
$$ -2133157 -2098394 -1796386 -1318187 -795426 -333187 -25202 76123 -12781 -208179 -408125
11480d08125j18057K2943J74085L43052M95217N40664M25865J22361l18171o78450
$$ -408125 -526182 -503239 -329154 13898 509115 1049779 1475644 1598005 1279834 601384
11470F01384p74308o68064m99440l40839j93459l046K40749M05603L56301J77205
$$ 601384 -172924 -840988 -1340428 -1681267 -1874726 -1877772 -1637023 -1231420 -875119 -697914
11460f97914N1257P626q3022l06623n48983n97661m24126j91178l3334J9800Q9174
$$ -697914 -646657 -639031 -722053 -1028676 -1577659 -2175320 -2599446 -2790624 -2823958 -2804158 -2714984
11449b714984K57226M23301N14060N53279N59950N52748N14177L62401J23154
$$ -2714984 -2457758 -2034457 -1520397 -967118 -407168 145580 659757 1022158 1145312
11440A145312m7044p4139j3120N2107P0933L6283q1635k45439l30772l39880l52630
$$ 1145312 1098268 1024129 1011009 1063116 1134049 1170332 1088697 843258 512486 172606 -180024
11429a80024l27163j89724l2108K2193M008N188O9694J96394L13602L18842J82647
$$ -180024 -507187 -696911 -729019 -706826 -702818 -697630 -627936 -431542 -117940 200902 383549
11418C83549l3160k45037l98102m79352n05832n13497m75074l17392r6030P2124
$$ 383549 350389 105352 -292750 -772102 -1277934 -1791431 -2266505 -2583897 -2679927 -2607803
11408b607803J20717M2457p3053j31309q6699O2384K19284K80791K77603K54208
$$ -2607803 -2487086 -2444629 -2517682 -2648991 -2735690 -2673306 -2454022 -2173231 -1895628 -1641420
11398a641420K22107K15134K07842J87338J98314K30591K33826J44727o2002l23395
$$ -1641420 -1419313 -1204179 -996337 -808999 -610685 -380094 -146268 -1541 -63543 -386938
11388c86938n04039m68825k38104M5623K85993M38402M28716K53339K2121j77117
$$ -386938 -890977 -1359802 -1597906 -1552283 -1266290 -827888 -399172 -145833 -123712 -300829
11378c00829l27634m17579m23189l86899l87393m27321m34362l39661j87674j10905
$$ -300829 -628463 -1046042 -1469231 -1856130 -2243523 -2670844 -3105206 -3444867 -3632541 -3743446
11368c743446j12090k2098K28467N13652O84738O48053L81495j9903l03722l12549
$$ -3743446 -3855536 -3877634 -3649167 -3135515 -2450777 -1802724 -1421229 -1441132 -1744854 -2057403
11358b057403j90330q3542J6604Q3560R8224J68098L24011M79153N41229M26420
$$ -2057403 -2247733 -2331275 -2314671 -2231111 -2132887 -1964789 -1640778 -1161625 -620396 -193976
11348a93976K00897O1609M6055M9977N6880P2003J00208J21959P4774n3396k06209
$$ -193976 6921 68530 114585 164562 221442 293445 393653 515612 590386 536990 330781
11337C30781l30267l53141k41526j01283k9288k5029l4950M817O2843J6744j61319
$$ 330781 514 -352627 -594153 -695436 -724724 -749753 -784703 -779886 -717043 -700299 -861618
11326h61618k88654j74993J05513L42203M60919N06362M50481K26037q1353l01062
$$ -861618 -1150272 -1325265 -1219752 -877549 -416630 89732 540213 766250 684897 383835
11316C83835l80438m14844m61346m38981k79507k2828K38665M92569P40379Q79260
$$ 383835 3397 -411447 -872793 -1311774 -1591281 -1614109 -1375444 -882875 -142496 736764
11306G36764Q51625P29673N66220L45719R6798r0815j82500k53738l76192m53922
$$ 736764 1588389 2318062 2884282 3230001 3326799 3235984 3053484 2799746 2423554 1969632
11296A969632l62324k14806j95649k92128l96367m25629l24714j54204l9337k3138
$$ 1969632 1607308 1392502 1196853 904725 508358 82729 -241985 -396189 -435526 -458664
11286d58664n3553n1345L9002J22178M5300j37127k88335l96230l97794k37899
$$ -458664 -512217 -563562 -524560 -402382 -357082 -494209 -782544 -1178774 -1576568 -1814467
11276a814467p3927l4175m2813Q75O3060P5180N0124P223r8588k61113l95042
$$ -1814467 -1888394 -1922569 -1965382 -1964507 -1901447 -1826267 -1776143 -1768920 -1867508 -2128621 -2523663
11265b523663m38002m19882l78856k99046j55625K5099J91712L21836M28581M88216
$$ -2523663 -2961665 -3381547 -3760403 -4059449 -4215074 -4189975 -3998263 -3676427 -3247846 -2759630
11255b759630M75481M94863N57860N06002L12297J08613P937N2875J63185J82066
$$ -2759630 -2284149 -1789286 -1231426 -725424 -413127 -304514 -296577 -243702 -80517 101549
11245A01549M1583j89886l83906l90850k03921m446Q5697J33077J91566K05863
$$ 101549 143132 -46754 -430660 -821510 -1025431 -1029877 -944180 -811103 -619537 -413674
11235d13674J52261L9678r6896j72782j38514r4700j55965k81334l48807k93652
$$ -413674 -261413 -221735 -318631 -491413 -629927 -724627 -880592 -1161926 -1510733 -1804385
11225a804385j31359J17782L93391N78621N81010M18272J81945o2894k08414j87494
$$ -1804385 -1935744 -1817962 -1424571 -845950 -264940 153332 335277 272383 63969 -123525
11215a23525p3949M7026J60622K51643K63902J77484P4675O4361J75308L23354
$$ -123525 -197474 -150448 10174 261817 525719 703203 777878 842239 1017547 1340901
11205A340901M20588M05912K78506J41025J9185j67929l45919l20885j03454R4020
$$ 1340901 1761489 2167401 2445907 2586932 2606117 2438188 2092269 1771384 1667930 1761950
11195A761950J19677L6888j869P6036K77180N42592P21446O30150K51670j96893
$$ 1761950 1881627 1918515 1916646 1992682 2269862 2812454 3533900 4164050 4415720 4218827
11185D218827m41659m26927l24088k88803l50323m35316m63729l66497j98915
$$ 4218827 3777168 3350241 3026153 2737350 2387027 1951711 1487982 1121485 922570
11176I22570r7266p4888p0390j06287j85376k07475j11685M1029Q4538q3846l33875
$$ 922570 825304 750416 680026 573739 388363 180888 69203 110232 194770 110924 -222951
11165b22951m01307j73448K07915N19338O31211M96880J03073m45469q73153r99305
$$ -222951 -624258 -797706 -589791 -70453 560758 1057638 1160711 715242 -157911 -1157216
11155a157216r01676p09998m90323k37157Q1386L69544M56086L46927J75015J6301
$$ -1157216 -2058892 -2768890 -3259213 -3496370 -3414984 -3045440 -2589354 -2242427 -2067412 -2051111
11145b051111m4439M9191J80029K56417L23327L74295M05256M09925L43644K01211
$$ -2051111 -2095550 -2046359 -1866330 -1609913 -1286586 -912291 -507035 -97110 246534 447745
11135D47745Q220j97986l24455l31667l28734l65715l72348k52384K2362L47298
$$ 447745 455965 257979 -66476 -398143 -726877 -1092592 -1464940 -1717324 -1694962 -1347664
11125a347664N32256M54980K16547M5087J5752q214j19144k34041k83714k81805
$$ -1347664 -815408 -360428 -143881 -98794 -83042 -91256 -210400 -444441 -728155 -1009960
11115a009960k00734K202L08582O18596P79812P24408N28681L14480J65052P4479
$$ -1009960 -1210694 -1208492 -899910 -281314 498498 1222906 1751587 2066067 2231119 2305598
11105B305598k7275j39424j76584j62903j93537j74481m1931O7781J00567P9337
$$ 2305598 2278323 2138899 1962315 1799412 1605875 1431394 1389463 1457244 1557811 1637148
11095A637148K3829J2093J4065j22451l91819n84188n48268l89289k94817k40517
$$ 1637148 1660977 1673070 1687135 1564684 1172865 588677 40409 -348880 -643697 -884214
11085h84214p8407K05230M39470M66315L13189J42656N5882R364o2936j15241
$$ -884214 -962621 -757391 -317921 148394 461583 604239 660121 669485 606549 491308
11075D91308n0038L7637l333j19743j76053j32265l7017L4880J17842K72762M54477
$$ 491308 441270 478907 475574 355831 179778 47513 10496 45376 163218 435980 890457
11064H90457N74119N50610L82059J23288j29037k59344k31953j82341k39681l48321
$$ 890457 1464576 2015186 2397245 2520533 2391496 2132152 1900199 1717858 1478177 1129856
11054A129856l69644k90843k54829l31462l91130k23011J71962N34757O94668
$$ 1129856 760212 469369 214540 -116922 -508052 -731063 -559101 -24344 670324
11045F70324O77884N47714L36483J4049l98503p38921q74193p59241m55471j17184
$$ 670324 1348208 1895922 2232405 2246454 1847951 1109030 234837 -524404 -979875 -1097059
11035a097059J28718K01453Q1941j03333j82207j36967q7588r6915j46867j92499
$$ -1097059 -968341 -766888 -684947 -788280 -970487 -1107454 -1195042 -1291957 -1438824 -1631323
11025a631323j80319j37959j37639j49939j19889j10400j91013k63734j70461
$$ -1631323 -1811642 -1949601 -2087240 -2237179 -2357068 -2467468 -2658481 -2922215 -3092676
11016c092676N0884J93321J64631J06024J05465R3695K9229J5315J50039L27434
$$ -3092676 -3041792 -2848471 -2683840 -2577816 -2472351 -2378656 -2349427 -2334112 -2184073 -1856639
11006a856639L79700L40963L57578L90450K94396N8388k34812m41654m31775k56865
$$ -1856639 -1476939 -1135976 -778398 -387948 -93552 -35164 -269976 -711630 -1143405 -1400270
10996a400270r4649m5644j21258k66603l56956l05711j20254J45195M24256O60988
$$ -1400270 -1494919 -1540563 -1661821 -1928424 -2285380 -2591091 -2711345 -2566150 -2141894 -1480906
10986a480906P76775P47966O51750N30635M38396M32745M44907L81771K86459
$$ -1480906 -704131 43835 695585 1226220 1664616 2097361 2542268 2924039 3210498
10977C210498K51058K57839K66876K69069K00816L0456j56433k88892l45553k85829
$$ 3210498 3461556 3719395 3986271 4255340 4456156 4486612 4330179 4041287 3695734 3409905
10967C409905j32976J1968P2401R7585J41357J38178M2328o4080r2537n9357n6162
$$ 3409905 3276929 3288897 3361298 3458883 3600240 3738418 3780746 3716666 3624129 3564772 3508610
10956C508610j28387k12258k52229k37627j74038j02733o3483n3924n7961r9160
$$ 3508610 3380223 3167965 2915736 2678109 2504071 2401338 2337855 2283931 2225970 2126810
10946B126810j47763j24102k7280Q4945J32441R3279K7245j7955q9304k42448
$$ 2126810 1979047 1854945 1827665 1912610 2045051 2138330 2165575 2147620 2058316 1815868
10936A815868m15386n05893m83694l65619j65576P7134K69079K97914J67473O6921
$$ 1815868 1400482 894589 410895 45276 -120300 -43166 225913 523827 691300 758221
10926G58221J30702K38607K63242K76338K51060R0779q1040j22247j05883j30051
$$ 758221 888923 1127530 1390772 1667110 1918170 2008949 1927909 1805662 1699779 1569728
10916A569728j94461l34073n12128o02108n84698m70503k28825P8426K94694L11815
$$ 1569728 1375267 1041194 529066 -73042 -657740 -1128243 -1357068 -1278642 -983948 -672133
10906f72133J80519L7927j0784M9268J42278J62528J04382M8879N6229J14300
$$ -672133 -491614 -453687 -464471 -415203 -272925 -110397 -6015 42864 99093 213393
10896B13393J33335N5018q2989k19396l01259l06706k76219k71919l19107l36413
$$ 213393 346728 401746 318757 99361 -201898 -508604 -784823 -1056742 -1375849 -1712262
10886a712262k03525J001O0237q9214l03467l85899k68672o0198J25610K67283
$$ -1712262 -1915787 -1914786 -1854549 -1943763 -2247230 -2633129 -2901801 -2961999 -2836389 -2569106
10876b569106L97307N31685N94093N27681L86181K33277J01681L916k4926Q3281
$$ -2569106 -2171799 -1640114 -1046021 -518340 -132159 101118 202799 206715 181789 265070
10866B65070K84182M33002M31842K98292J82842J88657K46932K47344J57235L0471
$$ 265070 549252 982254 1414096 1712388 1895230 2083887 2330819 2578163 2735398 2765869
10856B765869n8855p5160p2148j56696l64174o02785p02778n89875l52619r8674
$$ 2765869 2707014 2631854 2559706 2403010 2038836 1436051 733273 143398 -209221 -307895
10846c07895Q9161J54071J16148O7142J08671J82412J49686Q9946J52266L01826
$$ -307895 -218734 -64663 51485 118627 227298 409710 559396 649342 801608 1103434
10836A103434M20709M31130K62450l2736k69904l46341k93229j79593m9014J5504
$$ 1103434 1524143 1955273 2217723 2184987 1915083 1568742 1275513 1095920 1046906 1062410
10826A062410o0222k07657k86265k58880j97099j31988k515J85378L15124K67044
$$ 1062410 1002188 794531 508266 249386 52287 -79701 -82216 103162 418286 685330
10816F85330O2635j48095k78179l18188k84197k29442j84195j44119j13815l5757
$$ 685330 747965 599870 321691 3503 -280694 -510136 -694331 -838450 -952265 -988022
10806i88022J30865L17978M39326M27790L03976K02725K09106K53702J82155r4393
$$ -988022 -857157 -539179 -99853 327937 631913 834638 1043744 1297446 1479601 1385208
10796A385208m30821n98082n69036m22523j89312J02494L47282M03804K55743
$$ 1385208 954387 356305 -212731 -635254 -824566 -722072 -374790 29014 284757
10787B84757N0785q9359j73295k15803j80247o1689L4985N6454M2333J8821N3474
$$ 284757 335542 246183 72888 -142915 -323162 -384851 -349866 -293412 -251079 -232258 -178784
10776a78784J55752K28073J91701P5382l1270o4913m1833o4433j73199k39746
$$ -178784 -23032 205041 396742 472124 440854 375941 334108 269675 96476 -143270
10766a43270j37781M8455J25728P2537L3005J03304K00146J77164N9467k8670
$$ -143270 -281051 -232596 -106868 -34331 -1326 101978 302124 479288 538755 510085
10756E10085k9384M9306J38841J56236J03020N5059P6123J16386J20745Q9131
$$ 510085 480701 530007 668848 825084 928104 983163 1059286 1175672 1296417 1385548
10746A385548L7983l795n6476j38088k22704k96808l64676l86724l23421k80277
$$ 1385548 1423531 1419736 1363260 1225172 1002468 705660 340984 -45740 -369161 -649438
10736f49438l12790l10328j88507L5716K47475L28049K72100J49142N9791J04658
$$ -649438 -962228 -1272556 -1461063 -1425347 -1177872 -849823 -577723 -428581 -368790 -264132
10726b64132K19797K00909K7280j16372j49173j02183m7059o9032j27822j06435
$$ -264132 -44335 156574 183854 67482 -81691 -183874 -230933 -299965 -427787 -534222
10716e34222M3668K53518M10543M84137N07382M56512K76687l886k51480l51284
$$ -534222 -490554 -237036 173507 657644 1165026 1621538 1898225 1894339 1642859 1291575
10706A291575l20077k63181k24844k13964k96362l86368l25204j76506j02872
$$ 1291575 971498 708317 483473 269509 -26853 -413221 -738425 -914931 -1017803
10697a017803j20621j24667n2423N3475J28889J58594J71272J83313J44793J0152
$$ -1017803 -1138424 -1263091 -1315514 -1262039 -1133150 -974556 -803284 -619971 -475178 -465026
10687d65026j93501l98552m96781m22432k29712j872K20587L92859M62270M16714
$$ -465026 -658527 -1057079 -1553860 -1976292 -2206004 -2207876 -1987289 -1594430 -1132160 -715446
10677g15446K61079K8109j54087j92258j11010N408M7956m0578k25812l43278
$$ -715446 -454367 -426258 -580345 -772603 -883613 -878205 -830249 -870827 -1096639 -1439917
10667a439917k22750P1954K94934L15882K37193J73287J24334M0216n3427q7223
$$ -1439917 -1662667 -1590713 -1295779 -979897 -742704 -569417 -445083 -404867 -458294 -545517
10657e45517j13442k08575l24452l81540l38266j40463J84086M82029O69224P46364
$$ -545517 -658959 -867534 -1191986 -1573526 -1911792 -2052255 -1868169 -1386140 -716916 29448
10647B9448O78635M79929K60428R5652k834J2968J24553K08993K18046J52698
$$ 29448 708083 1188012 1448440 1544092 1541258 1554226 1678779 1887772 2105818 2258516
10637B258516K5138j02661j76383j85277j60391j41669j79284l40079n14568m86851
$$ 2258516 2283654 2180993 2004610 1819333 1658942 1517273 1337989 997910 483342 -3509
10627c509k78706j22536j04416j09437j9499J71984L29553L27400K26918J58364
$$ -3509 -282215 -404751 -509167 -618604 -638103 -466119 -136566 190834 417752 576116
10617E76116J64302K06605K19868J24710l4680j50138j94576j99063k79483n39623
$$ 576116 740418 947023 1166891 1291601 1256921 1106783 912207 713144 433661 -105962
10607a05962q78871j045987r57225p01064k89134K09361N52942N93945M10223
$$ -105962 -984833 -2030820 -2988045 -3689109 -3978243 -3768882 -3215940 -2621995 -2211772
10598b211772J71896J0713o4214j52011k98103m77340o55552p35691o53692m53515
$$ -2211772 -2039876 -2029163 -2093377 -2245388 -2543491 -3020831 -3676383 -4412074 -5065766 -5519281
10588e519281j38203K90416O86712R04810R32121Q46986P40442N82779L22821
$$ -5519281 -5657484 -5367068 -4680356 -3775546 -2843425 -1996439 -1255997 -673218 -350397
10579c50397O0396o8725m6221P7004K13881K74280K42517J25154n7219k09264
$$ -350397 -290001 -358726 -404947 -327943 -114062 160218 402735 527889 470670 261406
10569B61406k32557j34707r393Q3613J23165Q7141j6822r1150j19285j69815k19597
$$ 261406 28849 -105858 -115251 -31638 91527 178668 161846 70696 -48589 -218404 -438001
10558d38001k20287j62746j17184j74579k91967l72306l55495j65562J30881L52269
$$ -438001 -658288 -821034 -938218 -1112797 -1404764 -1777070 -2132565 -2298127 -2167246 -1814977
10548a814977M33900M35855M40002M24666L21441J50087k4510j57604k10439k22731
$$ -1814977 -1381077 -945222 -505220 -80554 240887 390974 366464 208860 -1579 -224310
10538b24310k91026m31754n38173n23456m49924m00813l33847k20004j32551r4347
$$ -224310 -515336 -947090 -1485263 -2008719 -2458643 -2859456 -3193303 -3413307 -3545858 -3640205
10528c640205o0249m4048n7441J1494J95670L48741L80612L34612K94082K93531
$$ -3640205 -3700454 -3744502 -3801943 -3790449 -3594779 -3246038 -2865426 -2530814 -2236732 -1943201
10518a943201K81456K00637P7997l2893j19524j74125j84957j19803k2122n57
$$ -1943201 -1661745 -1461108 -1383111 -1416004 -1535528 -1709653 -1894610 -2014413 -2036535 -2037092
10508b037092n9794j11161o1524L8224L1538o9839r0632O7075L12224M71490M67593
$$ -2037092 -2096886 -2208047 -2269571 -2231347 -2199809 -2269648 -2360280 -2293205 -1980981 -1509491 -1041898
10497a041898L40988K03195J35239J45005K00903K70734K67500R1044j89226l77878
$$ -1041898 -700910 -497715 -362476 -217471 -16568 254166 521666 612710 423484 45606
10487D5606l83443k50593r0440m0445j40424k67416k63858j17177N0775J42324
$$ 45606 -337837 -588430 -678870 -719315 -859739 -1127155 -1391013 -1508190 -1457415 -1315091
10477a315091J77927K32585L28521L94619L60311K46234J37046J40727K59980
$$ -1315091 -1137164 -904579 -576058 -181439 178872 425106 562152 702879 962859
10468I62859L39694K53349j1122l29241n07376n16130m49850l57607k41314r4054
$$ 962859 1302553 1555902 1544780 1215539 708163 192033 -257817 -615424 -856738 -950792
10458i50792J9994j2981k25704n23590p50513p66537n62821k66226k4694O7133
$$ -950792 -930798 -943779 -1169483 -1693073 -2443586 -3210123 -3772944 -4039170 -4063864 -3996731
10448c996731L3962J7588J78644N10193Q07546R04057Q08912O10030L79117K26782
$$ -3996731 -3962769 -3945181 -3766537 -3256344 -2448798 -1544741 -735829 -125799 253318 480100
10438D80100K12090K70619L16419K72856J35743k628m9171j08R8253K24829L31230
$$ 480100 692190 962809 1279228 1552084 1687827 1685199 1636028 1635920 1734173 1959002 2290232
10427B290232L37706K51369J79773K14200L21716L95952L81785K98140J89914
$$ 2290232 2627938 2879307 3059080 3273280 3594996 3990948 4372733 4670873 4860787
10418D860787R0826j331j18383k66854l88628m30112m10212l67441l17742l15366
$$ 4860787 4951613 4950282 4831899 4565045 4176417 3746305 3336093 2968652 2650910 2335544
10408B335544m54567o29401o17478m37608k46872r8223R608N1355K0379j3687
$$ 2335544 1880977 1251576 634098 196490 -50382 -148605 -138997 -87642 -67263 -80950
10398h0950K9912R8034J41124K18759L34322M16189M04870L09697J88162J10206
$$ -80950 -51038 46996 188120 406879 741201 1157390 1562260 1871957 2060119 2170325
10388B170325P6296o107j23776j78073j74133j72504j79128j83212j84249j50016
$$ 2170325 2246621 2240514 2116738 1938665 1764532 1592028 1412900 1229688 1045439 895423
$$ [...]
##END NTUPLES=NMR SPECTRUM
##END=
