##TITLE=31P ikalashn
112-2024
19.12.2024
##JCAMPDX= 6.0         $$ Bruker NMR JCAMP-DX V2.0
##DATA TYPE= NMR SPECTRUM
##DATA CLASS= NTUPLES
##ORIGIN= UXNMR, Bruker Analytische Messtechnik GmbH
##OWNER= root
$$ TOPSPIN		Version 1.3
$$ 2024-12-19 14:00:28.000 +0400  Irina@DPX200
$$ Compression mode = diff/dup
##.OBSERVE FREQUENCY= 81.01967998063
##.OBSERVE NUCLEUS= ^31P
##.ACQUISITION MODE= SIMULTANEOUS
##.ACQUISITION SCHEME= undefined
##.AVERAGES= 16
##.DIGITISER RES= 17
##SPECTROMETER/DATA SYSTEM= spect
##.PULSE SEQUENCE= zgpg
##.SOLVENT NAME= DMSO
##.SHIFT REFERENCE= INTERNAL, DMSO, 1, 298.5841
##AUDIT TRAIL= $$ (NUMBER, WHEN, WHO, WHERE, WHAT)
$$ ##TITLE= Audit trail, TOPSPIN		Version 1.3
$$ ##JCAMPDX= 5.01
$$ ##ORIGIN= Bruker BioSpin GmbH
$$ ##OWNER= Irina
$$ $$ F:/spectra/data/iren/nmr/P31dec/1/pdata/1/auditp.txt
$$ ##AUDIT TRAIL=  $$ (NUMBER, WHEN, WHO, WHERE, VERSION, WHAT)
(   1,<2024-12-19 14:00:00.921 +0400>,<Irina>,<DPX200>,<TOPSPIN 1.3>,
      <created by zg
	started at 2024-12-19 13:59:29.656 +0400,
	POWCHK disabled, PULCHK disabled
       terminated by command 'halt'
       configuration hash MD5:
       BE 6D 3F 07 2A EA 11 49 91 17 2B D3 AF B3 58 0D
       data hash MD5: 32K
       8A 68 27 59 AF D8 ED 99 EA 5A E0 94 EF 9B 8D 92>)
(   2,<2024-12-19 14:00:15.968 +0400>,<Irina>,<DPX200>,<TOPSPIN 1.3>,
      <Start of raw data processing
       efp BC_mod = 2 LB = 8 FT_mod = 6 PKNL = 1 PHC0 = 114.7996 PHC1 = -87.91702 SI = 32K 
       data hash MD5: 32K
       AA B7 0E 16 F9 BE 16 72 64 9F BC BF C7 72 2C 48>)
(   3,<2024-12-19 14:00:17.984 +0400>,<Irina>,<DPX200>,<TOPSPIN 1.3>,
      <abs n ABSG = 5 
       data hash MD5: 32K
       B3 2A 46 9D 71 1A 43 63 56 FE 98 A9 00 A0 D0 22>)
$$ ##END=
$$ 
$$ $$ hash MD5
$$ $$ 83 DA 23 7B 69 FB A2 EA 2C C8 2A 70 B7 AC 4F 09
##$RELAX= 
##$RELAX= 
##$RELAX= 
##$RELAX= 
##$RELAX= 
##$RELAX= 
##$RELAX= 
##$RELAX= 
##$RELAX= 
##$RELAX= 
##$RELAX= 
$$ Bruker specific parameters
$$ --------------------------
##$DU= <F:/spectra>
##$EXPNO= 1
##$NAME= <P31dec>
##$PROCNO= 1
##$TYPE= <nmr>
##$USER= <iren>
##$AMP= (0..31)
100 100 100 100 100 100 100 100 100 100 100 100 100 100 100 100 100 100 
100 100 100 100 100 100 100 100 100 100 100 100 100 100 
##$ANAVPT= -1
##$AQSEQ= 0
##$AQ_mod= 1
##$AUNM= <au_zg>
##$AUTOPOS= <>
##$BF1= 81.014009
##$BF2= 200.13
##$BF3= 200.13
##$BF4= 200.13
##$BF5= 200.13
##$BF6= 200.13
##$BF7= 200.13
##$BF8= 200.13
##$BYTORDA= 1
##$CFDGTYP= 0
##$CFRGTYP= 5
##$CHEMSTR= <none>
##$CNST= (0..63)
1 1 145 1 1 1 1 1 1 1 1 1 1 1 1 1 1 1 1 1 1 1 1 1 1 1 1 1 1 1 1 1 1 1 
1 1 1 1 1 1 1 1 1 1 1 1 1 1 1 1 1 1 1 1 1 1 1 1 1 1 1 1 1 1 
##$CPDPRG= <waltz16>
##$CPDPRG1= <>
##$CPDPRG2= <waltz16>
##$CPDPRG3= <>
##$CPDPRG4= <mlev>
##$CPDPRG5= <mlev>
##$CPDPRG6= <mlev>
##$CPDPRG7= <mlev>
##$CPDPRG8= <mlev>
##$CPDPRGB= <>
##$CPDPRGT= <>
##$D= (0..63)
0 1 0 0 0 0 0 0 0 0.06 0 0.03 2e-005 3e-006 0 0 0.0002 0 0 0 0 0 0 0 0 
0 0 0 0 0 0 0 0 0 0 0 0 0 0 0 0 0 0 0 0 0 0 0 0 0 0 0 0 0 0 0 0 0 0 0 
0 0 0 0 
$$ [...]
##$SW_h= 37037.037037037
##$TD= 32768
##$TD0= 1
##$TE= 300
##$TE2= 300
##$TE3= 300
##$TEG= 300
##$TL= (0..7)
0 120 53 12 22 120 120 120 
##$TP= (0..7)
150 150 150 150 150 150 150 150 
##$TP07= 0
##$TPNAME0= <>
##$TPNAME1= <>
##$TPNAME2= <>
##$TPNAME3= <>
##$TPNAME4= <>
##$TPNAME5= <>
##$TPNAME6= <>
##$TPNAME7= <>
##$TPOAL= (0..7)
0.5 0.5 0.5 0.5 0.5 0.5 0.5 0.5 
##$TPOFFS= (0..7)
0 0 0 0 0 0 0 0 
##$TUNHIN= 0
##$TUNHOUT= 0
##$TUNXOUT= 0
##$USERA1= <user>
##$USERA2= <user>
##$USERA3= <user>
##$USERA4= <user>
##$USERA5= <user>
##$V9= 5
##$VALIST= <valist>
##$VCLIST= <CCCCCCCCCCCCCCC>
##$VD= 0
##$VDLIST= <DDDDDDDDDDDDDDD>
##$VPLIST= <PPPPPPPPPPPPPPP>
##$VTLIST= <TTTTTTTTTTTTTTT>
##$WBST= 1024
##$WBSW= 4
##$XGAIN= (0..3)
0 0 0 0 
##$XL= 0
##$YL= 0
##$YMAX_a= 997
##$YMIN_a= -1533
##$ZGOPTNS= <>
##$ZL1= 120
##$ZL2= 120
##$ZL3= 120
##$ZL4= 120
##$ABSF1= 298.5841
##$ABSF2= -158.5842
##$ABSG= 5
##$ABSL= 5
##$ALPHA= 0
##$AQORDER= 0
##$ASSFAC= 0
##$ASSFACI= 0
##$ASSFACX= 0
##$ASSWID= 0
##$AUNMP= <proc_1d>
##$AXLEFT= 0
##$AXRIGHT= 0
##$AXTYPE= 0
##$AXUNIT= <>
##$AZFE= 0.1
##$AZFW= 0.5
##$BCFW= 0
##$BC_mod= 2
##$BYTORDP= 0
##$COROFFS= 0
##$CY= 12.5935478210449
##$DATMOD= 1
##$DC= 0
##$DFILT= <>
##$DTYPP= 0
##$F1P= 47.1127640792319
##$F2P= -24.0371245302204
##$FCOR= 0.5
##$FTSIZE= 32768
##$FT_mod= 6
##$GAMMA= 0
##$GB= 0
##$INTBC= 1
##$INTSCL= 7.269226e-011
##$ISEN= 30
##$LB= 8
##$LEV0= 0
##$LPBIN= 0
##$MAXI= 12.09355
##$MC2= 0
##$MEAN= 0
##$ME_mod= 0
##$MI= 0.7550151
##$NCOEF= 0
##$NC_proc= -12
##$NLEV= 6
##$NOISF1= 298.5841
##$NOISF2= 270.0111
##$NSP= 0
##$NTH_PI= 0
##$NZP= 0
##$OFFSET= 298.5841
##$PC= 1.4
##$PHC0= 114.7996
##$PHC1= -87.91702
##$PH_mod= 1
##$PKNL= yes
##$PPARMOD= 0
##$PPDIAG= 0
##$PPIPTYP= 0
##$PPMPNUM= 100
##$PPRESOL= 1
##$PSCAL= 0
##$PSIGN= 0
##$REVERSE= no
##$SF= 81.014009
##$SI= 32768
##$SIGF1= 270.0111
##$SIGF2= -158.5842
##$SINO= 77.54984
##$SIOLD= 32768
##$SREGLST= <31P.CDCl3>
##$SSB= 0
##$STSI= 32768
##$STSR= 0
##$SW_p= 37037.037037037
##$SYMM= 0
##$S_DEV= 0
##$TDeff= 32768
##$TDoff= 0
##$TI= <>
##$TILT= no
##$TM1= 0
##$TM2= 0
##$TOPLEV= 0
##$USERP1= <user>
##$USERP2= <user>
##$USERP3= <user>
##$USERP4= <user>
##$USERP5= <user>
##$WDW= 1
##$XDIM= 32768
##$YMAX_p= 502696216
##$YMIN_p= -7659293
$$ End of Bruker specific parameters
$$ ---------------------------------
##NTUPLES= NMR SPECTRUM
##VAR_NAME=  FREQUENCY,     SPECTRUM/REAL,   SPECTRUM/IMAG
##SYMBOL=    X,             R,               I
##VAR_TYPE=  INDEPENDENT,   DEPENDENT,       DEPENDENT
##VAR_FORM=  AFFN,          ASDF,            ASDF
##VAR_DIM=   32768,         32768,           32768
##UNITS=     HZ,            ARBITRARY UNITS, ARBITRARY UNITS
##FACTOR=    1.13031516577767, 1,            1
##FIRST=     37037.037037037, -918200,       1472827
##LAST=      0,             2290854,         -4089029
##MIN=       0,             -7659293,        0
##MAX=       37037.037037037, 502696216,     0
$$ Real data points
##PAGE= N=1
##DATA TABLE= (X++(R..R)), XYDATA
$$ [...]
16076b75933O4359K53763K57370N3920k26481l86251l79703k47995m2938J22639
16066h07250K40852L69802M16424L36128K32803Q6702o5959m6825J42280L46918
16056A251875M20800K50305o5427k47494k28669k44914m80538p64448q13056n78559
16046a500125k38514K8136J68637K27058K59017K55832K47673L89763P11917R42140
16036A491534P86127K54564l36895o42062n02410o8259L01383M00841K73887K8974
16026A987684j98426k82183k79444l17111l55461l66614l99339m06510l10542
16017i27946r2672J59130K59352J78147R2873R5156J52987K14326K46738K46816
16007F24907K09330J46231J8996k01086l88157m00248k58484j08663p6864j69165
$$ y = [-275933, -211574, 42189, 299559, 353479, 126998, -259253, -638956, -886951, -929889, -807250, -566398, -196596, 219828, 555956, 788759, 875461, 809502, 762677, 904957, 1251875, 1672675, 1922980, 1857553, 1610059, 1381390, 1136476, 655938, -108510, -921566, -1500125, -1738639, -1710503, -1541866, -1314808, -1055791, -799959, -552286, -162523, 549394, 1491534, 2277661, 2532225, 2195330, 1553268, 1050858, 982599, 1283982, 1684823, 1958710, 1987684, 1789258, 1507075, 1227631, 910520, 555059, 188445, -210894, -617404, -927946, -1020618, -861488, -602136, -423989, -331116, -235960, -82973, 131353, 378091, 624907, 834237, 980468, 999464, 798378, 410221, 9973, -248511, -357174, -434038, -603203]
15997f03203l18275l86881k58252K698J99664K01929N9720j03456j52289n2725
15987a411070J4787j11260k93326k57298J4327K96037M41935L87672J98129q546
15977g28613k52769m74849m73073k14165R6593L09774L71843L12845K83168L04095
15967d65151K53128P1604k60244o60529q97962q44663o21199l17328J0097K61715
15957c470532L94914M30311M83231O22106P92705Q95083Q58697O84781L51881
15948B043177j75412q04154j231214j240655r55065n78510k12639O2484J94662
15939b897326K40331K32305J00470o5709p1759O1269J23778L3650m5817o10J51486
15928b137932K99358K70820L2249k37942m18654n46995n88136m94018l35794j83504
$$ y = [-603203, -921478, -1308359, -1566611, -1563913, -1364249, -1162320, -1102600, -1206056, -1358345, -1411070, -1396283, -1507543, -1800869, -2058167, -2043840, -1747803, -1305868, -918196, -720067, -728613, -981382, -1456231, -1929304, -2143469, -2046876, -1737102, -1365259, -1052414, -769246, -465151, -212023, -140419, -400663, -1061192, -1959154, -2803817, -3425016, -3742344, -3732247, -3470532, -3075618, -2645307, -2162076, -1539970, -747265, 147818, 1006515, 1691296, 2043177, 1867765, 1063611, -167603, -1408258, -2363323, -2941833, -3154472, -3091988, -2897326, -2656995, -2424690, -2324220, -2389929, -2461688, -2400419, -2276641, -2242991, -2288808, -2289418, -2137932, -1838574, -1567754, -1535505, -1773447, -2192101, -2739096, -3327232, -3821250, -4157044, -4340548]
15918d340548l2369J55168L59442N17334O38106P54065Q66820R06986P63900M94322
15908A083226L60010M93733P91788J029879R67401N71180M5862l47694n28096
15899D467289o49568q05646q60408p43067n35192l02848j12667O2352K84105M66959
15889A271309M96267L53749J12776j22365k62668k88302k53854k33672k35035
15880H38205j82264l9284J30835K06118J43719N8031M3751K1938o4722j16970
15870A039357j19021k00129m26159o64625p92485q06409p22817m90919k2281N95202
15860b610286J120284J325178J118822O57943K47246L5880l8912j12191k12699
15851A531265k52776j91424j21043j97749m50049p43648r36525r92281r02511
$$ y = [-4340548, -4372917, -4217749, -3858307, -3340973, -2702867, -1948802, -1081982, -174996, 588904, 1083226, 1443236, 1936969, 2728757, 3758636, 4726037, 5297217, 5343079, 4995385, 4467289, 3817721, 3012075, 2151667, 1408600, 873408, 570560, 457893, 520245, 804350, 1271309, 1767576, 2121325, 2234101, 2111736, 1849068, 1560766, 1306912, 1073240, 838205, 655941, 616657, 747492, 953610, 1097329, 1155360, 1199111, 1221049, 1156327, 1039357, 920336, 720207, 294048, -370577, -1163062, -1969471, -2692288, -3183207, -3205488, -2610286, -1490002, -164824, 953998, 1611941, 1859187, 1895067, 1856155, 1743964, 1531265, 1278489, 1087065, 966022, 768273, 318224, -425424, -1361949, -2354230, -3256741]
15842c256741o14477j32269L52505N79642M92674L20760L39345N10585O16833
15833g91143O13853N40455L60675N8628k41639l81020k72563l3396N7111n8940
15823a47979j50106m1489J60467K61289K21305J90661K83135L84598L82954L17675
15813A862510K19793J27098J25598J63887J45124R3998j1366k14232m34830n52048
15803A525532m89625k61005k8954P7041J77519L82801N58123N04265J30858m89110
15793B087445j082349j338342j201993q87983o05487l39871J3512L45173M99550
15784b510345N04938N03365N47170N24162L28963J9194k03130k06832n7384J32319
15774d17580L05761L94875L85171L63746L75453L90760L75740K89438J22284q6330
$$ y = [-3256741, -3871218, -4003487, -3650982, -3071340, -2578666, -2257906, -1918561, -1407976, -791143, -177290, 363165, 723840, 782468, 540829, 159809, -112754, -146150, -89039, -147979, -298085, -339574, -179107, 82182, 303487, 494148, 777283, 1161881, 1544835, 1862510, 2082303, 2209401, 2334999, 2498886, 2644010, 2738008, 2726642, 2512410, 2077580, 1525532, 1035907, 774902, 745948, 822989, 1000508, 1383309, 1941432, 2445697, 2576555, 2087445, 1005096, -333246, -1535239, -2423222, -3028709, -3368580, -3355068, -3009895, -2510345, -2005407, -1502042, -954872, -430710, -101747, -82553, -285683, -492515, -549899, -417580, -111819, 283056, 668227, 1031973, 1407426, 1798186, 2173926, 2463364, 2585648, 2499318]
15764B499318l13392n38814o08030m32363j50512L2993J3365q5683q9215k8699
15754B98968p0621k11319k65994k09954k26366l89596n78371o79866o38442n16564
15744c488125l49256j6236M04529O52211O22046L90577J53490J4866o0975j421
15734a678294J71695K53844K35865K31952J89632M9011j22420k99136m93598o30852
15724b092301n84110l22515M6982L94451N86787N22752K70333L7659m762R2905
15714a051819J05506m8592k55888l60631k38927P6258L85512M89347L39331J15451
15704d44452j0954q4970j82789l51455m99724m77327l64802k56733j26991P115
15694b793082Q5774N6115l5102p3915j7472P3014J56614K46503L05116K94283
$$ y = [2499318, 2185926, 1647112, 1039082, 606719, 456207, 489200, 502565, 416882, 327667, 298968, 228347, 17028, -248966, -458920, -685286, -1074882, -1653253, -2333119, -2971561, -3488125, -3837381, -3853617, -3449088, -2796877, -2174831, -1784254, -1630764, -1615898, -1676873, -1678294, -1506599, -1252755, -1016890, -784938, -595306, -546295, -668715, -967851, -1461449, -2092301, -2676411, -2998926, -2951944, -2557493, -1970706, -1447954, -1177621, -1139962, -1144724, -1051819, -946313, -994905, -1250793, -1611424, -1850351, -1774093, -1388581, -899234, -559903, -444452, -455406, -540376, -723165, -1074620, -1574344, -2051671, -2416473, -2673206, -2800197, -2793082, -2707308, -2651193, -2686295, -2760210, -2777682, -2704668, -2548054, -2301551, -1996435, -1702152]
15684a702152L04509M05689M81213M21659K73391J24512J4936p4502j94220l14375
15674b59340l57423l49292l20078k12785k9986J94367M40743O17982O15816M16228
15664G56232J47806K8210P1871J19606J59315K43428L09729K71683J24168n1934
15654B180114j37149o2897P1890J27006J49402J63187J53096J62785K10161K78649
15644C296244K10703p5378l83743n18264m27996j85618m0741j46115l92525n48927
15634G87640n24630m96812o77574r45331r54480n38283J03578O47779R51937R74384
15624f71792P11676L14087K9198o3099k6285J12828K81384M04213N34138O73315
15614B299663O39239L05504j67121n17588o66920p18476p10322o06137m85562
$$ y = [-1702152, -1397643, -991954, -510741, -89082, 184309, 308821, 323757, 249255, 55035, -259340, -616763, -966055, -1286133, -1498918, -1528904, -1334537, -893794, -275812, 340004, 756232, 904038, 932248, 1004119, 1123725, 1283040, 1526468, 1836197, 2107880, 2232048, 2180114, 2042965, 1980068, 2051958, 2178964, 2328366, 2491553, 2644649, 2807434, 3017595, 3296244, 3506947, 3431569, 3047826, 2529562, 2101566, 1915948, 1875207, 1729092, 1336567, 787640, 263010, -233802, -911376, -1856707, -2811187, -3349470, -3245892, -2598113, -1646176, -671792, 39884, 353971, 383169, 320070, 293785, 406613, 687997, 1092210, 1626348, 2299663, 2938902, 3244406, 3077285, 2559697, 1892777, 1174301, 463979, -142158, -627720]
15605f27720m39406m08298l36659k69474j98183o1918J41284L67971N26325O24811
15595f81267Q29656J142927J291010J029784M37566j57004n10321o20855o14917
15586B146579o46835p89272q67707o55178k18461J40437L44722N85799R44631
15577I84715J303566J412593J096282N27964P3177q9099n4416k0315j01665l23278
15567D809524o04842p96055q46397p77698o13530m36851k92879k11466k35431
15558e625l01893k84631j52594K320J51363L13132M36363M88418M21362J91542
15548A259757n2941q9342Q0355L32953O43437R84435J198744J045912M48976k80391
15538E571895p21521p35902m66430j91372r9735j77028k40055j61740q8939j24210
$$ y = [-627720, -1067126, -1475424, -1812083, -2081557, -2279740, -2341658, -2200374, -1832403, -1306078, -681267, 148389, 1291316, 2582326, 3612110, 4049676, 3892672, 3382351, 2761496, 2146579, 1499744, 710472, -157235, -812413, -1030874, -890437, -545715, 40084, 984715, 2288281, 3700874, 4797156, 5325120, 5398297, 5309198, 5254782, 5234467, 5132802, 4809524, 4204682, 3408627, 2562230, 1784532, 1171002, 734151, 441272, 229806, -5625, -307518, -592149, -744743, -742423, -591060, -277928, 158435, 646853, 1068215, 1259757, 1206816, 1117474, 1197829, 1530782, 2174219, 3158654, 4357398, 5403310, 5852286, 5571895, 4850374, 4114472, 3648042, 3456670, 3356935, 3179907, 2939852, 2778112, 2689173, 2564963]
15528B564963j62878j70306j88739k58486m19455o75246q78818q39661n39106
15519a567732j36198J44312K60849L73016N46231O72616O19337M02984K01496
15510A516911K04914L44560L29236J21076j03856k79158l79908l51269k77183
15501A125323l33720m75474n37551m61961k92950j45494r2360j08974k03249l50656
15491a877066m05008k98242j23801K5703N0978j34168m16562n19092l02650Q5001
15481c914907M23008O58285Q21293P84338N01066J34887j00191m8979K20511M57966
15471f2723N04768M11405K24009n3866l03113l88364l45896k81336k06800j60618
15461f62534j47742n0212Q0984M3758r8898m8355K08778M08179M78458N10339
$$ y = [2564963, 2402085, 2231779, 2043040, 1784554, 1365099, 689853, -188965, -1028626, -1567732, -1703930, -1559618, -1298769, -925753, -379522, 293094, 912431, 1315415, 1516911, 1721825, 2066385, 2395621, 2516697, 2412841, 2133683, 1753775, 1402506, 1125323, 791603, 316129, -221422, -683383, -976333, -1121827, -1214187, -1323161, -1526410, -1877066, -2282074, -2580316, -2704117, -2678414, -2627436, -2761604, -3178166, -3697258, -3999908, -3914907, -3491899, -2833614, -2012321, -1227983, -726917, -592030, -692221, -741200, -520689, -62723, 442045, 853450, 1077459, 1023593, 720480, 332116, -13780, -295116, -501916, -662534, -810276, -860488, -779504, -735746, -834644, -882999, -674221, -266042, 212416, 722755]
15451G22755N42361N42320M35008K17714j7453k46709m97621o80646o80070n36122
15441a98463l59832j75904J8892J75236J92933J2815k61026l88495k54857J0365
15431a228336K15230K66125K35190K12859J85477J40707O679k59873n15173o07171
15421a348286m51376p7670L17986N12092M40009K17571J1867j41414k85517m31130
15411a235868n44365n38857m40461k91163j14486n225O4995J75079L39473N45416
15401b045462O41115N32405L49878K53590K33916K40576K56171J35925j61565
15392D36549m13398m12423k22529J4333K59490M59898M76475K87590J34524J31145
15382A151654J04609l5819k21317l86437m69771m03367j80048O3786K03540J87583
$$ y = [722755, 1265116, 1807436, 2242444, 2460158, 2442705, 2195996, 1698375, 1017729, 337659, -198463, -558295, -734199, -715307, -540071, -347138, -334323, -595349, -983844, -1238701, -1228336, -1013106, -746981, -511791, -298932, -113455, 27252, 33931, -225942, -741115, -1348286, -1799662, -1877332, -1559346, -1047254, -607245, -389674, -377807, -519221, -804738, -1235868, -1780233, -2319090, -2759551, -3050714, -3165200, -3170425, -3105430, -2930351, -2590878, -2045462, -1404347, -871942, -522064, -268474, -34558, 206018, 462189, 598114, 436549, 23151, -389272, -611801, -597468, -337978, 121920, 598395, 885985, 1020509, 1151654, 1256263, 1220444, 999127, 612690, 142919, -260448, -440496, -376710, -173170, 14413]
15372A4413Q793k21658l01830j06995K47115N30551O35338N79674M31127L40123
15362B156651L89867M91999M99309L52005J72476J44440K64694L12917J17217
15353D901575l54430r47601j354763j474186j465997j438777j339378j159333
15345d632890q91311m76660K166L70646N21560N04894M82745M84120M03652K39196
15335b991882M4941j55361k83494k94449j70058Q9630L32939L65150J41343j43324
15325c064565j77243J38431N78945Q50642Q23286N89622L11774l791l95948p20242
15315a069089p34898m18001l3136J73007J93168J73222K20482L79056N49680N20634
15305d5875L19205J21051l0221j33506j96947k76569m63047p51292r16117p86455
$$ y = [14413, 23206, -198452, -500282, -607277, -360162, 170389, 805727, 1385401, 1816528, 2156651, 2546518, 3038517, 3537826, 3889831, 4062307, 4206747, 4471441, 4784358, 4901575, 4547145, 3599544, 2244781, 770595, -695402, -2134179, -3473557, -4632890, -5524201, -6000861, -5998695, -5628049, -5106489, -4601595, -4118850, -3634730, -3231078, -2991882, -2946941, -3102302, -3385796, -3680245, -3850303, -3760673, -3427734, -3062584, -2921241, -3064565, -3241808, -3103377, -2524432, -1673790, -850504, -260882, 50892, 47101, -348847, -1069089, -1803987, -2221988, -2255124, -2082117, -1888949, -1715727, -1495245, -1116189, -566509, -45875, 273330, 394381, 364160, 230654, 33707, -242862, -705909, -1457201, -2373318, -3159773]
15295c159773m86099k35567j02722N0297K83317L97150K90208J54501J88456L60162
15285b260070N00362M69070K68274J11469J58460K65475J79318j13777l60305
15276g81724l63109j53361J05435K23676J49250L7175L2234Q4164J32549J79226
15266c54485J73042J19700J54324L67101N99169O27761M40194K03430R5649R7207
15256B523092P6793k3675k03093l87224n00977n16651m42849l29839k64202l18711
15246c87336m42294m70536l52550j39432J25975L41592M89507O37569P57822O89002
15236A249319L02885l53470j011872j379732j388900j057157m30035K54600P13833
15227c100529R62376J114384J055703P12304K55154j34195l53994l98941l59978
$$ y = [-3159773, -3645872, -3881439, -3984161, -3933864, -3650547, -3253397, -2963189, -2808688, -2620232, -2260070, -1759708, -1290638, -1022364, -910895, -752435, -486960, -307642, -421419, -781724, -1144833, -1298194, -1192759, -969083, -819833, -782658, -750424, -666260, -533711, -354485, -181443, -61743, 92581, 459682, 1058851, 1686612, 2126806, 2330236, 2425885, 2523092, 2599885, 2576210, 2373117, 1985893, 1484916, 968265, 525416, 195577, -68625, -387336, -829630, -1300166, -1652716, -1792148, -1666173, -1324581, -835074, -197505, 560317, 1249319, 1552204, 1198734, 186862, -1192870, -2581770, -3638927, -4068962, -3814362, -3100529, -2138153, -1023769, 31934, 744238, 999392, 865197, 511203, 112262, -247716]
15218b47716k92669j75806k9827Q9227J61960J64835P1134n0760j54955k43749
15208g08326k70426j47072J65376N47494P61745O86155M00550N7415k29543l80095
15198H83273l57980k26016r7273j13075l55351p01635q98921q29241n68751k13822
15188c478792J27146L03896K53837R6542k7384j51601l13425l94281l31251k15897
15178d131210r4360J29678M75375P60668Q02514N59036J75967p4551J805L25125
15168a069953O25067P19000O32910M72249K30863p7767k58304j60096Q9658K26995
15158A430622J08222k08440m37573l35322j8526K35050K56291M4796k40642m03806
15148D30672l99492l66948l81153l26009q4363L04060O29862O78273N03489L54062
$$ y = [-247716, -540385, -716191, -746018, -656791, -494831, -329996, -258862, -309622, -464577, -708326, -978752, -1125824, -960448, -412954, 348791, 1034946, 1435496, 1492911, 1263368, 883273, 525293, 299277, 202004, 88929, -266422, -968057, -1866978, -2696219, -3264970, -3478792, -3351646, -3047750, -2793913, -2697371, -2724755, -2876356, -3189781, -3584062, -3915313, -4131210, -4225570, -4095892, -3620517, -2859849, -2057335, -1498299, -1322332, -1396883, -1395078, -1069953, -444886, 274114, 907024, 1379273, 1610136, 1532369, 1274065, 1113969, 1203627, 1430622, 1538844, 1330404, 892831, 557509, 538983, 774033, 1030324, 1075120, 834478, 430672, 31180, -335768, -716921, -1042930, -1127293, -823233, -193371, 484902, 988391, 1342453]
15138A342453L54032L97051L67437L16399L26956L54104K95028P8918k74578n81811
15128B975989o66547n88666m60809k84385j41662k00434l73145l88856k00609
15119c29124j1809J10701J73022L7286k81451o00573p95273q13122o75636l91531
15109c577510m3886K15963L69931M54819M59020M04493L62492L28452K46746J72391
15099f07089J69399J62587J55012J64428J20234R7157J91850K82299J91053n0134
15089H76796k42662l11502k96557k12188j15651j07657j80425j78933m7754J34437
15079f82096K59675L02882L55737M18443M04621K78591J31183O4558J30842L35181
15069A999617N82797P01021N36901J32647k60948m20785l66211k98861l63113
$$ y = [1342453, 1696485, 2093536, 2460973, 2777372, 3104328, 3458432, 3753460, 3832378, 3557800, 2975989, 2309442, 1720776, 1259967, 975582, 833920, 633486, 260341, -128515, -329124, -340933, -230232, -57210, -19924, -301375, -901948, -1697221, -2510343, -3185979, -3577510, -3621396, -3405433, -3035502, -2580683, -2121663, -1717170, -1354678, -1026226, -779480, -607089, -437690, -275103, -120091, 44337, 164571, 261728, 453578, 735877, 926930, 876796, 634134, 322632, 26075, -186113, -301764, -409421, -589846, -768779, -816533, -682096, -422421, -119539, 236198, 654641, 1059262, 1337853, 1469036, 1533594, 1664436, 1999617, 2582414, 3283435, 3820336, 3952983, 3692035, 3271250, 2905039, 2606178, 2243065]
15060B243065m82291m17768r4527K02065J92495n6125l10893m22126l74259k70598
15050B09038k24223k23639k78534l61239l26343j88868q6426n1887m9831n7739
15040a639691j36130l10805m14631k93224k7472J72263K35007K57067K37739J40787
15030a779090L9191j883R488l4398k50472n66465p34490n07024Q6875O18834P81839
15019b337595O73738M71819K78082R6420r0564j55517j1382K44086M40684N55788
15009A65559Q52132J539784K157814J955098J087427K87072r9059k30093l63698
15000G352036n01403o22034p40306p80831p72269p98423p72241n30623n2306M96418
14990B278018Q47657R18663Q02586M39197j16182m89546n31635m78471n10659
$$ y = [2243065, 1760774, 1343006, 1248479, 1450544, 1643039, 1586914, 1276021, 853895, 479636, 209038, -15185, -238824, -517358, -878597, -1204940, -1393808, -1480234, -1532121, -1581952, -1639691, -1775821, -2086626, -2501257, -2794481, -2821953, -2649690, -2414683, -2157616, -1919877, -1779090, -1739899, -1741782, -1732294, -1766692, -2017164, -2583629, -3318119, -3825143, -3738268, -3119434, -2337595, -1663857, -1192038, -913956, -817536, -908100, -1063617, -1074999, -830913, -390229, 165559, 1017691, 2557475, 4715289, 6670387, 7757814, 8044886, 7945827, 7715734, 7352036, 6850633, 6228599, 5488293, 4707462, 3935193, 3136770, 2364529, 1833906, 1781600, 2278018, 3125675, 4044338, 4846924, 5286121, 5169939, 4680393, 4148758, 3670287, 3159628]
14981C159628n69219n63432n09519l78126j18142J89992M05654M12144J49499
14972B178479k30882m62119m25080k10756K5979J39163J18351J15645J48808K0384
14962A417972l12318n81547n23717j77700K37348N32126N63315L10385o4702l47883
14952A053279m52273m72305m93228m36364k07461J18590M13332N49030M72852
14943E45452K95472O4090j62841k06786r1311l8891j25892k15287j56068K3859
14933f8203J90696K87027K97820J68375j44012n24589p41090o56281k95685J91362
14923a294580O10418Q12035P56848M51554M6028j91956k19055k31165l31176m18561
14913i610m29123l76589k60178j03185P1783K22574K53316R6516j31267j65699
$$ y = [3159628, 2590409, 2026977, 1517458, 1139332, 1021190, 1211182, 1616836, 2028980, 2178479, 1947597, 1485478, 1060398, 849642, 875621, 1014784, 1133135, 1248780, 1397588, 1417972, 1105654, 524107, 390, -177310, 60038, 592164, 1155479, 1465864, 1401162, 1053279, 601006, 128701, -364527, -800891, -1008352, -889762, -476430, 72600, 545452, 840924, 905014, 742173, 535387, 444076, 405185, 279293, 64006, -92062, -68203, 122493, 409520, 707340, 875715, 731703, 207114, -533976, -1190257, -1485942, -1294580, -684162, 127873, 884721, 1336275, 1382303, 1190347, 971292, 740127, 408951, -9610, -438733, -815322, -1075500, -1178685, -1106902, -884328, -631012, -534496, -665763, -831462]
14903h31462N0030L11779N38206P68155Q96823P68784L84160j8632k41630l85029
14893B241184o85923j049708j130763r46119o99896m83127l01959j01141J62741
14884b994711M24133N11228L88825K51376K84851M01651M18495L21557J71541
14875A78946M8421j9158q200J54162M28811O77173P78639O84493N22884M52423
14865C898594L99537J95630j33992l73955m07140k99094j43599R391J23215K26193
14855C494780L25468L66467L33975Q7991m86057j219500j836680j983473j629897
14846b546926j238230j029617q98707p93647o66049m08933n2899K40347M19967
14837f974694N36470N05307K34630p6946j55462K006J66784J91000J42314J54452
$$ y = [-831462, -781432, -469653, 68553, 836708, 1733531, 2502315, 2886475, 2867843, 2626213, 2241184, 1555261, 505553, -625210, -1571329, -2271225, -2754352, -3056311, -3157452, -2994711, -2570578, -2059350, -1670525, -1419149, -1134298, -732647, -314152, 7405, 178946, 227367, 208209, 200009, 354171, 782982, 1460155, 2238794, 2923287, 3446171, 3898594, 4298131, 4493761, 4359769, 3985814, 3578674, 3279580, 3135981, 3145372, 3268587, 3494780, 3820248, 4186715, 4520690, 4608681, 4122624, 2903124, 1066444, -917029, -2546926, -3785156, -4814773, -5713480, -6507127, -7173176, -7582109, -7635008, -7394661, -6974694, -6438224, -5932917, -5698287, -5775233, -5930695, -5928689, -5761905, -5570905, -5428591, -5274139]
14827e274139K84142M80623N54671L41660n5135l19813k78577j55165j50225j06423
14817d678381N8751J66128J25836j4405j78399k90421l08607j85870J15414M98516
14807d691438P22932O19174L48651J90370J99412K87196L49363L50511K64086
14798a359743N0744j59426j38672J40532M80322O89874P68664P56754N62490K38411
14788B029950Q6350K33122M32303M54025L23378J07076k35078p30843j148705
14779A551578j191965r00266n32785k93768j69544o5961K0594O7537M5621m0024
14769a508983p8046J7184J66854K30264J25825p1613j20215M2624J91526K28921
14759g75659L01026M68986N72768M59776K23079M4586k4036j17310l94199p05856
$$ y = [-5274139, -4989997, -4509374, -3954703, -3613043, -3668178, -3987991, -4266568, -4421733, -4571958, -4678381, -4619630, -4453502, -4327666, -4342071, -4520470, -4810891, -5119498, -5305368, -5189954, -4691438, -3968506, -3349332, -3000681, -2810311, -2610899, -2323703, -1974340, -1623829, -1359743, -1308999, -1468425, -1607097, -1466565, -986243, -296369, 472295, 1229049, 1791539, 2029950, 2116300, 2349422, 2781725, 3235750, 3559128, 3666204, 3431126, 2700283, 1551578, 359613, -540653, -1073438, -1367206, -1536750, -1602711, -1582117, -1514580, -1468959, -1508983, -1587029, -1569845, -1402991, -1172727, -1046902, -1118515, -1238730, -1196106, -1004580, -775659, -474633, -5647, 567121, 1026897, 1249976, 1294562, 1270526, 1153216, 759017, 53161]
14749E3161q41368q22903o62457l23769J29650M73740N40286N14375N57149N43448
14739A61312L42004l1321m00632n59027m61762k16570O8742K80605L28522K58333
14729b29794K60109M00754M76820L27233M8656r8441L29J16890J378l19517o24668
14718C59749p17522o02025m62520m30736l97548k24918k758M1895k09021n98070
14708c243474q07335o37217k04616J63997L02287K77765K24229K32845K53585
14699c437934K13895J95551K54505K46700R1760p2764j09890l0931J64139M53369
14689b031600O48011O34360N14035L29565R9360l8059m9300R665J08575J62164
14679C86776P4555j70070l90290l34775l5410L09168N29587M83737K46557O9331
$$ y = [53161, -788207, -1611110, -2273567, -2597336, -2467686, -1993946, -1453660, -939285, -382136, 161312, 503316, 471995, 71363, -487664, -949426, -1165996, -1097254, -816649, -488127, -229794, 30315, 431069, 907889, 1235122, 1283778, 1185337, 1185666, 1302556, 1303934, 984417, 359749, -357773, -959798, -1422318, -1853054, -2250602, -2475520, -2478278, -2436383, -2645404, -3243474, -4050809, -4688026, -4892642, -4728645, -4426358, -4148593, -3924364, -3691519, -3437934, -3224039, -3028488, -2773983, -2527283, -2435523, -2508287, -2618177, -2649108, -2484969, -2031600, -1383589, -749229, -235194, 94371, 193731, 155672, 106372, 116037, 224612, 386776, 461331, 291261, -99029, -433804, -469214, -160046, 369541, 853278, 1099835, 1169166]
14669A169166N716m945R0069K85771M02125L59662K40180J03951l3510j53304
14659B464881k17534j76321q7501l6065O310K7847J2637O6726J23955J4523j75832
14648B023626l39857n26365p72982r49420r27133q04148p01257n29892k59201
14639c786629j4221J69715L01314L55501L64097L99008M21693L55215K94244L94516
14629g45547O11828P20418N89184L14801R0389J1675j0917p3556j51502j76959
14619A179814l3282K54251M00689K32515r4721l55551n12119o31033p14632o70994
14609i45063l83980J06668N25198O27538M68126K37314L6585m6657K9607J26487
14599G81823J31315J82053K81181K47244M0763k56564n02489n36925l33065n1087
$$ y = [1169166, 1174882, 1169937, 1260006, 1545777, 1947902, 2307564, 2547744, 2651695, 2618185, 2464881, 2247347, 2071026, 1983525, 1947460, 1953770, 1981617, 1994254, 2060980, 2184935, 2199458, 2023626, 1683769, 1157404, 384422, -564998, -1492131, -2296279, -2997536, -3527428, -3786629, -3800850, -3631135, -3329821, -2974320, -2610223, -2211215, -1789522, -1434307, -1140063, -745547, -133719, 586699, 1175883, 1490684, 1581073, 1592748, 1581831, 1508275, 1356773, 1179814, 1146532, 1400783, 1801472, 2033987, 1939266, 1583715, 1071596, 440563, -274069, -945063, -1329043, -1222375, -697177, -69639, 398487, 635801, 672386, 625729, 655336, 781823, 913138, 1095191, 1376372, 1623616, 1664379, 1407815, 905326, 368401, 35336, -15751]
14589a5751J22470J76648J76476J42872J30334J90455K27722R6867j54900k92403
14579H00790j88048N2696K81407L98893L33758J46242j1738q6666j62260k55068
14569A310006k26557q1683l1063k12570n01336o49070n76142k67189K10544N35273
14559d89787M35863O0812k68580m91340o49346o31075l28929J78342O93908J000606
14549d89526R78435P79721O42918N68098L75637L4936l20800n72225o62607o47236
14539F87351n62376m91173n51145o13867l89896J93418Q48972J238435J275883
14530A635602J099082Q81019O69608M29940J74900q8406l95215o75458p62432
14521B968640n91604k43986J61738M56146M24988P3597k85116m09665l33022j82274
$$ y = [-15751, 106719, 283367, 459843, 602715, 733049, 923504, 1151226, 1248093, 1093193, 800790, 612742, 665438, 946845, 1345738, 1679496, 1825738, 1814000, 1727334, 1565074, 1310006, 1083449, 1001766, 970703, 758133, 256797, -392273, -968415, -1235604, -1025060, -489787, -53924, 6888, -261692, -753032, -1402378, -2033453, -2362382, -2184040, -1490132, -489526, 488909, 1268630, 1911548, 2479646, 2855283, 2890219, 2569419, 1997194, 1334587, 687351, 124975, -366198, -917343, -1531210, -1921106, -1727688, -878716, 359719, 1635602, 2734684, 3615703, 4285311, 4715251, 4890151, 4801745, 4406530, 3731072, 2968640, 2377036, 2133050, 2294788, 2750934, 3175922, 3249519, 2964403, 2554738, 2221716, 2039442]
14511B039442o6886k2733r1274k62097l53447k17876J07777M33366O42517Q22482
14501C031271J025383J148952J113136Q11522K06017m46187q62515r88829q79878
14492D158872o18845m01748l33001k88597j03653K69359N93080N49155J79475
14483D004097j69166l26613m44640o44302q09855p97461o35158m55498l04627
14474e83223k42245l34732m61307m72195m11924l70180k64382m2145J85791L37019
14464b659523M12864M11982L41300L33424N07202P30412P61337N51073J84101
14455A574172j11231n9874K61472N52219O14356L44370j10612m01034l96708j94517
14445B072613L6917J36044Q3201p9539l13110m83492m57326k81516j32959l0477
$$ y = [2039442, 1972556, 1949823, 1858549, 1596452, 1243005, 1025129, 1132906, 1566272, 2208789, 3031271, 4056654, 5205606, 6318742, 7130264, 7336281, 6890094, 6027579, 5038750, 4158872, 3540027, 3138279, 2805278, 2516681, 2413028, 2682387, 3275467, 3824622, 4004097, 3834931, 3508318, 3063678, 2419376, 1609521, 812060, 176902, -278596, -583223, -825468, -1160200, -1621507, -2093702, -2505626, -2875806, -3140188, -3182333, -2996542, -2659523, -2246659, -1834677, -1493377, -1159953, -652751, 77661, 838998, 1390071, 1574172, 1462941, 1403067, 1664539, 2216758, 2831114, 3175484, 3064872, 2663838, 2267130, 2072613, 2109530, 2245574, 2328775, 2249236, 1936126, 1452634, 995308, 713792, 580833, 550356]
14435E50356J50732L34807L96672L44139K49314J95430J47193L8254q6733j31551
14425B188613m0285J59830L84295M83435L40516L4327j76005k32223l45734n21124
14415B275645n50254m32747l55888l93547m80188n10866l90847j51962P8890K48692
14405f63072L81259M84802N36254N28455M37196K62803M5143j73836m05585n75712
14395H57707m68537j12806J72857J91326m929k47814l35858k20324r0776p3796
14385c32950j27353j57078j44862k34772n12276q59872j042741q72427m08499
14376d692830Q2584L91253M97739N40720O04110N97933M21885J12465j79937l36185
14366a960263l59778l41583k81290j18128J43516M02798M99233M40598M10049
$$ y = [550356, 701088, 1035895, 1432567, 1776706, 2026020, 2221450, 2368643, 2406897, 2320164, 2188613, 2148328, 2308158, 2692453, 3175888, 3516404, 3550731, 3374726, 3142503, 2796769, 2275645, 1725391, 1292644, 936756, 543209, 63021, -447845, -838692, -990654, -911764, -663072, -281813, 202989, 739243, 1267698, 1704894, 1967697, 2012840, 1839004, 1433419, 857707, 389170, 276364, 449221, 640547, 635618, 387804, 51946, -168378, -259154, -332950, -460303, -617381, -762243, -997015, -1509291, -2369163, -3411904, -4284331, -4692830, -4610246, -4218993, -3721254, -3180534, -2576424, -1978491, -1556606, -1444141, -1624078, -1960263, -2320041, -2661624, -2942914, -3061042, -2917526, -2514728, -2015495, -1574897, -1164848]
14357a164848M69494M66936L24961J87140J61327K39001L87850N58689O14018
14348B244568M11779J00906J7136K46253M94575M96450K55158j15524m50190o31032
14338C070079o30682m64946k41671p4400R5435L13506L95141J98354j48339m62720
14328B049757o98660r01365j035650r73431p13161m15442j95798j5334K13105
14319b685979M30223N25512N44385N70666N24438L56305J83672L8885j61336l55803
14309b9032m00862l87968m80651o24643o43305m49138j08861J76429K39911J83400
14299b524720J82322J68679O0828J5775J37787L00157L90358L53454J77039m7111
14289g85432j69367j02242R9008L21464M66818M61626L11908Q9682r2270j48797
$$ y = [-1164848, -695354, -228418, 96543, 283683, 445010, 684011, 1071861, 1630550, 2244568, 2656347, 2757253, 2774389, 3020642, 3515217, 4011667, 4266825, 4151301, 3701111, 3070079, 2439397, 1974451, 1732780, 1658380, 1753815, 2067321, 2462462, 2660816, 2512477, 2049757, 1351097, 449732, -585918, -1559349, -2272510, -2687952, -2883750, -2899084, -2685979, -2255756, -1730244, -1185859, -615193, -90755, 265550, 449222, 488107, 326771, -29032, -429894, -817862, -1298513, -1923156, -2566461, -3015599, -3124460, -2948031, -2708120, -2524720, -2342398, -2173719, -2112891, -2097116, -1959329, -1659172, -1268814, -915360, -738321, -785432, -954799, -1057041, -958033, -636569, -169751, 291875, 603783, 693465, 601195, 452398]
14279D52398p3048Q1242J73321R3156j45905l61478l82306k34052l3012J43014
14269b86670K81734M15198M88464M00520J49183j38553k93674k36602R793K83610
14259A073003M41943N05215M48615K03063j89884n68083p62431p44699o45420
14250b38678n38918l66651j23085Q2877J51234J28066J30357J97695L49721N58305
14240C30923O24696M72209L01860K33011K21024K12214J78882O6402j13457k10498
14230B317266j83211k15969m20412o20930o59463n47040l48592j12955J65250
14221f26056M49465O64340P26082O15167M41397K80459J13825p0003k05554k17699
14211B171423j35571q3699j18350j90061k79859l78245m16748l58719k31177r7356
$$ y = [452398, 379350, 460592, 633913, 727069, 581164, 219686, -162620, -396672, -429684, -286670, -4936, 410262, 898726, 1299246, 1448429, 1309876, 1016202, 779600, 789393, 1073003, 1514946, 2020161, 2468776, 2671839, 2481955, 1913872, 1151441, 406742, -238678, -777596, -1144247, -1267332, -1184455, -1033221, -905155, -774798, -577103, -227382, 330923, 955619, 1427828, 1729688, 1962699, 2183723, 2395937, 2574819, 2641221, 2527764, 2317266, 2134055, 1918086, 1497674, 876744, 217281, -329759, -678351, -791306, -626056, -176591, 487749, 1213831, 1828998, 2270395, 2550854, 2664679, 2594676, 2389122, 2171423, 2035852, 1952153, 1833803, 1643742, 1363883, 985638, 568890, 210171, -21006, -118362]
14201a18362K3187J29327J88245J79457P8881q3965k55215m44985n96617n66258
14191a466305l32424o1044Q7224Q2039q851p4884l5144R6093J92711J32167M856
14180a383562J5772K16646M69641O41149O46897M57726K10341L8527r4024k30518
14170I88595l73685n58446p24830o68756l18123O7264K12107K17068K43868K43603
14160f71335J69738R9233R1010J18305J16967N6196J545L637K9342K7553N0822
14149I3013J15233J22416J959k40036n14597p55538q81302q02724n71465k54425
14139c687466J71715O42852Q48179N70444P8045k16531k36066j82704k02588k54529
14129b468649k52505j78760p6849L6662K48094N49181P70108P91548O02555L43723
$$ y = [-118362, -95175, 34152, 222397, 401854, 480735, 396770, 141555, -303430, -900047, -1466305, -1798729, -1859773, -1772549, -1690510, -1699361, -1774245, -1809389, -1713296, -1520585, -1388418, -1383562, -1367790, -1151144, -681503, -40354, 606543, 1064269, 1274610, 1313137, 1219113, 988595, 614910, 56464, -668366, -1337122, -1655245, -1587981, -1375874, -1158806, -914938, -671335, -501597, -402364, -311354, -193049, -76082, -19886, -18341, -14704, 14638, 42191, 93013, 208246, 330662, 332621, 92585, -422012, -1177550, -2058852, -2861576, -3433041, -3687466, -3515751, -2872899, -2024720, -1454276, -1376231, -1592762, -1828828, -2011532, -2214120, -2468649, -2721154, -2899914, -2976763, -2940101, -2692007, -2142826, -1372718, -581170, 21385, 365108]
14119C65108K34078L29431N26493P27627P52239M78682N0976l50688o54789q86403
14109A572754j090372j109288q15491l91649k6271K46425L67190K88802P0723
14100h87177j50965l17548m68500n78637o05339n23937k62395J82456O68202J021147
14090a922693J130420J045773Q56757N92620K91198j8775l53107p03645r55573
14081c7025j032759r81395q31822n75312k59208L329J45819K81324M95488O48099
14071b143462O06162M77790L75162L28688L87378N09377N70361N57914N76393
14062B245763N83085M48091J33150k68575n55286o32173n55783m12751k97854
14053F87667j60677J20066M48976N53117L91654K36847K17796J91830L7828j91280
$$ y = [365108, 599186, 928617, 1455110, 2182737, 2934976, 3413658, 3464634, 3113946, 2459157, 1572754, 482382, -626906, -1442397, -1834046, -1860317, -1613892, -1246702, -957900, -887177, -1038142, -1355690, -1824190, -2402827, -3008166, -3532103, -3794498, -3612042, -2943840, -1922693, -792273, 253500, 1110257, 1702877, 1994075, 1975300, 1622193, 918548, -37025, -1069784, -2051179, -2883001, -3458313, -3717521, -3714192, -3568373, -3287049, -2791561, -2143462, -1537300, -1059510, -684348, -355660, 31718, 541095, 1111456, 1669370, 2245763, 2828848, 3276939, 3410089, 3141514, 2586228, 1954055, 1398272, 985521, 687667, 526990, 647056, 1096032, 1649149, 2040803, 2277650, 2495446, 2687276, 2725104, 2533824]
14043B533824l55040m62134o46627q48969q60802n91181k07358n214r5680l21987
14033a861168m12750k35507P7208L68709N68605N53848K92442O4179J24417L54208
14023a05809N15492N32857M14008J56719j66436m41189o40010p89335q53104p34755
14013b111562m89891l15127k87134l09771j94818J48259N51726P65801O51846
14004a590671K96580n7690k40921j91289J04064N04022P51233P54438O69350O43006
13994A642122O03109M70033K52585m5260l48518m72889l43504j38360n5118j50268
13984A413932l11588l72067l39432l04688l14345l68651m37731m76764n01277
13975b012611n29303m25287p5745L91605P89437J081586J196081R92567N54120
$$ y = [2533824, 2178784, 1716650, 1070023, 221054, -639748, -1230929, -1438287, -1443501, -1539181, -1861168, -2273918, -2509425, -2432217, -2063508, -1494903, -941055, -648613, -584434, -460017, -105809, 409683, 942540, 1356548, 1513267, 1346831, 905642, 265632, -523703, -1376807, -2111562, -2601453, -2916580, -3203714, -3513485, -3708303, -3560044, -3008318, -2242517, -1590671, -1294091, -1351781, -1592702, -1783991, -1679927, -1175905, -424672, 329766, 999116, 1642122, 2245231, 2715264, 2967849, 2922589, 2574071, 2101182, 1757678, 1619318, 1564200, 1413932, 1102344, 730277, 390845, 86157, -228188, -596839, -1034570, -1511334, -2012611, -2541914, -2967201, -3042946, -2651341, -1861904, -780318, 415763, 1408330, 1962450]
13966A962450J15228j74759k07697k0880J18674L4059j44216k41510k95447l88693
13956G57209m27945k41575J05748L63714M33981L65993J77886j22383m42365n88452
13946C81811n15562l68803k50111j92579j94603k87100m86117p00276q10624p61799
13936d185763o16146m56592k46780M0948L49883N50234N37610L85728K02556O3906
13926c374416N33l7056n7995m4627n1851j71908l46057m39938m51463l98805k78366
13915e651949k13072l14304m64527m00927l2949L90610O13189N93004L78598O5189
13905e037138j84027k00579P4474M63631P03662O88884M86259K34563Q9789P0117
13895b610365J02207J89529L07376M02939N08133P00927R00958Q95150O93497
$$ y = [1962450, 2077678, 1902919, 1695222, 1674342, 1793016, 1827075, 1682859, 1441349, 1145902, 757209, 329264, 87689, 193437, 557151, 991132, 1357125, 1535011, 1412628, 970263, 381811, -133751, -502554, -752665, -945244, -1139847, -1426947, -1913064, -2613340, -3423964, -4185763, -4801909, -5258501, -5505281, -5464333, -5114450, -4564216, -4026606, -3640878, -3438322, -3374416, -3373883, -3410939, -3468934, -3513561, -3565412, -3737320, -4083377, -4523315, -4974778, -5373583, -5651949, -5865021, -6179325, -6643852, -7044779, -7077728, -6687118, -6073929, -5480925, -5102327, -5037138, -5221165, -5421744, -5347270, -4883639, -4179977, -3491093, -3004834, -2770271, -2680482, -2610365, -2508158, -2318629, -2011253, -1608314, -1100181, -399254, 501704, 1396854, 2090351]
13886B090351N41630N64528O40866N90518M46784L51450L02338J83731k2828k18961
13876E470407l79439m94371m58514k56806p2351j03969l48604n79360o09355n18603
13866A649035m89532n70524o32700n31730k75667J4782K52052M10592M59891M14755
13856G00954L72609L44970K84341K08352J42186J00479J32612K38598L11572K83234
13846C119907J14203k08561m93038m92233k41412M7140J63142O2429p9398q7393
13836A904786K3184J00261K8477j81328m13026n22700m89749m42485m28049l61910
13826g82539j69890J04778L41452M70708N31053N76614M86502J36688l40842o37080
13816G17444n68619k15279J58502L14915K03456n1310k60062k97615j65261M2438
$$ y = [2090351, 2631981, 3196509, 3837375, 4427893, 4874677, 5226127, 5528465, 5712196, 5689368, 5470407, 5090968, 4596597, 4138083, 3881277, 3808926, 3704957, 3356353, 2776993, 2167638, 1649035, 1159503, 588979, -43721, -575451, -851118, -836336, -584284, -173692, 286199, 700954, 1073563, 1418533, 1702874, 1911226, 2053412, 2153891, 2286503, 2525101, 2836673, 3119907, 3234110, 3025549, 2532511, 2040278, 1798866, 1846006, 2009148, 2071577, 1992179, 1904786, 1927970, 2028231, 2056708, 1875380, 1462354, 939654, 449905, 7420, -420629, -782539, -952429, -847651, -506199, -35491, 495562, 1072176, 1558678, 1695366, 1354524, 717444, 148825, -66454, 92048, 406963, 610419, 559109, 299047, 1432, -163829, -121391]
13806a21391K58488L80499L15775J64903P8801N4279p4n8606o03J87000M21103
13795A680174O40554P68532O66017K64619l24734q00075r99068j070322j024243
13786a98546o77346j08366L66601M74082J89659j96476l44673j69752J81234N18083
13776C4500P04966P60779P75036O62202L64742J22259R2200J14865P833k16054
13766C423328m17959n02614n06815m96286m83249m40424k77181l3813O3798p4266
13756B54519l74418o98507q02124n61709j57822J69693L32304L52635L37082M64952
13746f83395P95808J102985J089304O43063l6719n86056p83516o04057k17646
13737G19771O9860Q5077j22313l65070m94262n08299m31730k35460N5716L94182
$$ y = [-121391, 137097, 517596, 833371, 998274, 1077075, 1131354, 1131280, 1072674, 1072071, 1259071, 1680174, 2320728, 3089260, 3755277, 4019896, 3695162, 2895087, 1896019, 825697, -198546, -875892, -984258, -617657, -143575, 46084, -150392, -495065, -664817, -483583, 34500, 739466, 1500245, 2275281, 2937483, 3302225, 3424484, 3516684, 3631549, 3639382, 3423328, 3005369, 2502755, 1995940, 1499654, 1016405, 575981, 298800, 264987, 328785, 254519, -119899, -818406, -1620530, -2182239, -2340061, -2170368, -1838064, -1485429, -1148347, -683395, 112413, 1215398, 2304702, 2947765, 2911046, 2324990, 1541474, 937417, 719771, 789631, 874708, 752395, 387325, -106937, -615236, -1046966, -1282426, -1226710, -832528]
13727h32528P87495J147438J283730J137935Q27004M65339J24151k06832n86286
13718D147446r47482j115846j116042j127120j209514j258849j121613q03382
13710d552402m42513j18826J87306M32023M60183K73208J02683M3395L7251J13648
13700c464044K87653N02450O80185P10432N64252L15027Q796k82534l75045k14927
13690a267755l886P5019j4090j30652j24342n6236j0158o3194k91172m75546m44420
13679b806432l61654l78601m27930l00064P1367M59654N92664M41826J70140l6623
13669b575653j01684j01444j02545j4781K42669O16372R43026J016472P69594
13660F92026M16558K06078Q6972q8175k41360l67088n10335n23054l25959n29
$$ y = [-832528, -45033, 1102405, 2386135, 3524070, 4351074, 4816413, 4940564, 4733732, 4147446, 3199964, 2084118, 968076, -159044, -1368558, -2627407, -3749020, -4552402, -4994915, -5113741, -4926435, -4494412, -4034229, -3761021, -3658338, -3614943, -3577692, -3464044, -3176391, -2673941, -1993756, -1283324, -719072, -404045, -395249, -677783, -1052828, -1267755, -1271641, -1196622, -1210712, -1341364, -1465706, -1521942, -1532100, -1595294, -1886466, -2362012, -2806432, -3168086, -3546687, -3974617, -4274681, -4203314, -3743660, -3150996, -2709170, -2539030, -2575653, -2677337, -2778781, -2881326, -2896107, -2653438, -2037066, -1094040, -77568, 692026, 1108584, 1314662, 1401634, 1313459, 1072099, 705011, 194676, -328378, -654337, -654866]
13650f54866K95860L70436K21156N1176K749P3330K08247M23066O30764O24285
13640B246203L35450o3204l39476n37696p81008r04579p21147l15732J03646L78008
13630e99535M95854M93666L84009K45621J23932M7261O2646J47213J83965R5443
13620A680075N9533K56969N36879O23936L93280l975k86439l87395m57478n98022
13610A817363o90606n91193m18204l64976l72142k79769j30114j21432l10014
13601a461087m56412l85227j89036L1823K57655M98779P19259P72839O02200K87919
13591F78712q4452m27544o72507o98681m47667n0065L39271P21800J027819J042174
13581A428860P30219K73973o0516j23265m8729j05423l04748m34972m29927m23309
$$ y = [-654866, -359006, 11430, 232586, 283762, 286511, 359841, 568088, 991154, 1621918, 2246203, 2581653, 2518449, 2178973, 1641277, 860269, -44310, -765457, -1081189, -977543, -599535, -103681, 389985, 773994, 1019615, 1143547, 1190808, 1253454, 1400667, 1584632, 1680075, 1739608, 1996577, 2533456, 3157392, 3550672, 3546697, 3260258, 2872863, 2415385, 1817363, 1126757, 535564, 117360, -247616, -619758, -899527, -1029641, -1151073, -1461087, -1917499, -2302726, -2491762, -2459939, -2202284, -1703505, -984246, -211407, 390793, 678712, 594260, 166716, -505791, -1204472, -1652139, -1702204, -1362933, -641133, 386686, 1428860, 2159079, 2433052, 2372536, 2249271, 2200542, 2095119, 1790371, 1355399, 925472, 502163]
13571E02163m73535n02266m09388k07463O011K18187L74708L44568J45985N315
13561D285P4833L02773O39167J000462J151929R16433L68702k42165o54470p78936
13551B783013p17459o00788n08928m19535l15661j88343j0667J66400K31490J64244
13541E83766O1548M8613K81801P04267J000476R84061O93194K78497j26893m17059
13531D092271n30965m88367l45055k47577l16368m31159m43340l96324l45197
13522E47919k33462l6371J56385K72271K54126J24308O608m8745j23822l07256
13512F11961n74493p51695o61389l18192Q4059L28184L88123L24176P9533k49677
13502g39410m33669m16705k92266j47509j4135J27266K24930K20841K25270L39907
$$ y = [502163, 28628, -473638, -883026, -1090489, -1084478, -866291, -491583, -147015, -1030, 4285, 79118, 381891, 1021058, 2021520, 3173449, 4089882, 4458584, 4216419, 3561949, 2783013, 2065554, 1464766, 955838, 536303, 220642, 32299, 21632, 188032, 419522, 583766, 645314, 693927, 975728, 1679995, 2680471, 3664532, 4357726, 4636223, 4509330, 4092271, 3561306, 3072939, 2727884, 2480307, 2163939, 1732780, 1289440, 893116, 547919, 314457, 278086, 434471, 706742, 960868, 1085176, 1091784, 1043039, 919217, 611961, 37468, -714227, -1375616, -1693808, -1609749, -1281565, -893442, -569266, -489733, -739410, -1173079, -1589784, -1882050, -2029559, -2043694, -1916428, -1691498, -1470657, -1245387, -905480]
13492i05480N02809N71173M99864L78551K88300K54955K54813J78011M3300N756
13482B072052J06724K94710M41705L99393J97309m5688k45530k97366j25894J62566
13472B959981L33297L14020J19129k11605m73141m76550k86950j19133r8903j73955
13462A886190k69266l18962k46893j38755j48161k61032l74046m72793n94042
13453i37760o75964o43636m72198j72364J05926L06316N37773P36952P82255P06023
13443B73323N23004K21187j37107m34733o15920p67624r10783r50040q59544o50474
13433d308711k93443J77508O29842Q58446P43887M20336J24444K1332J07291K30723
13423a288345K74196J86940k9791k30340k47583j14673J3015N102j15547k04637
$$ y = [-905480, -402671, 168502, 668366, 1046917, 1335217, 1590172, 1844985, 2022996, 2066296, 2072052, 2178776, 2473486, 2915191, 3314584, 3511893, 3466205, 3220675, 2923309, 2797415, 2959981, 3293278, 3607298, 3726427, 3514822, 3041681, 2565131, 2278181, 2159048, 2060145, 1886190, 1616924, 1297962, 1051069, 912314, 764153, 503121, 129075, -343718, -937760, -1613724, -2257360, -2729558, -2901922, -2795996, -2489680, -1951907, -1214955, -432700, 273323, 796327, 1017514, 880407, 445674, -170246, -937870, -1848653, -2798693, -3658237, -4308711, -4602154, -4424646, -3794804, -2936358, -2192471, -1772135, -1647691, -1626359, -1519068, -1288345, -1014149, -827209, -857000, -1087340, -1334923, -1449596, -1436581, -1431479, -1547026, -1751663]
13413a751663r3445K85718P13129Q51687N99787J49320k27271l80963l68148k94191
13403e16040j54421P0931L67036O97461R63854J091125R63241M93147o0774l42730
13393C572830k65714l4828O5458p4362l47218n91881p45924p79175o23082k67676
13383i1572J56181M81870O29555N59329L28834R1570l6715o848O8109k9954j99826
13372A950533j53783O5876K62141L56351L58469L12719K60182J91933N3102j68529
13362C488994m04239n47835n04604l04816j19925o5246j09886j29493l6877Q0304
13352A346377P4174q6660k65242k49674l5320J17785K7295k08978l56264l58217
13342E276l05470k29132j21749K2894J68837K52428K93800L36749L05564J94349
$$ y = [-1751663, -1845108, -1559390, -846261, 5426, 605213, 754533, 527262, 146299, -221849, -516040, -670461, -599530, -232494, 464967, 1428821, 2519946, 3483187, 3976334, 3915560, 3572830, 3307116, 3272288, 3337746, 3263384, 2916166, 2324285, 1578361, 799186, 176104, -91572, 64609, 546479, 1176034, 1735363, 2064197, 2155767, 2119052, 2112204, 2180313, 2150359, 1950533, 1796750, 1862626, 2124767, 2481118, 2839587, 3152306, 3412488, 3604421, 3657523, 3488994, 3084755, 2536920, 2032316, 1727500, 1607575, 1542329, 1432443, 1302950, 1266073, 1346377, 1420551, 1333891, 1068649, 818975, 783655, 901440, 928735, 719757, 363493, 5276, -300194, -529326, -651075, -628181, -459344, -206916, 86884, 423633, 729197, 923546]
13332I23546J47387L10655O73790J004381J066942Q64637N66469L54738L43124
13323F255669M78513O40037P79235Q62366R31360J076371J243619J242151R92681
13314A4502002P57582P26241O91215M95677J51555l23736p39108q66878p66226
13305A4628324n93046l29836P4923N50685R59774J211828J346180J469880J620042
13296B0938754J717706J712453J756110J992714K395044K863744L341000L873279
13288D0590804M622251N705848P072909Q767130J0950162J3832518J7836013K3391515
13280A32769150L0671156L9788332N0918754O3275150P2716852O9480749M3076073
13273E02696216j836538m2143842o1235238o2230752n5131097m6465108l8580349
$$ y = [923546, 1070933, 1381588, 2055378, 3059759, 4126701, 4991338, 5557807, 5912545, 6255669, 6734182, 7374219, 8153454, 9015820, 9947180, 11023551, 12267170, 13509321, 14502002, 15259584, 15985825, 16677040, 17172717, 17324272, 17000536, 16261428, 15394550, 14628324, 14035278, 13705442, 13780365, 14331050, 15290824, 16502652, 17848832, 19318712, 20938754, 22656460, 24368913, 26125023, 28117737, 30512781, 33376525, 36717525, 40590804, 45213055, 50918903, 57991812, 66758942, 77709104, 91541622, 109377635, 132769150, 163440306, 203228638, 254147392, 317422542, 390139394, 459620143, 502696216, 500859678, 458715836, 397480598, 335249846, 280118749, 233653641, 195073292]
13266A95073292l1838547k6159955k1509269j7778150j4709272j2027994r706626
13259F1343479p876441o534557n471199m604097l958760l456186k990518k541769
13251B3909952k100171j647653j264561j035990r29565p75790m42993m3734J88718
13242A5858213J31562q2605k15508j93793j40666j17709r8235p0332K3404J79374
13232A5273705K72383K44323J8019m00041p88373r41981r09299q25966p43785
13223A1198985p06496p16500p15834o64251n41750l70119j71384j315L0619o6036
13213G275919k44537m33431n19436n38945o07754p08552p40359o89200n50996
13204B242709l26683j15255J0980J44363K95865K85815R504m08630o52238n23014
$$ y = [195073292, 163234745, 137074790, 115565521, 97787371, 83078099, 71050105, 61343479, 53467038, 46932481, 41461282, 36857185, 32898425, 29442239, 26451721, 23909952, 21809781, 20162128, 18897567, 17861577, 16932012, 16156222, 15713229, 15669495, 15858213, 15989775, 15907170, 15691662, 15497869, 15357203, 15239494, 15141259, 15070927, 15094331, 15273705, 15546088, 15790411, 15808430, 15408389, 14620016, 13678035, 12768736, 11942770, 11198985, 10492489, 9775989, 9060155, 8395904, 7854154, 7484035, 7312651, 7311336, 7341955, 7275919, 7031382, 6597951, 6078515, 5539570, 4931816, 4223264, 3482905, 2793705, 2242709, 1916026, 1800771, 1811751, 1956114, 2251979, 2537794, 2547298, 2138668, 1486430, 963416]
13194I63416j98512n9456k35982m04017k76568k4097O4573L6321J15292K99512
13184B80482M06707L64245K46638J74092K21196K86701K08844p9092l94569m51554
13174A263690k22926N1357J18800n710j08889n1927J35821L43137M58134M55850
13164B437337L41817J59216k041q4843q3097r9044k39658m64902o60586p00029
13154F04170m83435j02930J65728J69517j7967k27953l04221k44457j70556j73817
13144g85921k08584k52307l51109m23380l24283n8374K07724L51869L67469L53758
13134a123138L15417J52936n3622j27222K8387L44045O00102O08232L55473k1289
13124A079321k95508l15077j58567l0312m475J922n6624k47392l84563k65329
$$ y = [963416, 764904, 705448, 469466, 65449, -211119, -235216, -170643, -134322, -19030, 280482, 687189, 1051434, 1298072, 1472164, 1693360, 1980061, 2188905, 2109813, 1715244, 1263690, 1040764, 1092121, 1210921, 1205211, 1096322, 1044395, 1180216, 1523353, 1981487, 2437337, 2779154, 2938370, 2936329, 2851486, 2768389, 2669345, 2429687, 1964785, 1304199, 604170, 120735, 17805, 183533, 353050, 335083, 107130, -197091, -441548, -612104, -785921, -994505, -1246812, -1597921, -2021301, -2345584, -2403958, -2196234, -1844365, -1476896, -1123138, -807721, -654785, -708407, -835629, -807242, -463197, 136905, 745137, 1100610, 1079321, 783813, 468736, 310169, 279857, 275382, 277304, 220680, -26712, -411275, -676604]
13114f76604K0659K28719K62766J97133Q7914k5105q8179r6936n2989Q8511K76173
13103B22062L11268J00167k48957n34834o32628n86494m45587k34544K0075L19615
13093a709857O37524Q46612O98949K10359k26728l73971l36723l24388l32310
13084i10533k36453j12155r8287j44707n9963K33897N28954O25765N54000L79067
13074G59585J48216J3056P7952K19683L43592N10912O78285O69799M51513J67349
13064D039942q0966l91388p52998r40418q70689o43105l55002l9093K32283L03503
13054E02069J23820p2717n9939J32878M08294O44678P54969Q25416Q51053P64365
13044D874886O03207M12824J75273j60093n11120p40071q21482p99231p20435
$$ y = [-676604, -655945, -427226, -164460, 32673, 120587, 95482, 7303, -89633, -142622, -54111, 222062, 533330, 633497, 384540, -150294, -782922, -1369416, -1815003, -2049547, -2029472, -1709857, -1072333, -225721, 473228, 683587, 456859, 82888, -253835, -578223, -910533, -1146986, -1259141, -1357428, -1502135, -1562098, -1328201, -799247, -173482, 380518, 759585, 907801, 920857, 998809, 1218492, 1562084, 2072996, 2751281, 3421080, 3872593, 4039942, 3958976, 3567588, 2814590, 1874172, 1003483, 360378, 5376, -33717, 198566, 502069, 625889, 553172, 493233, 626111, 1034405, 1679083, 2434052, 3259468, 4110521, 4874886, 5478093, 5890917, 6066190, 5906097, 5394977, 4654906, 3833424, 3034193, 2313758]
13035B313758o27385n23220l90617k63082k16219k59969l23137l54261l03230
13026i47362j53669j3145Q2395J85332K13168J06596k4431q3540j00527j22416
13016h57599j46163j28208l7321O0292P7620J5619j39207k74639j04657L81573
13006a152690P57044O71002L09415M2180K9370K31881M93261O89461P40384N67470
12996C378778J78874l30912p97580r70740p82406m64403j52091K08665M65224
12987G33409L62215J7239k22722j80909O1837K98433L94691L27610J06158k09216
12977A688745m80604o30061o36583n23777l86766k51151q6331J02483K91446M79128
12967d33471O18403O73856O56953O30483N59694K76389k32715p28668r69338q86022
$$ y = [2313758, 1686373, 1163153, 772536, 509454, 293235, 33266, -289871, -644132, -947362, -1101031, -1114176, -1031781, -846449, -633281, -526685, -551116, -634656, -735183, -857599, -1003762, -1131970, -1169291, -1108999, -1031379, -1015760, -1154967, -1429606, -1534263, -1152690, -395646, 275356, 584771, 626951, 656321, 888202, 1381463, 2070924, 2811308, 3378778, 3557652, 3226740, 2429160, 1458420, 676014, 211611, 59520, 268185, 733409, 1095624, 1112863, 890141, 709232, 771069, 1069502, 1464193, 1791803, 1897961, 1688745, 1208141, 578080, -58503, -582280, -969046, -1220197, -1306528, -1204045, -912599, -433471, 184932, 858788, 1515741, 2146224, 2705918, 2982307, 2749592, 2020924, 1051586, 165564]
12957A65564n66339k36822l5381Q6415J59132J85785K03368K23881K21695K10636
12947F17934K35826L57406N55868O96820O78845M98942K55307R6675Q488j25763
12937C876348k53437k44835j88600k40789l66679m65592m95672m39906l70800
12928H10038l38301k88457j49805J02801L75629M79608L50933J53963M2098o751
12918A531756q2851k54950n39636p58917p16365n13120l32339k13298j80598k17551
12908b277869k12275j53082j16022r8376n2709R4281L15942M81750N47100N83316
12898h87944N38879K13743k95693n95773m80748r6336K99191N81134P23603P24680
12888G24736O78055O66709O07067L85440J10800m0234k0508J16432K36417J97275
$$ y = [165564, -400775, -637597, -672978, -586563, -427431, -241646, -38278, 185603, 407298, 617934, 853760, 1211166, 1767034, 2463854, 3142699, 3641641, 3896948, 3993623, 4002111, 3876348, 3622911, 3378076, 3189476, 2948687, 2582008, 2116416, 1620744, 1180838, 810038, 471737, 183280, 33475, 136276, 511905, 991513, 1342446, 1496409, 1538507, 1531756, 1448905, 1193955, 654319, -104598, -820963, -1334083, -1666422, -1879720, -2060318, -2277869, -2490144, -2643226, -2759248, -2857624, -2910333, -2816052, -2500110, -2018360, -1471260, -887944, -349065, -135322, -431015, -1026788, -1507536, -1603872, -1304681, -723547, 56, 724736, 1402791, 2069500, 2676567, 3062007, 3172807, 3132573, 3112065, 3228497, 3464914, 3662189]
12878C662189m6743m08932p48405q85948p38849m18806r3519J38482K17601J25799
12868H02869K1002L7559P4693Q2311J65852L72414N28196M18449O5151l35882
12858B232614o17266p69368q08378o76276l84554n164L76133O03054N31004K11001
12848F92800j06720k37545k29698j85705p1140P4122J40546J29248P1839m1936
12838B35811j62486j78510o2552P0678N7719j39385l86897m24747j89201P2525
12828a107045J62376R7411j5647p1765j3902J61424L34896L41604K29609J87534
12818C06495K36515K26665J37009N5949n495l2377j7613M034P0306K42401M16043
12807A639932M31536K69236M1419j88033m54783p82416j126909j299369j110159
$$ y = [3662189, 3615446, 3206514, 2458109, 1572161, 833312, 414506, 320987, 459469, 677070, 802869, 823871, 861430, 936123, 1018434, 1184286, 1556700, 2084896, 2503345, 2568496, 2232614, 1615348, 845980, 37602, -638674, -1023228, -1028392, -652259, -49205, 481799, 692800, 586080, 348535, 118837, -66868, -138008, -63886, 76660, 205908, 277747, 235811, 73325, -105185, -167737, -97059, -39340, -178725, -565622, -990369, -1179570, -1107045, -944669, -847258, -862905, -934670, -948572, -787148, -452252, -110648, 118961, 306495, 543010, 769675, 906684, 962633, 957138, 924761, 907148, 911182, 981488, 1223889, 1639932, 2071468, 2340704, 2382123, 2194090, 1739307, 956891, -170018, -1469387, -2579546]
12798b579546o77520k93586p9784P7102K71114M47520N02070M03213K81178K40422
12788a407817J63647k7184j26059J0534K46797M36636N40814N57169N10361M43968
12778A348866L85224L18801K20607N8871j79255l21505k42943q8350o2984k51532
12768A185800m80306n04496l07855n9082J04077J98842L56873O18918Q34085Q24353
12758B771209N04250P46m48650o88261o78714m73242j63084P0552Q7868q5513
12748H97161m09327q17589j083330j017032p68281o20119o27624o07301m19430
12739e472872j26273R6776J79113K33421L52908M86502N83878O98957Q35227Q48489
12729a283874N97793J90147j02817j17799N5404K01707K58140L48967M81864N11062
$$ y = [-2579546, -3257066, -3550652, -3630436, -3553334, -3282220, -2834700, -2332630, -1929417, -1648239, -1407817, -1244170, -1271354, -1397413, -1386879, -1140082, -703446, -162632, 394537, 904898, 1348866, 1734090, 2052891, 2273498, 2332369, 2153114, 1831609, 1588666, 1500316, 1437332, 1185800, 705494, 200998, -106857, -165939, -61862, 136980, 493853, 1112771, 1946856, 2771209, 3275459, 3276205, 2827555, 2139294, 1460580, 987338, 824254, 894806, 982674, 897161, 487834, -329755, -1413085, -2430117, -3198398, -3818517, -4446141, -5053442, -5472872, -5599145, -5502369, -5323256, -5089835, -4736927, -4250425, -3666547, -2967590, -2132363, -1283874, -686081, -495934, -598751, -716550, -661146, -459439, -201299, 147668, 629532, 1140594]
12719A140594M22378L24176K50381J39543m077r4612j21131k05963l89904n18994
12709I42391m85142k89503m2745J34062L02597M66651N12459M30880K50077n368
12699B216359k64216m73146n74300m40442q6909K68741M34273M32083L80438L32181
12689B225062L39196L59474L01360J27967j01434k66091k92213k01093r8043p0010
12679B324175j30598k11658k44628k19393k30556k85295k24806m8219L9306j00829
12669F67499m04702o50169p42686q02698q55731q38795p12898n26874l07033N72
12659e173515L64635O62002P96307P83477O00714K79699P6717J40767L11525L77170
12649g80502L74705M15434M29082L70695K41400j5963m02867p41462q62416p43998
$$ y = [1140594, 1562972, 1887148, 2137529, 2277072, 2272995, 2178383, 2057252, 1851289, 1461385, 942391, 457249, 167746, 125001, 259063, 561660, 1028311, 1540770, 1971650, 2221727, 2216359, 1952143, 1478997, 904697, 464255, 377346, 646087, 1080360, 1512443, 1892881, 2225062, 2564258, 2923732, 3225092, 3353059, 3251625, 2985534, 2693321, 2492228, 2394185, 2324175, 2193577, 1981919, 1737291, 1517898, 1287342, 1002047, 777241, 729022, 768328, 667499, 262797, -387372, -1130058, -1932756, -2788487, -3627282, -4340180, -4867054, -5174087, -5173515, -4808880, -4146878, -3350571, -2567094, -1966380, -1686681, -1609964, -1469197, -1157672, -780502, -405797, 9637, 438719, 809414, 1050814, 1034851, 631984, -109478, -971894, -1715892]
12639a715892m51879j51694l1150j61249m59200p09571o58900l19287O7022L65095
12629d226705N06686L77089O3797k32354m46058n29503m33745j92436P6344K99760
12619d737125N63922Q91442J085547J000034O98839L84099J86345J11758J72402
12610C57263L25892M62738M47494J71240k96139o20339n21599j36132J85581K99515
12600F75514K68810K20507K61140M08627N76353O50704N78435L20083j00014n50640
12590C309519q71227r31233p65053n84404n92081o94889o51039m96909l34225
12581b611541j13023J44820L60548N16480N67602M82960L16977J64423R0580P5473
12571d701N5231J2960K6136J05241J58069J10196K4957O4086K50627M23350L85559
$$ y = [-1715892, -2167771, -2319465, -2350615, -2511864, -2971064, -3680635, -4339535, -4658822, -4591800, -4226705, -3720019, -3342930, -3279133, -3511487, -3957545, -4487048, -4920793, -5113229, -5036885, -4737125, -4173203, -3281761, -2196214, -1196180, -497341, -113242, 73103, 184861, 357263, 683155, 1145893, 1593387, 1764627, 1468488, 848149, 326550, 190418, 375999, 675514, 944324, 1164831, 1425971, 1834598, 2410951, 3061655, 3640090, 3960173, 3860159, 3309519, 2438292, 1507059, 742006, 157602, -434479, -1129368, -1780407, -2277316, -2611541, -2724564, -2579744, -2219196, -1702716, -1135114, -652154, -335177, -170754, -80174, -4701, 50530, 63490, 89626, 194867, 352936, 463132, 488089, 552175, 802802, 1226152, 1611711]
12560A611711Q3309l06180n81418p72608r63429j084526j044042q15405m64958
12551d337546j20791J48472L40233N20664O65290O78947O72718Q30902J114233
12542E13122J336148J263827P62568O7676l93676m67292l44349k09503o8135P7571
12532B537957J88618K64880L25838L86905L77868K32106n0575l74713n83892o72614
12522B632378o87996o60863o46215o19971n36609l99172k06647l4784P9553K15794
12512h64532L97171N24148M82967L11276J32265N1928J03010K46015L75085L40913
12502B100246J72464O242r3033q7532Q263O5352j7437j13169r4860j04585l19189
12491A522762n37709m30932j16275M9289r1558m24259o78763o75832m45300p5511
$$ y = [1611711, 1695020, 1388840, 807422, 34814, -928615, -2013141, -3057183, -3872588, -4337546, -4458337, -4309865, -3969632, -3448968, -2783678, -2104731, -1432013, -601111, 513122, 1849270, 3113097, 3875665, 3943341, 3549665, 3082373, 2738024, 2528521, 2460386, 2537957, 2726575, 2991455, 3317293, 3704198, 4082066, 4314172, 4263597, 3888884, 3304992, 2632378, 1944382, 1283519, 637304, 17333, -519276, -918448, -1125095, -1159879, -1080326, -864532, -467361, 56787, 539754, 851030, 983295, 1035223, 1138233, 1384248, 1759333, 2100246, 2272710, 2278952, 2185919, 2098387, 2106650, 2172002, 2154565, 2041396, 1946536, 1841951, 1522762, 985053, 554121, 437846, 487135, 395577, -28682, -707445, -1383277, -1828577, -1904088]
12481a904088L06891N34224N95225N81681M55946J73475j18197k55954k42138
12472A27065k28078l11568l64516k89462j67137j06175j59029l12252m58370m17201
12462b686723j14802K50234M40189L66215J38253m0263p4623M5932K17567K07484
12452a250537j2186j59079r4090N3063K13792M24281O75198Q57488Q30119N65527
12442B103576K02046n1114o2805J11760K79332K95773J59305j2927j76246l17806
12432B530894l48840k84511k11426j69849j88413k68492l32748l21254k21575
12423A83786p2322N2778J38533J48248J9093j42259p7554K34486N13122N17110
12413A515021K40702r1243k91843m08495n22682n51799m85709m03130k30496L3280
$$ y = [-1904088, -1597197, -1062973, -467748, 113933, 569879, 743354, 625157, 369203, 127065, -101013, -412581, -777097, -1066559, -1233696, -1339871, -1498900, -1811152, -2269522, -2686723, -2801525, -2551291, -2111102, -1744887, -1606634, -1646897, -1721520, -1675588, -1458021, -1250537, -1262723, -1421802, -1515892, -1462829, -1249037, -824756, -149558, 707930, 1538049, 2103576, 2305622, 2254508, 2191703, 2303463, 2582795, 2878568, 3037873, 3024946, 2848700, 2530894, 2182054, 1897543, 1686117, 1516268, 1327855, 1059363, 726615, 405361, 183786, 111464, 164242, 302775, 451023, 470116, 327857, 250303, 484789, 997911, 1515021, 1755723, 1664480, 1372637, 964142, 441460, -110339, -596048, -999178, -1229674, -1196394]
12403a196394J86232J03888o5009p9612P3778K38255L13140K42922K4302k95630
12393d54128o26771p72879n61349n1882M70566P21971O37781L10997p4003l51996
12383g51693n01664m94665l21869r5068O8541J50912K19384L88204O90464R47927
12373C00473J003122Q86618O90383M84276K73560K8099k08840m04791m81835l69821
12363B201244j73828q4757k08811m61205o47084o36726m52181j55168J65257L63150
12353i0109L19920P1019k30096m56764n63271n55701m35244k53882p5864N7367
12343b212625P3935K2064M0591J35630K41979L61869L89260J71418k30154n63454
12333a569487o13868l54958J3367K51955L76246M61371M42938L20083J73453N4449
$$ y = [-1196394, -1010162, -906274, -971283, -1050895, -977117, -738862, -425722, -182800, -158498, -454128, -1080899, -1853778, -2415127, -2467009, -1996443, -1274472, -636691, -325694, -399697, -751693, -1253357, -1748022, -2069891, -2164959, -2096418, -1945506, -1726122, -1337918, -647454, 300473, 1303595, 2190213, 2880596, 3364872, 3638432, 3666531, 3457691, 3052900, 2571065, 2201244, 2027416, 1942659, 1733848, 1272643, 625559, -11167, -463348, -618516, -453259, -90109, 229811, 300830, 70734, -386030, -949301, -1505002, -1940246, -2194128, -2269992, -2212625, -2138690, -2116626, -2076035, -1940405, -1698426, -1336557, -947297, -775879, -1006033, -1569487, -2183355, -2538313, -2524946, -2272991, -1896745, -1435374, -992436, -672353, -498900, -444451]
12323d44451p775L627J45635L79443M82590L37003L6553k69660m21397l41944
12313a00376j29921M1296J16755J33912P5721n3274j39321j25613j47176k64618
12303e92615l65312l30312j07248K75702O70185Q54028P45785M06288n9038m74551
12293A022912o03929l95386r2976M4075k1053j64350k96977l59411k42474n367
12283a114936J13880P9229J421n6973k3013L6890J0155q7092j69684r5555J82675
12272a123003M65533M83286K03747j73706m42148m49396l00920k55499l07338
12263a899444k92681j93036P915L30902O10226O14265L61677J08551m1361k01237
12253e94223m04783n36143m70215k51731n6971M4959M8616r1782k63396k31827
$$ y = [-444451, -452226, -448599, -302964, 76479, 559069, 896072, 932625, 662965, 241568, -100376, -230297, -189001, -72246, 61666, 137387, 84113, -55208, -180821, -327997, -592615, -957927, -1288239, -1395487, -1119785, -449600, 404428, 1150213, 1556501, 1497463, 1022912, 418983, 23597, -69379, -25304, -46357, -210707, -507684, -867095, -1109569, -1114936, -1001056, -921827, -920406, -977379, -1000392, -963502, -953347, -1040439, -1210123, -1305678, -1123003, -657470, -174184, 29563, -144143, -586291, -1035687, -1336607, -1592106, -1899444, -2192125, -2385161, -2377246, -2046344, -1436118, -821853, -460176, -351625, -392986, -594223, -999006, -1535149, -2005364, -2257095, -2314066, -2269107, -2220491, -2312273, -2575669, -2807496]
12243b807496J435K12289L29218M45576N27318M63979L06300K20164J78434N9996
12233f2787o7314j75821l35637m96953n54482m95389k96112J8666K62223K97982
12223a905624J11546j49059k55883j59916L1841K63664M78868N20713L23951M7305
12213f92594j16258q5999J04629K57719J75762o0718k34854l72052n61982o84996
12203b271343o40184l82561M6589M11395N80835O69494Q24030J041403J151060
12194A430718R82691N32321R920l05256l40730k49339j83559j43165p9644N3861
12184A707818K28114K31077M6389m6402R7496L27316M81768N55782N80390N68533
12174D778281M73056K44171o3898l65296o32869q07700p72289o36591o55863q17137
$$ y = [-2807496, -2806061, -2593772, -2264554, -1818978, -1291660, -827681, -521381, -301217, -122783, -62787, -130101, -305922, -641559, -1138512, -1692994, -2188383, -2484495, -2465829, -2203606, -1905624, -1794078, -1943137, -2199020, -2358936, -2327095, -2063431, -1584563, -1063850, -739899, -692594, -808852, -894851, -790222, -532503, -356741, -417459, -652313, -1024365, -1586347, -2271343, -2911527, -3294088, -3247499, -2836104, -2255269, -1585775, -761745, 279658, 1430718, 2413409, 2945730, 2955650, 2650394, 2309664, 2060325, 1876766, 1733601, 1653957, 1707818, 1935932, 2167009, 2213398, 2166996, 2264492, 2591808, 3073576, 3629358, 4209748, 4778281, 5251337, 5495508, 5431610, 5066314, 4433445, 3625745, 2853456, 2216865, 1561002, 743865]
12164G43865q94827p82193n32863k20605J96109P17571J122226J188648R35368
12155B473299N38432J44066p3002q2228j04306j90263j43110Q7551L11080M00800
12145C362319L12550Q3337r1889j21378q4792q4010q2757k5613m3153k13046m00732
12134B610836m39552l08126j47049r9532j93844l90862n47792n69339n22229m21893
12124a029382k18864K0665J50696J22011j6049j65422l05835n00556o30686m45771
12114c019193j5290L30641M72442N09858N43457N38563M47203L36458K36679J22626
12104E03444O9357J67954L04100K85107P7022k64865o53912r69401j079843q95246
12094b456283n29574k08050N6791L79090O91612P56869N43600K93451J93441K76671
$$ y = [743865, -150962, -933155, -1466018, -1686623, -1490514, -772943, 349283, 1537931, 2473299, 3011731, 3155797, 3082795, 3000567, 2896261, 2705998, 2562888, 2650439, 2961519, 3362319, 3674869, 3758206, 3666317, 3544939, 3460147, 3376137, 3293380, 3267767, 3224614, 3011568, 2610836, 2171284, 1863158, 1716109, 1616577, 1422733, 1031871, 484079, -85260, -607489, -1029382, -1248246, -1227581, -1076885, -954874, -970923, -1136345, -1442180, -1942736, -2573422, -3019193, -3034483, -2703842, -2231400, -1721542, -1178085, -639522, -192319, 144139, 380818, 503444, 572801, 740755, 1044855, 1329962, 1406984, 1142119, 488207, -481194, -1561037, -2456283, -2985857, -3193907, -3137116, -2758026, -2066414, -1309545, -765945, -472494, -279053, -2382]
12084b382N19720P60308P94837O25753L96924K29499J22714R601o7197m1139L9788
12073C388426L5076r8416j93981j29758J7083O7967q6188l52309n14324m65841
12063A667735l80081m05083m36656l17691l0056L09087N29936N05521K45612j07621
12053A580703l39283l99336m38824m82986m25105k88241j31680N8900L08366N44750
12043a2736N97127M55256K98302J71069K3532p7558m2193P7666K62994M90899
12033B244358O28050O37259N41421L46393J23946n2635j55530j69207j81616k78075
12023C684364m01662m76161m39354k14530J13187L31258L78257L44782K68556
12014C588697Q3985k21642m79039m72845k02145R2122K05593J86327J72324J21708
$$ y = [-2382, 517338, 1277646, 2072483, 2698236, 3095160, 3324659, 3447373, 3456974, 3389777, 3348638, 3388426, 3423502, 3325086, 3131105, 3001347, 3018430, 3086397, 3000209, 2647900, 2133576, 1667735, 1287654, 882571, 445915, 128224, 98168, 407255, 937191, 1442712, 1688324, 1580703, 1241420, 842084, 403260, -79726, -504831, -793072, -924752, -865852, -557486, -12736, 584391, 1039647, 1337949, 1509018, 1532550, 1454992, 1412799, 1490465, 1753459, 2244358, 2872408, 3509667, 4051088, 4397481, 4521427, 4468792, 4313262, 4144055, 3962439, 3684364, 3282702, 2806541, 2367187, 2152657, 2265844, 2597102, 2975359, 3320141, 3588697, 3672682, 3451040, 2972001, 2499156, 2297011, 2389133, 2594726, 2781053, 2953377, 3075085]
12004C075085m5703k72302m57753n73170o07352n19166l85973l68879m16183l15918
11994h87314j51117j59054k29721j75855r0022m0701K4630J00027J30302O9212
11984a409613l3600q5288j45437k76852l54925k60198n13K41056L10617L20094
11974a694659L54059L39528K81578K90702L42385K99123K02985J37781N4244l0883
11964E76843l1869m4503j84813l67466l60543r1247K17353L67131L16997J62051
11954E59934Q1826O2407j5196r5371q9478k1091k3086j29441k63183m11602n43610
11943h87891o12141o52763o60723o11011n35633m54759l04105o8714K33479N43240
11933d011021O51222M81508J85995p2862j56638O687L33380O15009O73366N09837
$$ y = [3075085, 3029382, 2757080, 2299327, 1726157, 1118805, 599639, 213666, -155213, -571396, -887314, -1038431, -1197485, -1427206, -1603061, -1693083, -1733784, -1709154, -1609127, -1478825, -1409613, -1443213, -1528501, -1673938, -1950790, -2305715, -2565913, -2566426, -2325370, -2014753, -1694659, -1340600, -1001072, -719494, -428792, -86407, 212716, 415701, 553482, 607726, 576843, 544974, 500471, 315658, -51808, -412351, -503598, -286245, 80886, 397883, 559934, 641760, 704167, 688971, 593600, 504122, 483031, 459945, 330504, 67321, -344281, -887891, -1500032, -2152795, -2813518, -3424529, -3960162, -4414921, -4719026, -4787740, -4554261, -4011021, -3359799, -2878291, -2692296, -2765158, -2921796, -2915109, -2581729, -1966720, -1293354, -783517]
11923g83517K11895r0832k16213l3671L49734O30905O21209M39015K53301O245
11913A388071l20317n41612n38359l36950q2711L142j34221k99417l08608j64548
11903a335530O8273L04117M03277K94138J15151J4799R341P9146J84154K18498
11893C55364J34416P171r6548j76920j60323R5314N47133Q44547P52521M77899
11883B780574K90444K80243M38382O20350N64095J69505l54207o84049o65620
11874C439717m57568k44663k2517K10112L40050K35741j04341m46626n63121m91999
11864A894785m25877m85390n44953m54842l23758k42240j48160N7816L42449N64157
11854B33987O76833O75925N77170M27861K42164L3312j22238j54786l5582J62358
$$ y = [-783517, -571622, -662454, -878667, -912338, -562604, 68301, 689510, 1128525, 1381826, 1388071, 1067754, 526142, -12217, -349167, -431878, -428736, -562957, -862374, -1170982, -1335530, -1267257, -963140, -559863, -265725, -150574, -135775, -126434, -47288, 136866, 355364, 489780, 496951, 400403, 223483, 63160, 158474, 705607, 1550154, 2302675, 2780574, 3071018, 3351261, 3789643, 4409993, 4974088, 5143593, 4789386, 4105337, 3439717, 2982149, 2737486, 2714969, 2925081, 3265131, 3500872, 3396531, 2949905, 2386784, 1894785, 1468908, 983518, 438565, -16277, -340035, -582275, -730435, -672619, -330170, 233987, 910820, 1586745, 2163915, 2591776, 2833940, 2867252, 2745014, 2590228, 2554646, 2717004]
11844B717004K04251p2114n38380r17842j081600j027108q02368n77018m43320
11835b538495k39878J46277N36853P02852O00833L80072J98530k7707l85452o43384
11825a269499o57258n54475l65381m691L84446M48736M4627n81121j004214r98900
11815d557730o54127k01562K08607N74759Q83086J039966R91331Q61758Q10890
11806d3022P30209M56711J17169o5136l3637J4429j18808l74168n30585l56996
11796b03834Q1736M33233M62199K07084j39597m14848n08525l87807j74311n1445
11786f96115p2211j21911j61156k36884l03918k33398J021K76774M36947L94175
11776g16676K42398J58194J46805P8642m6495j54933k26951l19093m94223o93766
$$ y = [2717004, 2921255, 2849141, 2310761, 1392919, 311319, -715789, -1518157, -2095175, -2538495, -2778373, -2632096, -2095243, -1392391, -791558, -411486, -212956, -240663, -626115, -1269499, -1926757, -2481232, -2846613, -2851304, -2466858, -2018122, -1973495, -2554616, -3558830, -4557730, -5211857, -5413419, -5204812, -4630053, -3746967, -2707001, -1715670, -853912, -43022, 687187, 1143898, 1261067, 1195931, 1162294, 1176723, 1057915, 683747, 153162, -203834, -122098, 311135, 773334, 980418, 840821, 425973, -82552, -470359, -644670, -696115, -768326, -890237, -1051393, -1288277, -1592195, -1825593, -1824572, -1547798, -1110851, -716676, -474278, -316084, -169279, -90637, -137132, -292065, -519016, -838109, -1332332, -2026098]
11766b026098q14181p98476o24996l04557J00819M02146M75433M31631M62667
11757b695612N49347N13427L47995J65316k034j35613j69405o1216J00366J65205
11747a222224Q7780m5103j26016j80954k67936l62344l71866j84752J78957N04003
11737a990455N80924M32525K43011J59079J67977J89303K33078L64116M74405
11728H53963L68305Q9360j15992j62824j99235k36821j50533L2599K18974M52775
11718A150571P49022Q57868N25380j45270p81830j123126j176693j019210o76020
11709a639308j90496L58623P84279Q99476P94914P03351O60362N34900K44643
11700C150744j03520l33631m54107n91609p22278o97610n17529m22159n04033
$$ y = [-2026098, -2840279, -3638755, -4263751, -4568308, -4467489, -4065343, -3589910, -3158279, -2695612, -2146265, -1632838, -1284843, -1119527, -1121561, -1257174, -1426579, -1487795, -1387429, -1222224, -1134444, -1179547, -1305563, -1486517, -1754453, -2116797, -2488663, -2673415, -2494458, -1990455, -1409531, -977006, -733995, -574916, -406939, -217636, 15442, 379558, 853963, 1222268, 1311628, 1195636, 1032812, 833577, 596756, 446223, 478822, 697796, 1150571, 1899593, 2757461, 3282841, 3137571, 2355741, 1232615, 55922, -963288, -1639308, -1829804, -1471181, -686902, 212574, 1007488, 1710839, 2371201, 2906101, 3150744, 3047224, 2713593, 2259486, 1667877, 945599, 247989, -269540, -691699, -1195732]
11691a195732n73311n09645l62471j83102l7324M2582R2771J43846K15813K68028
11681b098545K02334L409k01025k54558j43954J7507J52334K13584K06884K47942
11671a654088L70766M23590K80331j257k81377m60539m97089m39547l93568l58431
11661c011209k17088L4203K67000M01927M43149M26768L74822K76547Q9716j73684
11651a087849l87972m51948l53755j95287p8587K9329J88695L64535M29518L27088
11641a216233O8684k33374m04360m09233k65978n3087M9703J8026M7296J53695
11631b244861J88011J47850N1836j36886l10543k92844j12648Q2766K27974L86778
11621b012567O04918P14179O08834M11603K26949O6479j18991l25184m41561n05375
$$ y = [-1195732, -1769043, -2278688, -2641159, -2824261, -2861585, -2819003, -2726232, -2582386, -2366573, -2098545, -1896211, -1892802, -2093827, -2348385, -2492339, -2474832, -2322498, -2108914, -1902030, -1654088, -1283322, -859732, -579401, -580658, -862035, -1322574, -1819663, -2259210, -2652778, -3011209, -3228297, -3194094, -2927094, -2525167, -2082018, -1655250, -1280428, -1003881, -914165, -1087849, -1475821, -1927769, -2281524, -2476811, -2555398, -2526069, -2337374, -1972839, -1543321, -1216233, -1147549, -1380923, -1785283, -2194516, -2460494, -2513581, -2463878, -2445852, -2398556, -2244861, -2056850, -1909000, -1857164, -1994050, -2304593, -2597437, -2710085, -2627319, -2399345, -2012567, -1407649, -693470, -84636, 326967, 553916, 620395, 501404, 176220, -265341, -770716]
11611g70716n75724n59475m25879k11220M8973K37589K33235L6124k21495l50623
11601b559211k68864l3486K17195L51030M20417N56394O69922N42551J19329l73834
11591c58557n78524m58686l29254l37287l61672l02121j61957J6065K06415L34340
11581b331238L48531L04870K19918J17783P8094J26914K88098M91697N34658L22177
11571E01502k3738k93223l60726l60823m98022o82981o73864l72837J19183N87786
11561b057743Q96405J036243R61753O47463K68678J10572K21751L91427M29318
11552B905867L13408J38033j945l2264K6690N9723m2389k03800k61765k28020
11542B673538k49813l24578l45976l30861m07358n70966o96443o48875m21033
$$ y = [-770716, -1346440, -1905915, -2331794, -2543014, -2494041, -2256452, -2023217, -1987093, -2208588, -2559211, -2828075, -2861561, -2644366, -2293336, -1872919, -1316525, -646603, -104052, 15277, -358557, -937081, -1395767, -1725021, -2062308, -2423980, -2726101, -2888058, -2871993, -2665578, -2331238, -1982707, -1677837, -1457919, -1340136, -1262042, -1135128, -847030, -355333, 179325, 501502, 477764, 184541, -176185, -537008, -1035030, -1718011, -2391875, -2764712, -2645529, -2057743, -1161338, -125095, 836658, 1484121, 1752799, 1863371, 2085122, 2476549, 2905867, 3219275, 3357308, 3355363, 3323099, 3349789, 3409512, 3367123, 3163323, 2901558, 2673538, 2423725, 2099147, 1753171, 1422310, 1014952, 443986, -252457, -901332, -1322365]
11533a322365k16067j39488o4204M4893Q9729L3054p2883j11120j3482J35304
11523a636629K40080L15704L60447L30609K14908M7014j37256k57806k05628Q0864
11513f47693N30302Q93167R24733O47354K83966O7238P8322J44451P5683o1729
11503B935794j41315j68396k20283l54319m67795m32598k65457p0302N9666P5691
11493I50686n7066k22957j59650J06130K08703m3090l89823m65868k67166m4272
11483c84373M7524N0980P9855J69053K93747M17372N11814N00384K57426j41788
11473A801994m27317m14145k16428q8999j23748j99879j98990j38974n5994P0797
11463H317J36537M4518p8472j27643j89057l31601m22218l36498j80266j34852
$$ y = [-1322365, -1538432, -1677920, -1742124, -1697231, -1607502, -1574448, -1647331, -1758451, -1771933, -1636629, -1396549, -1080845, -720398, -389789, -174881, -127867, -265123, -522929, -728557, -647693, -117391, 775776, 1700509, 2347863, 2631829, 2699067, 2777389, 2921840, 2997523, 2935794, 2794479, 2626083, 2405800, 2051481, 1583686, 1151088, 885631, 815329, 874995, 950686, 893620, 670663, 511013, 617143, 825846, 782756, 392933, -72935, -340101, -384373, -336849, -285869, -206014, -36961, 256786, 674158, 1185972, 1686356, 1943782, 1801994, 1374677, 960532, 744104, 655105, 531357, 331478, 132488, -6486, -62480, 8317, 144854, 189372, 110900, -16743, -205800, -537401, -959619, -1296117, -1476383, -1611235]
11453a611235k36457l68099m24976l91928k43725o94K38008M20904M77464K84497
11443a856241j32514n20698o45756n10241k51428K6049L07505O11112R21537J173114
11433h77561J286633J271889J182265R66673O10062J81488k20290m75131o12792
11424C313236o76530o20186n30814n34270o29491p78583q87005q41363n66561
11415b751567r2940M18775P49435P37023L54720k24458o57756o25840k04500J48261
11405b148847Q5542k76076n33079m92141k15900J25561K92800J61381j07380k71237
11395c379376k51544q9950P5050J16133R5352J40445K30365K52205J89840J45135
11385b476345K00457K82799K08329l9580k85655l73271l18698j63672J04221L69837
$$ y = [-1611235, -1847692, -2215791, -2640767, -3032695, -3276420, -3277114, -3039106, -2618202, -2140738, -1856241, -1988755, -2509453, -3155209, -3665450, -3916878, -3890829, -3583324, -2972212, -2050675, -877561, 409072, 1680961, 2863226, 3829899, 4439961, 4621449, 4401159, 3926028, 3313236, 2636706, 2016520, 1485706, 951436, 321945, -456638, -1343643, -2185006, -2751567, -2844507, -2425732, -1676297, -939274, -584554, -809012, -1466768, -2092608, -2297108, -2148847, -2063305, -2339381, -2872460, -3364601, -3580501, -3454940, -3162140, -3000759, -3108139, -3379376, -3630920, -3720870, -3645820, -3529687, -3434335, -3293890, -3063525, -2811320, -2621480, -2476345, -2275888, -1993089, -1784760, -1824340, -2109995, -2483266, -2801964, -2965636, -2861415, -2491578]
11375b491578N22340N64165N63585N20358L55861J27494K6653J49424L50594M57163
11365A146059N35884O11223N62126L69880J44147l4029j73235k15164j24945j4335
11355B807611L3573L6072j9562r2752p0595N1773K10662L06721K58746N1355j88290
11344C385314k26828q1522M8485M3303j14236l85706o45268o60098l80767n5236
11334I27441J45433K71346L53339L73201L11186J52497l7085j47810k18733l27832
11324A802983m03467l08205j37496j42094k94036m02680m27264l35874n7547K61541
11314d44139M14875L85873J82454j27339l10652k21035Q1709M56646P92895R92244
11304B203531R02217N15560O6881k39119l59808l75169m13864m92430n11471m13097
$$ y = [-2491578, -1969238, -1405073, -841488, -321130, 34731, 162225, 188878, 338302, 688896, 1146059, 1681943, 2293166, 2855292, 3225172, 3369319, 3335290, 3162055, 2946891, 2821946, 2807611, 2841184, 2877256, 2857694, 2764942, 2694347, 2746120, 2956782, 3263503, 3522249, 3573604, 3385314, 3158486, 3076964, 3125449, 3168752, 3054516, 2668810, 2023542, 1363444, 982677, 927441, 1072874, 1344220, 1697559, 2070760, 2381946, 2534443, 2497358, 2349548, 2130815, 1802983, 1399516, 1091311, 953815, 811721, 517685, 115005, -312259, -648133, -705680, -444139, -29264, 356609, 539063, 411724, 101072, -119963, -38254, 418392, 1211287, 2203531, 3105748, 3621308, 3688189, 3449070, 3089262, 2714093, 2300229, 1807799, 1296328, 883231]
11294H83231k38981j05364j14352k73255m89998o36565o70916o36386m79327j88250
11284b950163L1208J4735j65219l10121l39724k68562j41920p0854o4832R397
11274d256055J50116K24069K83994M45215O34220P15803O62350N26921M37199
11265a76168M35688M64519N68923P28229P30998N15521K50093r232l22092o58475
11255B528004q99670r22384p44220m45520j30490R205l0194o5116J8979K47119
11245d34287N70202Q82261J057067J062036R38411O54030K89632L6733o4792q8394
11235D902899j12780j78040k90869l57570l26444l01412l91294n64524p05499
11226A674467p64325p60077o53162l82786m058L35652M81225L79457J82167Q5127
$$ y = [883231, 644250, 538886, 424534, 151279, -338719, -975284, -1646200, -2282586, -2761913, -2950163, -2918955, -2904220, -3069439, -3379560, -3719284, -3987846, -4129766, -4200620, -4265452, -4256055, -4105939, -3881870, -3597876, -3152661, -2518441, -1802638, -1140288, -613367, -176168, 259520, 724039, 1292962, 2021191, 2752189, 3267710, 3517803, 3508571, 3186479, 2528004, 1628334, 705950, -38270, -483790, -614280, -605075, -635269, -700385, -681406, -434287, 135915, 1018176, 2075243, 3137279, 4075690, 4729720, 5019352, 5056085, 4991293, 4902899, 4790119, 4612079, 4321210, 3963640, 3637196, 3335784, 2944490, 2379966, 1674467, 910142, 150065, -503097, -885883, -889941, -554289, -73064, 306393, 488560, 573687]
11216E73687Q2860N1831j2829k3814K162J0477k2145r7163j49972j23798n6020
11205B35276j1305m036O1820J93143K04034J5439k19657l61498l73460k55251
11195e15495o7497M6205n1578k73815m41960n61472o52104o01506l42395J5827
11185c445790K95087M08004M60946N16121M65208L00414J73914J19213M3062q2903
11175g46724j96232k92922l41475k05736O8095K95692L60563K48495R9096p31
11165g11879j32334l01244l65307k77789k33501l68574n39409n77878m50379k64056
11155d222350k05951l09388l84998k65481r725K12443L00817K59376K22709K88426
11145d114122M52162O49938P10140N70268L93295K79503J74736l2441l29680n30103
$$ y = [573687, 656547, 708378, 695549, 671735, 673897, 684374, 662229, 565066, 415094, 291296, 235276, 223971, 219935, 281755, 474898, 678932, 694371, 474714, 113216, -260244, -515495, -582992, -536787, -588365, -862180, -1304140, -1865612, -2517716, -3119222, -3461617, -3445790, -3150703, -2742699, -2281753, -1765632, -1300424, -1000010, -826096, -706883, -663821, -746724, -942956, -1235878, -1577353, -1783089, -1714994, -1419302, -1058739, -810244, -711148, -711879, -844213, -1145457, -1510764, -1788553, -2022054, -2390628, -2930037, -3507915, -3958294, -4222350, -4428301, -4737689, -5122687, -5388168, -5397893, -5185450, -4884633, -4625257, -4402548, -4114122, -3661960, -3012022, -2301882, -1731614, -1338319, -1058816, -884080, -916521, -1246201, -1776304]
11135a776304n42683l89730p9184L69467Q25617J062244R74607P32318N52842
11126A729194M93679M62572L71386K05744k1116j99142j98660j11536o5616l00
11116B666205P6411p310l25105p46205j019541r24665m78401P4114M91535O43199
11106D50237M81207J22709k21029m21600m28600l41788l08221l26480l89035m43332
11096a825932l41006j3346M57596Q36416Q63345M99840p514l27098l53049j76726
11086c87474Q292R645j50349k87074k24724M6667L26652L74232J79580p5834k24411
11075d04798j52604J07134M04787O38049P24464N59284J39835l74689p76695r14394
11065d9627q24709o80493n85753n04132k99851O2451M49777O42558N23085K47608
$$ y = [-1776304, -2318987, -2708717, -2787901, -2418434, -1592817, -530573, 444034, 1176352, 1729194, 2222873, 2685445, 3056831, 3262575, 3241459, 3042317, 2843657, 2732121, 2666505, 2666205, 2742616, 2735306, 2410201, 1663996, 644455, -280210, -758611, -684497, -192962, 450237, 931444, 1054153, 833124, 411524, -17076, -358864, -667085, -993565, -1382600, -1825932, -2166938, -2180284, -1722688, -886272, -22927, 476913, 469399, 142301, -210748, -387474, -379182, -369537, -519886, -806960, -1031684, -985017, -658365, -284133, -104553, -180387, -404798, -557402, -450268, -45481, 592568, 1317032, 1876316, 2016151, 1641462, 864767, -49627, -874336, -1554829, -2140582, -2644714, -2944565, -2882114, -2432337, -1789779, -1266694, -1019086]
11055a019086L3583q2514j54593j71374j59328j74926j50665j9488J11855Q1998
11045a704538j3596L5078J34522R4749m6167j04507l8930K8428L3680q0000l66005
11034b027286o79180p73388o44017n14759m41913l46959k06756M3403L96954P02854
11024d491047Q39423Q21623P44096O72451O02280M94632L60256K52381J85701
11015D81796R1131j06386l67878o20500q17432p48877l34194J61082M83128M64611
11005a313519J04208k96478m38877l01184j2203L10705O18730Q39480Q75241P79798
10995A165901O65023N47774L75240J66962P548j30839l32380n05408m16856m669
10985A538296M81154P05843N57777K38977O717m3363K2781P3045L2835o4093n6099
$$ y = [-1019086, -985503, -1068017, -1222610, -1393984, -1553312, -1728238, -1878903, -1898391, -1786536, -1704538, -1718134, -1683056, -1548534, -1453785, -1499952, -1604459, -1643389, -1614961, -1581281, -1661281, -2027286, -2706466, -3479854, -4123871, -4638630, -5080543, -5427502, -5634258, -5590855, -5193901, -4491047, -3651624, -2830001, -2085905, -1413454, -811174, -316542, 43714, 296095, 481796, 572927, 466541, 98663, -521837, -1339269, -2088146, -2422340, -2261258, -1778130, -1313519, -1209311, -1505789, -1944666, -2245850, -2258053, -1947348, -1328618, -489138, 386103, 1165901, 1830924, 2378698, 2753938, 2920900, 2928448, 2797609, 2465229, 1959821, 1542965, 1538296, 2019450, 2725293, 3283070, 3522047, 3528764, 3485401, 3508182, 3581227, 3614062, 3549969, 3493870]
10974C493870J73319M94829P25456P63980N06052L24m96230p55005p28356n67817
10964C610422m33234l92567m56337n85640p00876o58337l93989j04223q741n8060
10954a81582j36397j63997j10349j1443J01380J45871R0681M8745L7871N4233
10944a24987J83139L90205M99520L59568L9859j96487k52821k47395k53764j51903
10934B44934J49568N16397P19431N71357J16820l79112o25229n07799j69685K12762
10924H49444M85267N12591K92218n3665m02985o79326q61183r07796p36807l93707
10914a895949l8355J95689K45256J23762k1841p4808l0819R6785K27497K25329
10904i47454R5913L9750J77080M39466P26198Q93407P71010M23458J14366j4830
$$ y = [3493870, 3667189, 4162018, 4887474, 5651454, 6157506, 6157830, 5661600, 4906595, 4178239, 3610422, 3177188, 2784621, 2328284, 1742644, 1041768, 383431, -10558, -114781, -123522, -181582, -317979, -481976, -592325, -603768, -502388, -356517, -265836, -217091, -179220, -124987, 58152, 448357, 947877, 1307445, 1347304, 1150817, 897996, 650601, 396837, 244934, 394502, 910899, 1630330, 2201687, 2318507, 1939395, 1314166, 806367, 636682, 849444, 1334711, 1847302, 2139520, 2085855, 1682870, 1003544, 142361, -765435, -1502242, -1895949, -1934304, -1738615, -1493359, -1369597, -1391438, -1466246, -1497065, -1400280, -1172783, -947454, -851541, -811791, -634711, -195245, 530953, 1424360, 2195370, 2618828, 2733194, 2718364]
10894B718364N683R2343J56327J33612M6565n9074j61708l07163n72018q69136
10884A183795j004910r50877p53438l51768J66001N38658N76320K91413n1117
10875c55923k45011l17809l42311l41658k16897Q6333L83713N14468M39645K17967
10865a77483J22912L11983M47541K25324j62621m20580m66689l86261k34066J233
10855g38707K64281M61943M42863J20094k81156m38277k71017J6639J89588K80665
10845D6916M24288N40426M83800K59947n2585l02296l08674o5602J89241K19795
10835A435256J8218l02971n92031p01300n92943l04722P2751M16162O22660O50723
10825G21803N32883L65051K07456N5662j30405l52405n07819m55634k02059l750
$$ y = [2718364, 2724047, 2816390, 2972717, 3106329, 3152894, 3093820, 2932112, 2624949, 2052931, 1183795, 178885, -771992, -1525430, -1877198, -1711197, -1172539, -596219, -304806, -355923, -600934, -918743, -1261054, -1602712, -1819609, -1733276, -1349563, -835095, -395450, -177483, -54571, 257412, 704953, 930277, 767656, 347076, -119613, -505874, -739940, -738707, -474426, -12483, 430380, 550474, 269318, -168959, -439976, -423337, -233749, 46916, 471204, 1011630, 1495430, 1755377, 1702792, 1400496, 1091822, 1026220, 1215461, 1435256, 1453474, 1150503, 558472, -142828, -735771, -1040493, -967742, -551580, 71080, 721803, 1254686, 1619737, 1827193, 1882855, 1752450, 1400045, 892226, 436592, 234533, 230783]
10815B30783q3612l57762n48095m99757l20386k48947l05092k68119p8391J17080
10805b362298K44479L85609N63985O76627O66996N43637L02807N031k11551m11288
10795D04034o50067p02087m61796j51619K7175P8288R6915J40618J50089N3059
10785a015391p2847j23974j25994j32705q4655N8053K32439L35482L28145K94467
10775c06980K95858K59120M7117k87237m62977l31850p6328Q196r0603j35503
10765a081187k4697J13144J32939O7436L9074J92778N06323O88067N90774L85108
10755A609759K08403Q3754L8276O2292R9131J40009R8042j03883k83748l16374
10745A635661k73880k62600l35603m02291l64124k07345j0791J03431R4333n3939
$$ y = [230783, 147171, -210591, -758686, -1258443, -1578829, -1827776, -2132868, -2400987, -2479378, -2362298, -2117819, -1732210, -1168225, -491598, 175398, 719035, 1021842, 1026873, 815322, 404034, -246033, -948120, -1409916, -1561535, -1534360, -1456072, -1359157, -1218539, -1068450, -1015391, -1088238, -1212212, -1338206, -1470911, -1555566, -1497513, -1265074, -929592, -601447, -306980, -11122, 247998, 295115, 7878, -455099, -786949, -863277, -855081, -945684, -1081187, -1105884, -992740, -859801, -792365, -753291, -560513, -54190, 633877, 1224651, 1609759, 1818162, 1901916, 1940192, 2002484, 2101615, 2241624, 2339666, 2235783, 1952035, 1635661, 1361781, 1099181, 763578, 361287, -2837, -210182, -220973, -117542, -23209, -77148]
10735g7148k60872l28760k60655k08840j81652j29258m2789N8405J68311K80809
10725i82449M24207O09535P08695P04529O84742N78603L21744J4687j83887k43787
10715B636619k98738l89792m40069m36286l56195j61905O3574K56293M83007O75051
10705B031559O67814M72137K17300L2043p978O2839K02407L29755K88025L5664
10695D331565k98222n17934n09725l69029l80831o47726r07276q94171n97691
10686g91040j18958L88017O37421M74302R0582k63486m66382m54040k87817j08718
10676i00119q1723k82256n27653n58420k63201K45839P43712J073700J160473
10667F10352J004315P18413M97299L97402L46837K64982J6083m09712q47151j114648
$$ y = [-77148, -338020, -666780, -927435, -1136275, -1317927, -1447185, -1489974, -1431569, -1263258, -982449, -558242, 51293, 759988, 1464517, 2149259, 2727862, 3049606, 3064293, 2880406, 2636619, 2337881, 1948089, 1508020, 1071734, 715539, 553634, 617208, 873501, 1356508, 2031559, 2699373, 3171510, 3388810, 3420853, 3412875, 3475714, 3678121, 4007876, 4295901, 4331565, 4033343, 3515409, 3005684, 2636655, 2255824, 1608098, 700822, -193349, -791040, -909998, -521981, 115440, 589742, 680324, 416838, -49544, -503584, -791401, -900119, -981842, -1264098, -1791751, -2350171, -2613372, -2367533, -1623821, -550121, 610352, 1614667, 2333080, 2830379, 3227781, 3574618, 3839600, 3855683, 3445971, 2598820, 1484172]
10657A484172j174525j077583p75657k64497L51202R01835J168563J018229N41569
10648B173308K3819l25329n30739o16945n53434m12913k89923j66712p277J72933
10638e33212L40346M15329L55203K34806J29722o943k34305m96613o51998o41683
10628a089348n83895n10945l59441j99595r6602J6698K18453N12185Q01395R89311
10618c01784R95462P77975M61645K08723K8401p5716m7754K3539Q905o5518j01997
10607A911881j00580p8764K1990J41426J16015q5751l76791n79513m58305o0094
10597D51514K29268J33940k89702p08821q09887n85411k49758O7148L47958M51126
10587i62625K36420j38262l94352n05327o01875o77659o21428l31682J21449M61057
$$ y = [1484172, 309647, -767936, -1543593, -1808090, -1456888, -555053, 613510, 1631739, 2173308, 2197127, 1871798, 1341059, 724114, 170680, -242233, -532156, -698868, -706145, -533212, -192866, 222463, 577666, 812472, 942194, 935251, 700946, 204333, -447665, -1089348, -1673243, -2184188, -2543629, -2743224, -2839826, -2823128, -2604675, -2092490, -1291095, -301784, 693678, 1471653, 1933298, 2142021, 2170422, 2094706, 2046952, 2070491, 2079396, 2013878, 1911881, 1811301, 1732537, 1754527, 1895953, 2011968, 1926217, 1549426, 969913, 511608, 451514, 680782, 814722, 525020, -183801, -993688, -1579099, -1828857, -1761709, -1413751, -962625, -726205, -864467, -1258819, -1764146, -2366021, -3043680, -3665108, -3996790, -3875341, -3414284]
10577c414284M92652L09919J04500o7423j81004j97738q3305J07176J82924N5697
10567b690886j29032j18805P4185J36099l9401k78611m33153m25512l09610j91679
10557d406405j02275j10459j34563O8480L66466M00049J76320q340j3439R3506
10547c670660K32000L51206M36321N09752N84851O11628N99493O59028P99349
10538A112968Q87941P30996K77679k17382m72053m54490k97055j62894j88027
10529A217683l90927n89508n88041l88219r1725K00099L88654L92197K17698L6299
10519D04210m8851j07758j10895m30R6783N6344r7558k81502l50800k60359j80961
10508h81777j97192j86635j08670l9592j5271j4238p110P0598K34604K93282J68199
$$ y = [-3414284, -2921632, -2611713, -2507213, -2574636, -2755640, -2953378, -3036683, -2929507, -2746583, -2690886, -2819918, -2938723, -2864538, -2728439, -2767840, -3046451, -3479604, -3905116, -4214726, -4406405, -4508680, -4619139, -4753702, -4685222, -4318756, -3918707, -3742387, -3750727, -3764166, -3670660, -3438660, -3087454, -2651133, -2141381, -1556530, -944902, -345409, 313619, 1112968, 2000909, 2731905, 3009584, 2792202, 2320149, 1865659, 1568604, 1405710, 1217683, 826756, 237248, -350793, -739012, -830737, -630638, -241984, 150213, 367911, 404210, 355359, 247601, 136706, 136276, 233059, 289403, 191845, -89657, -440457, -700816, -881777, -1078969, -1265604, -1374274, -1413866, -1429137, -1443375, -1450485, -1379887, -1145283, -852001, -683802]
10497f83802j8797k11883l55691l21800m7358M47423R68754J172758R28929M53897
10487B332430N4863j79779l48648m74638n22986n38750n47758n01552m22875l06682
10477a456375l3660M05885Q11268R27539P03645L57140J38981L8169j23299l26043
10467A443250m43865m97406n00929l47996r8331M0448P1517J23192J59833J15856
10457F5569O5238P7521J20829J82923K72099L66835M30838M18677L48242K38970
10447B587741Q4839k9192j4840R1412J72972O1342k26882m07302l72891k49322
10437A697877q6193P8543J65952K15676K92481K84596R5003q0277k6987J00098
$$ y = [-683802, -702599, -914482, -1270173, -1591973, -1639331, -1191908, -223154, 949604, 1878533, 2332430, 2387293, 2207514, 1858866, 1384228, 861242, 322492, -225266, -726818, -1149693, -1456375, -1490035, -1084150, -272882, 654657, 1358302, 1715442, 1854423, 1892592, 1769293, 1443250, 999385, 501979, 1050, -346946, -445277, -404829, -333312, -210120, -50287, 65569, 130807, 208328, 329157, 512080, 784179, 1151014, 1581852, 2000529, 2348771, 2587741, 2672580, 2643388, 2628548, 2719960, 2892932, 2954274, 2727392, 2320090, 1947199, 1697877, 1611684, 1690227, 1856179, 2071855, 2364336, 2648932, 2743935, 2663658, 2636671, 2736769]
$$ [...]
##END NTUPLES=NMR SPECTRUM
##END=
