##TITLE=31P ikalashn
111-2024
18.12.2024
##JCAMPDX= 6.0         $$ Bruker NMR JCAMP-DX V2.0
##DATA TYPE= NMR SPECTRUM
##DATA CLASS= NTUPLES
##ORIGIN= UXNMR, Bruker Analytische Messtechnik GmbH
##OWNER= root
$$ TOPSPIN		Version 1.3
$$ 2024-12-18 10:44:00.328 +0400  Irina@DPX200
$$ Compression mode = diff/dup
##.OBSERVE FREQUENCY= 81.01967998063
##.OBSERVE NUCLEUS= ^31P
##.ACQUISITION MODE= SIMULTANEOUS
##.ACQUISITION SCHEME= undefined
##.AVERAGES= 32
##.DIGITISER RES= 17
##SPECTROMETER/DATA SYSTEM= spect
##.PULSE SEQUENCE= zgpg
##.SOLVENT NAME= DMSO
##.SHIFT REFERENCE= INTERNAL, DMSO, 1, 298.5841
##AUDIT TRAIL= $$ (NUMBER, WHEN, WHO, WHERE, WHAT)
$$ ##TITLE= Audit trail, TOPSPIN		Version 1.3
$$ ##JCAMPDX= 5.01
$$ ##ORIGIN= Bruker BioSpin GmbH
$$ ##OWNER= Irina
$$ $$ F:/spectra/data/iren/nmr/P31dec/1/pdata/1/auditp.txt
$$ ##AUDIT TRAIL=  $$ (NUMBER, WHEN, WHO, WHERE, VERSION, WHAT)
(   1,<2024-12-18 10:42:48.031 +0400>,<Irina>,<DPX200>,<TOPSPIN 1.3>,
      <acquisition in progress>)
(   2,<2024-12-18 10:43:42.937 +0400>,<Irina>,<DPX200>,<TOPSPIN 1.3>,
      <Start of raw data processing
       efp BC_mod = 2 LB = 10 FT_mod = 6 PKNL = 1 PHC0 = 35.81481 PHC1 = -6.78759 SI = 32K 
       data hash MD5: 32K
       8C A0 05 5B 17 46 D7 D5 C6 FE A2 63 4F 91 FB EA>)
(   3,<2024-12-18 10:43:45.046 +0400>,<Irina>,<DPX200>,<TOPSPIN 1.3>,
      <apk 
       data hash MD5: 32K
       92 52 36 3F 47 4D E5 A8 12 10 74 1A 2B CA 26 1A>)
(   4,<2024-12-18 10:43:47.984 +0400>,<Irina>,<DPX200>,<TOPSPIN 1.3>,
      <abs n ABSG = 5 
       data hash MD5: 32K
       CF 56 E8 EC 7B 09 83 93 70 56 E8 98 7E 87 D5 FC>)
$$ ##END=
$$ 
$$ $$ hash MD5
$$ $$ 0D 75 C7 9A 35 F1 9A 42 9A 6F E0 E4 2B 75 E2 63
##$RELAX= 
##$RELAX= 
##$RELAX= 
##$RELAX= 
##$RELAX= 
##$RELAX= 
##$RELAX= 
##$RELAX= 
##$RELAX= 
##$RELAX= 
##$RELAX= 
$$ Bruker specific parameters
$$ --------------------------
##$DU= <F:/spectra>
##$EXPNO= 1
##$NAME= <P31dec>
##$PROCNO= 1
##$TYPE= <nmr>
##$USER= <iren>
##$AMP= (0..31)
100 100 100 100 100 100 100 100 100 100 100 100 100 100 100 100 100 100 
100 100 100 100 100 100 100 100 100 100 100 100 100 100 
##$ANAVPT= -1
##$AQSEQ= 0
##$AQ_mod= 1
##$AUNM= <au_zg>
##$AUTOPOS= <>
##$BF1= 81.014009
##$BF2= 200.13
##$BF3= 200.13
##$BF4= 200.13
##$BF5= 200.13
##$BF6= 200.13
##$BF7= 200.13
##$BF8= 200.13
##$BYTORDA= 1
##$CFDGTYP= 0
##$CFRGTYP= 5
##$CHEMSTR= <none>
##$CNST= (0..63)
1 1 145 1 1 1 1 1 1 1 1 1 1 1 1 1 1 1 1 1 1 1 1 1 1 1 1 1 1 1 1 1 1 1 
1 1 1 1 1 1 1 1 1 1 1 1 1 1 1 1 1 1 1 1 1 1 1 1 1 1 1 1 1 1 
##$CPDPRG= <waltz16>
##$CPDPRG1= <>
##$CPDPRG2= <waltz16>
##$CPDPRG3= <>
##$CPDPRG4= <mlev>
##$CPDPRG5= <mlev>
##$CPDPRG6= <mlev>
##$CPDPRG7= <mlev>
##$CPDPRG8= <mlev>
##$CPDPRGB= <>
##$CPDPRGT= <>
##$D= (0..63)
0 1 0 0 0 0 0 0 0 0.06 0 0.03 2e-005 3e-006 0 0 0.0002 0 0 0 0 0 0 0 0 
0 0 0 0 0 0 0 0 0 0 0 0 0 0 0 0 0 0 0 0 0 0 0 0 0 0 0 0 0 0 0 0 0 0 0 
0 0 0 0 
##$DATE= 1734504219
##$DBL= (0..7)
120 120 120 11 120 120 24 19 
##$DBP= (0..7)
$$ [...]
##$SW_h= 37037.037037037
##$TD= 32768
##$TD0= 1
##$TE= 300
##$TE2= 300
##$TE3= 300
##$TEG= 300
##$TL= (0..7)
0 120 53 12 22 120 120 120 
##$TP= (0..7)
150 150 150 150 150 150 150 150 
##$TP07= 0
##$TPNAME0= <>
##$TPNAME1= <>
##$TPNAME2= <>
##$TPNAME3= <>
##$TPNAME4= <>
##$TPNAME5= <>
##$TPNAME6= <>
##$TPNAME7= <>
##$TPOAL= (0..7)
0.5 0.5 0.5 0.5 0.5 0.5 0.5 0.5 
##$TPOFFS= (0..7)
0 0 0 0 0 0 0 0 
##$TUNHIN= 0
##$TUNHOUT= 0
##$TUNXOUT= 0
##$USERA1= <user>
##$USERA2= <user>
##$USERA3= <user>
##$USERA4= <user>
##$USERA5= <user>
##$V9= 5
##$VALIST= <valist>
##$VCLIST= <CCCCCCCCCCCCCCC>
##$VD= 0
##$VDLIST= <DDDDDDDDDDDDDDD>
##$VPLIST= <PPPPPPPPPPPPPPP>
##$VTLIST= <TTTTTTTTTTTTTTT>
##$WBST= 1024
##$WBSW= 4
##$XGAIN= (0..3)
0 0 0 0 
##$XL= 0
##$YL= 0
##$YMAX_a= 2511
##$YMIN_a= -1588
##$ZGOPTNS= <>
##$ZL1= 120
##$ZL2= 120
##$ZL3= 120
##$ZL4= 120
##$ABSF1= 298.5841
##$ABSF2= -158.5842
##$ABSG= 5
##$ABSL= 5
##$ALPHA= 0
##$AQORDER= 0
##$ASSFAC= 0
##$ASSFACI= 0
##$ASSFACX= 0
##$ASSWID= 0
##$AUNMP= <proc_1d>
##$AXLEFT= 0
##$AXRIGHT= 0
##$AXTYPE= 0
##$AXUNIT= <>
##$AZFE= 0.1
##$AZFW= 0.5
##$BCFW= 0
##$BC_mod= 2
##$BYTORDP= 0
##$COROFFS= 0
##$CY= 12.5935478210449
##$DATMOD= 1
##$DC= 0
##$DFILT= <>
##$DTYPP= 0
##$F1P= 47.1127640792319
##$F2P= -24.0371245302204
##$FCOR= 0.5
##$FTSIZE= 32768
##$FT_mod= 6
##$GAMMA= 0
##$GB= 0
##$INTBC= 1
##$INTSCL= 7.269226e-011
##$ISEN= 30
##$LB= 10
##$LEV0= 0
##$LPBIN= 0
##$MAXI= 12.09355
##$MC2= 0
##$MEAN= 0
##$ME_mod= 0
##$MI= 0.7550151
##$NCOEF= 0
##$NC_proc= -10
##$NLEV= 6
##$NOISF1= 298.5841
##$NOISF2= 270.0111
##$NSP= 0
##$NTH_PI= 0
##$NZP= 0
##$OFFSET= 298.5841
##$PC= 1.4
##$PHC0= 16.84241
##$PHC1= -16.22269
##$PH_mod= 1
##$PKNL= yes
##$PPARMOD= 0
##$PPDIAG= 0
##$PPIPTYP= 0
##$PPMPNUM= 100
##$PPRESOL= 1
##$PSCAL= 0
##$PSIGN= 0
##$REVERSE= no
##$SF= 81.014009
##$SI= 32768
##$SIGF1= 270.0111
##$SIGF2= -158.5842
##$SINO= 77.54984
##$SIOLD= 32768
##$SREGLST= <31P.CDCl3>
##$SSB= 0
##$STSI= 32768
##$STSR= 0
##$SW_p= 37037.037037037
##$SYMM= 0
##$S_DEV= 0
##$TDeff= 32768
##$TDoff= 0
##$TI= <>
##$TILT= no
##$TM1= 0
##$TM2= 0
##$TOPLEV= 0
##$USERP1= <user>
##$USERP2= <user>
##$USERP3= <user>
##$USERP4= <user>
##$USERP5= <user>
##$WDW= 1
##$XDIM= 32768
##$YMAX_p= 453084863
##$YMIN_p= -3930940
$$ End of Bruker specific parameters
$$ ---------------------------------
##NTUPLES= NMR SPECTRUM
##VAR_NAME=  FREQUENCY,     SPECTRUM/REAL,   SPECTRUM/IMAG
##SYMBOL=    X,             R,               I
##VAR_TYPE=  INDEPENDENT,   DEPENDENT,       DEPENDENT
##VAR_FORM=  AFFN,          ASDF,            ASDF
##VAR_DIM=   32768,         32768,           32768
##UNITS=     HZ,            ARBITRARY UNITS, ARBITRARY UNITS
##FACTOR=    1.13031516577767, 1,            1
##FIRST=     37037.037037037, 174795,        -881663
##LAST=      0,             -457481,         1205172
##MIN=       0,             -3930940,        0
##MAX=       37037.037037037, 453084863,     0
$$ Real data points
##PAGE= N=1
##DATA TABLE= (X++(R..R)), XYDATA
$$ [...]
16549A56532J71767J68944J30164P2325Q447n5704j14777j65413k04754k17930
16539e0399j83249j00838j0205M3617N4290M3309L1575K6074K2119K1351L3322
16528f9034N9579Q4268Q4501N8743L3855K6353J7147j0560m4506p2738r6652j17271
16516d6315j32441j36617j24314j01689q2217o8977n0128r803M7262Q8844Q6830
16505e29565M6765M788M21N1587J45264K42810L05710L15644K66746J63508L3513
16494A047191p6346j29312j25007r3799o5490m9060l6492q836M5724J05284J30349
16483G44206J08825O4187K4412k085k7009p7609j79406l14702m13848m14456l20471
16472h07956j89615p9660j4870J9393N1414R1520J36557J87226K42330K92426
$$ y = [156532, 328299, 497243, 627407, 699732, 708179, 652475, 537698, 372285, 167531, -50399, -233648, -334486, -344691, -301074, -246784, -203475, -171900, -145826, -123707, -102356, -69034, -9455, 74813, 159314, 218057, 251912, 278265, 295412, 284852, 240346, 167608, 70956, -46315, -178756, -315373, -439687, -541376, -623593, -692570, -742698, -752501, -705239, -616395, -529565, -482800, -478012, -477591, -426004, -280740, -37930, 267780, 583424, 850170, 1013678, 1047191, 970845, 841533, 716526, 622727, 557237, 508177, 471685, 462849, 508573, 613857, 744206, 853031, 917218, 941630, 939545, 912536, 834927, 655521, 340819, -73029, -487485, -807956, -997571, -1077231, -1092101, -1072708, -1021294, -929774, -793217, -605991, -363661, -71235]
16462g1235L24139L08552K05812L5518j03997j45879j12947o2152l2750m0132
16452C04929q3854j41949j70234j40372p2142n245M2727P3169Q3182P1984N5202
16441A7397M8970N1839N2980N1984N8819O9304O3997L7598P435p271j0251j9772
16429D23029l5255m0243l0561k3205m0454q1202j12441r2975r238J13028K26000
16418B96483K84519K77284K30922J83533J63168J67432J66948J37838Q1401J6993
16408B006521l6532p0648q3714q1048p9679r0078r7522q3905n0107r736J6708
16397A340260J1618j6519l5590k9667j9262k8949n1426n4470j8852L4698N4872
16386A186713p413j60527l42301m47031m18627k97888j61479m6013N5670J48576
$$ y = [-71235, 252904, 561456, 767268, 802786, 698789, 552910, 439963, 377811, 345061, 304929, 221075, 79126, -91108, -231480, -303622, -308867, -266140, -192971, -109789, -37805, 17397, 66367, 118206, 171186, 223170, 281989, 351293, 415290, 452888, 460323, 453052, 442801, 423029, 387774, 347531, 316970, 293765, 253311, 172109, 59668, -33307, -42545, 70483, 296483, 581002, 858286, 1089208, 1272741, 1435909, 1603341, 1770289, 1908127, 1989528, 2006521, 1969989, 1899341, 1815627, 1734579, 1654900, 1564822, 1467300, 1383395, 1333288, 1323552, 1340260, 1351878, 1335359, 1299769, 1270102, 1250840, 1221891, 1170465, 1115995, 1097143, 1131841, 1186713, 1179300, 1018773, 676472, 229441, -189186, -487074, -648553, -694566, -638896, -490320]
16376d90320K18652K52278K44337J97525J21883L8179k2356m2741m0524m1741
16366D35172m2334j3004N0877J11751J36976J32842J15590P2006j5001j19637
16356H65238j85527j77771j14029m5099n267J1614L1383P0395J20310J56221J59851
16345H87319J32862R0240M4531L487k9787o5045j15502j72737k08212k10360j97187
16334A59609j82308j55199j07330m6599J7437O9773Q9018P8683O7074O6591O7904
16323A24653O9158Q4112J28304J99253K70492L10940L05378K62205K04942J57993
16313B117430J37987J43224J45200R1261o8964l21321n45869o18690n36054l74646
16303A69558k06773p7096j871L2818N4857P8936J03728J22261J19521Q2106K0388
$$ y = [-490320, -271668, -19390, 224947, 422472, 544355, 582534, 560178, 517437, 476913, 435172, 392838, 379834, 430711, 542462, 679438, 812280, 927870, 999876, 984875, 865238, 679711, 501940, 387911, 342812, 337545, 349159, 380542, 450937, 571247, 727468, 887319, 1020181, 1110421, 1154952, 1158439, 1128652, 1063607, 948105, 775368, 567156, 356796, 159609, -22699, -177898, -285228, -331827, -314390, -244617, -155599, -76916, -9842, 56749, 124653, 193811, 277923, 406227, 605480, 875972, 1186912, 1492290, 1754495, 1959437, 2117430, 2255417, 2398641, 2543841, 2635102, 2566138, 2244817, 1698948, 1080258, 544204, 169558, -37215, -114311, -116182, -83364, -28507, 50429, 154157, 276418, 395939, 478045, 498433]
16292D98433l2320n0161l8602k3515k3685m1620o8035q4462p7558m9563n941N0867
16280E3838J10305J59008J91190K00466J77195J23651N3365k1527q8424j30948
16270H28119j41987j34842j26450j21361j17366j14830j17805j30795j50065j63604
16260d90986j64655j43713q9833j2033P1576J54951K33212K88157K96044K46232
16250C88952J53705M8557m6572j23488j76468k01603k08751k16759k36185k56537
16240h75149k46764j80558p1689L2453J00608J32689J36959J19074Q3129L5767
16230g33481o450k5884k2481p848J5456N3930R8669J22093J11525Q6187O8357
16219b39927N3619K6167q615k4779k541N3384J24104J89235K24236K09345J45821
$$ y = [498433, 466113, 415952, 377350, 353835, 330150, 288530, 220495, 136033, 58475, 8912, 2971, 53838, 164143, 323151, 514341, 714807, 892002, 1015653, 1069018, 1047491, 959067, 828119, 686132, 551290, 424840, 303479, 186113, 71283, -46522, -177317, -327382, -490986, -655641, -799354, -889187, -901220, -829644, -674693, -441481, -153324, 142720, 388952, 542657, 591214, 544642, 421154, 244686, 43083, -165668, -382427, -618612, -875149, -1121913, -1302471, -1374160, -1341707, -1241099, -1108410, -971451, -852377, -769248, -733481, -739931, -765815, -788296, -796144, -780688, -726758, -628089, -505996, -394471, -308284, -239927, -186308, -160141, -168756, -193535, -196076, -142692, -18588, 170647, 394883, 604228, 750049]
16208G50049N0996m7633j09422j07498n6201P306N5222P3142N3938R911k5058
16197F54752k1852J5700N7876Q0350P2498L3262k7421r0008j32323j49321j52675
16186C40838j37732q5991l392P8211J30200J41549J24450J00933P3109L2147q885
16175G85437k6920j9461n3J6694K5108L1556L6196K8991J4688J3197K7978M0616
16163I74027L1975j0652q7875j73277k21955k02634j28751n2769k0921l8922p8407
16152a0161j06358j09375j03450j15169j44854j65285j58012j28192q7221m4937
16142a173014j4922j129J3214N0089J16039J84863K10307J77412J12550M6794
16132b77797N071O696M5252Q5473R3515O3780J8456j0359P68N5659J28397J71035
$$ y = [750049, 801045, 753412, 643990, 536492, 480291, 487597, 542819, 615961, 669899, 679810, 654752, 632900, 648600, 706476, 786826, 859324, 892586, 865165, 775157, 642834, 493513, 340838, 203106, 117115, 113723, 191934, 322134, 463683, 588133, 689066, 762175, 794322, 785437, 758517, 739056, 739003, 755697, 780805, 812361, 848557, 877548, 892236, 905433, 933411, 974027, 1006002, 995350, 907475, 734198, 512243, 309609, 180858, 128089, 107168, 68246, -10161, -116519, -225894, -329344, -444513, -589367, -754652, -912664, -1040856, -1128077, -1173014, -1187936, -1189065, -1175851, -1125762, -1009723, -824860, -614553, -437141, -324591, -277797, -272726, -266030, -220778, -135305, -41790, 21990, 40446, 30087, 30855, 86514, 214911, 385946]
16120C85946J57632J06214M8151M869j7704l7607p6122j28615j68367j67713j19385
16109a2701m6187J5201L9509J9658l2678r1832j33327j46098j34925j06731o0332
16098f90443l464M1092O6094Q7843J17453J51197J73780J57127R0064P515m4282
16087A53976n9666o4620p9601j10450j43009j47668j12730o3740l5602l6979n3139
16076g53228o6392o6051n1415k8501k801K3387M9364P4414R4771J01142P9568
16065e45742K5707m2411r2486r6053n4230k032K8603L3736K1975O91k0379l3341
16053g75962l7857l4872k2728M534N0123J04836J56828K05422K53510K88841K91688
16042D84363K56020J91087J09045K6177l5034p2552j07053j42762j61392j51271
$$ y = [385946, 543578, 649792, 697943, 702812, 685108, 647501, 571379, 442764, 274397, 106684, -12701, -58888, -43687, -4178, 15480, -17198, -109030, -242357, -388455, -523380, -630111, -690443, -693907, -652815, -586721, -498878, -381425, -230228, -56448, 100679, 190743, 198258, 153976, 94310, 29690, -49911, -160361, -303370, -451038, -563768, -627508, -663110, -700089, -753228, -819620, -885671, -937086, -965587, -968388, -945001, -895637, -821223, -726452, -625310, -545742, -520035, -562446, -654932, -750985, -805215, -807247, -778644, -744908, -722933, -722242, -742621, -775962, -813819, -848691, -871419, -866885, -816762, -711926, -555098, -349676, -96166, 192675, 484363, 740383, 931470, 1040515, 1066692, 1031658, 959106, 852053, 709291, 547899, 396628]
16032C96628j16979p5714m6336k9664j1895P199R042j2963m0796n5594n8980o5996
16020a02048q3243j01785j10287j06987r5335o7470q229O8645J23750J39748J30005
16009b13236J08674P9474N0848L6017L5279M0403M2684L0287k192m9889j10518
15998D7831j77967k28601k44012k30946k04417j65060j05154l2274L2037O8885
15988a239678P0261M2278K875k4956k9692k2636k8358o0507j01247j22645j13226
15977a627531p4255j6621M2223Q7509J14303J26122J30108J39781J66322J94539
15967g17500J89178J34700N4861o619k2988k215K9897M8668L6250o843n2232o3808
15955c78651l3630K1561Q7250J45379J76807J80867J70204J52656J24479Q0696
$$ y = [396628, 279649, 203935, 157599, 127935, 116040, 123239, 132281, 119318, 78522, 22928, -36052, -102048, -185291, -287076, -397363, -504350, -599685, -667155, -675384, -606739, -482989, -343241, -213236, -104562, -25088, 25760, 61777, 97056, 137459, 180143, 210430, 208238, 158349, 47831, -130136, -358737, -602749, -833695, -1038112, -1203172, -1308326, -1340600, -1308563, -1239678, -1169417, -1127139, -1124264, -1149220, -1178912, -1201548, -1229906, -1290413, -1391660, -1514305, -1627531, -1701786, -1718407, -1676184, -1588675, -1474372, -1348250, -1218142, -1078361, -912039, -717500, -528322, -393622, -338761, -345380, -368368, -370583, -340686, -292018, -255768, -262611, -314843, -378651, -412281, -390720, -303470, -158091, 18716, 199583, 369787, 522443, 646922, 727618]
15945G27618K5621l0221p8150j14502j36284j38190j19359q6044m8206j7642J076
15934a4283J7466M6779R1459J32381J44291J18890P5839M0580J5098j7810p1703
15923E78987j37923j90394k08173j83529j22555m6858K5121R4310J64374K21322
15913A94682K34871J84628Q8006r024p7678j24921j57684j67483j56794j40267
15903a31664j25210j08684q3288m3781R210O5837J02900R8508N2464j3781o8686
15892b46175q9075p3963m4367k4436j9250j7434j3532k2779n4749q4112p4809
15881g64681k3778L8728Q2075R0108O1692J3710k7874n2517p8968j24467j66244
15870i52216j68937j33278q1160k4968K6394O3364Q6259J05993J31503J58415
$$ y = [727618, 753239, 723018, 644868, 530366, 394082, 255892, 136533, 50489, 2283, -15359, -14283, 3183, 49962, 141421, 273802, 418093, 536983, 612822, 653402, 668500, 650690, 578987, 441064, 250670, 42497, -141032, -263587, -310445, -285324, -191014, -26640, 194682, 429553, 614181, 702187, 693163, 615485, 490564, 332880, 165397, 8603, -131664, -256874, -365558, -448846, -492627, -483417, -417580, -314680, -216172, -163708, -177489, -246175, -335250, -409213, -453580, -478016, -497266, -514700, -528232, -551011, -605760, -689872, -764681, -788459, -749731, -667656, -577548, -515856, -502146, -530020, -582537, -661505, -785972, -952216, -1121153, -1254431, -1335591, -1360559, -1334165, -1270801, -1184542, -1078549, -947046, -788631]
15860g88631J66410J36348P8404K8930J0514Q411m895l2765n5197n4821l3587
15849e40879r182L034M182R099K4435L9290M7676N4761O0650O3379O9358P7484
15837i6713O9604L9925P908j2775k4422k6021k0010k4649n8713j20492j76405
15826d42763j82132j32645p7252o2542p5432o9206k6136M0088J27233K37266L40708
15815c22813L93922L84248L35647K64828J61685K8244j03972j95988k17533j59443
15805E68825n0647N1383J01700R2789M7116l672m3326p8313j17837j59850j98295
15794B09873k24948k27858k02483j53135q6403j9114K7110N3820Q1323J17857
15784d23958J51263J67445J68823J65292J55700J32712R4011M4599o563n4933
$$ y = [-788631, -622221, -485873, -407469, -378539, -368025, -359614, -364509, -397274, -452471, -507292, -540879, -550061, -547027, -542845, -533746, -509311, -470021, -422345, -367584, -306934, -243555, -174197, -96713, -27109, 12816, 20724, 7949, -16473, -42494, -62504, -87153, -145866, -266358, -442763, -624895, -757540, -834792, -897334, -972766, -1041972, -1068108, -1028020, -900787, -663521, -322813, 71109, 455357, 791004, 1055832, 1217517, 1245761, 1141789, 945801, 728268, 568825, 518178, 569561, 671261, 764050, 811166, 807494, 764168, 685855, 568018, 408168, 209873, -15075, -242933, -445416, -598551, -684954, -704068, -676958, -623138, -541815, -423958, -272695, -105250, 63573, 228865, 384565, 517277, 611288, 655887, 649324, 594391]
15774E94391j01848j46463j80597j91366j70579j33010j12314j20779j31060j12801
15764h06426o9423k7737j0662j6678j6095K3956J05876J92089K35199K17752J59934
15753a2215R6627N5237M2031L6863J0672m5285j15782j81404k26430k41868k29499
15742h11053j94368j37670o1524K0112Q0447R7760P3686L3360j3j9885k3460m720
15730i47328L5666Q3750J22784J34058R2338r254j34972k31056k71770k64753
15720a390537k16329j26253j4264P6370J08602Q2030L5840J7946M6985J06408
15710a273202J67966K12727K36648K43420K30858J95317J41838Q1195K9707M749
15700B71223J1557L7926O5963Q3053P8962N6721M0457M5789O2036P3573P6109
$$ y = [594391, 492543, 346080, 165483, -25883, -196462, -329472, -441786, -562565, -693625, -806426, -875849, -903586, -914248, -930926, -947021, -923065, -817189, -625100, -389901, -172149, -12215, 84412, 139649, 181680, 218543, 229215, 183930, 68148, -113256, -339686, -581554, -811053, -1005421, -1143091, -1204615, -1184503, -1104056, -1006296, -932610, -899250, -899263, -919148, -942608, -947328, -911662, -827912, -705128, -571070, -478732, -487986, -622958, -854014, -1125784, -1390537, -1606866, -1733119, -1747383, -1671013, -1562411, -1480381, -1444541, -1426595, -1379610, -1273202, -1105236, -892509, -655861, -412441, -181583, 13734, 155572, 236767, 266474, 271223, 282780, 320706, 386669, 469722, 548684, 605405, 645862, 691651, 753687, 827260, 903369]
15689I03369P2501O4401N3323L9131J2105l1885p3562r5291j12881j47713j87743
15678D95755k09593k11660k05088j92777j71560j49433j36744j18731p0240M916
15668i65155P5170J14867J16764Q1264K1392l4590o6367p1370n1985j0900M5607
15657g45303J05072J46510J51146J22217Q4904O1777N6233O0540O6145O5719N4279
15646B29239L2687N629k1183m3499o0421p4444r0574j05522j04668q1635m6768
15635c61159j2411J4875L0282L1235K1352M435k4482o4289q6078n2465L2566J16058
15623c50081J52925J50385J39139J20050P1034o461p9474j21425j36877j42766
15613b03551j42807j31852j15661j03843q3986l0691N9113J56652K22043K33946
$$ y = [903369, 975870, 1040271, 1093594, 1132725, 1144830, 1112945, 1039383, 944092, 831211, 683498, 495755, 286162, 74502, -130586, -323363, -494923, -644356, -781100, -899831, -970071, -965155, -889985, -775118, -658354, -577090, -555698, -590288, -656655, -728025, -780010, -790910, -745303, -640231, -493721, -342575, -220358, -135454, -73677, -17444, 43096, 109241, 174960, 229239, 261926, 267555, 246372, 202873, 142452, 68008, -22566, -128088, -232756, -314391, -361159, -373570, -358695, -328413, -297178, -275826, -271391, -295873, -360162, -446240, -498705, -466139, -350081, -197156, -46771, 92368, 212418, 283452, 276991, 197517, 76092, -60785, -203551, -346358, -478210, -593871, -697714, -781700, -812391, -753278, -596626, -374583, -140637]
15603a40637K03824J56221J02467M4994k662j8590P487O7410J34466J72127J57374
15592H84481R7997K6838k8434o5652r2952j12419j23715j24103j05323o4031j1511
15581B81176L8784P7105Q9351O4987J4641l8606q2726j16659j42548j60645j62598
15570a37738j41982j13816j00589r9574r1694p2749n3693m5157m2879k9110k94
15559i29275K5992M4135P8593J50208K35309K73665K23629J01649k8064r6492
15549G9349q0168j8613K7926L7835K8889K2364K9264N0469P2333P4890N6465K9308
15537D10311o081n8157j16739j49694j33112p3323l760M3826O7869Q2937R1035
15526A55112Q4900O3725L4516O209j4813k4751k3350r143K1616N5049O0901L2790
$$ y = [-140637, 63187, 219408, 321875, 366869, 364207, 345617, 353104, 420514, 554980, 727107, 884481, 982478, 1009316, 980882, 915230, 822278, 709859, 586144, 462041, 356718, 292687, 281176, 319960, 397065, 486416, 551403, 566044, 527438, 444712, 328053, 185505, 24860, -137738, -279720, -393536, -494125, -593699, -685393, -758142, -811835, -856992, -899871, -928981, -929275, -903283, -859148, -780555, -630347, -395038, -121373, 102256, 203905, 175841, 79349, -819, -19432, 8494, 46329, 75218, 97582, 126846, 177315, 249648, 324538, 381003, 410311, 404230, 346073, 229334, 79640, -53472, -126795, -130555, -86729, -18860, 64077, 155112, 240012, 303737, 338253, 344462, 329649, 304898, 281548, 272405, 294021, 349070, 409971, 442761]
15514D42761O267K2162Q6389J69289K28259K29981J66310N5290p3661j91764k73944
15503H67339l03913k85586k37103j70936r1918j2803L5693K3280m5647j23580
15493c45174j50086j03429k3329L2898M2927K0155j1772l6805m9710m9087l5119
15482g08531j9099j5954k1531k0117m948K0585N2226Q8158J27366J60626J65970
15471a75249J27317N4264k3765p3285p4179l6656M945J2045l7925j23010j86488
15460e31986j86201j17932p038J04361J69952J57555P9120q796o0480p7735p9803
15449e58983p0056m5863k0717j4146j9099p340L0232P0808R3873J12271J44283
15438b84737J71127J62577J22816P2098R750o5653j28314j48116j24206q1166
$$ y = [442761, 449028, 471190, 557579, 726868, 955127, 1185108, 1351418, 1406708, 1333047, 1141283, 867339, 563426, 277840, 40737, -130199, -222117, -234920, -199227, -175947, -221594, -345174, -495260, -598689, -622018, -589120, -546193, -526038, -537810, -574615, -624325, -673412, -708531, -727630, -743584, -765115, -785232, -790180, -769595, -717369, -629211, -501845, -341219, -175249, -47932, 6332, -17433, -90718, -164897, -201553, -196608, -184563, -222488, -345498, -531986, -718187, -836119, -843157, -738796, -568844, -411289, -332169, -340965, -401445, -479180, -558983, -629039, -674902, -695619, -709765, -728864, -736204, -705972, -635164, -541291, -429020, -284737, -113610, 48967, 171783, 243881, 253631, 187978, 59664, -88452, -212658, -293824]
15428b93824m3608j9990K242M4686J09443J72070K06646K03737J68684J12300
15418F62386M4156k2140o5766p5134n9750m1033l2710k6015n215K7074M9633M1522
15406D97008L335l9242o0024n6708m8993n6023p5203r0505r7364j06865j27852
15395b58436j59311j90144k01673j80992j27603n4486J6956P3730J14635J38231
15385h29093J39440J11225N1651k3714q3963j08347j05969r9308r9102r9410r0781
15374a237371p1993m1709M475O1522J14834J52221J69509J74767J87822K18061
15364b67862K44237K37323J94642J33070O6908J0666j1984R938M5610M4959j8001
15353F89506j28016k31521k71277k37614j65224p8707K2049J27172K10683K58473
$$ y = [-293824, -337432, -357422, -355180, -310494, -201051, -28981, 177665, 381402, 550086, 662386, 706542, 684402, 618636, 543502, 483752, 442719, 410009, 383994, 378779, 405853, 455486, 497008, 500343, 461101, 401077, 344369, 295376, 239353, 164150, 73645, -23719, -130584, -258436, -417747, -607891, -809564, -990556, -1118159, -1172645, -1155689, -1081959, -967324, -829093, -689653, -578428, -526777, -550491, -634454, -742801, -848770, -948078, -1047180, -1146590, -1237371, -1309364, -1351073, -1346598, -1285076, -1170242, -1018021, -848512, -673745, -485923, -267862, -23625, 213698, 408340, 541410, 608318, 618984, 607000, 616938, 662548, 707507, 689506, 561490, 329969, 58692, -178922, -344146, -422853, -400804, -273632, -62949, 195524]
15343A95524K69714K41482J76165R0677Q018n6851j02771j28843j31094j17893
15333D44128j02320p9410m2093q781k543j8174l7879n7012p4365q3085p7420n9386
15321a98340l9222k8239k7529k4772k492M2607Q8079J09048J09778J13699J29872
15310B72489J51891J67735J56033J02280K3360m6091r1585j22705j39639j26141
15300C47627p9524j8506L4854O9577Q4661Q1297N9819K0746k5101n7824p0773
15289D46853p7098q6980r2425p8344l6862K8186J04495J71848K07145J96241J36389
15278I19448M1937n7196j36124j82664j89803j56758r4180k4054K8552N2075N5440
15267B56673N1127M2367L1730J8917j2930p4030j39129j73971j69207j32726p3062
$$ y = [195524, 465238, 706720, 882885, 973562, 981580, 924729, 821958, 693115, 562021, 444128, 341808, 262398, 220305, 211524, 208981, 190807, 152928, 95916, 21551, -61534, -138954, -198340, -237562, -265801, -293330, -318102, -320594, -277987, -189908, -80860, 28918, 142617, 272489, 424380, 592115, 748148, 850428, 873788, 827697, 736112, 613407, 473768, 347627, 268103, 249597, 284451, 354028, 438689, 519986, 579805, 600551, 575450, 517626, 446853, 369755, 282775, 190350, 112006, 75144, 103330, 207825, 379673, 586818, 783059, 919448, 961385, 904189, 768065, 585401, 395598, 238840, 144660, 120606, 149158, 201233, 256673, 307800, 350167, 381897, 400814, 387884, 313854, 174725, 754, -168453, -301179, -374241]
15256c74241K73P0826J20489J37055J12807N0926k5470p6696q0455n5783k4590
15245a44859J3486N4155Q1719Q9354Q3731P7191P7740P9300O3777K0580l7557
15234D58617q4388j02058r2145p1305n9645o6743q4633r2688o8560o546P1178
15223a98916J31676J59900J68376J78426J98211K13759J97356J37345N2773l3008
15213A205898j12222j78311k22826k50780k76462k91861k63975j84246q4059R115
15203f49729R1421J60553K06033K20346K07242J77158J37660R3119M5115o287
15193F82631n4113r2676j25332j51211j59738j43600j06599n6113J079M4936M8318
15182a12418J6533j5910l0029k9199j4323J0781K7829K6088J6924J8365L9869
$$ y = [-374241, -373968, -303142, -182653, -45598, 67209, 118135, 92665, 15969, -64486, -120269, -144859, -131373, -77218, 4501, 93855, 177586, 254777, 332517, 411817, 475594, 496174, 458617, 374229, 272171, 180026, 108721, 49076, -17667, -102300, -194988, -263548, -270094, -198916, -67240, 92660, 261036, 439462, 637673, 851432, 1048788, 1186133, 1238906, 1205898, 1093676, 915365, 692539, 441759, 165297, -126564, -390539, -574785, -658844, -649729, -558308, -397755, -191722, 28624, 235866, 413024, 550684, 643803, 688918, 682631, 628518, 535842, 410510, 259299, 99561, -44039, -150638, -206751, -205672, -160736, -112418, -95885, -111795, -141824, -171023, -185346, -174565, -146736, -120648, -103724, -85359, -45490]
15171d5490P3950R7390R9190R5713R9950R6795O7558K2291q751m471K6700N0482
15159F71307L7221j2096o8637j03550j09569r3021n6712o408L5849M3585P581
15148C45550n4651j14660j57014j80118j77659j40399p9219k3978N035J3598K1943
15137e41572M5079P4704Q4725O8405M8483M7208O9722J09244J43141J38533Q0452
15126C68124j6245j17964j90346k14552j95526j59741j34472j23472j12376r2809
15116i89379o3587k3204K1258N7769Q2336R2167Q2444O3381O0674Q3257J11350
15105d21534J21092R4930K3699p3027j51220j83837j86065j87047j85450j57631
15095a306090j01510m5041j2887O42J8453N1444R6138J41187J75777J98207K12884
$$ y = [-45490, 28460, 125850, 225040, 320753, 420703, 517498, 585056, 607347, 598596, 594125, 620825, 671307, 708528, 696432, 627795, 524245, 414676, 321655, 264943, 258535, 294384, 337969, 345550, 290899, 176239, 19225, -160893, -338552, -478951, -558170, -582148, -577113, -563515, -541572, -496493, -421789, -337064, -268659, -220176, -172968, -103246, 5998, 149139, 287672, 368124, 351879, 233915, 43569, -170983, -366509, -526250, -660722, -784194, -896570, -989379, -1052966, -1076170, -1054912, -997143, -914807, -822640, -740196, -676815, -616141, -532884, -421534, -300442, -205512, -181813, -254840, -406060, -589897, -775962, -963009, -1148459, -1306090, -1407600, -1452641, -1465528, -1464886, -1446433, -1394989, -1298851, -1157664, -981887, -783680, -570796]
15084e70796K21486K19569K08003J95021J76207J28158L9707o8493j60271k04105
15074A84486j87984j26932n4419r85K1861J9727N165r588j6377j0901J0197M7657
15062a18093Q7585J07248R6449N7596R700j5152n626J8272K4653j7082j16143
15051A29407k32053k90800k49133j37951k9479L4067N6910M6745N07p1739j46213
15040h89732k02364k25105k04134j41402n4097K8891Q3350J08385J18868J33399
15030a243941J66800K17625K68005K93650K76810K22548J60747J14713P4351J8694
15020E70002m9085j04189j31469j35286j25153j02547o3970k4394j5320m3104
15010b24515p1042n8485o028M4197N2338J8422l2224p8033j03252r8885o8538
$$ y = [-570796, -349310, -129741, 78262, 273283, 449490, 577648, 617355, 548862, 388591, 184486, -3498, -130430, -184849, -185834, -163973, -144246, -139081, -148669, -165046, -175947, -165750, -118093, -30508, 76740, 173189, 230785, 240485, 225333, 219707, 237979, 262632, 245550, 129407, -102646, -393446, -642579, -780530, -810009, -775942, -719032, -672287, -671780, -743519, -889732, -1092096, -1317201, -1521335, -1662737, -1716834, -1687943, -1604593, -1496208, -1377340, -1243941, -1077141, -859516, -591511, -297861, -21051, 201497, 362244, 476957, 551308, 570002, 520917, 416728, 285259, 149973, 24820, -77727, -141697, -166091, -181411, -224515, -295557, -354042, -360070, -315873, -263535, -245113, -277337, -355370, -458622, -557507, -626045]
14999f26045k6375N745J2558O353K2645Q1861J61933K20336K28719J83751J08704
14988C80185L8270j0816l9891n5490o5093o5371m1589J2700Q0691J32678J49094
14977E15368J26988P3747N747n2556p8053o1103j5327K8540M9961N6003O2737
14966G12052O9761O9100O0580N1959N6305P3703P9243N3839R774k9965o1304q8183
14954A056864r6995p4046l5681j0566p172k1743n1013p8719p6872l5936J5191
14943E83312L5894J9082j1369k8968j7648J7569M7641L6826k7152j13255j69924
14932C72008j67722j13964m1974J8052O1894Q9947Q1351K1079n8173j01443r7199
14921F3856q4130r4035j15707j21642j00021n5778k327M2826O3891N4194K0134
$$ y = [-626045, -652420, -646675, -634117, -627764, -605119, -523258, -361325, -140989, 87730, 271481, 380185, 418455, 407639, 367748, 312258, 247165, 181794, 140205, 152905, 233596, 366274, 515368, 642356, 716103, 721850, 669294, 591241, 530138, 514811, 543351, 593312, 649315, 712052, 781813, 850913, 911493, 963452, 1019757, 1093460, 1172703, 1226542, 1236316, 1206351, 1145047, 1056864, 959869, 885823, 850142, 839576, 832404, 810661, 759648, 680929, 604057, 568121, 583312, 619206, 638288, 626919, 597951, 580303, 597872, 645513, 682339, 655187, 541932, 372008, 204286, 90322, 48348, 66400, 128294, 218241, 299592, 320671, 262498, 161055, 63856, -20274, -114309, -230016, -351658, -451679, -507457, -509784, -466958, -403067, -348873, -328739]
14910c28739q019O580O0386J10820J24905J08996R1174Q1958P0102M9623K5022
14899C92808J392j4120j6683j5660l2071p8417j46400k16768k70311k94407k89164
14888i79801k57955j90048p4551O4402J76934K35346K45635K22367J80981J42522
14878b34168J25166J27606J26759J02574O5551M0981L2798K5105J476m4001j06015
14867B63832j72103k18174k11493j44930n7911R918N5614Q4283R1397Q1029O9936
14856a48602P6088J07730J54342J88305J85531J47386R4730M3868n396o8097j57850
14845F18035k60064l31600l39341k84726j92214r5147j7418M2849R2850J21992
14835f44784J20836J01132Q6593R7174J33473J70584J84908J81886J81150J84651
$$ y = [-328739, -336758, -330178, -269792, -158972, -34067, 74929, 166103, 248061, 318163, 367786, 392808, 394200, 380080, 363397, 347737, 315666, 237249, 90849, -125919, -396230, -690637, -979801, -1237756, -1427804, -1502355, -1437953, -1261019, -1025673, -780038, -557671, -376690, -234168, -109002, 18604, 145363, 247937, 313488, 354469, 387267, 412372, 413848, 369847, 263832, 91729, -126445, -337938, -482868, -540779, -530861, -475247, -390964, -299567, -218538, -148602, -72514, 35216, 189558, 377863, 563394, 710780, 805510, 849378, 843982, 775885, 618035, 357971, 26371, -312970, -597696, -789910, -885057, -902475, -859626, -766776, -644784, -523948, -422816, -336223, -239049, -105576, 65008, 249916, 431802, 612952, 797603]
14825G97603J71510J23666M9768k4940q5820j28132j48619j52113j41718j09892
14815C51313o0214j7993l253l647J5040P0048J37073J67907J35379M9336n5277
14804G85712j25940j25467p0509j4494R314J1511J3621K0438K1387M718j7860
14793E12431k1691n918R450J1268J202j5200l4757o3539j13963j80627k35782
14782a37126k46051k01365j28597n5221J8921R5344J45529J33877P0240O782j6923
14771c14590k047K3548L9649N2893P8912J21236J63188J75636J50151J04865N0732
14760F44173o626m6997n1051j8354L5107Q1360Q9444N1503q926o6487j12145j41378
14748D49623j50201j43791j32230j22448j16463j08468q6485m4475J1953P2204
$$ y = [797603, 969113, 1092779, 1142547, 1117607, 1031787, 903655, 755036, 602923, 461205, 351313, 291099, 273106, 269853, 266206, 281246, 351294, 488367, 656274, 791653, 840989, 785712, 659772, 534305, 463796, 449302, 458616, 470127, 483748, 504186, 525573, 530291, 512431, 490740, 484822, 494272, 505540, 506742, 491542, 456785, 393246, 279283, 98656, -137126, -383177, -584542, -713139, -768360, -749439, -654095, -508566, -374689, -304449, -297667, -314590, -316637, -293089, -253440, -200547, -121635, -399, 162789, 338425, 488576, 593441, 644173, 637547, 590550, 539499, 521145, 556252, 637612, 727056, 778559, 769633, 703146, 591001, 449623, 299422, 155631, 23401, -99047, -215510, -323978, -410463, -454938, -442985, -370781]
14738c70781J24928J55365J44611R0170J8137m3580q3259r0846n8192L603O7775
14727d2069J12349J33844J38694J31401J14017P9843J8711o0584j34400j83110
14717C08696j96346j77559j44616j16208r7936q8424q3445p5064n9126l5590l768
14706g69386L3784O9846R9934J23098J37046J35795J13973O8979L508o4752j02174
14695a50349q1581j0902O8925J13115J09431Q7324P4201P1538P7119Q7739R4313
14684E40873Q9435O6431J9427m2928r9429j37788j59851j72889j78883j70423
14674b46025j41012r4298l8275K2906Q8860J59464K28922K78329K83000K37576
14664G79447J65836J01201M9504j3903r8191j70795j88497j36573k9267J01356
$$ y = [-370781, -245853, -90488, 54123, 144293, 162430, 118850, 35591, -55255, -113447, -109844, -42069, 70280, 204124, 342818, 474219, 588236, 668079, 686790, 626206, 491806, 308696, 112350, -65209, -209825, -326033, -423969, -512393, -595838, -670902, -730028, -765618, -769386, -735602, -665756, -565822, -442724, -305678, -169883, -55910, 13069, 16577, -48175, -150349, -231930, -242832, -173907, -60792, 48639, 135963, 210164, 281702, 358821, 446560, 540873, 630308, 696739, 716166, 673238, 573809, 436021, 276170, 103281, -75602, -246025, -387037, -481335, -519610, -496704, -407844, -248380, -19458, 258871, 541871, 779447, 945283, 1046484, 1095988, 1082085, 983894, 813099, 624602, 488029, 458762, 560118]
14654E60118K08035K47600K12788J27102J3720j02378j85945k18438k14442j94471
14644D53689j59060j07080n7776k6785r270j749l171o479j1284k7658n8959q8706
14632a04288r3190o3215o747O4682J31132J62146J40714P7158k339p0891j09676
14621A25486j19462j15281j04580q5989n9804k9899k366K2535N1927Q2465R5444
14610a39524P6866K9238l1876q2292j04573r6139n7235R999R0255J48618J42361
14599a4302O0654n0896j32917j62794j43792q2592N887R1638J43061J47760J18251
14588b0042P9899M4317J970m9125r2774j16116j17093r7827o5927k8466J1984
14577d49200M6800O3839N9661M2813K8376K1680J3549l327k4963m3654n5578n8342
$$ y = [560118, 768153, 1015753, 1228541, 1355643, 1369363, 1266985, 1081040, 862602, 648160, 453689, 294629, 187549, 129773, 102988, 93718, 91969, 88798, 82319, 71035, 43377, -15582, -104288, -197478, -260693, -267440, -202758, -71626, 90520, 231234, 308392, 306053, 235162, 125486, 6024, -109257, -213837, -299826, -359630, -389529, -391895, -369360, -317433, -234968, -139524, -62658, -33420, -65296, -147588, -252161, -348300, -405535, -395536, -305281, -156663, -14302, 46352, -4544, -137461, -300255, -444047, -526639, -520752, -429114, -286053, -138293, -20042, 59857, 104174, 106144, 57019, -35755, -151871, -268964, -366791, -432718, -461184, -449200, -402400, -338561, -278900, -236087, -207711, -186031, -172482, -175809, -200772, -244426, -300004, -358346]
14565c58346m4670p43P7203J64222K25146K38174J97036J22835O2372M3863N0625
14554G77717M1617j3394j06639j94405k34766k18298j56948o8324J8587O0129
14544i4724K7052o0513j49006j92216j70848j02618k5883L5978P9733J06343J21192
14533d25510J39158J68434J98173K17629K32023K44071K41606K11368J52771Q3964
14523A463687K4474l3026j10602k00811k57798k44098j66816o4168K2384P0799
14513E04025R0257J03462J17470J21461J04910P4142M6867K9047N197l9856r3247
14502A063735j30189j43643j40867j28955j09041p6801k7727L1431Q1306J08070
14492E27319J09062P9094K3320l6350q7400j37144j93296k41555k55378k24958
$$ y = [-358346, -403016, -403759, -326556, -162334, 62812, 300986, 498022, 620857, 683229, 727092, 777717, 819334, 805940, 699301, 504896, 270130, 51832, -105116, -173440, -154853, -94724, -67672, -128185, -277191, -469407, -640255, -742873, -768756, -732778, -653045, -546702, -425510, -286352, -117918, 80255, 297884, 529907, 773978, 1015584, 1226952, 1379723, 1463687, 1488161, 1455135, 1344533, 1143722, 885924, 641826, 475010, 410842, 433226, 504025, 594282, 697744, 815214, 936675, 1041585, 1115727, 1162594, 1191641, 1196838, 1156982, 1063735, 933546, 789903, 649036, 520081, 411040, 334239, 306512, 337943, 419249, 527319, 636381, 715475, 738795, 702445, 615045, 477901, 284605, 43050, -212328, -437286]
14482d37286j60645q2299j5139J9988K4085K1630L6568P3784J24940J72409J96468
14471b5497J94759J79640J56705J23540Q1004L4376n056k4775k6458k5394l1557
14460F31287m0416m6041n0894n7733o2888o1930n8698n9467n9034n1955m4997
14449C7234l9480k4058M913L2493L8731J8334j5223m0301m4545l5773k9147l3273
14437a30095m4174m0884r184L3641O3639Q2321J04876J34042J56302J60741J50549
14426F61774J41803J54954J86320K05350J97280J81966J80463J86292J78098J42798
14416B417098P5826k4351j46655k63076l38505l48586k96688k12837j33588q0967
14406F47671m6801p969L8535P4774P9759M1098l0930j09240j74400k13187k09852
$$ y = [-437286, -597931, -680230, -695369, -675381, -651296, -629666, -593098, -519314, -394374, -221965, -25497, 169262, 348902, 505607, 629147, 710151, 744527, 739471, 714696, 688238, 662844, 631287, 590871, 544830, 493936, 436203, 373315, 311385, 252687, 193220, 134186, 82231, 37234, -2246, -26304, -21391, 11102, 49833, 68167, 52944, 12643, -31902, -67675, -96822, -130095, -174269, -215153, -224337, -190696, -127057, -44736, 60140, 194182, 350484, 511225, 661774, 803577, 958531, 1144851, 1350201, 1547481, 1729447, 1909910, 2096202, 2274300, 2417098, 2492924, 2468573, 2321918, 2058842, 1720337, 1371751, 1075063, 862226, 728638, 647671, 600870, 592901, 631436, 706210, 785969, 827067, 796137, 686897, 512497, 299310, 89458]
14395H9458j67197j13178p1574m4445k2040l296L335p65k986Q483L4837O1640
14383b27728P6599Q3277Q2839P2586O4856P3409Q9736Q8475N2458p261o2316r2866
14371B94064r5910p3514l0277J4107L5155L5407M6736R2243J60618K23486K57736
14360I59851K53579K25438K05373K16089K62763L39162M19798M46626L48705J25668
14350C803052j12019k50293k81828k74079k82756l12456l30554l06683k39669
14341A412715j52991p7000k5276J4587N5644Q8740Q6904L0555o9126j68828k18041
14330I77883k02581j55249j12500q1046n2656k6908j0408k886j413j3106m3703
14319B75427q9677j45214j96936k25579k20358j80516j19544o2932k5373l213
$$ y = [89458, -77739, -190917, -262491, -306936, -328976, -332272, -328937, -329702, -332688, -324205, -289368, -227728, -151129, -67852, 14987, 87573, 152429, 225838, 315574, 404049, 456507, 449246, 386930, 294064, 198154, 124640, 94363, 108470, 143625, 179032, 225768, 318011, 478629, 702115, 959851, 1213430, 1438868, 1644241, 1860330, 2123093, 2462255, 2882053, 3328679, 3677384, 3803052, 3691033, 3440740, 3158912, 2884833, 2602077, 2289621, 1959067, 1652384, 1412715, 1259724, 1182724, 1157448, 1172035, 1227679, 1316419, 1403323, 1433878, 1364752, 1195924, 977883, 775302, 620053, 507553, 426507, 373851, 346943, 336535, 333649, 332236, 319130, 275427, 185750, 40536, -156400, -381979, -602337, -782853, -902397, -965329, -990702, -993915]
14309i93915O067l643j9960n077N8473J37330J78214J57918J01418M4114o781
14298c45842n1292p6089p1898m1038R049O6913J16933J39376J18999O1413o983
14287h0459n5813o5458l7672K292K8769M3027O6206J04857J33568J17564N1399
14276C08280l7790j21095j83547k19258k28553k24790k27859k37498k31013j94851
14266a597974j36185o9156p058M5582R9014J65563K38535K91237K94335K35816
14256d40291J36354M0741k1137n4083p3094q3698q5810q1238p7944q4280r8550
14245i23030j09877j09576r9239q6197o9195l6266J6668P0547J01532J06058R1363
14234a047212N9983K1695l587q351J77J0120N068k0081n1093p4825q5365p5659
$$ y = [-993915, -987848, -991491, -1011451, -1016528, -958055, -820725, -642511, -484593, -383175, -339061, -345842, -397134, -473223, -545121, -586159, -577110, -510197, -393264, -253888, -134889, -73476, -80459, -136272, -201730, -239402, -237110, -208341, -165314, -99108, 5749, 139317, 256881, 308280, 270490, 149395, -34152, -253410, -481963, -706753, -934612, -1172110, -1403123, -1597974, -1734159, -1803315, -1810373, -1764791, -1665777, -1500214, -1261679, -970442, -676107, -440291, -303937, -263196, -284333, -338416, -411510, -495208, -581018, -662256, -740200, -824480, -923030, -1032907, -1142483, -1241722, -1327919, -1397114, -1433380, -1416712, -1346165, -1244633, -1138575, -1047212, -987229, -965534, -969121, -977472, -977295, -967175, -962107, -982188, -1033281, -1108106, -1193471, -1269130]
14222a269130m1306J2865P2089J07768Q6302L267r9452j58174j30850k8610R3589
14211a351642J84776K27544K29937K06178J65365J12570N3825M161j5848p059
14201a90193R390K3957L8750N4363P0032P8884O2356J5663l1187m6623l8776l6663
14189I953m2522l7142j4114J8320N1886Q1408R7336Q8998O1199L3888J1724l0891
14177C30043j12532k04415k46395k06226j13667k7396J6459K2973K2232L2906
14167d86018M0673K5947k426j9604j4924K953K5460M8310N6861L4260j7395p5067
14155c80970j07116r7480o4551l7421k4183j5522j37K3685M0655L2306K092k5829
14143f54471k8215q2M0435P2101Q8750R0731P4619M4322K1194K4461N1723Q2477
$$ y = [-1269130, -1310436, -1297571, -1225482, -1117714, -1031412, -1028145, -1127597, -1285771, -1416621, -1445231, -1351642, -1166866, -939322, -709385, -503207, -337842, -225272, -171447, -167286, -183134, -190193, -180803, -156846, -118096, -63733, 6299, 85183, 147539, 163202, 132015, 85392, 46616, 9953, -32569, -69711, -83825, -65505, -13619, 67789, 165125, 254123, 315322, 349210, 360934, 330043, 217511, 13096, -233299, -439525, -553192, -580588, -564129, -541156, -518924, -486018, -445345, -419398, -421824, -441428, -456352, -453399, -427939, -379629, -322768, -288508, -305903, -380970, -488086, -585566, -650117, -687538, -711721, -727243, -727380, -703695, -663040, -630734, -628642, -654471, -682686, -682768, -642333, -570232, -481482, -390751, -316132, -271810, -250616, -226155, -174432, -91955]
14131i1955R3634P7883N0000L3462M2947O8874Q2342O7395L5525J1579J2545K8060
14119E12291K6127q646n7972r1472q7001m0969K4624Q0528J14356J26850J19418
14108G18134R2698N0614K811m3549q7907j25552j44175j33102r2964l6042K7708
14097B28674Q9440J33286J53945J60090J57620J45043J16057O8304P134n9732
14087A199861j24355j73564j94013j89480j75621j56885j23314p2223j8033J9514
14077h113L1839K8704K7589L9832N9758P1700O9424N3436J8267l4762q4686j10445
14065A62543j07295q0815l9788M398L5261L9042K4391J2549J0845J8768L9303
14054A19202O8949R3885J05074J02522Q1878L6765k2560o1201m9854l064L8016
$$ y = [-91955, 1679, 79562, 129562, 163024, 205971, 274845, 357187, 424582, 460107, 471686, 484231, 512291, 538418, 529772, 471800, 380328, 293327, 252358, 276982, 357510, 471866, 598716, 718134, 810832, 861446, 864257, 820708, 732801, 607249, 463074, 329972, 237008, 200966, 228674, 318114, 451400, 605345, 765435, 923055, 1068098, 1184155, 1252459, 1259593, 1199861, 1075506, 901942, 707929, 518449, 342828, 185943, 62629, -9594, -27627, -8113, 23726, 52430, 80019, 119851, 179609, 251309, 320733, 374169, 392436, 357674, 272988, 162543, 55248, -25567, -65355, -60957, -25696, 13346, 37737, 50286, 61131, 79899, 119202, 188151, 282036, 387110, 489632, 571510, 608275, 585715, 524514, 474660, 471596, 509612]
14043E09612L8841j3432r3503j50890j56359j23949p9313l5720l710J4369K6332
14032f7722L2941K9791J7274o78j6215j8159r194j1608m0158q6212j24705j29596
14020d24241j00838o6412m8367m0147j7801L3030J01210J62247J97899J98564
14010d856J63763J12366P1977N4227N3341N5457M7921L3922K5965K6482L7910
13999F78475O5137R3466R3410M6575l0825r3972j11856r3223o9436o3801q0026
13988D33924j05803j22521j17889q9492l9069K5388Q6009J26044J36516J14814
13978D47921O9520J9036j9351l8152m2559m8555p5523j23410j63628j61108j04373
13967b40182j8653N7602J00798J05073P7097L1655j4901m1837l0796J3576O4279
$$ y = [509612, 548453, 535021, 441518, 290628, 134269, 10320, -68993, -104713, -108423, -94054, -67722, -34781, -4990, 12284, 11606, -4609, -22768, -31962, -43570, -83728, -169940, -294645, -424241, -525079, -591491, -639858, -680005, -697806, -664776, -563566, -401319, -203420, -4856, 158907, 271273, 343250, 397477, 450818, 506275, 554196, 588118, 614083, 640565, 678475, 743612, 837078, 930488, 977063, 946238, 852266, 740410, 647187, 577751, 513950, 433924, 328121, 205600, 87711, -1781, -40850, -15462, 70547, 196591, 333107, 447921, 517441, 536477, 517126, 478974, 436415, 387860, 312337, 188927, 25299, -135809, -240182, -258835, -201233, -100435, 4638, 81735, 113390, 98489, 56652, 25856, 39432, 103711]
13956A03711R2014Q1363L1011m5582j14794j38614j10554o1502j8387J5535L7071
13945a28728L9479L3458M2083P4172J08579J12734P8260K2211l2534o7695p7428
13934B04591p3991o9602n2697n865O0080J10717J23856J07344P8374L8389j4975
13923E06221o4688q7422p5541l8484o8J3588k616k7959m0315l5085k0308o941
13911A20382J064P916J6383K6506L4521L3284K0848N11k6400n3474o0993l2384
13899H8164K8064J01937J68723K10398K11044J56807M7533q3812j84699k24707
13889E19452k08679j68165j42005j42874j51343j43731j17915q9586o2901k0764
13879g28511M6171J22037J81385K02805J77779J18339N0313k445l0394m0943m9498
$$ y = [103711, 195725, 277088, 308099, 262517, 147723, 9109, -101445, -162947, -181334, -165799, -128728, -89249, -55791, -13708, 60464, 169043, 281777, 360037, 382248, 349714, 282019, 204591, 130600, 60998, 8301, 2436, 62516, 173233, 297089, 404433, 482807, 521196, 506221, 441533, 354111, 278570, 240086, 240018, 253606, 250990, 223031, 182716, 147631, 127323, 120382, 121446, 129362, 145745, 172251, 206772, 240056, 260904, 261415, 235015, 181541, 120548, 88164, 116228, 218165, 386888, 597286, 808330, 965137, 1012670, 928858, 744159, 519452, 310773, 142608, 603, -142271, -293614, -437345, -555260, -644846, -707747, -728511, -682340, -560303, -378918, -176113, 1666, 120005, 170318, 167873, 137479, 96536, 47038]
13868D7038o1991o6622n0157j7679Q009K279l4464o8764p8646q1147r4593j04454
13856f01191q5057l9886m814j0907n5683j08493j29265r8988l9849O435J9578
13845a148120J5530K1665M9804R2640J31756J49083J43065J30101J18091J00733
13835a95652Q4638Q2505R0646R6811R3389Q2010P7827J02301J56438K05186K03593
13824A079692J35289K5054p8001j40130j59556j49815j26569j03153q6444p1598
13814C24769m8919j6037J9373M6848O1961O3318M7614J7910r907k0443j5514r617
13802D61356r245j1464j7309k9646m4911n2625m4676k5954n638J5002L4658M3088
13790C12636K7379j5840p4462j25715j47023j30086q5138k6609L4432Q0049Q7922
$$ y = [47038, -14953, -81575, -131732, -149411, -141402, -139123, -173587, -242351, -320997, -402144, -496737, -601191, -686248, -726134, -730948, -741855, -797538, -906031, -1035296, -1134284, -1174133, -1167698, -1148120, -1132590, -1110925, -1061121, -968481, -836725, -687642, -544577, -414476, -296385, -195652, -111014, -28509, 62137, 158948, 252337, 334347, 412174, 514475, 670913, 876099, 1079692, 1214981, 1240035, 1162034, 1021904, 862348, 712533, 585964, 482811, 396367, 324769, 275850, 259813, 279186, 326034, 387995, 451313, 498927, 516837, 506930, 486487, 470973, 461356, 452111, 440647, 423338, 393692, 348781, 296156, 251480, 225526, 219888, 234890, 269548, 312636, 340015, 324175, 249713, 123998, -23025, -153111, -238249, -264858, -230426, -150377, -62455]
13779f2455N7853J5442k3225o3964j07883j42882j58192j43160q2587K2971J39623
13768e48459K18984K32475J83821R8492J3470l3260k8341j217Q474n5l861L169
13756A43692J1184Q588r618l0773l1402N79N7560J22077J84698K44845K89749
13745I91179K91968K37576J43082L4650o6870j40324j70934j58542j16250o8030
13735I77505l5883j9498r71K8375O4332J02039J32366J35742R9886L5939l1312
13724A488520q3623j21119j51396j77118j95913k08786k17272k14368j91983j42490
13714b15548n6210O1536J79228K60957K87838K60059J87684P8115n4837j64622
13704H24200j88730j09559L3129J78257K67125K68657J98672J04453K4781l0924
$$ y = [-62455, -4602, 10840, -12385, -76349, -184232, -327114, -485306, -628466, -711053, -688082, -548459, -329475, -97000, 86821, 185313, 198783, 165523, 137182, 135965, 144439, 144384, 140523, 143692, 154876, 163464, 153846, 123073, 91671, 92250, 149810, 271887, 456585, 701430, 991179, 1283147, 1520723, 1663805, 1698455, 1631585, 1491261, 1320327, 1161785, 1045535, 977505, 941622, 922124, 921153, 949528, 1013860, 1115899, 1248265, 1384007, 1483893, 1519832, 1488520, 1404897, 1283778, 1132382, 955264, 759351, 550565, 333293, 118925, -73058, -215548, -271758, -210222, -30994, 229963, 517801, 777860, 965544, 1043659, 988822, 824200, 635470, 525911, 559040, 737297, 1004422, 1273079, 1471751, 1576204, 1600985, 1570061]
13694A570061o4033p1716n5534k8107r253j3819m0050o8540p5528n4979j6997
13683A071505K7981O9207Q8774O8039R394n9214j06976j18494r5270m8053J1942
13672I18835P7243J35555J66576J58977J25483R0301O4712M6144L3218J8376j9245
13661A816175q5036j54924k01613k13373j92975j54738j11142n7794J4281R4523
13651G53384J48849J46794R7964M9017K9901J9710j5945o9352r2894n5118K6441
13640A038751J13088J82878K37106K81404L06208K97146K54187J85805J03270
13631B999843K6980k0847l0282l527M4307Q9218J16506J29056J38893J51251J51510
13620C792908J12109K0818r8241j95607k29457j93019j15982l5028L1533P6736
$$ y = [1570061, 1506028, 1434312, 1378778, 1350671, 1341418, 1327599, 1287549, 1219009, 1143481, 1088502, 1071505, 1099486, 1168693, 1257467, 1325506, 1334900, 1275686, 1168710, 1050216, 954946, 906893, 918835, 996078, 1131633, 1298209, 1457186, 1582669, 1672970, 1737682, 1783826, 1817044, 1835420, 1816175, 1731139, 1576215, 1374602, 1161229, 968254, 813516, 702374, 644580, 658861, 753384, 902233, 1049027, 1146991, 1196008, 1225909, 1245619, 1229674, 1160322, 1067428, 1012310, 1038751, 1151839, 1334717, 1571823, 1853227, 2159435, 2456581, 2710768, 2896573, 2999843, 3026823, 3005976, 2975694, 2972167, 3016474, 3105692, 3222198, 3351254, 3490147, 3641398, 3792908, 3905017, 3925835, 3827594, 3631987, 3402530, 3209511, 3093529, 3058501, 3090034, 3166770]
13610C166770R0725O4394J330p6104j33486j42450r9255k1654O0404J11455J12504
13599C134633O9511M953n2671q1294o8871o778R7454K08132K93524L54535M01399
13588D354527M26002M14176L60396K63938J40015K7180m7111r0829j24337j52903
13578E571054j62760j35119o5837K8339J23217J94031K20673K03116J59014J05625
13568F241353N0611l797n5838r6146j05402p4142o198R1847J98670K77454L03637
13557F822049K81533K29463J54266O0344k2418n2963j8962N2564J24117J75318
13547G805311K02973K17696K42850K96938L74307M49364M97786N16069N16221
13538A1119515N08476M96779M77981M48403M13582L91233M01378M51611N29635
$$ y = [3166770, 3257495, 3321889, 3323219, 3247115, 3113629, 2971179, 2871924, 2850270, 2910674, 3022129, 3134633, 3204144, 3209097, 3156426, 3075132, 3006261, 2999483, 3096937, 3305069, 3598593, 3953128, 4354527, 4780529, 5194705, 5555101, 5819039, 5959054, 5986234, 5939123, 5848294, 5723957, 5571054, 5408294, 5273175, 5207338, 5235677, 5358894, 5552925, 5773598, 5976714, 6135728, 6241353, 6291964, 6288167, 6232329, 6136183, 6030781, 5956639, 5950441, 6042288, 6240958, 6518412, 6822049, 7103582, 7333045, 7487311, 7547655, 7525237, 7472274, 7453312, 7505876, 7629993, 7805311, 8008284, 8225980, 8468830, 8765768, 9140075, 9589439, 10087225, 10603294, 11119515, 11627991, 12124770, 12602751, 13051154, 13464736, 13855969, 14257347, 14708958, 15238593]
13529A5238593O08081O68501P15310P61165Q06797Q36894Q38360Q10458P51544
13520B2035703O66806N87480N51580N72794O39292P29265Q26965R32689J049534
13511B8592108J166751J272688J367866J459417J563605J702635J876420K052163
13503D1053653K206428K363837K572671K855219L199254L587612M016375M490225
13495F6345274N016374N605669O279508P070725Q014504R139148J0450543J1933848
13487A29855593J3591278J5467358J7621495K0079346K2806306K5696534K8543485
13480B73661395L0994913L2544054L2580526L0480817K5761530J8332683Q728945
13473D53084863j902499j2113867k0618496k6666529l0134187l1354865l0882767
$$ y = [15238593, 15846674, 16515175, 17230485, 17991650, 18798447, 19635341, 20473701, 21284159, 22035703, 22702509, 23289989, 23841569, 24414363, 25053655, 25782920, 26609885, 27542574, 28592108, 29758859, 31031547, 32399413, 33858830, 35422435, 37125070, 39001490, 41053653, 43260081, 45623918, 48196589, 51051808, 54251062, 57838674, 61855049, 66345274, 71361648, 76967317, 83246825, 90317550, 98332054, 107471202, 117921745, 129855593, 143446871, 158914229, 176535724, 196615070, 219421376, 245117910, 273661395, 304656308, 337200362, 369780888, 400261705, 426023235, 444355918, 453084863, 451182364, 439068497, 418450001, 391783472, 361649285, 330294420, 299411653]
13466B99411653k9303695k7113793k4667114k2180918j9776017j7527423j5491922
13459A43350771j3693850j2108267j0686525r401489q258399p264573o405453
13452G5532215n663341n038908m535403m139377l816821l521100l221931k926110
13444D2669224k655802k410372k165355j912237j678040j490526j346540j231889
13436B7778463j141715j063524r72862q54326p13052n80473n00983m88950n13491
13427B0949087n33194n33424n27222n33060n59631o03853o57312p04773p21842
13418A5574776o95535o43674o07737o19761o63493o80108o29569n40082m78937
13409A0015880m76921n05009n17046m88735m25194l49950k86173k47326k32962
$$ y = [299411653, 270107958, 242994165, 218327051, 196146133, 176370116, 158842693, 143350771, 129656921, 117548654, 106862129, 97460640, 89202241, 81937668, 75532215, 69868874, 64829966, 60294563, 56155186, 52338365, 48817265, 45595334, 42669224, 40013422, 37603050, 35437695, 33525458, 31847418, 30356892, 29010352, 27778463, 26636748, 25573224, 24600362, 23746036, 23032984, 22452511, 21951528, 21462578, 20949087, 20415893, 19882469, 19355247, 18822187, 18262556, 17658703, 17001391, 16296618, 15574776, 14879241, 14235567, 13627830, 13008069, 12344576, 11664468, 11034899, 10494817, 10015880, 9538959, 9033950, 8516904, 8028169, 7602975, 7253025, 6966852, 6719526, 6486564]
13400F486564k32588k40544k54207k61718k51744k20306j62145q1764j2319O463
13390D775692k2684n7359o8787n7803k9631R884L9177L3536p929o3075j07076
13379D443945j29778j28588j05387p9730p4235r0725j14031j29517j30007j12654
13369C349293p9787m4063k4718l1232n6365q3486r2459p1057l2589l345J0065
13358B840257J6713J6214L521j3033j3874P909L7647N7271O2279N6943L9614Q354
13346C119815k5059m8804o2893o5244n5308m8766o6777j17246j94706k84689l58110
13335A792213l74169l10456j86197m8910N6869J16065J35809J26226J05580R4381
13325A507411R2775Q1602N4737M1723P0819J18429J31518R0424J9651m7722r2036
$$ y = [6486564, 6253976, 6013432, 5759225, 5497507, 5245763, 5025457, 4863312, 4781548, 4769229, 4775692, 4753008, 4695649, 4626862, 4569059, 4539428, 4549312, 4588489, 4622025, 4614096, 4551021, 4443945, 4314167, 4185579, 4080192, 4000462, 3926227, 3835502, 3721471, 3591954, 3461947, 3349293, 3269506, 3225443, 3200725, 3169493, 3113128, 3029642, 2937183, 2866126, 2833537, 2830192, 2840257, 2856970, 2873184, 2876705, 2863672, 2849798, 2857707, 2895354, 2952625, 3014904, 3071847, 3111461, 3119815, 3094756, 3045952, 2983059, 2917815, 2862507, 2813741, 2746964, 2629718, 2435012, 2150323, 1792213, 1418044, 1107588, 921391, 872481, 929350, 1045415, 1181224, 1307450, 1413030, 1507411, 1600186, 1681788, 1736525, 1778248, 1849067, 1967496, 2099014, 2189438, 2209089, 2161367, 2069331]
13314B069331j05022q3362l3216K5430O9379Q2340O7241M8543M0288K7308k600
13303B205660l9731o9569q3302q0610p7560r6896j41403j87559k08202j98444
13293A022384j77520j65659j63697j56085j21863n1534L8232J20425J80910K13331
13283G38924K14099J91419J62485J37857J16270R4259P4045N7162L8524J3856
13273A838900j5938m6289p0261p8507o0689j0844N8044J14382J38782J38414J26271
13262B132265R9528N0816p658n4845q7597j15764j45481j79027k14646k40736
13252A236855k42647k18757j79330j34345r5156p5870p8042q3979p7875o6871
13242a6017p2740r9705j18065r2692k3894N3283J05985J26777J23113J05182Q4270
$$ y = [2069331, 1964309, 1880947, 1847731, 1873161, 1942540, 2024880, 2092121, 2140664, 2180952, 2208260, 2205660, 2165929, 2096360, 2013058, 1932448, 1854888, 1757992, 1616589, 1429030, 1220828, 1022384, 844864, 679205, 515508, 359423, 237560, 186026, 224258, 344683, 525593, 738924, 953023, 1144442, 1306927, 1444784, 1561054, 1655313, 1729358, 1786520, 1825044, 1838900, 1822962, 1776673, 1706412, 1627905, 1567216, 1556372, 1614416, 1728798, 1867580, 2005994, 2132265, 2231793, 2282609, 2274951, 2220106, 2132509, 2016745, 1871264, 1692237, 1477591, 1236855, 994208, 775451, 596121, 461776, 366620, 290750, 212708, 128729, 50854, -16017, -88757, -188462, -306527, -399219, -423113, -369830, -263845, -137068, -13955, 91227, 175497]
13231A75497P1185P4863R5804J20879J34204J31720J22338J16256J13154J07983
13221A263883R6659P0496K4650l3819q6004j10147j05276r2727q8741q9113q4315
13210G65546p6282p2566p8499r5946j21420j37683j15367n0914J2218K9158J740
13199E9985l2547m3963l1269p906J2300K2091K3801K6097L4052L9997L1268P025
13187A40931j8158k7476j3229K1218N9035P3849N4671K1592k79p246j2296k7243
13175B65369m6575n5183n1627m1768k2294J6249P6690J41815J87517K10375K18610
13164H99178K08156J65942Q7396k0124j34274k14145k31179j94382j25862m0144
13154D00562L5100O2155M4085K6835M0489P7443J12360J16106P3054m380p8538
$$ y = [175497, 246682, 321545, 417349, 538228, 672432, 804152, 926490, 1042746, 1155900, 1263883, 1360542, 1431038, 1455688, 1421869, 1335865, 1225718, 1120442, 1027715, 938974, 849861, 765546, 689264, 616698, 538199, 442253, 320833, 183150, 67783, 16869, 29087, 58245, 59985, 27438, -16525, -47794, -55700, -43400, -21309, 2492, 28589, 62641, 102638, 133906, 140931, 122773, 95297, 82068, 103286, 162321, 236170, 290841, 312433, 312154, 304908, 292612, 265369, 218794, 163611, 111984, 70216, 47922, 64171, 140861, 282676, 470193, 680568, 899178, 1107334, 1273276, 1360672, 1340548, 1206274, 992129, 760950, 566568, 440706, 400562, 435662, 497817, 541902, 568737, 609226, 686669, 799029, 915135, 988189, 983809, 905271]
13143I05271j12161r7018n3500q740K4053M2019M0110J8087m716j227K7624N0245
13131H30047M1988N504l6968n7179m2888j2076J0583J9550J6081k53j9881l1401
13119G23107l5924l3475k4198k4238m1368n3304l6405j897J5576P83k4182k4589
13107D39886J303J5954m524m2761p1517q8632j16645j58957j78720j47238p9835
13096d31686o576N6351R9460J12782R5177O5261M8874N8108R2575J39706J67997
13085D98029J40684N0808o2227j41223j55830j22198q0976n4783l8084k2805o347
13074E048J3428K8865K2271k0899r3523j52901j48060o3661P1346K06663K96609
13063A65186L17446K75083J95536J10806M4987J98l7407q0693j29139j60256j50993
$$ y = [905271, 793110, 696092, 642592, 633852, 657905, 699924, 740034, 758121, 753405, 752178, 779802, 830047, 872035, 877539, 840571, 783392, 740504, 728428, 739011, 758561, 774642, 774389, 754508, 723107, 687183, 653708, 629510, 605272, 563904, 510600, 474195, 472298, 487874, 488657, 464475, 439886, 441189, 457143, 452619, 409858, 338341, 249709, 133064, -25893, -204613, -351851, -431686, -438262, -381911, -282451, -169669, -74492, -9231, 39643, 97751, 190326, 330032, 498029, 638713, 689521, 627294, 486071, 330241, 208043, 127067, 72284, 34200, 11395, 5048, 18476, 47341, 69612, 48713, -44810, -197711, -345771, -409432, -338086, -131423, 165186, 482632, 757715, 953251, 1064057, 1109044, 1109242, 1071835, 991142, 862003, 701747, 550754]
13052E50754j13499q4097p5246o7075m5546k5451k9766n3162o6793n2851j6580
13041g9312J7041K1193L549J251K8493N6522N3951K3961n172n703L0809Q3222
13029B29805J18791J24010J07016Q2209N7761L2667L224l2597o6290p1570l3412
13018E51614K2151N2868M1587L216l4426m6733k7679K092J7079J2513n636l1997
13006E56649n1915n0231k8529j887J2100J576l3876q0225j14595j21054r6695
12995h682n0647n492J5330Q886j632J5100O9532J39167J93768K21523K18140J79046
12983I94039J17111N9402K1120l760l0863o7506j00947j09596q9479o4846o5466
12972F59209j00857j59414k19794k57285k53315k07538j40411q4603o3805p0423
$$ y = [550754, 437255, 353158, 277912, 210837, 165291, 139840, 110074, 56912, -9881, -62732, -79312, -62271, -41078, -37529, -36278, -7785, 48737, 102688, 126649, 121477, 115774, 146583, 229805, 348596, 472606, 579622, 661831, 719592, 752259, 755483, 722886, 656596, 585026, 551614, 573765, 626633, 668220, 671436, 637010, 590277, 562598, 564690, 581769, 594282, 588646, 556649, 504734, 454503, 425974, 424087, 436187, 437763, 403887, 323662, 209067, 88013, -8682, -59329, -64821, -49491, -40605, -42237, -27137, 42395, 181562, 375330, 596853, 814993, 994039, 1111150, 1170552, 1191672, 1187912, 1157049, 1089543, 988596, 879000, 789521, 724675, 659209, 558352, 398938, 179144, -78141, -331456, -538994, -679405, -764008, -827813, -898236]
12962h98236o7217j9655P4524J84604K68878L03886K95499K64367K33673K13679
12952H54002J88091J38192O9310L309m3881o8640p1068n6506k9804P550M5439
12941A035994P1222Q5038R2033R2792Q3175N2499j311n4958p4339m6933L245L5171
12929A373628K7729j1597o9585j31664j75338j81171j45698q0135o444L8755K8111
12918F66591k4769q1606j13824j15683r8539p4286m8413l1868m2075p9778j20168
12907a64418j32961j08265p1499n4511n0594k8163K9147J12083J94818K52523
12897b1840K80246K86904K73771K34116J68503R1419L0329R023J9142K4103M984
12886A400700j3572q98L3881N3567L7575k55l4760n0279l9858q953K4482M6104
$$ y = [-898236, -965453, -985108, -910584, -725980, -457102, -153216, 142283, 406650, 640323, 854002, 1042093, 1180285, 1249595, 1252904, 1209023, 1140383, 1069315, 1012809, 983005, 990555, 1035994, 1107216, 1192254, 1284287, 1377079, 1460254, 1512753, 1511442, 1456484, 1382145, 1335212, 1338457, 1373628, 1401357, 1389760, 1320175, 1188511, 1013173, 832002, 686304, 606169, 599725, 638480, 666591, 641822, 560216, 446392, 330709, 232170, 157884, 109471, 77603, 35528, -44250, -164418, -297379, -405644, -477143, -531654, -582248, -610411, -581264, -469181, -274363, -21840, 258406, 545310, 819081, 1053197, 1221700, 1313119, 1343448, 1352471, 1371613, 1395716, 1400700, 1387128, 1386230, 1420111, 1473678, 1511253, 1510998, 1476238, 1425959, 1386101, 1377148, 1401630, 1447734]
12874A447734N1353L8630J1681j5174k9887l7136m9320o8697q0100o4500k1183
12863A183401L1192P6758J07520J17286J09555R1114O4361M1182L6299M3502M4021
12852A946191L1570J5505J700j6224l7004m3119l1396k2364k7040l2997l0913
12841A753909l5370o8314j29784j97024k44935k53291k16910j52513q1857j9774
12831C54137K9511O9218R6561J00256P1681J3082n7294j06741j10468p3863k4818
12820C61262Q520O899l6298j01960j51798j58788j23154o8166j7068K5925O0402
12809a94224P0626L9529k5203r3152j40054j61053j54976j15202m5083L2078R4040
12798f92674J40253J78718K10182K31303K37308K25498J98234J52830Q4273k081
$$ y = [1447734, 1499087, 1537717, 1549398, 1534224, 1504337, 1467201, 1417881, 1349184, 1269084, 1204584, 1183401, 1214593, 1291351, 1398871, 1516157, 1625712, 1716826, 1781187, 1822369, 1858668, 1902170, 1946191, 1977761, 1993266, 1994966, 1978742, 1941738, 1898619, 1867223, 1844859, 1817819, 1784822, 1753909, 1718539, 1650225, 1520441, 1323417, 1078482, 825191, 608281, 455768, 373911, 354137, 383648, 452866, 549427, 649683, 721364, 734446, 677152, 570411, 459943, 386080, 361262, 369782, 376681, 340383, 238423, 86625, -72163, -195317, -263483, -280551, -254626, -194224, -123598, -84069, -109272, -202424, -342478, -503531, -658507, -773709, -818792, -786714, -692674, -552421, -373703, -163521, 67782, 305090, 530588, 728822, 881652, 965925, 963844]
12788I63844r1855j68456k21753k49463k51185k23111j58903o7066K5524R7174
12778c45250J41376J53554J27508O8597j758n1576n8526l3676j0594q607j9264
12767c8216k5170j4528J0220K9043K0038j6114m6108l2886K2771Q6068J20702
12756A15820J13936Q0844M0849J795k4665j3175L9947R2405R8900N5196n980m9806
12744E46066o8376o8223n0066k0254j714k0920r0038j89463k69272k86371k35610
12733g54241j46242n5406J5629O3893R2002J00750R2429P8745P9088J07079J61763
12722a64511K28769K86285L07727K72798J87259Q4641L327l8581m6001l7990l4398
12711A049325m1386m6030k7301K1026Q3888J32979J39698J04527N8931K8774R839
$$ y = [963844, 871989, 703533, 481780, 232317, -18868, -241979, -400882, -467948, -442424, -345250, -203874, -50320, 77188, 145785, 144027, 92451, 33925, 249, -10345, -18952, -38216, -63386, -77914, -67694, -38651, -18613, -34727, -80835, -113721, -90950, -4882, 115820, 229756, 310600, 351449, 353244, 328579, 315404, 355351, 447756, 546656, 601852, 595872, 546066, 477690, 409467, 359401, 339147, 337433, 316513, 226475, 37012, -232260, -518631, -754241, -900483, -955889, -940260, -876367, -784365, -683615, -591186, -512441, -433353, -326274, -164511, 64258, 350543, 658270, 931068, 1118327, 1202968, 1206295, 1167714, 1121713, 1083723, 1049325, 1007939, 961909, 934608, 955634, 1039522, 1172501, 1312199, 1416726, 1475657, 1504431, 1514270]
12700A514270j9509o4826j06598j30473j50356j82982k15517k17743j72727q4606
12690A68933K3163J08605J32438R2104K9725n085k448J3473K3873K3628L582n3116
12678E58875j46712k38429k76880k46850j72438r1317m0462m0180q0574j25614
12668i00581j38881j05019l2565M5959R3438R5442O1455Q024m8788q8568r1718
12657a101802n6251q420J4687O793l37J9084N6773Q3169P4120L6078N09p373J2996
12644h69974L7147L7619Q971l2367o1650o2767m1207j2248J6404M1877N8884O4122
12632h15189O4853P1051P7683O5902J7831o9627j74223k60309k96938k60945j54041
12621a733952k1149P8715J19733J16523J01458R4918Q9148O5330J7998l8600p7071
$$ y = [1514270, 1494761, 1429935, 1323337, 1192864, 1042508, 859526, 644009, 426266, 253539, 168933, 192096, 300701, 433139, 525243, 554968, 549883, 547435, 560908, 584781, 608409, 611991, 558875, 412163, 173734, -103146, -349996, -522434, -613751, -654213, -694393, -774967, -900581, -1039462, -1144481, -1177046, -1131087, -1037649, -942207, -880752, -872728, -921516, -1010084, -1101802, -1158053, -1166473, -1151786, -1144993, -1145330, -1126246, -1069473, -986304, -912184, -876106, -875597, -882970, -869974, -832827, -795208, -786237, -818604, -880254, -943021, -984228, -996476, -980072, -938195, -879311, -815189, -750336, -679285, -601602, -535700, -517869, -587496, -761719, -1022028, -1318966, -1579911, -1733952, -1755101, -1676386, -1556653, -1440130, -1338672, -1243754, -1154606, -1089276, -1071278, -1109878, -1186949]
12610a186949p6310m2226L775M7503Q3502J04432J03572Q7700P2622O4366N6573
12599f81440N3963P5375J23773J77875K17813K36349K33549K12115J70354J08520
12589I28246L5921l4412q9306j18957j20148r3531m3618J9063P8233J13655J11812
12578G86958P3701R217n8452r2423p7319l9545j8753l2569p1998j19461j59438
12567A99918j80428j75628j37105o0377L4434J15178J70899K02356K04403J80992
12557E54642J53495J38194J27985J06105O5066O154n6770r4083r1798p4400p4858
12546G59732r8540j22113j20443r2625n4110j2327L0802O3134P2587O6521O0940
12535E53558N7263M4566J8396j2011l3386m4402n6596p8152j03793j24128j36883
$$ y = [-1186949, -1263259, -1305485, -1301710, -1254207, -1170705, -1066273, -962701, -875001, -802379, -738013, -681440, -627477, -552102, -428329, -250454, -32641, 203708, 437257, 649372, 819726, 928246, 964167, 929755, 840449, 721492, 601344, 507813, 464195, 483258, 561491, 675146, 786958, 860659, 869876, 811424, 719001, 641682, 602137, 583384, 550815, 478817, 359356, 199918, 19490, -156138, -293243, -353620, -319186, -204008, -33109, 169247, 373650, 554642, 708137, 846331, 974316, 1080421, 1145487, 1151641, 1094871, 1000788, 908990, 834590, 759732, 661192, 539079, 418636, 326011, 271901, 259574, 290376, 353510, 426097, 492618, 553558, 610821, 655387, 673783, 661772, 628386, 583984, 527388, 449236, 345443, 221315, 84432]
12524H4432j44354j41632j18643p9591m5281l5834n2778p8479r2970q6536n6459
12513h48125j342P1411J48750K22339K83511L13994K94572K25598J27918L7035
12503H75661q911j124L5902O8691P4737N7622L3994K188m8987j01057j17674r6411
12491G74631o9218o3464q5482j23410j50936j45062j05500m9752M077M0317M1189
12480F7390J0431j3693J955N4081J20540J79721K14257K17217J89658J31400M4089
12469A217046n0845j12875j19959r7426r2551j25115j77919k24075k52425k65274
12459c01418k59260k23240j54770o8885J1824O8254R4096J00777J13078J52134
12449d67410K13076K68294K87988K59091J96910J33592Q8759N6949K4469j0414
$$ y = [84432, -59922, -201554, -320197, -399788, -445069, -480903, -533681, -612160, -705130, -791666, -848125, -849467, -778056, -629306, -406967, -123456, 190538, 485110, 710708, 838626, 875661, 866750, 865626, 901528, 970219, 1044956, 1102578, 1136572, 1138760, 1089773, 988716, 871042, 774631, 705413, 641949, 556467, 433057, 282121, 137059, 31559, -18193, -14116, 26201, 67390, 77821, 64128, 66083, 120164, 240704, 420425, 634682, 851899, 1041557, 1172957, 1217046, 1166201, 1053326, 933367, 835941, 743390, 618275, 440356, 216281, -36144, -301418, -560678, -783918, -938688, -1007573, -995749, -927495, -833399, -732622, -619544, -467410, -254334, 13960, 301948, 561039, 757949, 891541, 980300, 1037249, 1061718, 1051304]
12439A051304l8388n1240n3194o2652q8653j08763r0604k9972M7230J07021J26348
12428H08437J05705O3377J4967l8878r8241j42716j48275j19176q0589m9229k7121
12417B88261k0453l7934p0409r6684j08477j11432j04587q1754m1931J1378O6145
12406c07877J05185J16685J00974P0703M0368K2997K4861M2367P1033J03163J24207
12395E14666J29570J27639J20082R6483M9744j1542o9043j11232j33011j25802
12385E87554q9527m2988j0027r30j2244l6122o3210q1759p9622n3483j4191K1694
12373A25145M4031M9273L8367K4068J8906J2522r450l7288m8114k9162J0971N0701
12361B49970P6035Q8106R6480J04718J00174P4213L9355J1399o824j9446k6825
$$ y = [1051304, 1012916, 961676, 908482, 845830, 757177, 648414, 557810, 527838, 575068, 682089, 808437, 914142, 977519, 992486, 953608, 855367, 712651, 564376, 445200, 364611, 315382, 288261, 267808, 229874, 159465, 62781, -45696, -157128, -261715, -343469, -385400, -374022, -307877, -202692, -86007, 14967, 85670, 126038, 149035, 173896, 216263, 287296, 390459, 514666, 644236, 771875, 891957, 988440, 1038184, 1026642, 957599, 846367, 713356, 587554, 498027, 455039, 445012, 444082, 431838, 395716, 332506, 250747, 171125, 117642, 103451, 125145, 169176, 218449, 256816, 280884, 299790, 312312, 302862, 265574, 217460, 188298, 199269, 249970, 326005, 414111, 510591, 615309, 715483, 789696, 829051, 840450, 833626, 814180, 787355]
12350G87355k2798N07M5280R6050J17783Q8080K0964n2623j09385j34068j14660
12339G22485n8287Q00L1418K9389L568l9663r1083j33547j48880j31600q5574
12328I9026j9905M1244P1023O5513M3395K2141P404L335J7495M4871O4448O2494
12316E22484M2069J5016j0300l5010o1051q5965j00083r3717o9790m3045l2932
12305D7676n2420r4364j32053j37654j00432l1150M5632J02615J21342R9168N4641
12294g6999K1362J7071J9804o963o3791j05284r4567m9392j1626l909k0699l7653
12282d12646l0397R307P4101J48450K05679K16614J73857J03301M7102K6339K8470
12271E90177K9811J6873n116j9194j3299P413K2033J1424k0029m2109l0836N780
$$ y = [787355, 764557, 765064, 810344, 906394, 1024177, 1112257, 1133221, 1080598, 971213, 837145, 722485, 664198, 664998, 696416, 725805, 729373, 689710, 598627, 465080, 316200, 184600, 99026, 79121, 120365, 191388, 256901, 300296, 322437, 329841, 333176, 350671, 395542, 459990, 522484, 564553, 579569, 569269, 534259, 473208, 387243, 287160, 193443, 123653, 80608, 47676, -4744, -99108, -231161, -368815, -469247, -500397, -454765, -352150, -230808, -131640, -76999, -55637, -38566, -18762, -25725, -89516, -194800, -289367, -338759, -350385, -354294, -374993, -412646, -443043, -433736, -359635, -211185, -5506, 211108, 384965, 488266, 535368, 561707, 590177, 619988, 636861, 631745, 612551, 599252, 606665, 628698, 640122, 620093, 577984, 547148, 552928]
12259E52928M3719O6082O4919L6932p447l9495m0225j5901J9672N5339P7921P0791
12247H85235K9467j9911l7975j4230K0875K9791R642j0780j5861k4982o3711j32282
12235F55278k11620k75673k95873k63394k00068j26391m5538L2268Q4226J00518
12225e46267R6587Q9422P6503M8824J5879J675J5839M2225N7931N5065L6270L415
12213f632l4207o1305p3331p5538p0431n0238p61P3854J34273J38487Q0114j5564
12201C8721j13025j90057k41779k53204k04092j07574m826P5521J33085J80545
12191f86685K20134K32949K00885J40039R0803O9475N4531K1402l4126j00005
12181B09402j54867j74496j43897p1604J0076O7407Q1618N0871o516n4049n8295
$$ y = [552928, 596647, 662729, 727648, 764580, 757133, 717638, 677413, 661512, 681184, 736523, 814444, 885235, 914702, 894791, 856816, 842586, 863461, 893252, 902894, 892114, 876253, 851271, 787560, 655278, 443658, 167985, -127888, -391282, -591350, -717741, -763279, -731011, -646785, -546267, -449680, -360258, -283755, -234931, -219052, -217377, -201538, -159313, -101382, -46317, -10047, -6632, -40839, -102144, -175475, -251013, -321444, -371682, -372443, -298589, -164316, -25829, 54285, 38721, -74304, -264361, -506140, -759344, -963436, -1071010, -1075836, -1000315, -867230, -686685, -466551, -233602, -32717, 107322, 198125, 267600, 322131, 343533, 309407, 209402, 54535, -119961, -263858, -335462, -325386, -257979, -176361, -125490, -132006, -186055, -244350]
12170b44350k3363J1439J4279j0353l2540k6500J3393P7166J47307J98625K02448
12159C27551J44261M2216n8589j20275j35932j19257q3447l9371p133p725m0206
12148i7907q9011j47812k10265k45343k11327j02664L3715J41147J94714K00769
12138e33984J77823J34451P1295Q832j5704J2300O2144Q1838M6219k4266r4068
12127g3120j41537j61732j58086j34240j02360p8750n9114k6519J6541M7916N3266
12116h17735L8675J8714N159N697J9154M1449P4953J14425J40139J28032O9147
12105a62191j0023o8862q8417p6424n8454n1406m1265j1629K5712N0521O3449
12094d28989Q1932J08860J18092Q4321J6639m9801q4561p8227l9711R612L9375
$$ y = [-244350, -267713, -256274, -241995, -252348, -284888, -311388, -297995, -220829, -73522, 125103, 327551, 471812, 514028, 455439, 335164, 199232, 79975, -3472, -42843, -49976, -57701, -97907, -186918, -334730, -544995, -790338, -1001665, -1104329, -1070614, -929467, -734753, -533984, -356161, -221710, -150415, -141583, -157287, -144987, -82843, -1005, 45214, 20948, -73120, -214657, -376389, -534475, -668715, -771075, -849825, -908939, -935458, -918917, -871001, -817735, -779060, -760346, -755187, -749490, -730336, -688887, -613934, -499509, -359370, -231338, -162191, -172214, -241076, -329493, -405917, -464371, -515777, -557042, -568671, -542959, -492438, -428989, -347057, -238197, -120105, -35784, -19145, -68946, -153507, -231734, -271445, -261833, -222458]
12083b22458K5077l0305r3118j27857j22286q3167l2185K450J7680M2831J01334
12072e22004J83006K55748K89381K71942K10793J23311L1749m2240q6728j05150
12062F09808j11025j08315q6833m9417k3688l0297n7820p9181p6663m9026m336
12051f6793M9140R9755J29836J35207J28706J14569Q5964M8631K0903L297k8463
12040G20752q5509j38884j51749j22873p9099l8440j256L7217P3901Q6194N5931
12029C56185k541o0196j02892j31670j51769j63882j60526j38308j05934p3503
12019g35036m6382k4290O81L4554P4097J06473J13806R2413O4839O2694J00920
12008a55231J64536K20333K42742K26141J81256J25190P1658K4165k5381p9806
$$ y = [-222458, -197381, -227686, -320804, -448661, -570947, -654114, -686299, -683849, -666169, -623338, -522004, -338998, -83250, 206131, 478073, 688866, 812177, 843926, 801686, 714958, 609808, 498783, 390468, 303635, 254218, 230530, 200233, 142413, 63232, -13431, -62457, -66793, -17653, 82102, 211938, 347145, 475851, 590420, 676384, 725015, 745918, 749215, 720752, 635243, 496359, 344610, 221737, 142638, 104198, 102942, 140159, 214060, 300254, 356185, 353644, 293448, 190556, 58886, -92883, -256765, -417291, -555599, -661533, -735036, -781418, -805708, -805027, -770473, -696376, -589903, -476097, -383684, -318845, -256151, -155231, 9305, 229638, 472380, 698521, 879777, 1004967, 1076625, 1100790, 1075409, 995603]
11998I95603j24028j37960j14317o6270j5564J7532J8327n640k8074l3193k5309
11987D81107j7296j7060k1412j9339j1306k1038o4550j23003j65533j80986j78158
11976c38574j67513j53312j36565j14011p9026l5210l864J379l612L521K5154
11965a001633M5196M6485K5961k677j7267n794K2386M2171L8580K2824J9069M4701
11953g19998R7863J57184J94465J98051J85241J77718J71948J50154J05460M7298
11943G65384q511m8180o3209o3499p4592j04719j38073j58294j58004j33450q8176
11932b73323l7830J297K1776K2412Q216j222J9151O5092J03604J11784R5291P0201
11920B06449M2765J7739P865J4815J8495M137j1578k725K3399L9798L5751J7398
$$ y = [995603, 871575, 733615, 619298, 553028, 537464, 554996, 573323, 567683, 539609, 506416, 481107, 463811, 446751, 425339, 406000, 394694, 373656, 309106, 186103, 20570, -160416, -338574, -506087, -659399, -795964, -909975, -989001, -1024211, -1028075, -1026696, -1030308, -1026787, -1001633, -956437, -909952, -883991, -886668, -903935, -909729, -887343, -845172, -806592, -783768, -764699, -719998, -622135, -464951, -270486, -72435, 112806, 290524, 462472, 612626, 718086, 765384, 756873, 708693, 645484, 581985, 507393, 402674, 264601, 106307, -51697, -185147, -273323, -311153, -309856, -288080, -265668, -257452, -258674, -239523, -174431, -70827, 40957, 136248, 206449, 249214, 266953, 274818, 289633, 308128, 312265, 300687, 297962, 321361, 361159, 396910, 414308]
11908D14308r683m6020q3540j04705j07904j09525j14243j09106q9581o8532n5422
11897d83953m2156j5973K0811N3529P0464O7719M9937L0713K1580J7570L752k1859
11885b27866m8290o7313p6372p3888n9556l4461O230O6939J30795J63166J43296
11874g7320P5877j7396r7421j23616r0569l3605P739J5348p405m3503p1895o9646
11862e33412k1446N9774J31937J52033J07968K7650l8576n3319j9960K4222M4196
11851a18933L0762o675m4039n0712j7795K5569L8445L798o3067j25859j54287
11840d82793j42632j06245o6814l3209M35L5165O1633O9895N6267K9199N683l443
11828e76859o648j9928m7458q1755j07717j10198q6188m7283p823K9916P1479
$$ y = [414308, 404625, 358605, 275065, 170360, 62456, -47069, -161312, -270418, -359999, -428531, -483953, -526109, -542082, -521271, -467742, -397278, -329559, -279622, -248909, -227329, -209759, -206007, -227866, -276156, -343469, -419841, -493729, -553285, -587746, -581516, -514577, -383782, -220616, -77320, -1443, -18839, -116260, -239876, -330445, -364050, -356311, -340963, -348368, -391871, -463766, -533412, -554858, -495084, -363147, -211114, -103146, -75496, -114072, -167391, -187351, -163129, -118933, -88171, -94846, -138885, -189597, -207392, -181823, -143378, -139580, -202647, -328506, -482793, -625425, -731670, -798484, -831693, -831258, -796093, -734460, -664565, -608298, -579099, -573416, -576859, -583507, -603435, -650893, -732648, -840365, -950563, -1036751, -1084034, -1091857, -1061941, -990462]
11817i90462J14325J36321J02874O820j04422j59101j23191l1935M6127O6218
11807i36426L1203j6365l3768k1034j2769k7260m3074l6094j2263J0940K6777
11796a070133L2639K9777L0393M2142N7749O6784O3830M7904K9197L0448O2287
11785e76983J07546J40516J46803J25665R1885P1870Q6567J31766J85929K29264
11775G40828K43526K14107J45235O0000j6811p0450j03981j30047j49323j50312
11765G82772j28128q9057m1766m62J6162L934k6683o8695j18404j66223j99432
11754c5982k04378j74038j20395o5066j7645K0444L7331K0387j5702l5890k2896
11743f13830J9726Q6144J59729K11087K18995J78299R5413j2451j21001j98908
$$ y = [-990462, -876137, -739816, -636942, -630122, -734544, -893645, -1016836, -1048771, -1002644, -936426, -905223, -921588, -955356, -976390, -989159, -1016419, -1059493, -1095587, -1107850, -1096910, -1070133, -1037494, -1007717, -977324, -935182, -877433, -810649, -746819, -698915, -669718, -639270, -576983, -469437, -328921, -182118, -56453, 35432, 107302, 193869, 325635, 511564, 740828, 984354, 1198461, 1343696, 1403696, 1386885, 1316435, 1212454, 1082407, 933084, 782772, 654644, 565587, 523821, 523359, 539521, 543455, 516772, 448077, 329673, 163450, -35982, -240360, -414398, -534793, -599859, -617504, -597060, -559729, -539342, -555044, -590934, -613830, -594104, -507960, -348231, -137144, 81851, 260150, 355563, 343112, 222111, 23203]
11733B3203k14444j60455o1426M0543J03331J15705J02506Q9140P4496M1424j1464
11722A42559o1284p9411n5532q460L3171O0523P7119P2124L3561k6046q0599j12217
11710d492j05600m6647N6012J64019K31508K39060K06059J58783J02291M0139
11700A041132o423k0668j7046k0976l3226l4779j3675K3305O0506Q2056P3967
11689A134173L6525q993l9054n5612p8211j05770j17416j07310q9562p6967o7107
11678D24696m9457k2639O230K3036O962m4754r9901j16483q0094o882O6878R8524
11666B06116P2814J3422m5882p9862p5110m4766k0831k4259n4130r4178j25215
11655b71881j33070j05540l6679N5542J32817J62986J31113M3315o6597j46433
$$ y = [23203, -191241, -351696, -413122, -372579, -269248, -153543, -51037, 38103, 112599, 154023, 142559, 81275, 1864, -53668, -62128, -28957, 31566, 108685, 180809, 214370, 188324, 107725, -4492, -110092, -156739, -100727, 63292, 294800, 533860, 739919, 898702, 1000993, 1041132, 1034709, 1014041, 996995, 976019, 942793, 908014, 894339, 917644, 978150, 1060206, 1134173, 1170698, 1161705, 1122651, 1067039, 988828, 883058, 765642, 658332, 568770, 491803, 424696, 375239, 352600, 358830, 381866, 388828, 344074, 244173, 127690, 47596, 40714, 107592, 206116, 278930, 292352, 246470, 166608, 91498, 46732, 25901, 1642, -52488, -146666, -271881, -404951, -510491, -547170, -491628, -358811, -195825, -64712, -21397, -87994, -234427]
11645b34427j63269j33940j00150p7679n0732n199N7470J24856J77311J93638
11635b12121J66492J14635O4170K3359j0706l6035m4110l1536l874K9600N6142
11624A16016O8282O6451N4188L6281J4386j2406m2360o4896o4257l4722Q129L6225
11612A81317L3011Q919m283J8235P0490J21192J37022J02120K3965o9960j44601
11601D77427j78674j69218j26384p6059m2421j7568K8954R9420J58928J79360
11591C33765J60231J13566N4461o26m4967p7585q7402o8879m5891m4363n6310
11580B36000n5940k9323J6183N1388M7252J3154p821N153K5699K0675j2672m8897
11568B60851o2860m6923k899O2192J29160J69638J74826J52527R3443o047j08262
$$ y = [-234427, -397696, -531636, -631786, -709465, -760197, -765396, -707926, -583070, -405759, -212121, -45629, 69006, 133176, 156535, 145829, 109794, 65684, 34148, 30274, 59874, 116016, 184298, 250749, 304937, 341218, 355604, 343198, 300838, 235942, 171685, 136963, 145092, 181317, 214328, 223247, 218964, 237199, 307689, 428881, 565903, 668023, 691988, 622028, 477427, 298753, 129535, 3151, -72908, -115329, -132897, -103943, -4523, 154405, 333765, 493996, 607562, 662023, 661397, 616430, 538845, 451443, 382564, 336673, 292310, 236000, 180060, 150737, 166920, 218308, 265560, 278714, 270893, 276046, 301745, 322420, 309748, 260851, 197991, 151068, 148169, 210361, 339521, 509159, 683985, 836512, 929955, 923908, 815646]
11557H15646j66826j68417j27976o8941r929L7537O7697Q2746Q8738Q8267Q0988
11546G19530P5160Q2494R7928J01506P6848J6814p6713j76948k43457k69494k78105
11535A25563k70220k20537j23358j1198P1759J01902Q8994O1285M0996L6138M3627
11524e5049N0085M0603J8152L933J1306L5338N5989M7390Q024m2975j00265j59518
11512h6987j93614j81093j31118o3551J4381R9705J75843K20015K23312J96513
11502B73406J57504J23794J11517J16631J13809Q9589N4486L0914L8904P4370
11492A184924J02039Q9600L6561l5411r3987j10166q6437n9776o3613r3227j12312
11481G58195r5062n5137k6658k6333m6074p4972j08832j40902j63016j73893j68514
$$ y = [815646, 648820, 480403, 352427, 283486, 273557, 311094, 378791, 461537, 550275, 638542, 719530, 794690, 877184, 975112, 1076618, 1153466, 1170280, 1093567, 916619, 673162, 403668, 125563, -144657, -365194, -488552, -499750, -427991, -326089, -237095, -175810, -134814, -98676, -55049, -4964, 35639, 53791, 57724, 69030, 104368, 160357, 207747, 215771, 172796, 72531, -86987, -280601, -461694, -592812, -656363, -641982, -542277, -366434, -146419, 76893, 273406, 430910, 554704, 666221, 782852, 896661, 986250, 1040736, 1071650, 1110554, 1184924, 1286963, 1376563, 1413124, 1377713, 1283726, 1173560, 1087123, 1027347, 963734, 870507, 758195, 663133, 607996, 581338, 555005, 508931, 433959, 325127, 184225, 21209, -152684, -321198]
11470c21198j31515n6396L5692J01061J08378P0123K4148k956l968J5457L5177
11459a25997K7167r390l2495m52P8718J54920J89057J82408J51008J00033L4123
11448G49100l2680q9946j33072j52816j46154j31984j28692j21397q6693l5090
11438c09424O238K7938L1552J5850j0734k1134J0567P6376J32544J45651J22602
11427B28026Q8952O4265O2834Q9593J25894J38800J16927R1696J11359J95733
11417A314079L17707M20644M61466M41383L97744L72763L85340M24039M68201
11408E003366N09801N54403O24405P56215R77463J287710J660149K067811K506270
11399A5947593K977654L446481L797609L817715L243488J929335O7290j807206
$$ y = [-321198, -452713, -509109, -473417, -372356, -263978, -193855, -169707, -172663, -176631, -161174, -125997, -98830, -108220, -140715, -141167, -62449, 92471, 281528, 463936, 614944, 714977, 749100, 716420, 626474, 493402, 340586, 194432, 62448, -66244, -187641, -274334, -309424, -303186, -275248, -243696, -227846, -238580, -259714, -249147, -172771, -40227, 105424, 228026, 316978, 381243, 444077, 533670, 659564, 798364, 915291, 1006987, 1118346, 1314079, 1631786, 2052430, 2513896, 2955279, 3353023, 3725786, 4111126, 4535165, 5003366, 5513167, 6067570, 6691975, 7448190, 8425653, 9713363, 11373512, 13441323, 15947593, 18925247, 22371728, 26169337, 29987052, 33230540, 35159875, 35227165, 33419959]
11391C3419959l154217l767661l775478l433806k968680k516457k115209j750581
11383I937870j422588j151870r46004p93062o76079n82142n08661m58684m27153
11374B971627m07864m01740l95461l55091k60636j37102m1405j8328o3932j28318
11364G61750j57485j36547q8046l9236j0618j1833k9962l5818j4689K1297M7470
11353C06283M0485n852p3389j28933j49863j45694j44817j64630k00158k33779
11343i00347k48341k35156k01783j66851j32637q2678r564P4486J41321J61442
11333a600108J33428Q8700O8634R4149J38878J49039J01569K5811l5940o9732
11323i05572q0182o9061m1551j832N6549J26000J71499J69256J31098R0430P4556
$$ y = [33419959, 30265742, 26498081, 22722603, 19288797, 16320117, 13803660, 11688451, 9937870, 8515282, 7363412, 6417408, 5624346, 4948267, 4366125, 3857464, 3398780, 2971627, 2563763, 2162023, 1766562, 1411471, 1150835, 1013733, 972328, 954000, 890068, 761750, 604265, 467718, 379672, 340436, 329818, 317985, 288023, 252205, 237516, 258813, 306283, 346768, 340916, 267527, 138594, -11269, -156963, -301780, -466410, -666568, -900347, -1148688, -1383844, -1585627, -1752478, -1885115, -1967793, -1977357, -1902871, -1761550, -1600108, -1466680, -1377980, -1309346, -1215197, -1076319, -927280, -825711, -799900, -835840, -905572, -985754, -1054815, -1096366, -1098198, -1041649, -915649, -744150, -574894, -443796, -353366, -278810]
11312b78810Q3938R7203Q7864M8150L508q602J8340M6394L3911k4798j01186j55273
11300a49361j63490j32812q5512l3674K3921Q0065J11512J08006R1618Q9192J01054
11289D0519J07530R2052M8334j8339q4853j22127j21258r6921p1663o2596p5690
11278c65012j07515j46112j71461j67615j31697p2597o901N4155J04548J38508
11268h71699J59586J78351J88677J61555Q0061l5053j42892k08175k15096j69589
11258h74274r3664j7565L9123P7649J10811J52433K02748K34016K10242J31354
11248A72873L2604n6235j21424j54463j51817j18298n9143K7471J34986K29809
11238f3637K68421K31350J31977N130j11858j95482k34458k18357j44826m0591
$$ y = [-278810, -194872, -97669, -9805, 38345, 41853, 33251, 51591, 97985, 131896, 107098, 5912, -149361, -312851, -445663, -531175, -564849, -540928, -460863, -349351, -241345, -149727, -60535, 40519, 148049, 240101, 288435, 270096, 185243, 63116, -58142, -155063, -226726, -289322, -365012, -472527, -618639, -790100, -957715, -1089412, -1162009, -1168910, -1114755, -1010207, -871699, -712113, -533762, -345085, -183530, -103469, -138522, -281414, -489589, -704685, -874274, -967938, -985503, -946380, -868731, -757920, -605487, -402739, -168723, 41519, 172873, 205477, 149242, 27818, -126645, -278462, -396760, -455903, -428432, -293446, -63637, 204784, 436134, 568111, 573241, 461383, 265901, 31443, -186914, -331740, -372331]
11228c72331N3169J17162J49572J45173J01802L4581k5151m8919l8067k1739k3126
11217G2126m4597p5174r0465o2223J5273J18050K09003K61668K78647K76783K55626
11206A214717K03069J22238L3148m0529q8548j21637j56248j95924k27168k31850
11196E11268k08068j80984j81729k12551k46749k61613k52503k17569j49722n1571
11186a451791N0804J22860J50473J43834J19657Q9555O2786N3256P3985J18307
11176d66274J60129J75015J49281Q5719J0235m8546q6883j15335j31262j21845
11166c89766q6335l9945l261N398k4968r0432j64258k00380j61235n5285O0191
11155a150276J21880J06474M2080j7133l5415j7724Q590K3741L0630M0733O1107
$$ y = [-372331, -319162, -202000, -52428, 92745, 194547, 229128, 203977, 155058, 116991, 95252, 72126, 27529, -47645, -138110, -200333, -185060, -67010, 141993, 403661, 682308, 959091, 1214717, 1417786, 1540024, 1573172, 1532643, 1444095, 1322458, 1166210, 970286, 743118, 511268, 303200, 122216, -59513, -272064, -518813, -780426, -1032929, -1250498, -1400220, -1451791, -1400987, -1278127, -1127654, -983820, -864163, -774608, -711822, -658566, -584581, -466274, -306145, -131130, 18151, 103870, 114105, 65559, -21324, -136659, -267921, -389766, -476101, -516046, -519307, -513909, -538877, -629309, -793567, -993947, -1155182, -1210467, -1150276, -1028396, -921922, -879842, -896975, -932390, -950114, -941524, -917783, -887153, -846420, -785313]
11144g85313R8770J48461J89053K11934K24492K20864J84717J23903O7398L4876
11134G19155K8446L8825N8575R0232J27414J44274J18725N2990k8967r9985j45858
11123A103826j67351j76657j86829j97971j95131j68957j28042q8615o4145n5846
11113c25718n0577l7651k4024k5063m5180o4655n8384k8763Q785N8021J26124
11102d67085K00048K53525K64131K35284J93278J50927R3946J0392q2462j45278
11092G06706j52112j15883p5641o4539q9088j28307j46020j17851n8632j5542
11082b56909j7980m4507o0562o4788p6447j03137j30683j34390r9330l5071K8397
11071i95407O5682P4691P1216P2249P8453P5079N2562K1958K177m833j1490j9417
$$ y = [-785313, -686543, -538082, -349029, -137095, 87397, 308261, 492978, 616881, 684279, 719155, 747601, 786426, 845001, 935233, 1062647, 1206921, 1325646, 1378636, 1349669, 1249684, 1103826, 936475, 759818, 572989, 375018, 179887, 10930, -117112, -205727, -269872, -325718, -376295, -413946, -437970, -463033, -508213, -572868, -631252, -660015, -651230, -593209, -467085, -267037, -13512, 250619, 485903, 679181, 830108, 924054, 934446, 851984, 706706, 554594, 438711, 363070, 298531, 209443, 81136, -64884, -182735, -241367, -256909, -274889, -319396, -379958, -444746, -521193, -624330, -755013, -889403, -988733, -1023804, -995407, -929725, -855034, -783818, -711569, -633116, -558037, -505475, -483517, -481340, -486173, -497663, -517080]
11059e17080j4258J2622N2609R5446J35143J61930J72844J80922J97467K13172
11049F90817K08113J74824J22952O2005n813p1077j17157j42235j58675j72177
11039E91577j74387j49039q7042K75Q9664J62697K05024K02507J56991R7948N4721
11028A150936K5520j0083o4499j28866j79448k02096j95640j62673j16921p9447
11018C6783n9592n8055p3365r1606r0878o1449j1397M4503R4132J31308J53562
11007A3946J61916J58782J44202J21978R8956P5177M7202J9201r01j3819k8211
10996G98429m7243n8462m3694m963L0958M6662M9043M2021K1785o483l7579p4049
10984G16425j09774j24849j02819m6511J9571O8567R4653J07547J09773R7777
$$ y = [-517080, -531338, -518716, -466107, -370661, -235518, -73588, 99256, 280178, 477645, 690817, 898930, 1073754, 1196706, 1258711, 1252898, 1181821, 1064664, 922429, 763754, 591577, 417190, 268151, 181109, 181384, 271048, 433745, 638769, 841276, 998267, 1096215, 1150936, 1176456, 1166373, 1101874, 973008, 793560, 591464, 395824, 233151, 116230, 36783, -22809, -80864, -154229, -245835, -336713, -398162, -409559, -365056, -270924, -139616, 13946, 175862, 334644, 478846, 600824, 699780, 774957, 822159, 841360, 840459, 826640, 798429, 751186, 692724, 649030, 644067, 675025, 721687, 770730, 812751, 834536, 828053, 790474, 716425, 606651, 481802, 378983, 332472, 352043, 420610, 515263, 622810, 732583, 830360]
10974H30360P7293N6294L5678J6393O76j5767l7841o3655q6517r4872p7916m0183
10962E99943j549K1234K2062l38m4168j00323j45537j49324j03735l7848J1482
10951G1899L5877M3360L0054m837k8355k120N8299J00598J06656J00072R2271
10940F03774O6352J2629o1125j48357k34237k81315k68934k22133j70757j23281
10930h27384q1223m1754o33L7149O4090Q0894Q6821P2183L7613L952j3665k3297
10918f05254l4496l8671k4202l775j277j2523m124N1149J42862K25922K56427
10907d7962K22371J40390M0138m3576q6011q7911o4092k9243j130o0l7179r6593
10895i0858j42506j55254j39764r9671l5063L9399R3815J11250J08499J09177
$$ y = [830360, 907653, 963947, 999625, 1016018, 1016694, 1000927, 963086, 899431, 812914, 718042, 640126, 599943, 598394, 619628, 641690, 641352, 597184, 496861, 351324, 202000, 98265, 60417, 71899, 107776, 151136, 181190, 176353, 147998, 145878, 204177, 304775, 411431, 511503, 603774, 670126, 682755, 621630, 473273, 239036, -42279, -311213, -533346, -704103, -827384, -908607, -950361, -950994, -913845, -849755, -768861, -682040, -609857, -572244, -568292, -581957, -605254, -639750, -678421, -702623, -706398, -707675, -720198, -724322, -673173, -530311, -304389, -47962, 174409, 314799, 354937, 311361, 225350, 137439, 73347, 44104, 42974, 42914, 5735, -90858, -233364, -388618, -528382, -628053, -663116, -623717, -529902, -418652, -310153, -200976]
10885b00976J14065J09736Q8562N5017J8488j6721n0056q0734j06999j19325j06254
10874b95197p6436n2439m8717o8848r9379j14096j03393p8377m5291k849L7371
10863i47651N7682N8384N4665N3202N1587N2852N4924M4964K4124J5479L4407
10852d45381P1076R7848R0180N0506L968l0147n4972p7527q6748o7811k8030N848
10840d71190J8534K5962N5632J13021J71673J96591J73382J16580N6539K0679
10830D77403K0463L9004M3015J9438j1713j9213R592N3213P5339O3126L4067J4197
10818H17931K0141M5922O6643N8902J6960m3659r9088j33388j45725j47698j50524
10807C06417j53586j45433j17459p8379m9981m0760l8803l9638n3596q2856j10731
$$ y = [-200976, -86911, 22825, 111387, 166404, 184892, 168171, 118115, 37381, -69618, -188943, -295197, -371633, -424072, -472789, -541637, -641016, -755112, -858505, -936882, -982173, -985022, -947651, -889969, -831585, -776920, -723718, -672131, -619279, -564355, -519391, -495267, -479788, -445381, -374305, -276457, -186277, -135771, -131803, -161950, -216922, -294449, -381197, -449008, -477038, -471190, -452656, -426694, -371062, -258041, -86368, 110223, 283605, 400185, 456724, 477403, 497866, 536870, 579885, 599323, 587610, 568397, 577989, 631202, 706541, 769667, 803734, 817931, 838072, 883994, 950637, 1009539, 1026499, 982840, 883752, 750364, 604639, 456941, 306417, 152831, 7398, -110061, -188440, -238421, -279181, -317984, -357622, -411218, -494074, -604805]
10796f04805j13337q6500n6807n3600p8009j07121j18376j07070p8583l5479J1693
10785a427994M3608M3240N779m7637p8421o6496k6615R057J4066k0694q4040j47409
10773a783556j76100j41813k9996J50222L44759M52926M16114K93043J81174J22373
10763a70854J09326J21874J40971J54004J59060J54367J33124R8484O2215K5921
10753I88492j9356p6989j32360j62125j60127j44741j31616j15049r0405o1079
10743a05355k2945K3647O2538P6737O5107M5054K9787Q420l0793p8032j24299
10732e0134j71856k11941k24683j98777j36378m9728L9948J07873J42549J58814
10722e94313J74905J87398J84596J65275J36867J05079O7576K4902j1062l3367
$$ y = [-604805, -718142, -804642, -861449, -915049, -993058, -1100179, -1218555, -1325625, -1404208, -1439687, -1427994, -1384386, -1341146, -1335367, -1383004, -1461425, -1527921, -1554536, -1545479, -1531413, -1552107, -1636147, -1783556, -1959656, -2101469, -2131465, -1981243, -1636484, -1183558, -767444, -474401, -293227, -170854, -61528, 60346, 201317, 355321, 514381, 668748, 801872, 900356, 962571, 988492, 969136, 892147, 759787, 597662, 437535, 292794, 161178, 46129, -44276, -105355, -128300, -104653, -42115, 34622, 99729, 144783, 174570, 182990, 152197, 74165, -50134, -221990, -433931, -658614, -857391, -993769, -1043497, -1003549, -895676, -753127, -594313, -419408, -232010, -47414, 117861, 254728, 359807, 427383, 452285, 441223, 407856]
10712D07856m2481l9622l1064j8792J607K3952L6981L3916M549n4630j28882j85687
10700G703j84912j14193p002Q5278J28804J15862O0669j0213p0690j05000j11878
10689b05572r2792n4275j8051k690j604K926K0798N8023J13427J70139K01472
10678A91801J99197J81388J59287J29363R0610M4960p886o6580j19432j51894
10668F50814j64341j66221j59159j36413r8595o3629n5295p8889j07265r8376
10658d77369m0179L2249P5525P9581P2668R0043J34998J78592J93085J73453J31790
10647F44436Q2077L1039k3421q6627j45543j65328j23758l7777N0488J07159J27100
10636D59845J23275J00012N4435n146n6723q1430q4685q4334q4360p9730o9903
$$ y = [407856, 365375, 325753, 294689, 275897, 277504, 301456, 338437, 372353, 376902, 322272, 193390, 7703, -177209, -291402, -298404, -213126, -84322, 31540, 92209, 81996, 11306, -93694, -205572, -298364, -352639, -370690, -373380, -374984, -372058, -351260, -293237, -179810, -9671, 191801, 390998, 572386, 731673, 861036, 951646, 996606, 988720, 922140, 802708, 650814, 486473, 320252, 161093, 24680, -73915, -137544, -192839, -271728, -378993, -477369, -517548, -485299, -409774, -330193, -257525, -167482, -32484, 146108, 339193, 512646, 644436, 726513, 757552, 734131, 647504, 501961, 336633, 212875, 175098, 225586, 332745, 459845, 583120, 683132, 737567, 732421, 675698, 594268, 509583, 425249, 340889, 261159, 191256]
10625A91256n5256l7650k2465j5578k6302n4341p5088o2197j8994L4127Q8081
10614e4407J35404J52966J20216M8647k1602n4374m3992j3543J0690K3226L3558
10603C36789M3707M6722M3648M5100N4896O9759Q6668J00685J07213R7849N3932
10592A086968l4692j43549k22434k32943j76049q8120j1595K4322J3542j8247
10582A97203l5295k9338k0549k3720k8049j4566K1259O8811J10533J27704J08554
10571D82547O3572K5729J2007Q15k4009l6871p019N2459R0652P2162J8114j2982
10559G37176N290L7077L5991K80l8417o5795q8707r6071o1906J2670Q9535J25167
10547F92290J03587M4742j3350m4690n0171m3088k9999j0065J3741K7134J1074
$$ y = [191256, 136000, 98350, 75885, 60307, 34005, -20336, -95424, -157621, -176615, -142488, -54407, 80997, 233963, 354179, 402826, 381224, 326850, 282858, 269315, 280005, 303231, 336789, 380496, 427218, 470866, 515966, 570862, 640621, 727289, 827974, 935187, 1033036, 1086968, 1052276, 908727, 686293, 453350, 277301, 189181, 177586, 201908, 215450, 197203, 161908, 132570, 112021, 88301, 60252, 45686, 66945, 135756, 246289, 373993, 482547, 546119, 571848, 583855, 584670, 560661, 523790, 516771, 569230, 659882, 732044, 750158, 737176, 742466, 779543, 815534, 815814, 777397, 711602, 622895, 526824, 464918, 477588, 567123, 692290, 795877, 840619, 827269, 782579, 732408, 689320, 659321, 649256, 662997, 690131, 701205]
10536G01205k9881o4839p2194n5063k7496q01P042k7242r5177j53488j71562j46137
10524a35633q3700l269N8511P1896L6685k6168q7126j16379j10320r6504r1578
10513e83585q5600o8220l6807N906M0643M4599J6990k6466o8436j00565j23202
10502i84743j31015j18506r4007o9224m3742r921L0644O6603R2808J13772J28468
10491a018863J22550Q1680R597p3876j48834j96398k00179j61062j00280l9164
10481a724829J4096N4819P7804Q3803Q0595P5700P3099Q0756J09228J52167J82047
10470g40715J75378J38351R5888N8906K3083m464p369R614J9944J800m5105r6588
10458c71277j18955r9309n2464M046O6064J31459J88054K17347K08297J66111
$$ y = [701205, 671324, 606485, 534291, 479228, 451732, 450931, 457973, 430731, 335554, 182066, 10504, -135633, -219333, -222602, -164091, -92195, -55510, -81678, -168804, -285183, -395503, -492007, -583585, -669185, -737405, -774212, -768306, -727663, -683064, -666074, -692540, -760976, -861541, -984743, -1115758, -1234264, -1328271, -1397495, -1441237, -1451158, -1420514, -1353911, -1261103, -1147331, -1018863, -896313, -814633, -805036, -878912, -1027746, -1224144, -1424323, -1585385, -1685665, -1724829, -1710733, -1655914, -1578110, -1494307, -1413712, -1338012, -1264913, -1184157, -1074929, -922762, -740715, -565337, -426986, -331098, -272192, -249109, -253573, -260942, -251328, -231384, -229584, -274689, -371277, -490232, -589541, -642005, -637959, -571895, -440436, -252382, -35035, 173262, 339373]
10448C39373J11957P3397O4347P1067N9888J3999m4539q8368j17425j43449j68627
10437A71620j83656j77363j49323j08787o8325l5278j619M0451P7917Q5954N3953
10426b94456k702n6831q6356q2014n1747j7487K077J0009K0410L3542L9407L3204
10414d52944J9499J2857K3458L7445L5121J9885J1396K6554P3027J43262K06873
10403A56433K26479J91251J28555P4425L8969J0064j9495m3647n5635n4507l9909
10392F12983j4723O542Q535j0551m2246p1769q3775o9041k8975J8975N0626N1469
10380D28050K6328r646n1901r7867j29750j27665q7403k3327L9426Q3057J11487
$$ y = [339373, 451330, 524727, 589074, 660141, 720029, 734028, 689489, 601121, 483696, 340247, 171620, -12036, -189399, -338722, -447509, -515834, -551112, -552731, -512280, -434363, -348409, -294456, -297158, -353989, -440345, -522359, -574106, -591593, -589516, -579507, -559097, -525555, -486148, -452944, -433445, -420588, -397130, -359685, -324564, -304679, -293283, -266729, -193702, -50440, 156433, 382912, 574163, 702718, 777143, 816112, 826176, 806681, 763034, 707399, 652892, 612983, 598260, 604802, 613337, 602786, 560540, 488771, 404996, 335955, 306980, 325955, 376581, 428050, 454378, 444732, 392831, 294964, 165214, 37549, -49854, -73181, -33755, 49302, 160789]
$$ [...]
##END NTUPLES=NMR SPECTRUM
##END=
